lucene-dev mailing list archives

Site index · List index
Message view « Date » · « Thread »
Top « Date » · « Thread »
From Policeman Jenkins Server <jenk...@thetaphi.de>
Subject [JENKINS] Lucene-Solr-master-MacOSX (64bit/jdk1.8.0) - Build # 4736 - Still Unstable!
Date Mon, 16 Jul 2018 10:10:28 GMT
Build: https://jenkins.thetaphi.de/job/Lucene-Solr-master-MacOSX/4736/
Java: 64bit/jdk1.8.0 -XX:+UseCompressedOops -XX:+UseSerialGC

6 tests failed.
FAILED:  org.apache.lucene.document.TestLatLonShapeQueries.testRandomMedium

Error Message:
wrong hit (first of possibly more):  FAIL: id=2503 should match but did not   query=LatLonShapeBoundingBoxQuery: field=shape:Rectangle(lat=-44.92331048939377 TO 0.0 lon=8.381903171539307E-8 TO 0.9999999403953552) docID=2436   polygon=[-4.190951585769653E-8, 0.0] [89.99999995809048, 0.0] [89.99999995809048, 179.99999991618097] [-4.190951585769653E-8, 0.0]    deleted?=false  rect=Rectangle(-44.92331048939377 TO 0.0 lon=8.381903171539307E-8 TO 0.9999999403953552)

Stack Trace:
java.lang.AssertionError: wrong hit (first of possibly more):

FAIL: id=2503 should match but did not
  query=LatLonShapeBoundingBoxQuery: field=shape:Rectangle(lat=-44.92331048939377 TO 0.0 lon=8.381903171539307E-8 TO 0.9999999403953552) docID=2436
  polygon=[-4.190951585769653E-8, 0.0] [89.99999995809048, 0.0] [89.99999995809048, 179.99999991618097] [-4.190951585769653E-8, 0.0] 
  deleted?=false  rect=Rectangle(-44.92331048939377 TO 0.0 lon=8.381903171539307E-8 TO 0.9999999403953552)
	at __randomizedtesting.SeedInfo.seed([62D13477D093226D:DF0F03DF91F6410B]:0)
	at org.junit.Assert.fail(Assert.java:93)
	at org.apache.lucene.document.TestLatLonShapeQueries.verifyRandomBBoxes(TestLatLonShapeQueries.java:263)
	at org.apache.lucene.document.TestLatLonShapeQueries.verify(TestLatLonShapeQueries.java:134)
	at org.apache.lucene.document.TestLatLonShapeQueries.doTestRandom(TestLatLonShapeQueries.java:130)
	at org.apache.lucene.document.TestLatLonShapeQueries.testRandomMedium(TestLatLonShapeQueries.java:102)
	at sun.reflect.NativeMethodAccessorImpl.invoke0(Native Method)
	at sun.reflect.NativeMethodAccessorImpl.invoke(NativeMethodAccessorImpl.java:62)
	at sun.reflect.DelegatingMethodAccessorImpl.invoke(DelegatingMethodAccessorImpl.java:43)
	at java.lang.reflect.Method.invoke(Method.java:498)
	at com.carrotsearch.randomizedtesting.RandomizedRunner.invoke(RandomizedRunner.java:1737)
	at com.carrotsearch.randomizedtesting.RandomizedRunner$8.evaluate(RandomizedRunner.java:934)
	at com.carrotsearch.randomizedtesting.RandomizedRunner$9.evaluate(RandomizedRunner.java:970)
	at com.carrotsearch.randomizedtesting.RandomizedRunner$10.evaluate(RandomizedRunner.java:984)
	at org.apache.lucene.util.TestRuleSetupTeardownChained$1.evaluate(TestRuleSetupTeardownChained.java:49)
	at org.apache.lucene.util.AbstractBeforeAfterRule$1.evaluate(AbstractBeforeAfterRule.java:45)
	at org.apache.lucene.util.TestRuleThreadAndTestName$1.evaluate(TestRuleThreadAndTestName.java:48)
	at org.apache.lucene.util.TestRuleIgnoreAfterMaxFailures$1.evaluate(TestRuleIgnoreAfterMaxFailures.java:64)
	at org.apache.lucene.util.TestRuleMarkFailure$1.evaluate(TestRuleMarkFailure.java:47)
	at com.carrotsearch.randomizedtesting.rules.StatementAdapter.evaluate(StatementAdapter.java:36)
	at com.carrotsearch.randomizedtesting.ThreadLeakControl$StatementRunner.run(ThreadLeakControl.java:368)
	at com.carrotsearch.randomizedtesting.ThreadLeakControl.forkTimeoutingTask(ThreadLeakControl.java:817)
	at com.carrotsearch.randomizedtesting.ThreadLeakControl$3.evaluate(ThreadLeakControl.java:468)
	at com.carrotsearch.randomizedtesting.RandomizedRunner.runSingleTest(RandomizedRunner.java:943)
	at com.carrotsearch.randomizedtesting.RandomizedRunner$5.evaluate(RandomizedRunner.java:829)
	at com.carrotsearch.randomizedtesting.RandomizedRunner$6.evaluate(RandomizedRunner.java:879)
	at com.carrotsearch.randomizedtesting.RandomizedRunner$7.evaluate(RandomizedRunner.java:890)
	at org.apache.lucene.util.AbstractBeforeAfterRule$1.evaluate(AbstractBeforeAfterRule.java:45)
	at com.carrotsearch.randomizedtesting.rules.StatementAdapter.evaluate(StatementAdapter.java:36)
	at org.apache.lucene.util.TestRuleStoreClassName$1.evaluate(TestRuleStoreClassName.java:41)
	at com.carrotsearch.randomizedtesting.rules.NoShadowingOrOverridesOnMethodsRule$1.evaluate(NoShadowingOrOverridesOnMethodsRule.java:40)
	at com.carrotsearch.randomizedtesting.rules.NoShadowingOrOverridesOnMethodsRule$1.evaluate(NoShadowingOrOverridesOnMethodsRule.java:40)
	at com.carrotsearch.randomizedtesting.rules.StatementAdapter.evaluate(StatementAdapter.java:36)
	at com.carrotsearch.randomizedtesting.rules.StatementAdapter.evaluate(StatementAdapter.java:36)
	at com.carrotsearch.randomizedtesting.rules.StatementAdapter.evaluate(StatementAdapter.java:36)
	at org.apache.lucene.util.TestRuleAssertionsRequired$1.evaluate(TestRuleAssertionsRequired.java:53)
	at org.apache.lucene.util.TestRuleMarkFailure$1.evaluate(TestRuleMarkFailure.java:47)
	at org.apache.lucene.util.TestRuleIgnoreAfterMaxFailures$1.evaluate(TestRuleIgnoreAfterMaxFailures.java:64)
	at org.apache.lucene.util.TestRuleIgnoreTestSuites$1.evaluate(TestRuleIgnoreTestSuites.java:54)
	at com.carrotsearch.randomizedtesting.rules.StatementAdapter.evaluate(StatementAdapter.java:36)
	at com.carrotsearch.randomizedtesting.ThreadLeakControl$StatementRunner.run(ThreadLeakControl.java:368)
	at java.lang.Thread.run(Thread.java:748)


FAILED:  org.apache.lucene.document.TestLatLonShapeQueries.testRandomMedium

Error Message:
wrong hit (first of possibly more):  FAIL: id=2503 should match but did not   query=LatLonShapeBoundingBoxQuery: field=shape:Rectangle(lat=-44.92331048939377 TO 0.0 lon=8.381903171539307E-8 TO 0.9999999403953552) docID=2436   polygon=[-4.190951585769653E-8, 0.0] [89.99999995809048, 0.0] [89.99999995809048, 179.99999991618097] [-4.190951585769653E-8, 0.0]    deleted?=false  rect=Rectangle(-44.92331048939377 TO 0.0 lon=8.381903171539307E-8 TO 0.9999999403953552)

Stack Trace:
java.lang.AssertionError: wrong hit (first of possibly more):

FAIL: id=2503 should match but did not
  query=LatLonShapeBoundingBoxQuery: field=shape:Rectangle(lat=-44.92331048939377 TO 0.0 lon=8.381903171539307E-8 TO 0.9999999403953552) docID=2436
  polygon=[-4.190951585769653E-8, 0.0] [89.99999995809048, 0.0] [89.99999995809048, 179.99999991618097] [-4.190951585769653E-8, 0.0] 
  deleted?=false  rect=Rectangle(-44.92331048939377 TO 0.0 lon=8.381903171539307E-8 TO 0.9999999403953552)
	at __randomizedtesting.SeedInfo.seed([62D13477D093226D:DF0F03DF91F6410B]:0)
	at org.junit.Assert.fail(Assert.java:93)
	at org.apache.lucene.document.TestLatLonShapeQueries.verifyRandomBBoxes(TestLatLonShapeQueries.java:263)
	at org.apache.lucene.document.TestLatLonShapeQueries.verify(TestLatLonShapeQueries.java:134)
	at org.apache.lucene.document.TestLatLonShapeQueries.doTestRandom(TestLatLonShapeQueries.java:130)
	at org.apache.lucene.document.TestLatLonShapeQueries.testRandomMedium(TestLatLonShapeQueries.java:102)
	at sun.reflect.NativeMethodAccessorImpl.invoke0(Native Method)
	at sun.reflect.NativeMethodAccessorImpl.invoke(NativeMethodAccessorImpl.java:62)
	at sun.reflect.DelegatingMethodAccessorImpl.invoke(DelegatingMethodAccessorImpl.java:43)
	at java.lang.reflect.Method.invoke(Method.java:498)
	at com.carrotsearch.randomizedtesting.RandomizedRunner.invoke(RandomizedRunner.java:1737)
	at com.carrotsearch.randomizedtesting.RandomizedRunner$8.evaluate(RandomizedRunner.java:934)
	at com.carrotsearch.randomizedtesting.RandomizedRunner$9.evaluate(RandomizedRunner.java:970)
	at com.carrotsearch.randomizedtesting.RandomizedRunner$10.evaluate(RandomizedRunner.java:984)
	at org.apache.lucene.util.TestRuleSetupTeardownChained$1.evaluate(TestRuleSetupTeardownChained.java:49)
	at org.apache.lucene.util.AbstractBeforeAfterRule$1.evaluate(AbstractBeforeAfterRule.java:45)
	at org.apache.lucene.util.TestRuleThreadAndTestName$1.evaluate(TestRuleThreadAndTestName.java:48)
	at org.apache.lucene.util.TestRuleIgnoreAfterMaxFailures$1.evaluate(TestRuleIgnoreAfterMaxFailures.java:64)
	at org.apache.lucene.util.TestRuleMarkFailure$1.evaluate(TestRuleMarkFailure.java:47)
	at com.carrotsearch.randomizedtesting.rules.StatementAdapter.evaluate(StatementAdapter.java:36)
	at com.carrotsearch.randomizedtesting.ThreadLeakControl$StatementRunner.run(ThreadLeakControl.java:368)
	at com.carrotsearch.randomizedtesting.ThreadLeakControl.forkTimeoutingTask(ThreadLeakControl.java:817)
	at com.carrotsearch.randomizedtesting.ThreadLeakControl$3.evaluate(ThreadLeakControl.java:468)
	at com.carrotsearch.randomizedtesting.RandomizedRunner.runSingleTest(RandomizedRunner.java:943)
	at com.carrotsearch.randomizedtesting.RandomizedRunner$5.evaluate(RandomizedRunner.java:829)
	at com.carrotsearch.randomizedtesting.RandomizedRunner$6.evaluate(RandomizedRunner.java:879)
	at com.carrotsearch.randomizedtesting.RandomizedRunner$7.evaluate(RandomizedRunner.java:890)
	at org.apache.lucene.util.AbstractBeforeAfterRule$1.evaluate(AbstractBeforeAfterRule.java:45)
	at com.carrotsearch.randomizedtesting.rules.StatementAdapter.evaluate(StatementAdapter.java:36)
	at org.apache.lucene.util.TestRuleStoreClassName$1.evaluate(TestRuleStoreClassName.java:41)
	at com.carrotsearch.randomizedtesting.rules.NoShadowingOrOverridesOnMethodsRule$1.evaluate(NoShadowingOrOverridesOnMethodsRule.java:40)
	at com.carrotsearch.randomizedtesting.rules.NoShadowingOrOverridesOnMethodsRule$1.evaluate(NoShadowingOrOverridesOnMethodsRule.java:40)
	at com.carrotsearch.randomizedtesting.rules.StatementAdapter.evaluate(StatementAdapter.java:36)
	at com.carrotsearch.randomizedtesting.rules.StatementAdapter.evaluate(StatementAdapter.java:36)
	at com.carrotsearch.randomizedtesting.rules.StatementAdapter.evaluate(StatementAdapter.java:36)
	at org.apache.lucene.util.TestRuleAssertionsRequired$1.evaluate(TestRuleAssertionsRequired.java:53)
	at org.apache.lucene.util.TestRuleMarkFailure$1.evaluate(TestRuleMarkFailure.java:47)
	at org.apache.lucene.util.TestRuleIgnoreAfterMaxFailures$1.evaluate(TestRuleIgnoreAfterMaxFailures.java:64)
	at org.apache.lucene.util.TestRuleIgnoreTestSuites$1.evaluate(TestRuleIgnoreTestSuites.java:54)
	at com.carrotsearch.randomizedtesting.rules.StatementAdapter.evaluate(StatementAdapter.java:36)
	at com.carrotsearch.randomizedtesting.ThreadLeakControl$StatementRunner.run(ThreadLeakControl.java:368)
	at java.lang.Thread.run(Thread.java:748)


FAILED:  org.apache.lucene.document.TestLatLonShapeQueries.testRandomMedium

Error Message:
wrong hit (first of possibly more):  FAIL: id=2503 should match but did not   query=LatLonShapeBoundingBoxQuery: field=shape:Rectangle(lat=-44.92331048939377 TO 0.0 lon=8.381903171539307E-8 TO 0.9999999403953552) docID=2436   polygon=[-4.190951585769653E-8, 0.0] [89.99999995809048, 0.0] [89.99999995809048, 179.99999991618097] [-4.190951585769653E-8, 0.0]    deleted?=false  rect=Rectangle(-44.92331048939377 TO 0.0 lon=8.381903171539307E-8 TO 0.9999999403953552)

Stack Trace:
java.lang.AssertionError: wrong hit (first of possibly more):

FAIL: id=2503 should match but did not
  query=LatLonShapeBoundingBoxQuery: field=shape:Rectangle(lat=-44.92331048939377 TO 0.0 lon=8.381903171539307E-8 TO 0.9999999403953552) docID=2436
  polygon=[-4.190951585769653E-8, 0.0] [89.99999995809048, 0.0] [89.99999995809048, 179.99999991618097] [-4.190951585769653E-8, 0.0] 
  deleted?=false  rect=Rectangle(-44.92331048939377 TO 0.0 lon=8.381903171539307E-8 TO 0.9999999403953552)
	at __randomizedtesting.SeedInfo.seed([62D13477D093226D:DF0F03DF91F6410B]:0)
	at org.junit.Assert.fail(Assert.java:93)
	at org.apache.lucene.document.TestLatLonShapeQueries.verifyRandomBBoxes(TestLatLonShapeQueries.java:263)
	at org.apache.lucene.document.TestLatLonShapeQueries.verify(TestLatLonShapeQueries.java:134)
	at org.apache.lucene.document.TestLatLonShapeQueries.doTestRandom(TestLatLonShapeQueries.java:130)
	at org.apache.lucene.document.TestLatLonShapeQueries.testRandomMedium(TestLatLonShapeQueries.java:102)
	at sun.reflect.NativeMethodAccessorImpl.invoke0(Native Method)
	at sun.reflect.NativeMethodAccessorImpl.invoke(NativeMethodAccessorImpl.java:62)
	at sun.reflect.DelegatingMethodAccessorImpl.invoke(DelegatingMethodAccessorImpl.java:43)
	at java.lang.reflect.Method.invoke(Method.java:498)
	at com.carrotsearch.randomizedtesting.RandomizedRunner.invoke(RandomizedRunner.java:1737)
	at com.carrotsearch.randomizedtesting.RandomizedRunner$8.evaluate(RandomizedRunner.java:934)
	at com.carrotsearch.randomizedtesting.RandomizedRunner$9.evaluate(RandomizedRunner.java:970)
	at com.carrotsearch.randomizedtesting.RandomizedRunner$10.evaluate(RandomizedRunner.java:984)
	at org.apache.lucene.util.TestRuleSetupTeardownChained$1.evaluate(TestRuleSetupTeardownChained.java:49)
	at org.apache.lucene.util.AbstractBeforeAfterRule$1.evaluate(AbstractBeforeAfterRule.java:45)
	at org.apache.lucene.util.TestRuleThreadAndTestName$1.evaluate(TestRuleThreadAndTestName.java:48)
	at org.apache.lucene.util.TestRuleIgnoreAfterMaxFailures$1.evaluate(TestRuleIgnoreAfterMaxFailures.java:64)
	at org.apache.lucene.util.TestRuleMarkFailure$1.evaluate(TestRuleMarkFailure.java:47)
	at com.carrotsearch.randomizedtesting.rules.StatementAdapter.evaluate(StatementAdapter.java:36)
	at com.carrotsearch.randomizedtesting.ThreadLeakControl$StatementRunner.run(ThreadLeakControl.java:368)
	at com.carrotsearch.randomizedtesting.ThreadLeakControl.forkTimeoutingTask(ThreadLeakControl.java:817)
	at com.carrotsearch.randomizedtesting.ThreadLeakControl$3.evaluate(ThreadLeakControl.java:468)
	at com.carrotsearch.randomizedtesting.RandomizedRunner.runSingleTest(RandomizedRunner.java:943)
	at com.carrotsearch.randomizedtesting.RandomizedRunner$5.evaluate(RandomizedRunner.java:829)
	at com.carrotsearch.randomizedtesting.RandomizedRunner$6.evaluate(RandomizedRunner.java:879)
	at com.carrotsearch.randomizedtesting.RandomizedRunner$7.evaluate(RandomizedRunner.java:890)
	at org.apache.lucene.util.AbstractBeforeAfterRule$1.evaluate(AbstractBeforeAfterRule.java:45)
	at com.carrotsearch.randomizedtesting.rules.StatementAdapter.evaluate(StatementAdapter.java:36)
	at org.apache.lucene.util.TestRuleStoreClassName$1.evaluate(TestRuleStoreClassName.java:41)
	at com.carrotsearch.randomizedtesting.rules.NoShadowingOrOverridesOnMethodsRule$1.evaluate(NoShadowingOrOverridesOnMethodsRule.java:40)
	at com.carrotsearch.randomizedtesting.rules.NoShadowingOrOverridesOnMethodsRule$1.evaluate(NoShadowingOrOverridesOnMethodsRule.java:40)
	at com.carrotsearch.randomizedtesting.rules.StatementAdapter.evaluate(StatementAdapter.java:36)
	at com.carrotsearch.randomizedtesting.rules.StatementAdapter.evaluate(StatementAdapter.java:36)
	at com.carrotsearch.randomizedtesting.rules.StatementAdapter.evaluate(StatementAdapter.java:36)
	at org.apache.lucene.util.TestRuleAssertionsRequired$1.evaluate(TestRuleAssertionsRequired.java:53)
	at org.apache.lucene.util.TestRuleMarkFailure$1.evaluate(TestRuleMarkFailure.java:47)
	at org.apache.lucene.util.TestRuleIgnoreAfterMaxFailures$1.evaluate(TestRuleIgnoreAfterMaxFailures.java:64)
	at org.apache.lucene.util.TestRuleIgnoreTestSuites$1.evaluate(TestRuleIgnoreTestSuites.java:54)
	at com.carrotsearch.randomizedtesting.rules.StatementAdapter.evaluate(StatementAdapter.java:36)
	at com.carrotsearch.randomizedtesting.ThreadLeakControl$StatementRunner.run(ThreadLeakControl.java:368)
	at java.lang.Thread.run(Thread.java:748)


FAILED:  org.apache.lucene.document.TestLatLonShapeQueries.testRandomMedium

Error Message:
wrong hit (first of possibly more):  FAIL: id=2503 should match but did not   query=LatLonShapeBoundingBoxQuery: field=shape:Rectangle(lat=-44.92331048939377 TO 0.0 lon=8.381903171539307E-8 TO 0.9999999403953552) docID=2436   polygon=[-4.190951585769653E-8, 0.0] [89.99999995809048, 0.0] [89.99999995809048, 179.99999991618097] [-4.190951585769653E-8, 0.0]    deleted?=false  rect=Rectangle(-44.92331048939377 TO 0.0 lon=8.381903171539307E-8 TO 0.9999999403953552)

Stack Trace:
java.lang.AssertionError: wrong hit (first of possibly more):

FAIL: id=2503 should match but did not
  query=LatLonShapeBoundingBoxQuery: field=shape:Rectangle(lat=-44.92331048939377 TO 0.0 lon=8.381903171539307E-8 TO 0.9999999403953552) docID=2436
  polygon=[-4.190951585769653E-8, 0.0] [89.99999995809048, 0.0] [89.99999995809048, 179.99999991618097] [-4.190951585769653E-8, 0.0] 
  deleted?=false  rect=Rectangle(-44.92331048939377 TO 0.0 lon=8.381903171539307E-8 TO 0.9999999403953552)
	at __randomizedtesting.SeedInfo.seed([62D13477D093226D:DF0F03DF91F6410B]:0)
	at org.junit.Assert.fail(Assert.java:93)
	at org.apache.lucene.document.TestLatLonShapeQueries.verifyRandomBBoxes(TestLatLonShapeQueries.java:263)
	at org.apache.lucene.document.TestLatLonShapeQueries.verify(TestLatLonShapeQueries.java:134)
	at org.apache.lucene.document.TestLatLonShapeQueries.doTestRandom(TestLatLonShapeQueries.java:130)
	at org.apache.lucene.document.TestLatLonShapeQueries.testRandomMedium(TestLatLonShapeQueries.java:102)
	at sun.reflect.NativeMethodAccessorImpl.invoke0(Native Method)
	at sun.reflect.NativeMethodAccessorImpl.invoke(NativeMethodAccessorImpl.java:62)
	at sun.reflect.DelegatingMethodAccessorImpl.invoke(DelegatingMethodAccessorImpl.java:43)
	at java.lang.reflect.Method.invoke(Method.java:498)
	at com.carrotsearch.randomizedtesting.RandomizedRunner.invoke(RandomizedRunner.java:1737)
	at com.carrotsearch.randomizedtesting.RandomizedRunner$8.evaluate(RandomizedRunner.java:934)
	at com.carrotsearch.randomizedtesting.RandomizedRunner$9.evaluate(RandomizedRunner.java:970)
	at com.carrotsearch.randomizedtesting.RandomizedRunner$10.evaluate(RandomizedRunner.java:984)
	at org.apache.lucene.util.TestRuleSetupTeardownChained$1.evaluate(TestRuleSetupTeardownChained.java:49)
	at org.apache.lucene.util.AbstractBeforeAfterRule$1.evaluate(AbstractBeforeAfterRule.java:45)
	at org.apache.lucene.util.TestRuleThreadAndTestName$1.evaluate(TestRuleThreadAndTestName.java:48)
	at org.apache.lucene.util.TestRuleIgnoreAfterMaxFailures$1.evaluate(TestRuleIgnoreAfterMaxFailures.java:64)
	at org.apache.lucene.util.TestRuleMarkFailure$1.evaluate(TestRuleMarkFailure.java:47)
	at com.carrotsearch.randomizedtesting.rules.StatementAdapter.evaluate(StatementAdapter.java:36)
	at com.carrotsearch.randomizedtesting.ThreadLeakControl$StatementRunner.run(ThreadLeakControl.java:368)
	at com.carrotsearch.randomizedtesting.ThreadLeakControl.forkTimeoutingTask(ThreadLeakControl.java:817)
	at com.carrotsearch.randomizedtesting.ThreadLeakControl$3.evaluate(ThreadLeakControl.java:468)
	at com.carrotsearch.randomizedtesting.RandomizedRunner.runSingleTest(RandomizedRunner.java:943)
	at com.carrotsearch.randomizedtesting.RandomizedRunner$5.evaluate(RandomizedRunner.java:829)
	at com.carrotsearch.randomizedtesting.RandomizedRunner$6.evaluate(RandomizedRunner.java:879)
	at com.carrotsearch.randomizedtesting.RandomizedRunner$7.evaluate(RandomizedRunner.java:890)
	at org.apache.lucene.util.AbstractBeforeAfterRule$1.evaluate(AbstractBeforeAfterRule.java:45)
	at com.carrotsearch.randomizedtesting.rules.StatementAdapter.evaluate(StatementAdapter.java:36)
	at org.apache.lucene.util.TestRuleStoreClassName$1.evaluate(TestRuleStoreClassName.java:41)
	at com.carrotsearch.randomizedtesting.rules.NoShadowingOrOverridesOnMethodsRule$1.evaluate(NoShadowingOrOverridesOnMethodsRule.java:40)
	at com.carrotsearch.randomizedtesting.rules.NoShadowingOrOverridesOnMethodsRule$1.evaluate(NoShadowingOrOverridesOnMethodsRule.java:40)
	at com.carrotsearch.randomizedtesting.rules.StatementAdapter.evaluate(StatementAdapter.java:36)
	at com.carrotsearch.randomizedtesting.rules.StatementAdapter.evaluate(StatementAdapter.java:36)
	at com.carrotsearch.randomizedtesting.rules.StatementAdapter.evaluate(StatementAdapter.java:36)
	at org.apache.lucene.util.TestRuleAssertionsRequired$1.evaluate(TestRuleAssertionsRequired.java:53)
	at org.apache.lucene.util.TestRuleMarkFailure$1.evaluate(TestRuleMarkFailure.java:47)
	at org.apache.lucene.util.TestRuleIgnoreAfterMaxFailures$1.evaluate(TestRuleIgnoreAfterMaxFailures.java:64)
	at org.apache.lucene.util.TestRuleIgnoreTestSuites$1.evaluate(TestRuleIgnoreTestSuites.java:54)
	at com.carrotsearch.randomizedtesting.rules.StatementAdapter.evaluate(StatementAdapter.java:36)
	at com.carrotsearch.randomizedtesting.ThreadLeakControl$StatementRunner.run(ThreadLeakControl.java:368)
	at java.lang.Thread.run(Thread.java:748)


FAILED:  org.apache.lucene.document.TestLatLonShapeQueries.testRandomMedium

Error Message:
wrong hit (first of possibly more):  FAIL: id=2503 should match but did not   query=LatLonShapeBoundingBoxQuery: field=shape:Rectangle(lat=-44.92331048939377 TO 0.0 lon=8.381903171539307E-8 TO 0.9999999403953552) docID=2436   polygon=[-4.190951585769653E-8, 0.0] [89.99999995809048, 0.0] [89.99999995809048, 179.99999991618097] [-4.190951585769653E-8, 0.0]    deleted?=false  rect=Rectangle(-44.92331048939377 TO 0.0 lon=8.381903171539307E-8 TO 0.9999999403953552)

Stack Trace:
java.lang.AssertionError: wrong hit (first of possibly more):

FAIL: id=2503 should match but did not
  query=LatLonShapeBoundingBoxQuery: field=shape:Rectangle(lat=-44.92331048939377 TO 0.0 lon=8.381903171539307E-8 TO 0.9999999403953552) docID=2436
  polygon=[-4.190951585769653E-8, 0.0] [89.99999995809048, 0.0] [89.99999995809048, 179.99999991618097] [-4.190951585769653E-8, 0.0] 
  deleted?=false  rect=Rectangle(-44.92331048939377 TO 0.0 lon=8.381903171539307E-8 TO 0.9999999403953552)
	at __randomizedtesting.SeedInfo.seed([62D13477D093226D:DF0F03DF91F6410B]:0)
	at org.junit.Assert.fail(Assert.java:93)
	at org.apache.lucene.document.TestLatLonShapeQueries.verifyRandomBBoxes(TestLatLonShapeQueries.java:263)
	at org.apache.lucene.document.TestLatLonShapeQueries.verify(TestLatLonShapeQueries.java:134)
	at org.apache.lucene.document.TestLatLonShapeQueries.doTestRandom(TestLatLonShapeQueries.java:130)
	at org.apache.lucene.document.TestLatLonShapeQueries.testRandomMedium(TestLatLonShapeQueries.java:102)
	at sun.reflect.NativeMethodAccessorImpl.invoke0(Native Method)
	at sun.reflect.NativeMethodAccessorImpl.invoke(NativeMethodAccessorImpl.java:62)
	at sun.reflect.DelegatingMethodAccessorImpl.invoke(DelegatingMethodAccessorImpl.java:43)
	at java.lang.reflect.Method.invoke(Method.java:498)
	at com.carrotsearch.randomizedtesting.RandomizedRunner.invoke(RandomizedRunner.java:1737)
	at com.carrotsearch.randomizedtesting.RandomizedRunner$8.evaluate(RandomizedRunner.java:934)
	at com.carrotsearch.randomizedtesting.RandomizedRunner$9.evaluate(RandomizedRunner.java:970)
	at com.carrotsearch.randomizedtesting.RandomizedRunner$10.evaluate(RandomizedRunner.java:984)
	at org.apache.lucene.util.TestRuleSetupTeardownChained$1.evaluate(TestRuleSetupTeardownChained.java:49)
	at org.apache.lucene.util.AbstractBeforeAfterRule$1.evaluate(AbstractBeforeAfterRule.java:45)
	at org.apache.lucene.util.TestRuleThreadAndTestName$1.evaluate(TestRuleThreadAndTestName.java:48)
	at org.apache.lucene.util.TestRuleIgnoreAfterMaxFailures$1.evaluate(TestRuleIgnoreAfterMaxFailures.java:64)
	at org.apache.lucene.util.TestRuleMarkFailure$1.evaluate(TestRuleMarkFailure.java:47)
	at com.carrotsearch.randomizedtesting.rules.StatementAdapter.evaluate(StatementAdapter.java:36)
	at com.carrotsearch.randomizedtesting.ThreadLeakControl$StatementRunner.run(ThreadLeakControl.java:368)
	at com.carrotsearch.randomizedtesting.ThreadLeakControl.forkTimeoutingTask(ThreadLeakControl.java:817)
	at com.carrotsearch.randomizedtesting.ThreadLeakControl$3.evaluate(ThreadLeakControl.java:468)
	at com.carrotsearch.randomizedtesting.RandomizedRunner.runSingleTest(RandomizedRunner.java:943)
	at com.carrotsearch.randomizedtesting.RandomizedRunner$5.evaluate(RandomizedRunner.java:829)
	at com.carrotsearch.randomizedtesting.RandomizedRunner$6.evaluate(RandomizedRunner.java:879)
	at com.carrotsearch.randomizedtesting.RandomizedRunner$7.evaluate(RandomizedRunner.java:890)
	at org.apache.lucene.util.AbstractBeforeAfterRule$1.evaluate(AbstractBeforeAfterRule.java:45)
	at com.carrotsearch.randomizedtesting.rules.StatementAdapter.evaluate(StatementAdapter.java:36)
	at org.apache.lucene.util.TestRuleStoreClassName$1.evaluate(TestRuleStoreClassName.java:41)
	at com.carrotsearch.randomizedtesting.rules.NoShadowingOrOverridesOnMethodsRule$1.evaluate(NoShadowingOrOverridesOnMethodsRule.java:40)
	at com.carrotsearch.randomizedtesting.rules.NoShadowingOrOverridesOnMethodsRule$1.evaluate(NoShadowingOrOverridesOnMethodsRule.java:40)
	at com.carrotsearch.randomizedtesting.rules.StatementAdapter.evaluate(StatementAdapter.java:36)
	at com.carrotsearch.randomizedtesting.rules.StatementAdapter.evaluate(StatementAdapter.java:36)
	at com.carrotsearch.randomizedtesting.rules.StatementAdapter.evaluate(StatementAdapter.java:36)
	at org.apache.lucene.util.TestRuleAssertionsRequired$1.evaluate(TestRuleAssertionsRequired.java:53)
	at org.apache.lucene.util.TestRuleMarkFailure$1.evaluate(TestRuleMarkFailure.java:47)
	at org.apache.lucene.util.TestRuleIgnoreAfterMaxFailures$1.evaluate(TestRuleIgnoreAfterMaxFailures.java:64)
	at org.apache.lucene.util.TestRuleIgnoreTestSuites$1.evaluate(TestRuleIgnoreTestSuites.java:54)
	at com.carrotsearch.randomizedtesting.rules.StatementAdapter.evaluate(StatementAdapter.java:36)
	at com.carrotsearch.randomizedtesting.ThreadLeakControl$StatementRunner.run(ThreadLeakControl.java:368)
	at java.lang.Thread.run(Thread.java:748)


FAILED:  org.apache.lucene.document.TestLatLonShapeQueries.testRandomMedium

Error Message:
wrong hit (first of possibly more):  FAIL: id=2503 should match but did not   query=LatLonShapeBoundingBoxQuery: field=shape:Rectangle(lat=-44.92331048939377 TO 0.0 lon=8.381903171539307E-8 TO 0.9999999403953552) docID=2436   polygon=[-4.190951585769653E-8, 0.0] [89.99999995809048, 0.0] [89.99999995809048, 179.99999991618097] [-4.190951585769653E-8, 0.0]    deleted?=false  rect=Rectangle(-44.92331048939377 TO 0.0 lon=8.381903171539307E-8 TO 0.9999999403953552)

Stack Trace:
java.lang.AssertionError: wrong hit (first of possibly more):

FAIL: id=2503 should match but did not
  query=LatLonShapeBoundingBoxQuery: field=shape:Rectangle(lat=-44.92331048939377 TO 0.0 lon=8.381903171539307E-8 TO 0.9999999403953552) docID=2436
  polygon=[-4.190951585769653E-8, 0.0] [89.99999995809048, 0.0] [89.99999995809048, 179.99999991618097] [-4.190951585769653E-8, 0.0] 
  deleted?=false  rect=Rectangle(-44.92331048939377 TO 0.0 lon=8.381903171539307E-8 TO 0.9999999403953552)
	at __randomizedtesting.SeedInfo.seed([62D13477D093226D:DF0F03DF91F6410B]:0)
	at org.junit.Assert.fail(Assert.java:93)
	at org.apache.lucene.document.TestLatLonShapeQueries.verifyRandomBBoxes(TestLatLonShapeQueries.java:263)
	at org.apache.lucene.document.TestLatLonShapeQueries.verify(TestLatLonShapeQueries.java:134)
	at org.apache.lucene.document.TestLatLonShapeQueries.doTestRandom(TestLatLonShapeQueries.java:130)
	at org.apache.lucene.document.TestLatLonShapeQueries.testRandomMedium(TestLatLonShapeQueries.java:102)
	at sun.reflect.NativeMethodAccessorImpl.invoke0(Native Method)
	at sun.reflect.NativeMethodAccessorImpl.invoke(NativeMethodAccessorImpl.java:62)
	at sun.reflect.DelegatingMethodAccessorImpl.invoke(DelegatingMethodAccessorImpl.java:43)
	at java.lang.reflect.Method.invoke(Method.java:498)
	at com.carrotsearch.randomizedtesting.RandomizedRunner.invoke(RandomizedRunner.java:1737)
	at com.carrotsearch.randomizedtesting.RandomizedRunner$8.evaluate(RandomizedRunner.java:934)
	at com.carrotsearch.randomizedtesting.RandomizedRunner$9.evaluate(RandomizedRunner.java:970)
	at com.carrotsearch.randomizedtesting.RandomizedRunner$10.evaluate(RandomizedRunner.java:984)
	at org.apache.lucene.util.TestRuleSetupTeardownChained$1.evaluate(TestRuleSetupTeardownChained.java:49)
	at org.apache.lucene.util.AbstractBeforeAfterRule$1.evaluate(AbstractBeforeAfterRule.java:45)
	at org.apache.lucene.util.TestRuleThreadAndTestName$1.evaluate(TestRuleThreadAndTestName.java:48)
	at org.apache.lucene.util.TestRuleIgnoreAfterMaxFailures$1.evaluate(TestRuleIgnoreAfterMaxFailures.java:64)
	at org.apache.lucene.util.TestRuleMarkFailure$1.evaluate(TestRuleMarkFailure.java:47)
	at com.carrotsearch.randomizedtesting.rules.StatementAdapter.evaluate(StatementAdapter.java:36)
	at com.carrotsearch.randomizedtesting.ThreadLeakControl$StatementRunner.run(ThreadLeakControl.java:368)
	at com.carrotsearch.randomizedtesting.ThreadLeakControl.forkTimeoutingTask(ThreadLeakControl.java:817)
	at com.carrotsearch.randomizedtesting.ThreadLeakControl$3.evaluate(ThreadLeakControl.java:468)
	at com.carrotsearch.randomizedtesting.RandomizedRunner.runSingleTest(RandomizedRunner.java:943)
	at com.carrotsearch.randomizedtesting.RandomizedRunner$5.evaluate(RandomizedRunner.java:829)
	at com.carrotsearch.randomizedtesting.RandomizedRunner$6.evaluate(RandomizedRunner.java:879)
	at com.carrotsearch.randomizedtesting.RandomizedRunner$7.evaluate(RandomizedRunner.java:890)
	at org.apache.lucene.util.AbstractBeforeAfterRule$1.evaluate(AbstractBeforeAfterRule.java:45)
	at com.carrotsearch.randomizedtesting.rules.StatementAdapter.evaluate(StatementAdapter.java:36)
	at org.apache.lucene.util.TestRuleStoreClassName$1.evaluate(TestRuleStoreClassName.java:41)
	at com.carrotsearch.randomizedtesting.rules.NoShadowingOrOverridesOnMethodsRule$1.evaluate(NoShadowingOrOverridesOnMethodsRule.java:40)
	at com.carrotsearch.randomizedtesting.rules.NoShadowingOrOverridesOnMethodsRule$1.evaluate(NoShadowingOrOverridesOnMethodsRule.java:40)
	at com.carrotsearch.randomizedtesting.rules.StatementAdapter.evaluate(StatementAdapter.java:36)
	at com.carrotsearch.randomizedtesting.rules.StatementAdapter.evaluate(StatementAdapter.java:36)
	at com.carrotsearch.randomizedtesting.rules.StatementAdapter.evaluate(StatementAdapter.java:36)
	at org.apache.lucene.util.TestRuleAssertionsRequired$1.evaluate(TestRuleAssertionsRequired.java:53)
	at org.apache.lucene.util.TestRuleMarkFailure$1.evaluate(TestRuleMarkFailure.java:47)
	at org.apache.lucene.util.TestRuleIgnoreAfterMaxFailures$1.evaluate(TestRuleIgnoreAfterMaxFailures.java:64)
	at org.apache.lucene.util.TestRuleIgnoreTestSuites$1.evaluate(TestRuleIgnoreTestSuites.java:54)
	at com.carrotsearch.randomizedtesting.rules.StatementAdapter.evaluate(StatementAdapter.java:36)
	at com.carrotsearch.randomizedtesting.ThreadLeakControl$StatementRunner.run(ThreadLeakControl.java:368)
	at java.lang.Thread.run(Thread.java:748)




Build Log:
[...truncated 9499 lines...]
   [junit4] Suite: org.apache.lucene.document.TestLatLonShapeQueries
   [junit4]   2> NOTE: reproduce with: ant test  -Dtestcase=TestLatLonShapeQueries -Dtests.method=testRandomMedium -Dtests.seed=62D13477D093226D -Dtests.slow=true -Dtests.locale=be-BY -Dtests.timezone=Europe/Saratov -Dtests.asserts=true -Dtests.file.encoding=ISO-8859-1
   [junit4] FAILURE 18.5s J1 | TestLatLonShapeQueries.testRandomMedium <<<
   [junit4]    > Throwable #1: java.lang.AssertionError: wrong hit (first of possibly more):
   [junit4]    > FAIL: id=2503 should match but did not
   [junit4]    >   query=LatLonShapeBoundingBoxQuery: field=shape:Rectangle(lat=-44.92331048939377 TO 0.0 lon=8.381903171539307E-8 TO 0.9999999403953552) docID=2436
   [junit4]    >   polygon=[-4.190951585769653E-8, 0.0] [89.99999995809048, 0.0] [89.99999995809048, 179.99999991618097] [-4.190951585769653E-8, 0.0] 
   [junit4]    >   deleted?=false  rect=Rectangle(-44.92331048939377 TO 0.0 lon=8.381903171539307E-8 TO 0.9999999403953552)
   [junit4]    > 	at __randomizedtesting.SeedInfo.seed([62D13477D093226D:DF0F03DF91F6410B]:0)
   [junit4]    > 	at org.apache.lucene.document.TestLatLonShapeQueries.verifyRandomBBoxes(TestLatLonShapeQueries.java:263)
   [junit4]    > 	at org.apache.lucene.document.TestLatLonShapeQueries.verify(TestLatLonShapeQueries.java:134)
   [junit4]    > 	at org.apache.lucene.document.TestLatLonShapeQueries.doTestRandom(TestLatLonShapeQueries.java:130)
   [junit4]    > 	at org.apache.lucene.document.TestLatLonShapeQueries.testRandomMedium(TestLatLonShapeQueries.java:102)
   [junit4]    > 	at java.lang.Thread.run(Thread.java:748)
   [junit4] IGNOR/A 0.00s J1 | TestLatLonShapeQueries.testRandomBig
   [junit4]    > Assumption #1: 'nightly' test group is disabled (@Nightly())
   [junit4]   2> NOTE: leaving temporary files on disk at: /Users/jenkins/workspace/Lucene-Solr-master-MacOSX/lucene/build/sandbox/test/J1/temp/lucene.document.TestLatLonShapeQueries_62D13477D093226D-001
   [junit4]   2> NOTE: test params are: codec=Asserting(Lucene70): {id=PostingsFormat(name=MockRandom)}, docValues:{shape=DocValuesFormat(name=Lucene70), id=DocValuesFormat(name=Asserting)}, maxPointsInLeafNode=892, maxMBSortInHeap=6.621192662162256, sim=Asserting(org.apache.lucene.search.similarities.AssertingSimilarity@54ace834), locale=be-BY, timezone=Europe/Saratov
   [junit4]   2> NOTE: Mac OS X 10.11.6 x86_64/Oracle Corporation 1.8.0_172 (64-bit)/cpus=3,threads=1,free=22083112,total=107675648
   [junit4]   2> NOTE: All tests run in this JVM: [TestBigIntegerPoint, FuzzyLikeThisQueryTest, TestFieldCacheTermsFilter, TestFloatPointNearestNeighbor, TestIntervals, TestLatLonDocValuesQueries, TestLatLonShapeQueries]
   [junit4] Completed [20/24 (1!)] on J1 in 18.61s, 3 tests, 1 failure, 1 skipped <<< FAILURES!

[...truncated 53683 lines...]
[asciidoctor:convert] asciidoctor: ERROR: about-this-guide.adoc: line 1: invalid part, must have at least one section (e.g., chapter, appendix, etc.)
[asciidoctor:convert] asciidoctor: ERROR: solr-glossary.adoc: line 1: invalid part, must have at least one section (e.g., chapter, appendix, etc.)
     [java] Processed 2233 links (1787 relative) to 3129 anchors in 246 files
     [echo] Validated Links & Anchors via: /Users/jenkins/workspace/Lucene-Solr-master-MacOSX/solr/build/solr-ref-guide/bare-bones-html/

-documentation-lint:
    [jtidy] Checking for broken html (such as invalid tags)...
   [delete] Deleting directory /Users/jenkins/workspace/Lucene-Solr-master-MacOSX/lucene/build/jtidy_tmp
     [echo] Checking for broken links...
     [exec] 
     [exec] Crawl/parse...
     [exec] 
     [exec] Verify...
     [echo] Checking for malformed docs...

jar-checksums:

resolve:

ivy-availability-check:
[loadresource] Do not set property disallowed.ivy.jars.list as its length is 0.

-ivy-fail-disallowed-ivy-version:

ivy-fail:

ivy-configure:
[ivy:configure] :: loading settings :: file = /Users/jenkins/workspace/Lucene-Solr-master-MacOSX/lucene/top-level-ivy-settings.xml

resolve:

ivy-availability-check:
[loadresource] Do not set property disallowed.ivy.jars.list as its length is 0.

-ivy-fail-disallowed-ivy-version:

ivy-fail:

ivy-configure:
[ivy:configure] :: loading settings :: file = /Users/jenkins/workspace/Lucene-Solr-master-MacOSX/lucene/top-level-ivy-settings.xml

resolve:

resolve:

ivy-availability-check:
[loadresource] Do not set property disallowed.ivy.jars.list as its length is 0.

-ivy-fail-disallowed-ivy-version:

ivy-fail:

ivy-configure:
[ivy:configure] :: loading settings :: file = /Users/jenkins/workspace/Lucene-Solr-master-MacOSX/lucene/top-level-ivy-settings.xml

resolve:

ivy-availability-check:
[loadresource] Do not set property disallowed.ivy.jars.list as its length is 0.

-ivy-fail-disallowed-ivy-version:

ivy-fail:

ivy-configure:
[ivy:configure] :: loading settings :: file = /Users/jenkins/workspace/Lucene-Solr-master-MacOSX/lucene/top-level-ivy-settings.xml

resolve:

ivy-availability-check:
[loadresource] Do not set property disallowed.ivy.jars.list as its length is 0.

-ivy-fail-disallowed-ivy-version:

ivy-fail:

ivy-configure:
[ivy:configure] :: loading settings :: file = /Users/jenkins/workspace/Lucene-Solr-master-MacOSX/lucene/top-level-ivy-settings.xml

resolve:

ivy-availability-check:
[loadresource] Do not set property disallowed.ivy.jars.list as its length is 0.

-ivy-fail-disallowed-ivy-version:

ivy-fail:

ivy-configure:
[ivy:configure] :: loading settings :: file = /Users/jenkins/workspace/Lucene-Solr-master-MacOSX/lucene/top-level-ivy-settings.xml

resolve:

ivy-availability-check:
[loadresource] Do not set property disallowed.ivy.jars.list as its length is 0.

-ivy-fail-disallowed-ivy-version:

ivy-fail:

ivy-configure:
[ivy:configure] :: loading settings :: file = /Users/jenkins/workspace/Lucene-Solr-master-MacOSX/lucene/top-level-ivy-settings.xml

resolve:

ivy-availability-check:
[loadresource] Do not set property disallowed.ivy.jars.list as its length is 0.

-ivy-fail-disallowed-ivy-version:

ivy-fail:

ivy-configure:
[ivy:configure] :: loading settings :: file = /Users/jenkins/workspace/Lucene-Solr-master-MacOSX/lucene/top-level-ivy-settings.xml

resolve:

ivy-availability-check:
[loadresource] Do not set property disallowed.ivy.jars.list as its length is 0.

-ivy-fail-disallowed-ivy-version:

ivy-fail:

ivy-configure:
[ivy:configure] :: loading settings :: file = /Users/jenkins/workspace/Lucene-Solr-master-MacOSX/lucene/top-level-ivy-settings.xml

resolve:

ivy-availability-check:
[loadresource] Do not set property disallowed.ivy.jars.list as its length is 0.

-ivy-fail-disallowed-ivy-version:

ivy-fail:

ivy-configure:
[ivy:configure] :: loading settings :: file = /Users/jenkins/workspace/Lucene-Solr-master-MacOSX/lucene/top-level-ivy-settings.xml

resolve:

ivy-availability-check:
[loadresource] Do not set property disallowed.ivy.jars.list as its length is 0.

-ivy-fail-disallowed-ivy-version:

ivy-fail:

ivy-configure:
[ivy:configure] :: loading settings :: file = /Users/jenkins/workspace/Lucene-Solr-master-MacOSX/lucene/top-level-ivy-settings.xml

resolve:

ivy-availability-check:
[loadresource] Do not set property disallowed.ivy.jars.list as its length is 0.

-ivy-fail-disallowed-ivy-version:

ivy-fail:

ivy-configure:
[ivy:configure] :: loading settings :: file = /Users/jenkins/workspace/Lucene-Solr-master-MacOSX/lucene/top-level-ivy-settings.xml

resolve:

ivy-availability-check:
[loadresource] Do not set property disallowed.ivy.jars.list as its length is 0.

-ivy-fail-disallowed-ivy-version:

ivy-fail:

ivy-configure:
[ivy:configure] :: loading settings :: file = /Users/jenkins/workspace/Lucene-Solr-master-MacOSX/lucene/top-level-ivy-settings.xml

resolve:

ivy-availability-check:
[loadresource] Do not set property disallowed.ivy.jars.list as its length is 0.

-ivy-fail-disallowed-ivy-version:

ivy-fail:

ivy-configure:
[ivy:configure] :: loading settings :: file = /Users/jenkins/workspace/Lucene-Solr-master-MacOSX/lucene/top-level-ivy-settings.xml

resolve:

ivy-availability-check:
[loadresource] Do not set property disallowed.ivy.jars.list as its length is 0.

-ivy-fail-disallowed-ivy-version:

ivy-fail:

ivy-configure:
[ivy:configure] :: loading settings :: file = /Users/jenkins/workspace/Lucene-Solr-master-MacOSX/lucene/top-level-ivy-settings.xml

resolve:

ivy-availability-check:
[loadresource] Do not set property disallowed.ivy.jars.list as its length is 0.

-ivy-fail-disallowed-ivy-version:

ivy-fail:

ivy-configure:
[ivy:configure] :: loading settings :: file = /Users/jenkins/workspace/Lucene-Solr-master-MacOSX/lucene/top-level-ivy-settings.xml

resolve:

ivy-availability-check:
[loadresource] Do not set property disallowed.ivy.jars.list as its length is 0.

-ivy-fail-disallowed-ivy-version:

ivy-fail:

ivy-configure:
[ivy:configure] :: loading settings :: file = /Users/jenkins/workspace/Lucene-Solr-master-MacOSX/lucene/top-level-ivy-settings.xml

resolve:

ivy-availability-check:
[loadresource] Do not set property disallowed.ivy.jars.list as its length is 0.

-ivy-fail-disallowed-ivy-version:

ivy-fail:

ivy-configure:
[ivy:configure] :: loading settings :: file = /Users/jenkins/workspace/Lucene-Solr-master-MacOSX/lucene/top-level-ivy-settings.xml

resolve:

ivy-availability-check:
[loadresource] Do not set property disallowed.ivy.jars.list as its length is 0.

-ivy-fail-disallowed-ivy-version:

ivy-fail:

ivy-configure:
[ivy:configure] :: loading settings :: file = /Users/jenkins/workspace/Lucene-Solr-master-MacOSX/lucene/top-level-ivy-settings.xml

resolve:

ivy-availability-check:
[loadresource] Do not set property disallowed.ivy.jars.list as its length is 0.

-ivy-fail-disallowed-ivy-version:

ivy-fail:

ivy-configure:
[ivy:configure] :: loading settings :: file = /Users/jenkins/workspace/Lucene-Solr-master-MacOSX/lucene/top-level-ivy-settings.xml

resolve:

ivy-availability-check:
[loadresource] Do not set property disallowed.ivy.jars.list as its length is 0.

-ivy-fail-disallowed-ivy-version:

ivy-fail:

ivy-configure:
[ivy:configure] :: loading settings :: file = /Users/jenkins/workspace/Lucene-Solr-master-MacOSX/lucene/top-level-ivy-settings.xml

resolve:

ivy-availability-check:
[loadresource] Do not set property disallowed.ivy.jars.list as its length is 0.

-ivy-fail-disallowed-ivy-version:

ivy-fail:

ivy-configure:
[ivy:configure] :: loading settings :: file = /Users/jenkins/workspace/Lucene-Solr-master-MacOSX/lucene/top-level-ivy-settings.xml

resolve:

ivy-availability-check:
[loadresource] Do not set property disallowed.ivy.jars.list as its length is 0.

-ivy-fail-disallowed-ivy-version:

ivy-fail:

ivy-configure:
[ivy:configure] :: loading settings :: file = /Users/jenkins/workspace/Lucene-Solr-master-MacOSX/lucene/top-level-ivy-settings.xml

resolve:

ivy-availability-check:
[loadresource] Do not set property disallowed.ivy.jars.list as its length is 0.

-ivy-fail-disallowed-ivy-version:

ivy-fail:

ivy-configure:
[ivy:configure] :: loading settings :: file = /Users/jenkins/workspace/Lucene-Solr-master-MacOSX/lucene/top-level-ivy-settings.xml

resolve:

ivy-availability-check:
[loadresource] Do not set property disallowed.ivy.jars.list as its length is 0.

-ivy-fail-disallowed-ivy-version:

ivy-fail:

ivy-configure:
[ivy:configure] :: loading settings :: file = /Users/jenkins/workspace/Lucene-Solr-master-MacOSX/lucene/top-level-ivy-settings.xml

resolve:

ivy-availability-check:
[loadresource] Do not set property disallowed.ivy.jars.list as its length is 0.

-ivy-fail-disallowed-ivy-version:

ivy-fail:

ivy-configure:
[ivy:configure] :: loading settings :: file = /Users/jenkins/workspace/Lucene-Solr-master-MacOSX/lucene/top-level-ivy-settings.xml

common.resolve:

resolve:

ivy-availability-check:
[loadresource] Do not set property disallowed.ivy.jars.list as its length is 0.

-ivy-fail-disallowed-ivy-version:

ivy-fail:

ivy-configure:
[ivy:configure] :: loading settings :: file = /Users/jenkins/workspace/Lucene-Solr-master-MacOSX/lucene/top-level-ivy-settings.xml

resolve:

ivy-availability-check:
[loadresource] Do not set property disallowed.ivy.jars.list as its length is 0.

-ivy-fail-disallowed-ivy-version:

ivy-fail:

ivy-configure:
[ivy:configure] :: loading settings :: file = /Users/jenkins/workspace/Lucene-Solr-master-MacOSX/lucene/top-level-ivy-settings.xml

resolve:

ivy-availability-check:
[loadresource] Do not set property disallowed.ivy.jars.list as its length is 0.

-ivy-fail-disallowed-ivy-version:

ivy-fail:

ivy-configure:
[ivy:configure] :: loading settings :: file = /Users/jenkins/workspace/Lucene-Solr-master-MacOSX/lucene/top-level-ivy-settings.xml

resolve:

ivy-availability-check:
[loadresource] Do not set property disallowed.ivy.jars.list as its length is 0.

-ivy-fail-disallowed-ivy-version:

ivy-fail:

ivy-configure:
[ivy:configure] :: loading settings :: file = /Users/jenkins/workspace/Lucene-Solr-master-MacOSX/lucene/top-level-ivy-settings.xml

resolve:

ivy-availability-check:
[loadresource] Do not set property disallowed.ivy.jars.list as its length is 0.

-ivy-fail-disallowed-ivy-version:

ivy-fail:

ivy-configure:
[ivy:configure] :: loading settings :: file = /Users/jenkins/workspace/Lucene-Solr-master-MacOSX/lucene/top-level-ivy-settings.xml

resolve:

jar-checksums:
    [mkdir] Created dir: /Users/jenkins/workspace/Lucene-Solr-master-MacOSX/lucene/null1219465138
     [copy] Copying 36 files to /Users/jenkins/workspace/Lucene-Solr-master-MacOSX/lucene/null1219465138
   [delete] Deleting directory /Users/jenkins/workspace/Lucene-Solr-master-MacOSX/lucene/null1219465138

resolve-example:

ivy-availability-check:
[loadresource] Do not set property disallowed.ivy.jars.list as its length is 0.

-ivy-fail-disallowed-ivy-version:

ivy-fail:

ivy-configure:
[ivy:configure] :: loading settings :: file = /Users/jenkins/workspace/Lucene-Solr-master-MacOSX/lucene/top-level-ivy-settings.xml

resolve:

resolve-server:

ivy-availability-check:
[loadresource] Do not set property disallowed.ivy.jars.list as its length is 0.

-ivy-fail-disallowed-ivy-version:

ivy-fail:

ivy-fail:

ivy-configure:
[ivy:configure] :: loading settings :: file = /Users/jenkins/workspace/Lucene-Solr-master-MacOSX/lucene/top-level-ivy-settings.xml

resolve:

resolve:

ivy-availability-check:
[loadresource] Do not set property disallowed.ivy.jars.list as its length is 0.

-ivy-fail-disallowed-ivy-version:

ivy-fail:

ivy-fail:

ivy-configure:
[ivy:configure] :: loading settings :: file = /Users/jenkins/workspace/Lucene-Solr-master-MacOSX/lucene/top-level-ivy-settings.xml

resolve:

ivy-availability-check:
[loadresource] Do not set property disallowed.ivy.jars.list as its length is 0.

-ivy-fail-disallowed-ivy-version:

ivy-fail:

ivy-fail:

ivy-configure:
[ivy:configure] :: loading settings :: file = /Users/jenkins/workspace/Lucene-Solr-master-MacOSX/lucene/top-level-ivy-settings.xml

resolve:

ivy-availability-check:
[loadresource] Do not set property disallowed.ivy.jars.list as its length is 0.

-ivy-fail-disallowed-ivy-version:

ivy-fail:

ivy-configure:
[ivy:configure] :: loading settings :: file = /Users/jenkins/workspace/Lucene-Solr-master-MacOSX/lucene/top-level-ivy-settings.xml

resolve:

ivy-availability-check:
[loadresource] Do not set property disallowed.ivy.jars.list as its length is 0.

-ivy-fail-disallowed-ivy-version:

ivy-fail:

ivy-fail:

ivy-configure:
[ivy:configure] :: loading settings :: file = /Users/jenkins/workspace/Lucene-Solr-master-MacOSX/lucene/top-level-ivy-settings.xml

resolve:

ivy-availability-check:
[loadresource] Do not set property disallowed.ivy.jars.list as its length is 0.

-ivy-fail-disallowed-ivy-version:

ivy-fail:

ivy-configure:
[ivy:configure] :: loading settings :: file = /Users/jenkins/workspace/Lucene-Solr-master-MacOSX/lucene/top-level-ivy-settings.xml

resolve:

ivy-availability-check:
[loadresource] Do not set property disallowed.ivy.jars.list as its length is 0.

-ivy-fail-disallowed-ivy-version:

ivy-fail:

ivy-fail:

ivy-configure:
[ivy:configure] :: loading settings :: file = /Users/jenkins/workspace/Lucene-Solr-master-MacOSX/lucene/top-level-ivy-settings.xml

resolve:

ivy-availability-check:
[loadresource] Do not set property disallowed.ivy.jars.list as its length is 0.

-ivy-fail-disallowed-ivy-version:

ivy-fail:

ivy-fail:

ivy-configure:
[ivy:configure] :: loading settings :: file = /Users/jenkins/workspace/Lucene-Solr-master-MacOSX/lucene/top-level-ivy-settings.xml

resolve:

ivy-availability-check:
[loadresource] Do not set property disallowed.ivy.jars.list as its length is 0.

-ivy-fail-disallowed-ivy-version:

ivy-fail:

ivy-fail:

ivy-configure:
[ivy:configure] :: loading settings :: file = /Users/jenkins/workspace/Lucene-Solr-master-MacOSX/lucene/top-level-ivy-settings.xml

resolve:

ivy-availability-check:
[loadresource] Do not set property disallowed.ivy.jars.list as its length is 0.

-ivy-fail-disallowed-ivy-version:

ivy-fail:

ivy-fail:

ivy-configure:
[ivy:configure] :: loading settings :: file = /Users/jenkins/workspace/Lucene-Solr-master-MacOSX/lucene/top-level-ivy-settings.xml

resolve:

ivy-availability-check:
[loadresource] Do not set property disallowed.ivy.jars.list as its length is 0.

-ivy-fail-disallowed-ivy-version:

ivy-fail:

ivy-fail:

ivy-configure:
[ivy:configure] :: loading settings :: file = /Users/jenkins/workspace/Lucene-Solr-master-MacOSX/lucene/top-level-ivy-settings.xml

resolve:

ivy-availability-check:
[loadresource] Do not set property disallowed.ivy.jars.list as its length is 0.

-ivy-fail-disallowed-ivy-version:

ivy-fail:

ivy-fail:

ivy-configure:
[ivy:configure] :: loading settings :: file = /Users/jenkins/workspace/Lucene-Solr-master-MacOSX/lucene/top-level-ivy-settings.xml

resolve:

ivy-availability-check:
[loadresource] Do not set property disallowed.ivy.jars.list as its length is 0.

-ivy-fail-disallowed-ivy-version:

ivy-fail:

ivy-fail:

ivy-configure:
[ivy:configure] :: loading settings :: file = /Users/jenkins/workspace/Lucene-Solr-master-MacOSX/lucene/top-level-ivy-settings.xml

resolve:

ivy-availability-check:
[loadresource] Do not set property disallowed.ivy.jars.list as its length is 0.

-ivy-fail-disallowed-ivy-version:

ivy-fail:

ivy-fail:

ivy-configure:
[ivy:configure] :: loading settings :: file = /Users/jenkins/workspace/Lucene-Solr-master-MacOSX/lucene/top-level-ivy-settings.xml

resolve:

ivy-availability-check:
[loadresource] Do not set property disallowed.ivy.jars.list as its length is 0.

-ivy-fail-disallowed-ivy-version:

ivy-fail:

ivy-fail:

ivy-configure:
[ivy:configure] :: loading settings :: file = /Users/jenkins/workspace/Lucene-Solr-master-MacOSX/lucene/top-level-ivy-settings.xml

resolve:

ivy-availability-check:
[loadresource] Do not set property disallowed.ivy.jars.list as its length is 0.

-ivy-fail-disallowed-ivy-version:

ivy-fail:

ivy-fail:

ivy-configure:
[ivy:configure] :: loading settings :: file = /Users/jenkins/workspace/Lucene-Solr-master-MacOSX/lucene/top-level-ivy-settings.xml

resolve:

jar-checksums:
    [mkdir] Created dir: /Users/jenkins/workspace/Lucene-Solr-master-MacOSX/solr/null1093095008
     [copy] Copying 241 files to /Users/jenkins/workspace/Lucene-Solr-master-MacOSX/solr/null1093095008
   [delete] Deleting directory /Users/jenkins/workspace/Lucene-Solr-master-MacOSX/solr/null1093095008

check-working-copy:
[ivy:cachepath] :: resolving dependencies :: org.eclipse.jgit#org.eclipse.jgit-caller;working
[ivy:cachepath] 	confs: [default]
[ivy:cachepath] 	found org.eclipse.jgit#org.eclipse.jgit;4.6.0.201612231935-r in public
[ivy:cachepath] 	found com.jcraft#jsch;0.1.53 in public
[ivy:cachepath] 	found com.googlecode.javaewah#JavaEWAH;1.1.6 in public
[ivy:cachepath] 	found org.apache.httpcomponents#httpclient;4.3.6 in public
[ivy:cachepath] 	found org.apache.httpcomponents#httpcore;4.3.3 in public
[ivy:cachepath] 	found commons-logging#commons-logging;1.1.3 in public
[ivy:cachepath] 	found commons-codec#commons-codec;1.6 in public
[ivy:cachepath] 	found org.slf4j#slf4j-api;1.7.2 in public
[ivy:cachepath] :: resolution report :: resolve 45ms :: artifacts dl 4ms
	---------------------------------------------------------------------
	|                  |            modules            ||   artifacts   |
	|       conf       | number| search|dwnlded|evicted|| number|dwnlded|
	---------------------------------------------------------------------
	|      default     |   8   |   0   |   0   |   0   ||   8   |   0   |
	---------------------------------------------------------------------
[wc-checker] Initializing working copy...
[wc-checker] SLF4J: Failed to load class "org.slf4j.impl.StaticLoggerBinder".
[wc-checker] SLF4J: Defaulting to no-operation (NOP) logger implementation
[wc-checker] SLF4J: See http://www.slf4j.org/codes.html#StaticLoggerBinder for further details.
[wc-checker] Checking working copy status...

-jenkins-base:

BUILD SUCCESSFUL
Total time: 109 minutes 27 seconds
Setting ANT_1_8_2_HOME=/Users/jenkins/tools/hudson.tasks.Ant_AntInstallation/ANT_1.8.2
[Lucene-Solr-master-MacOSX] $ /bin/sh -xe /var/folders/qg/h2dfw5s161s51l2bn79mrb7r0000gn/T/jenkins6124213969849525946.sh
+ mv lucene/build lucene/build.orig
+ mv solr/build solr/build.orig
+ export ANT_HOME=/Users/jenkins/tools/hudson.tasks.Ant_AntInstallation/ANT_1.8.2
+ ANT_HOME=/Users/jenkins/tools/hudson.tasks.Ant_AntInstallation/ANT_1.8.2
+ export PATH=/Users/jenkins/tools/hudson.tasks.Ant_AntInstallation/ANT_1.8.2/bin:/Users/jenkins/tools/java/64bit/jdk1.8.0/bin:/usr/bin:/bin:/usr/sbin:/sbin:/usr/local/bin
+ PATH=/Users/jenkins/tools/hudson.tasks.Ant_AntInstallation/ANT_1.8.2/bin:/Users/jenkins/tools/java/64bit/jdk1.8.0/bin:/usr/bin:/bin:/usr/sbin:/sbin:/usr/local/bin
+ python3 -u dev-tools/scripts/reproduceJenkinsFailures.py --no-git https://jenkins.thetaphi.de/job/Lucene-Solr-master-MacOSX/4736/consoleText
[repro] Jenkins log URL: https://jenkins.thetaphi.de/job/Lucene-Solr-master-MacOSX/4736/consoleText

[repro] Revision: 1e50030940c2b089542e180d1abc6af66ac0c947

[repro] Ant options: "-Dargs=-XX:+UseCompressedOops -XX:+UseSerialGC"
[repro] Repro line:  ant test  -Dtestcase=TestLatLonShapeQueries -Dtests.method=testRandomMedium -Dtests.seed=62D13477D093226D -Dtests.slow=true -Dtests.locale=be-BY -Dtests.timezone=Europe/Saratov -Dtests.asserts=true -Dtests.file.encoding=ISO-8859-1

[repro] ant clean
Buildfile: /Users/jenkins/workspace/Lucene-Solr-master-MacOSX/build.xml

clean:

clean:

clean:

BUILD SUCCESSFUL
Total time: 0 seconds
[repro] Test suites by module:
[repro]    lucene/sandbox
[repro]       TestLatLonShapeQueries
[repro] ant compile-test
Buildfile: /Users/jenkins/workspace/Lucene-Solr-master-MacOSX/lucene/sandbox/build.xml

-check-git-state:

-git-cleanroot:

-copy-git-state:
    [mkdir] Created dir: /Users/jenkins/workspace/Lucene-Solr-master-MacOSX/lucene/build
     [copy] Copying 1 file to /Users/jenkins/workspace/Lucene-Solr-master-MacOSX/lucene/build

git-autoclean:

ivy-availability-check:
[loadresource] Do not set property disallowed.ivy.jars.list as its length is 0.

-ivy-fail-disallowed-ivy-version:

ivy-fail:

ivy-configure:
[ivy:configure] :: Apache Ivy 2.4.0 - 20141213170938 :: http://ant.apache.org/ivy/ ::
[ivy:configure] :: loading settings :: file = /Users/jenkins/workspace/Lucene-Solr-master-MacOSX/lucene/top-level-ivy-settings.xml

resolve:

common.init:

compile-lucene-core:

-check-git-state:

-git-cleanroot:

-copy-git-state:

git-autoclean:

ivy-availability-check:
[loadresource] Do not set property disallowed.ivy.jars.list as its length is 0.

-ivy-fail-disallowed-ivy-version:

ivy-fail:

ivy-configure:
[ivy:configure] :: loading settings :: file = /Users/jenkins/workspace/Lucene-Solr-master-MacOSX/lucene/top-level-ivy-settings.xml

resolve:

init:

-clover.disable:

-clover.load:

-clover.classpath:

-clover.setup:

clover:

compile-core:
    [mkdir] Created dir: /Users/jenkins/workspace/Lucene-Solr-master-MacOSX/lucene/build/core/classes/java
    [javac] Compiling 846 source files to /Users/jenkins/workspace/Lucene-Solr-master-MacOSX/lucene/build/core/classes/java
    [javac] Note: Some input files use or override a deprecated API.
    [javac] Note: Recompile with -Xlint:deprecation for details.
    [javac] Creating empty /Users/jenkins/workspace/Lucene-Solr-master-MacOSX/lucene/build/core/classes/java/org/apache/lucene/util/graph/package-info.class
    [javac] Creating empty /Users/jenkins/workspace/Lucene-Solr-master-MacOSX/lucene/build/core/classes/java/org/apache/lucene/document/package-info.class
    [javac] Creating empty /Users/jenkins/workspace/Lucene-Solr-master-MacOSX/lucene/build/core/classes/java/org/apache/lucene/package-info.class
    [javac] Creating empty /Users/jenkins/workspace/Lucene-Solr-master-MacOSX/lucene/build/core/classes/java/org/apache/lucene/util/bkd/package-info.class
    [javac] Creating empty /Users/jenkins/workspace/Lucene-Solr-master-MacOSX/lucene/build/core/classes/java/org/apache/lucene/codecs/compressing/package-info.class
    [javac] Creating empty /Users/jenkins/workspace/Lucene-Solr-master-MacOSX/lucene/build/core/classes/java/org/apache/lucene/codecs/lucene60/package-info.class
    [javac] Creating empty /Users/jenkins/workspace/Lucene-Solr-master-MacOSX/lucene/build/core/classes/java/org/apache/lucene/codecs/package-info.class
    [javac] Creating empty /Users/jenkins/workspace/Lucene-Solr-master-MacOSX/lucene/build/core/classes/java/org/apache/lucene/util/package-info.class
    [javac] Creating empty /Users/jenkins/workspace/Lucene-Solr-master-MacOSX/lucene/build/core/classes/java/org/apache/lucene/index/package-info.class
    [javac] Creating empty /Users/jenkins/workspace/Lucene-Solr-master-MacOSX/lucene/build/core/classes/java/org/apache/lucene/util/fst/package-info.class
    [javac] Creating empty /Users/jenkins/workspace/Lucene-Solr-master-MacOSX/lucene/build/core/classes/java/org/apache/lucene/analysis/tokenattributes/package-info.class
    [javac] Creating empty /Users/jenkins/workspace/Lucene-Solr-master-MacOSX/lucene/build/core/classes/java/org/apache/lucene/search/package-info.class
    [javac] Creating empty /Users/jenkins/workspace/Lucene-Solr-master-MacOSX/lucene/build/core/classes/java/org/apache/lucene/util/packed/package-info.class
    [javac] Creating empty /Users/jenkins/workspace/Lucene-Solr-master-MacOSX/lucene/build/core/classes/java/org/apache/lucene/util/mutable/package-info.class
    [javac] Creating empty /Users/jenkins/workspace/Lucene-Solr-master-MacOSX/lucene/build/core/classes/java/org/apache/lucene/codecs/lucene70/package-info.class
    [javac] Creating empty /Users/jenkins/workspace/Lucene-Solr-master-MacOSX/lucene/build/core/classes/java/org/apache/lucene/codecs/perfield/package-info.class
    [javac] Creating empty /Users/jenkins/workspace/Lucene-Solr-master-MacOSX/lucene/build/core/classes/java/org/apache/lucene/analysis/package-info.class
    [javac] Creating empty /Users/jenkins/workspace/Lucene-Solr-master-MacOSX/lucene/build/core/classes/java/org/apache/lucene/analysis/standard/package-info.class
    [javac] Creating empty /Users/jenkins/workspace/Lucene-Solr-master-MacOSX/lucene/build/core/classes/java/org/apache/lucene/store/package-info.class
    [javac] Creating empty /Users/jenkins/workspace/Lucene-Solr-master-MacOSX/lucene/build/core/classes/java/org/apache/lucene/codecs/blocktree/package-info.class
    [javac] Creating empty /Users/jenkins/workspace/Lucene-Solr-master-MacOSX/lucene/build/core/classes/java/org/apache/lucene/search/spans/package-info.class
    [javac] Creating empty /Users/jenkins/workspace/Lucene-Solr-master-MacOSX/lucene/build/core/classes/java/org/apache/lucene/search/similarities/package-info.class
    [javac] Creating empty /Users/jenkins/workspace/Lucene-Solr-master-MacOSX/lucene/build/core/classes/java/org/apache/lucene/util/automaton/package-info.class
    [javac] Creating empty /Users/jenkins/workspace/Lucene-Solr-master-MacOSX/lucene/build/core/classes/java/org/apache/lucene/codecs/lucene50/package-info.class
    [javac] Creating empty /Users/jenkins/workspace/Lucene-Solr-master-MacOSX/lucene/build/core/classes/java/org/apache/lucene/geo/package-info.class
     [copy] Copying 3 files to /Users/jenkins/workspace/Lucene-Solr-master-MacOSX/lucene/build/core/classes/java

init:

compile-test:

-check-git-state:

-git-cleanroot:

-copy-git-state:

git-autoclean:

ivy-availability-check:

ivy-configure:
[ivy:configure] :: loading settings :: file = /Users/jenkins/workspace/Lucene-Solr-master-MacOSX/lucene/top-level-ivy-settings.xml

resolve:

common.init:

compile-lucene-core:

init:

-clover.disable:

-clover.load:

-clover.classpath:

-clover.setup:

clover:

compile-core:
    [mkdir] Created dir: /Users/jenkins/workspace/Lucene-Solr-master-MacOSX/lucene/build/sandbox/classes/java
    [javac] Compiling 60 source files to /Users/jenkins/workspace/Lucene-Solr-master-MacOSX/lucene/build/sandbox/classes/java
    [javac] Note: Some input files use or override a deprecated API.
    [javac] Note: Recompile with -Xlint:deprecation for details.
    [javac] Creating empty /Users/jenkins/workspace/Lucene-Solr-master-MacOSX/lucene/build/sandbox/classes/java/org/apache/lucene/search/intervals/package-info.class
    [javac] Creating empty /Users/jenkins/workspace/Lucene-Solr-master-MacOSX/lucene/build/sandbox/classes/java/org/apache/lucene/codecs/idversion/package-info.class
    [javac] Creating empty /Users/jenkins/workspace/Lucene-Solr-master-MacOSX/lucene/build/sandbox/classes/java/org/apache/lucene/payloads/package-info.class
    [javac] Creating empty /Users/jenkins/workspace/Lucene-Solr-master-MacOSX/lucene/build/sandbox/classes/java/org/apache/lucene/sandbox/queries/package-info.class
     [copy] Copying 1 file to /Users/jenkins/workspace/Lucene-Solr-master-MacOSX/lucene/build/sandbox/classes/java

compile-test-framework:

-check-git-state:

-git-cleanroot:

-copy-git-state:

git-autoclean:

ivy-availability-check:
[loadresource] Do not set property disallowed.ivy.jars.list as its length is 0.

-ivy-fail-disallowed-ivy-version:

ivy-fail:

ivy-configure:
[ivy:configure] :: loading settings :: file = /Users/jenkins/workspace/Lucene-Solr-master-MacOSX/lucene/top-level-ivy-settings.xml

resolve:

init:

compile-lucene-core:

compile-codecs:

-check-git-state:

-git-cleanroot:

-copy-git-state:

git-autoclean:

ivy-availability-check:
[loadresource] Do not set property disallowed.ivy.jars.list as its length is 0.

-ivy-fail-disallowed-ivy-version:

ivy-fail:

ivy-configure:
[ivy:configure] :: loading settings :: file = /Users/jenkins/workspace/Lucene-Solr-master-MacOSX/lucene/top-level-ivy-settings.xml

resolve:

common.init:

compile-lucene-core:

init:

-clover.disable:

-clover.load:

-clover.classpath:

-clover.setup:

clover:

compile-core:
    [mkdir] Created dir: /Users/jenkins/workspace/Lucene-Solr-master-MacOSX/lucene/build/codecs/classes/java
    [javac] Compiling 63 source files to /Users/jenkins/workspace/Lucene-Solr-master-MacOSX/lucene/build/codecs/classes/java
    [javac] Note: Some input files use or override a deprecated API.
    [javac] Note: Recompile with -Xlint:deprecation for details.
    [javac] Creating empty /Users/jenkins/workspace/Lucene-Solr-master-MacOSX/lucene/build/codecs/classes/java/org/apache/lucene/codecs/bloom/package-info.class
    [javac] Creating empty /Users/jenkins/workspace/Lucene-Solr-master-MacOSX/lucene/build/codecs/classes/java/org/apache/lucene/codecs/memory/package-info.class
    [javac] Creating empty /Users/jenkins/workspace/Lucene-Solr-master-MacOSX/lucene/build/codecs/classes/java/org/apache/lucene/codecs/simpletext/package-info.class
    [javac] Creating empty /Users/jenkins/workspace/Lucene-Solr-master-MacOSX/lucene/build/codecs/classes/java/org/apache/lucene/codecs/blockterms/package-info.class
    [javac] Creating empty /Users/jenkins/workspace/Lucene-Solr-master-MacOSX/lucene/build/codecs/classes/java/org/apache/lucene/codecs/blocktreeords/package-info.class
     [copy] Copying 3 files to /Users/jenkins/workspace/Lucene-Solr-master-MacOSX/lucene/build/codecs/classes/java

-clover.disable:

-clover.load:

-clover.classpath:

-clover.setup:

clover:

common.compile-core:
    [mkdir] Created dir: /Users/jenkins/workspace/Lucene-Solr-master-MacOSX/lucene/build/test-framework/classes/java
    [javac] Compiling 194 source files to /Users/jenkins/workspace/Lucene-Solr-master-MacOSX/lucene/build/test-framework/classes/java
    [javac] Note: Some input files use or override a deprecated API.
    [javac] Note: Recompile with -Xlint:deprecation for details.
    [javac] Creating empty /Users/jenkins/workspace/Lucene-Solr-master-MacOSX/lucene/build/test-framework/classes/java/org/apache/lucene/codecs/asserting/package-info.class
    [javac] Creating empty /Users/jenkins/workspace/Lucene-Solr-master-MacOSX/lucene/build/test-framework/classes/java/org/apache/lucene/codecs/ramonly/package-info.class
    [javac] Creating empty /Users/jenkins/workspace/Lucene-Solr-master-MacOSX/lucene/build/test-framework/classes/java/org/apache/lucene/mockfile/package-info.class
    [javac] Creating empty /Users/jenkins/workspace/Lucene-Solr-master-MacOSX/lucene/build/test-framework/classes/java/org/apache/lucene/codecs/cheapbastard/package-info.class
    [javac] Creating empty /Users/jenkins/workspace/Lucene-Solr-master-MacOSX/lucene/build/test-framework/classes/java/org/apache/lucene/codecs/mockrandom/package-info.class
    [javac] Creating empty /Users/jenkins/workspace/Lucene-Solr-master-MacOSX/lucene/build/test-framework/classes/java/org/apache/lucene/codecs/cranky/package-info.class
    [javac] Creating empty /Users/jenkins/workspace/Lucene-Solr-master-MacOSX/lucene/build/test-framework/classes/java/org/apache/lucene/codecs/compressing/dummy/package-info.class
     [copy] Copying 4 files to /Users/jenkins/workspace/Lucene-Solr-master-MacOSX/lucene/build/test-framework/classes/java

compile-core:

common.compile-test:
    [mkdir] Created dir: /Users/jenkins/workspace/Lucene-Solr-master-MacOSX/lucene/build/sandbox/classes/test
    [javac] Compiling 26 source files to /Users/jenkins/workspace/Lucene-Solr-master-MacOSX/lucene/build/sandbox/classes/test
    [javac] Note: /Users/jenkins/workspace/Lucene-Solr-master-MacOSX/lucene/sandbox/src/test/org/apache/lucene/document/TestHalfFloatPoint.java uses or overrides a deprecated API.
    [javac] Note: Recompile with -Xlint:deprecation for details.

BUILD SUCCESSFUL
Total time: 17 seconds
[repro] ant test-nocompile -Dtests.dups=5 -Dtests.maxfailures=5 -Dtests.class="*.TestLatLonShapeQueries" -Dtests.showOutput=onerror "-Dargs=-XX:+UseCompressedOops -XX:+UseSerialGC" -Dtests.seed=62D13477D093226D -Dtests.slow=true -Dtests.locale=be-BY -Dtests.timezone=Europe/Saratov -Dtests.asserts=true -Dtests.file.encoding=ISO-8859-1
Buildfile: /Users/jenkins/workspace/Lucene-Solr-master-MacOSX/lucene/sandbox/build.xml

-clover.disable:

ivy-configure:
[ivy:configure] :: Apache Ivy 2.4.0 - 20141213170938 :: http://ant.apache.org/ivy/ ::
[ivy:configure] :: loading settings :: file = /Users/jenkins/workspace/Lucene-Solr-master-MacOSX/lucene/top-level-ivy-settings.xml

install-junit4-taskdef:

ivy-availability-check:
[loadresource] Do not set property disallowed.ivy.jars.list as its length is 0.

-ivy-fail-disallowed-ivy-version:

ivy-fail:

resolve-groovy:
[ivy:cachepath] :: resolving dependencies :: org.codehaus.groovy#groovy-all-caller;working
[ivy:cachepath] 	confs: [default]
[ivy:cachepath] 	found org.codehaus.groovy#groovy-all;2.4.15 in public
[ivy:cachepath] :: resolution report :: resolve 20ms :: artifacts dl 1ms
	---------------------------------------------------------------------
	|                  |            modules            ||   artifacts   |
	|       conf       | number| search|dwnlded|evicted|| number|dwnlded|
	---------------------------------------------------------------------
	|      default     |   1   |   0   |   0   |   0   ||   1   |   0   |
	---------------------------------------------------------------------

-init-totals:

-test:
    [mkdir] Created dir: /Users/jenkins/workspace/Lucene-Solr-master-MacOSX/lucene/build/sandbox/test
[junit4:pickseed] Seed property 'tests.seed' already defined: 62D13477D093226D
    [mkdir] Created dir: /Users/jenkins/workspace/Lucene-Solr-master-MacOSX/lucene/build/sandbox/test/temp
   [junit4] <JUnit4> says ahoj! Master seed: 62D13477D093226D
   [junit4] Executing 5 suites with 2 JVMs.
   [junit4] 
   [junit4] Started J1 PID(83728@localhost).
   [junit4] Started J0 PID(83727@localhost).
   [junit4] Suite: org.apache.lucene.document.TestLatLonShapeQueries
   [junit4] OK      1.96s J1 | TestLatLonShapeQueries.testRandomTiny
   [junit4]   2> NOTE: reproduce with: ant test  -Dtestcase=TestLatLonShapeQueries -Dtests.method=testRandomMedium -Dtests.seed=62D13477D093226D -Dtests.slow=true -Dtests.badapples=true -Dtests.locale=be-BY -Dtests.timezone=Europe/Saratov -Dtests.asserts=true -Dtests.file.encoding=ISO-8859-1
   [junit4] FAILURE 28.3s J1 | TestLatLonShapeQueries.testRandomMedium <<<
   [junit4]    > Throwable #1: java.lang.AssertionError: wrong hit (first of possibly more):
   [junit4]    > FAIL: id=2503 should match but did not
   [junit4]    >   query=LatLonShapeBoundingBoxQuery: field=shape:Rectangle(lat=-44.92331048939377 TO 0.0 lon=8.381903171539307E-8 TO 0.9999999403953552) docID=2436
   [junit4]    >   polygon=[-4.190951585769653E-8, 0.0] [89.99999995809048, 0.0] [89.99999995809048, 179.99999991618097] [-4.190951585769653E-8, 0.0] 
   [junit4]    >   deleted?=false  rect=Rectangle(-44.92331048939377 TO 0.0 lon=8.381903171539307E-8 TO 0.9999999403953552)
   [junit4]    > 	at __randomizedtesting.SeedInfo.seed([62D13477D093226D:DF0F03DF91F6410B]:0)
   [junit4]    > 	at org.apache.lucene.document.TestLatLonShapeQueries.verifyRandomBBoxes(TestLatLonShapeQueries.java:263)
   [junit4]    > 	at org.apache.lucene.document.TestLatLonShapeQueries.verify(TestLatLonShapeQueries.java:134)
   [junit4]    > 	at org.apache.lucene.document.TestLatLonShapeQueries.doTestRandom(TestLatLonShapeQueries.java:130)
   [junit4]    > 	at org.apache.lucene.document.TestLatLonShapeQueries.testRandomMedium(TestLatLonShapeQueries.java:102)
   [junit4]    > 	at java.lang.Thread.run(Thread.java:748)
   [junit4] IGNOR/A 0.01s J1 | TestLatLonShapeQueries.testRandomBig
   [junit4]    > Assumption #1: 'nightly' test group is disabled (@Nightly())
   [junit4]   2> NOTE: leaving temporary files on disk at: /Users/jenkins/workspace/Lucene-Solr-master-MacOSX/lucene/build/sandbox/test/J1/temp/lucene.document.TestLatLonShapeQueries_62D13477D093226D-001
   [junit4]   2> NOTE: test params are: codec=Asserting(Lucene70): {id=PostingsFormat(name=MockRandom)}, docValues:{shape=DocValuesFormat(name=Lucene70), id=DocValuesFormat(name=Asserting)}, maxPointsInLeafNode=892, maxMBSortInHeap=6.621192662162256, sim=Asserting(org.apache.lucene.search.similarities.AssertingSimilarity@1ae8ddbf), locale=be-BY, timezone=Europe/Saratov
   [junit4]   2> NOTE: Mac OS X 10.11.6 x86_64/Oracle Corporation 1.8.0_172 (64-bit)/cpus=3,threads=1,free=36874080,total=113606656
   [junit4]   2> NOTE: All tests run in this JVM: [TestLatLonShapeQueries]
   [junit4] Completed [1/5 (1!)] on J1 in 31.19s, 3 tests, 1 failure, 1 skipped <<< FAILURES!
   [junit4] 
   [junit4] Suite: org.apache.lucene.document.TestLatLonShapeQueries
   [junit4] OK      1.82s J0 | TestLatLonShapeQueries.testRandomTiny
   [junit4]   2> NOTE: reproduce with: ant test  -Dtestcase=TestLatLonShapeQueries -Dtests.method=testRandomMedium -Dtests.seed=62D13477D093226D -Dtests.slow=true -Dtests.badapples=true -Dtests.locale=be-BY -Dtests.timezone=Europe/Saratov -Dtests.asserts=true -Dtests.file.encoding=ISO-8859-1
   [junit4] FAILURE 28.8s J0 | TestLatLonShapeQueries.testRandomMedium <<<
   [junit4]    > Throwable #1: java.lang.AssertionError: wrong hit (first of possibly more):
   [junit4]    > FAIL: id=2503 should match but did not
   [junit4]    >   query=LatLonShapeBoundingBoxQuery: field=shape:Rectangle(lat=-44.92331048939377 TO 0.0 lon=8.381903171539307E-8 TO 0.9999999403953552) docID=2436
   [junit4]    >   polygon=[-4.190951585769653E-8, 0.0] [89.99999995809048, 0.0] [89.99999995809048, 179.99999991618097] [-4.190951585769653E-8, 0.0] 
   [junit4]    >   deleted?=false  rect=Rectangle(-44.92331048939377 TO 0.0 lon=8.381903171539307E-8 TO 0.9999999403953552)
   [junit4]    > 	at __randomizedtesting.SeedInfo.seed([62D13477D093226D:DF0F03DF91F6410B]:0)
   [junit4]    > 	at org.apache.lucene.document.TestLatLonShapeQueries.verifyRandomBBoxes(TestLatLonShapeQueries.java:263)
   [junit4]    > 	at org.apache.lucene.document.TestLatLonShapeQueries.verify(TestLatLonShapeQueries.java:134)
   [junit4]    > 	at org.apache.lucene.document.TestLatLonShapeQueries.doTestRandom(TestLatLonShapeQueries.java:130)
   [junit4]    > 	at org.apache.lucene.document.TestLatLonShapeQueries.testRandomMedium(TestLatLonShapeQueries.java:102)
   [junit4]    > 	at java.lang.Thread.run(Thread.java:748)
   [junit4] IGNOR/A 0.01s J0 | TestLatLonShapeQueries.testRandomBig
   [junit4]    > Assumption #1: 'nightly' test group is disabled (@Nightly())
   [junit4]   2> NOTE: leaving temporary files on disk at: /Users/jenkins/workspace/Lucene-Solr-master-MacOSX/lucene/build/sandbox/test/J0/temp/lucene.document.TestLatLonShapeQueries_62D13477D093226D-001
   [junit4]   2> NOTE: test params are: codec=Asserting(Lucene70): {id=PostingsFormat(name=MockRandom)}, docValues:{shape=DocValuesFormat(name=Lucene70), id=DocValuesFormat(name=Asserting)}, maxPointsInLeafNode=892, maxMBSortInHeap=6.621192662162256, sim=Asserting(org.apache.lucene.search.similarities.AssertingSimilarity@1ae8ddbf), locale=be-BY, timezone=Europe/Saratov
   [junit4]   2> NOTE: Mac OS X 10.11.6 x86_64/Oracle Corporation 1.8.0_172 (64-bit)/cpus=3,threads=1,free=24638264,total=115847168
   [junit4]   2> NOTE: All tests run in this JVM: [TestLatLonShapeQueries]
   [junit4] Completed [2/5 (2!)] on J0 in 31.49s, 3 tests, 1 failure, 1 skipped <<< FAILURES!
   [junit4] 
   [junit4] Duplicate suite name used with XML reports: org.apache.lucene.document.TestLatLonShapeQueries. This may confuse tools that process XML reports. Set 'ignoreDuplicateSuites' to true to skip this message.
   [junit4] Suite: org.apache.lucene.document.TestLatLonShapeQueries
   [junit4] OK      0.04s J0 | TestLatLonShapeQueries.testRandomTiny
   [junit4]   2> NOTE: reproduce with: ant test  -Dtestcase=TestLatLonShapeQueries -Dtests.method=testRandomMedium -Dtests.seed=62D13477D093226D -Dtests.slow=true -Dtests.badapples=true -Dtests.locale=be-BY -Dtests.timezone=Europe/Saratov -Dtests.asserts=true -Dtests.file.encoding=ISO-8859-1
   [junit4] FAILURE 23.4s J0 | TestLatLonShapeQueries.testRandomMedium <<<
   [junit4]    > Throwable #1: java.lang.AssertionError: wrong hit (first of possibly more):
   [junit4]    > FAIL: id=2503 should match but did not
   [junit4]    >   query=LatLonShapeBoundingBoxQuery: field=shape:Rectangle(lat=-44.92331048939377 TO 0.0 lon=8.381903171539307E-8 TO 0.9999999403953552) docID=2436
   [junit4]    >   polygon=[-4.190951585769653E-8, 0.0] [89.99999995809048, 0.0] [89.99999995809048, 179.99999991618097] [-4.190951585769653E-8, 0.0] 
   [junit4]    >   deleted?=false  rect=Rectangle(-44.92331048939377 TO 0.0 lon=8.381903171539307E-8 TO 0.9999999403953552)
   [junit4]    > 	at __randomizedtesting.SeedInfo.seed([62D13477D093226D:DF0F03DF91F6410B]:0)
   [junit4]    > 	at org.apache.lucene.document.TestLatLonShapeQueries.verifyRandomBBoxes(TestLatLonShapeQueries.java:263)
   [junit4]    > 	at org.apache.lucene.document.TestLatLonShapeQueries.verify(TestLatLonShapeQueries.java:134)
   [junit4]    > 	at org.apache.lucene.document.TestLatLonShapeQueries.doTestRandom(TestLatLonShapeQueries.java:130)
   [junit4]    > 	at org.apache.lucene.document.TestLatLonShapeQueries.testRandomMedium(TestLatLonShapeQueries.java:102)
   [junit4]    > 	at java.lang.Thread.run(Thread.java:748)
   [junit4] IGNOR/A 0.00s J0 | TestLatLonShapeQueries.testRandomBig
   [junit4]    > Assumption #1: 'nightly' test group is disabled (@Nightly())
   [junit4]   2> NOTE: leaving temporary files on disk at: /Users/jenkins/workspace/Lucene-Solr-master-MacOSX/lucene/build/sandbox/test/J0/temp/lucene.document.TestLatLonShapeQueries_62D13477D093226D-002
   [junit4]   2> NOTE: test params are: codec=Asserting(Lucene70): {id=PostingsFormat(name=MockRandom)}, docValues:{shape=DocValuesFormat(name=Lucene70), id=DocValuesFormat(name=Asserting)}, maxPointsInLeafNode=892, maxMBSortInHeap=6.621192662162256, sim=Asserting(org.apache.lucene.search.similarities.AssertingSimilarity@6585f8ca), locale=be-BY, timezone=Europe/Saratov
   [junit4]   2> NOTE: Mac OS X 10.11.6 x86_64/Oracle Corporation 1.8.0_172 (64-bit)/cpus=3,threads=1,free=25445056,total=115847168
   [junit4]   2> NOTE: All tests run in this JVM: [TestLatLonShapeQueries, TestLatLonShapeQueries]
   [junit4] Completed [3/5 (3!)] on J0 in 23.42s, 3 tests, 1 failure, 1 skipped <<< FAILURES!
   [junit4] 
   [junit4] Suite: org.apache.lucene.document.TestLatLonShapeQueries
   [junit4] OK      0.12s J1 | TestLatLonShapeQueries.testRandomTiny
   [junit4]   2> NOTE: reproduce with: ant test  -Dtestcase=TestLatLonShapeQueries -Dtests.method=testRandomMedium -Dtests.seed=62D13477D093226D -Dtests.slow=true -Dtests.badapples=true -Dtests.locale=be-BY -Dtests.timezone=Europe/Saratov -Dtests.asserts=true -Dtests.file.encoding=ISO-8859-1
   [junit4] FAILURE 23.7s J1 | TestLatLonShapeQueries.testRandomMedium <<<
   [junit4]    > Throwable #1: java.lang.AssertionError: wrong hit (first of possibly more):
   [junit4]    > FAIL: id=2503 should match but did not
   [junit4]    >   query=LatLonShapeBoundingBoxQuery: field=shape:Rectangle(lat=-44.92331048939377 TO 0.0 lon=8.381903171539307E-8 TO 0.9999999403953552) docID=2436
   [junit4]    >   polygon=[-4.190951585769653E-8, 0.0] [89.99999995809048, 0.0] [89.99999995809048, 179.99999991618097] [-4.190951585769653E-8, 0.0] 
   [junit4]    >   deleted?=false  rect=Rectangle(-44.92331048939377 TO 0.0 lon=8.381903171539307E-8 TO 0.9999999403953552)
   [junit4]    > 	at __randomizedtesting.SeedInfo.seed([62D13477D093226D:DF0F03DF91F6410B]:0)
   [junit4]    > 	at org.apache.lucene.document.TestLatLonShapeQueries.verifyRandomBBoxes(TestLatLonShapeQueries.java:263)
   [junit4]    > 	at org.apache.lucene.document.TestLatLonShapeQueries.verify(TestLatLonShapeQueries.java:134)
   [junit4]    > 	at org.apache.lucene.document.TestLatLonShapeQueries.doTestRandom(TestLatLonShapeQueries.java:130)
   [junit4]    > 	at org.apache.lucene.document.TestLatLonShapeQueries.testRandomMedium(TestLatLonShapeQueries.java:102)
   [junit4]    > 	at java.lang.Thread.run(Thread.java:748)
   [junit4] IGNOR/A 0.00s J1 | TestLatLonShapeQueries.testRandomBig
   [junit4]    > Assumption #1: 'nightly' test group is disabled (@Nightly())
   [junit4]   2> NOTE: leaving temporary files on disk at: /Users/jenkins/workspace/Lucene-Solr-master-MacOSX/lucene/build/sandbox/test/J1/temp/lucene.document.TestLatLonShapeQueries_62D13477D093226D-002
   [junit4]   2> NOTE: test params are: codec=Asserting(Lucene70): {id=PostingsFormat(name=MockRandom)}, docValues:{shape=DocValuesFormat(name=Lucene70), id=DocValuesFormat(name=Asserting)}, maxPointsInLeafNode=892, maxMBSortInHeap=6.621192662162256, sim=Asserting(org.apache.lucene.search.similarities.AssertingSimilarity@693580b3), locale=be-BY, timezone=Europe/Saratov
   [junit4]   2> NOTE: Mac OS X 10.11.6 x86_64/Oracle Corporation 1.8.0_172 (64-bit)/cpus=3,threads=1,free=14639352,total=113606656
   [junit4]   2> NOTE: All tests run in this JVM: [TestLatLonShapeQueries, TestLatLonShapeQueries]
   [junit4] Completed [4/5 (4!)] on J1 in 23.79s, 3 tests, 1 failure, 1 skipped <<< FAILURES!
   [junit4] 
   [junit4] Suite: org.apache.lucene.document.TestLatLonShapeQueries
   [junit4] OK      0.04s J0 | TestLatLonShapeQueries.testRandomTiny
   [junit4]   2> NOTE: reproduce with: ant test  -Dtestcase=TestLatLonShapeQueries -Dtests.method=testRandomMedium -Dtests.seed=62D13477D093226D -Dtests.slow=true -Dtests.badapples=true -Dtests.locale=be-BY -Dtests.timezone=Europe/Saratov -Dtests.asserts=true -Dtests.file.encoding=ISO-8859-1
   [junit4] FAILURE 16.2s J0 | TestLatLonShapeQueries.testRandomMedium <<<
   [junit4]    > Throwable #1: java.lang.AssertionError: wrong hit (first of possibly more):
   [junit4]    > FAIL: id=2503 should match but did not
   [junit4]    >   query=LatLonShapeBoundingBoxQuery: field=shape:Rectangle(lat=-44.92331048939377 TO 0.0 lon=8.381903171539307E-8 TO 0.9999999403953552) docID=2436
   [junit4]    >   polygon=[-4.190951585769653E-8, 0.0] [89.99999995809048, 0.0] [89.99999995809048, 179.99999991618097] [-4.190951585769653E-8, 0.0] 
   [junit4]    >   deleted?=false  rect=Rectangle(-44.92331048939377 TO 0.0 lon=8.381903171539307E-8 TO 0.9999999403953552)
   [junit4]    > 	at __randomizedtesting.SeedInfo.seed([62D13477D093226D:DF0F03DF91F6410B]:0)
   [junit4]    > 	at org.apache.lucene.document.TestLatLonShapeQueries.verifyRandomBBoxes(TestLatLonShapeQueries.java:263)
   [junit4]    > 	at org.apache.lucene.document.TestLatLonShapeQueries.verify(TestLatLonShapeQueries.java:134)
   [junit4]    > 	at org.apache.lucene.document.TestLatLonShapeQueries.doTestRandom(TestLatLonShapeQueries.java:130)
   [junit4]    > 	at org.apache.lucene.document.TestLatLonShapeQueries.testRandomMedium(TestLatLonShapeQueries.java:102)
   [junit4]    > 	at java.lang.Thread.run(Thread.java:748)
   [junit4] IGNOR/A 0.00s J0 | TestLatLonShapeQueries.testRandomBig
   [junit4]    > Assumption #1: 'nightly' test group is disabled (@Nightly())
   [junit4]   2> NOTE: leaving temporary files on disk at: /Users/jenkins/workspace/Lucene-Solr-master-MacOSX/lucene/build/sandbox/test/J0/temp/lucene.document.TestLatLonShapeQueries_62D13477D093226D-003
   [junit4]   2> NOTE: test params are: codec=Asserting(Lucene70): {id=PostingsFormat(name=MockRandom)}, docValues:{shape=DocValuesFormat(name=Lucene70), id=DocValuesFormat(name=Asserting)}, maxPointsInLeafNode=892, maxMBSortInHeap=6.621192662162256, sim=Asserting(org.apache.lucene.search.similarities.AssertingSimilarity@59185b2c), locale=be-BY, timezone=Europe/Saratov
   [junit4]   2> NOTE: Mac OS X 10.11.6 x86_64/Oracle Corporation 1.8.0_172 (64-bit)/cpus=3,threads=1,free=67013800,total=115847168
   [junit4]   2> NOTE: All tests run in this JVM: [TestLatLonShapeQueries, TestLatLonShapeQueries, TestLatLonShapeQueries]
   [junit4] Completed [5/5 (5!)] on J0 in 16.31s, 3 tests, 1 failure, 1 skipped <<< FAILURES!
   [junit4] 
   [junit4] 
   [junit4] Tests with failures [seed: 62D13477D093226D]:
   [junit4]   - org.apache.lucene.document.TestLatLonShapeQueries.testRandomMedium
   [junit4]   - org.apache.lucene.document.TestLatLonShapeQueries.testRandomMedium
   [junit4]   - org.apache.lucene.document.TestLatLonShapeQueries.testRandomMedium
   [junit4]   - org.apache.lucene.document.TestLatLonShapeQueries.testRandomMedium
   [junit4]   - org.apache.lucene.document.TestLatLonShapeQueries.testRandomMedium
   [junit4] 
   [junit4] 
   [junit4] JVM J0:     0.97 ..    73.41 =    72.44s
   [junit4] JVM J1:     0.97 ..    57.57 =    56.61s
   [junit4] Execution time total: 1 minute 13 seconds
   [junit4] Tests summary: 5 suites, 15 tests, 5 failures, 5 ignored (5 assumptions)

BUILD FAILED
/Users/jenkins/workspace/Lucene-Solr-master-MacOSX/lucene/common-build.xml:1568: The following error occurred while executing this line:
/Users/jenkins/workspace/Lucene-Solr-master-MacOSX/lucene/common-build.xml:1092: There were test failures: 5 suites, 15 tests, 5 failures, 5 ignored (5 assumptions) [seed: 62D13477D093226D]

Total time: 1 minute 15 seconds

[repro] Setting last failure code to 256

[repro] Failures:
[repro]   5/5 failed: org.apache.lucene.document.TestLatLonShapeQueries
[repro] Exiting with code 256
+ mv lucene/build lucene/build.repro
+ mv solr/build solr/build.repro
mv: rename solr/build to solr/build.repro: No such file or directory
+ true
+ mv lucene/build.orig lucene/build
+ mv solr/build.orig solr/build
Archiving artifacts
Setting ANT_1_8_2_HOME=/Users/jenkins/tools/hudson.tasks.Ant_AntInstallation/ANT_1.8.2
[WARNINGS] Parsing warnings in console log with parser Java Compiler (javac)
Setting ANT_1_8_2_HOME=/Users/jenkins/tools/hudson.tasks.Ant_AntInstallation/ANT_1.8.2
Setting ANT_1_8_2_HOME=/Users/jenkins/tools/hudson.tasks.Ant_AntInstallation/ANT_1.8.2
<Git Blamer> Using GitBlamer to create author and commit information for all warnings.
<Git Blamer> GIT_COMMIT=1e50030940c2b089542e180d1abc6af66ac0c947, workspace=/Users/jenkins/workspace/Lucene-Solr-master-MacOSX
[WARNINGS] Computing warning deltas based on reference build #4735
Recording test results
Setting ANT_1_8_2_HOME=/Users/jenkins/tools/hudson.tasks.Ant_AntInstallation/ANT_1.8.2
Build step 'Publish JUnit test result report' changed build result to UNSTABLE
Email was triggered for: Unstable (Test Failures)
Sending email for trigger: Unstable (Test Failures)
Setting ANT_1_8_2_HOME=/Users/jenkins/tools/hudson.tasks.Ant_AntInstallation/ANT_1.8.2
Setting ANT_1_8_2_HOME=/Users/jenkins/tools/hudson.tasks.Ant_AntInstallation/ANT_1.8.2
Setting ANT_1_8_2_HOME=/Users/jenkins/tools/hudson.tasks.Ant_AntInstallation/ANT_1.8.2
Setting ANT_1_8_2_HOME=/Users/jenkins/tools/hudson.tasks.Ant_AntInstallation/ANT_1.8.2

Mime
View raw message