lucene-dev mailing list archives

Site index · List index
Message view « Date » · « Thread »
Top « Date » · « Thread »
From Erick Erickson <erickerick...@gmail.com>
Subject Re: [JENKINS] Lucene-Solr-Tests-7.x - Build # 673 - Unstable
Date Thu, 12 Jul 2018 14:40:28 GMT
Likely 12008, digging although I'm traveling today so it might be a bit.

On Thu, Jul 12, 2018, 02:02 Apache Jenkins Server <jenkins@builds.apache.org>
wrote:

> Build: https://builds.apache.org/job/Lucene-Solr-Tests-7.x/673/
>
> 4 tests failed.
> FAILED:  org.apache.solr.logging.TestLogWatcher.testLog4jWatcher
>
> Error Message:
>
>
> Stack Trace:
> java.lang.AssertionError
>         at org.junit.Assert.fail(Assert.java:92)
>         at org.junit.Assert.assertTrue(Assert.java:43)
>         at org.junit.Assert.assertTrue(Assert.java:54)
>         at
> org.apache.solr.logging.TestLogWatcher.testLog4jWatcher(TestLogWatcher.java:49)
>         at sun.reflect.NativeMethodAccessorImpl.invoke0(Native Method)
>         at
> sun.reflect.NativeMethodAccessorImpl.invoke(NativeMethodAccessorImpl.java:62)
>         at
> sun.reflect.DelegatingMethodAccessorImpl.invoke(DelegatingMethodAccessorImpl.java:43)
>         at java.lang.reflect.Method.invoke(Method.java:498)
>         at
> org.junit.runners.model.FrameworkMethod$1.runReflectiveCall(FrameworkMethod.java:45)
>         at
> org.junit.internal.runners.model.ReflectiveCallable.run(ReflectiveCallable.java:15)
>         at
> org.junit.runners.model.FrameworkMethod.invokeExplosively(FrameworkMethod.java:42)
>         at
> org.junit.internal.runners.statements.InvokeMethod.evaluate(InvokeMethod.java:20)
>         at
> org.junit.internal.runners.statements.RunBefores.evaluate(RunBefores.java:28)
>         at org.junit.runners.ParentRunner.runLeaf(ParentRunner.java:263)
>         at
> org.junit.runners.BlockJUnit4ClassRunner.runChild(BlockJUnit4ClassRunner.java:68)
>         at
> org.junit.runners.BlockJUnit4ClassRunner.runChild(BlockJUnit4ClassRunner.java:47)
>         at org.junit.runners.ParentRunner$3.run(ParentRunner.java:231)
>         at org.junit.runners.ParentRunner$1.schedule(ParentRunner.java:60)
>         at
> org.junit.runners.ParentRunner.runChildren(ParentRunner.java:229)
>         at org.junit.runners.ParentRunner.access$000(ParentRunner.java:50)
>         at org.junit.runners.ParentRunner$2.evaluate(ParentRunner.java:222)
>         at org.junit.runners.ParentRunner.run(ParentRunner.java:300)
>         at
> com.carrotsearch.ant.tasks.junit4.slave.SlaveMain.execute(SlaveMain.java:251)
>         at
> com.carrotsearch.ant.tasks.junit4.slave.SlaveMain.main(SlaveMain.java:368)
>         at
> com.carrotsearch.ant.tasks.junit4.slave.SlaveMainSafe.main(SlaveMainSafe.java:13)
>
>
> FAILED:  org.apache.solr.logging.TestLogWatcher.testLog4jWatcherRepeat
>
> Error Message:
>
>
> Stack Trace:
> java.lang.AssertionError
>         at org.junit.Assert.fail(Assert.java:92)
>         at org.junit.Assert.assertTrue(Assert.java:43)
>         at org.junit.Assert.assertTrue(Assert.java:54)
>         at
> org.apache.solr.logging.TestLogWatcher.testLog4jWatcherRepeat(TestLogWatcher.java:69)
>         at sun.reflect.NativeMethodAccessorImpl.invoke0(Native Method)
>         at
> sun.reflect.NativeMethodAccessorImpl.invoke(NativeMethodAccessorImpl.java:62)
>         at
> sun.reflect.DelegatingMethodAccessorImpl.invoke(DelegatingMethodAccessorImpl.java:43)
>         at java.lang.reflect.Method.invoke(Method.java:498)
>         at
> org.junit.runners.model.FrameworkMethod$1.runReflectiveCall(FrameworkMethod.java:45)
>         at
> org.junit.internal.runners.model.ReflectiveCallable.run(ReflectiveCallable.java:15)
>         at
> org.junit.runners.model.FrameworkMethod.invokeExplosively(FrameworkMethod.java:42)
>         at
> org.junit.internal.runners.statements.InvokeMethod.evaluate(InvokeMethod.java:20)
>         at
> org.junit.internal.runners.statements.RunBefores.evaluate(RunBefores.java:28)
>         at org.junit.runners.ParentRunner.runLeaf(ParentRunner.java:263)
>         at
> org.junit.runners.BlockJUnit4ClassRunner.runChild(BlockJUnit4ClassRunner.java:68)
>         at
> org.junit.runners.BlockJUnit4ClassRunner.runChild(BlockJUnit4ClassRunner.java:47)
>         at org.junit.runners.ParentRunner$3.run(ParentRunner.java:231)
>         at org.junit.runners.ParentRunner$1.schedule(ParentRunner.java:60)
>         at
> org.junit.runners.ParentRunner.runChildren(ParentRunner.java:229)
>         at org.junit.runners.ParentRunner.access$000(ParentRunner.java:50)
>         at org.junit.runners.ParentRunner$2.evaluate(ParentRunner.java:222)
>         at org.junit.runners.ParentRunner.run(ParentRunner.java:300)
>         at
> com.carrotsearch.ant.tasks.junit4.slave.SlaveMain.execute(SlaveMain.java:251)
>         at
> com.carrotsearch.ant.tasks.junit4.slave.SlaveMain.main(SlaveMain.java:368)
>         at
> com.carrotsearch.ant.tasks.junit4.slave.SlaveMainSafe.main(SlaveMainSafe.java:13)
>
>
> FAILED:
> org.apache.solr.metrics.reporters.SolrSlf4jReporterTest.testReporter
>
> Error Message:
> Test requires that log-level is at-least INFO, but INFO is disabled
>
> Stack Trace:
> java.lang.AssertionError: Test requires that log-level is at-least INFO,
> but INFO is disabled
>         at
> __randomizedtesting.SeedInfo.seed([9F29715433B793A6:C0CD5C6358BB00E3]:0)
>         at org.junit.Assert.fail(Assert.java:93)
>         at
> org.apache.solr.metrics.reporters.SolrSlf4jReporterTest.ensureLoggingConfiguredAppropriately(SolrSlf4jReporterTest.java:100)
>         at
> org.apache.solr.metrics.reporters.SolrSlf4jReporterTest.testReporter(SolrSlf4jReporterTest.java:49)
>         at sun.reflect.NativeMethodAccessorImpl.invoke0(Native Method)
>         at
> sun.reflect.NativeMethodAccessorImpl.invoke(NativeMethodAccessorImpl.java:62)
>         at
> sun.reflect.DelegatingMethodAccessorImpl.invoke(DelegatingMethodAccessorImpl.java:43)
>         at java.lang.reflect.Method.invoke(Method.java:498)
>         at
> com.carrotsearch.randomizedtesting.RandomizedRunner.invoke(RandomizedRunner.java:1737)
>         at
> com.carrotsearch.randomizedtesting.RandomizedRunner$8.evaluate(RandomizedRunner.java:934)
>         at
> com.carrotsearch.randomizedtesting.RandomizedRunner$9.evaluate(RandomizedRunner.java:970)
>         at
> com.carrotsearch.randomizedtesting.RandomizedRunner$10.evaluate(RandomizedRunner.java:984)
>         at
> com.carrotsearch.randomizedtesting.rules.SystemPropertiesRestoreRule$1.evaluate(SystemPropertiesRestoreRule.java:57)
>         at
> org.apache.lucene.util.TestRuleSetupTeardownChained$1.evaluate(TestRuleSetupTeardownChained.java:49)
>         at
> org.apache.lucene.util.AbstractBeforeAfterRule$1.evaluate(AbstractBeforeAfterRule.java:45)
>         at
> org.apache.lucene.util.TestRuleThreadAndTestName$1.evaluate(TestRuleThreadAndTestName.java:48)
>         at
> org.apache.lucene.util.TestRuleIgnoreAfterMaxFailures$1.evaluate(TestRuleIgnoreAfterMaxFailures.java:64)
>         at
> org.apache.lucene.util.TestRuleMarkFailure$1.evaluate(TestRuleMarkFailure.java:47)
>         at
> com.carrotsearch.randomizedtesting.rules.StatementAdapter.evaluate(StatementAdapter.java:36)
>         at
> com.carrotsearch.randomizedtesting.ThreadLeakControl$StatementRunner.run(ThreadLeakControl.java:368)
>         at
> com.carrotsearch.randomizedtesting.ThreadLeakControl.forkTimeoutingTask(ThreadLeakControl.java:817)
>         at
> com.carrotsearch.randomizedtesting.ThreadLeakControl$3.evaluate(ThreadLeakControl.java:468)
>         at
> com.carrotsearch.randomizedtesting.RandomizedRunner.runSingleTest(RandomizedRunner.java:943)
>         at
> com.carrotsearch.randomizedtesting.RandomizedRunner$5.evaluate(RandomizedRunner.java:829)
>         at
> com.carrotsearch.randomizedtesting.RandomizedRunner$6.evaluate(RandomizedRunner.java:879)
>         at
> com.carrotsearch.randomizedtesting.RandomizedRunner$7.evaluate(RandomizedRunner.java:890)
>         at
> com.carrotsearch.randomizedtesting.rules.StatementAdapter.evaluate(StatementAdapter.java:36)
>         at
> com.carrotsearch.randomizedtesting.rules.SystemPropertiesRestoreRule$1.evaluate(SystemPropertiesRestoreRule.java:57)
>         at
> org.apache.lucene.util.AbstractBeforeAfterRule$1.evaluate(AbstractBeforeAfterRule.java:45)
>         at
> com.carrotsearch.randomizedtesting.rules.StatementAdapter.evaluate(StatementAdapter.java:36)
>         at
> org.apache.lucene.util.TestRuleStoreClassName$1.evaluate(TestRuleStoreClassName.java:41)
>         at
> com.carrotsearch.randomizedtesting.rules.NoShadowingOrOverridesOnMethodsRule$1.evaluate(NoShadowingOrOverridesOnMethodsRule.java:40)
>         at
> com.carrotsearch.randomizedtesting.rules.NoShadowingOrOverridesOnMethodsRule$1.evaluate(NoShadowingOrOverridesOnMethodsRule.java:40)
>         at
> com.carrotsearch.randomizedtesting.rules.StatementAdapter.evaluate(StatementAdapter.java:36)
>         at
> com.carrotsearch.randomizedtesting.rules.StatementAdapter.evaluate(StatementAdapter.java:36)
>         at
> com.carrotsearch.randomizedtesting.rules.StatementAdapter.evaluate(StatementAdapter.java:36)
>         at
> org.apache.lucene.util.TestRuleAssertionsRequired$1.evaluate(TestRuleAssertionsRequired.java:53)
>         at
> org.apache.lucene.util.TestRuleMarkFailure$1.evaluate(TestRuleMarkFailure.java:47)
>         at
> org.apache.lucene.util.TestRuleIgnoreAfterMaxFailures$1.evaluate(TestRuleIgnoreAfterMaxFailures.java:64)
>         at
> org.apache.lucene.util.TestRuleIgnoreTestSuites$1.evaluate(TestRuleIgnoreTestSuites.java:54)
>         at
> com.carrotsearch.randomizedtesting.rules.StatementAdapter.evaluate(StatementAdapter.java:36)
>         at
> com.carrotsearch.randomizedtesting.ThreadLeakControl$StatementRunner.run(ThreadLeakControl.java:368)
>         at java.lang.Thread.run(Thread.java:748)
>
>
> FAILED:
> org.apache.solr.update.processor.UpdateRequestProcessorFactoryTest.testUpdateDistribChainSkipping
>
> Error Message:
> Tests must be run with INFO level logging otherwise LogUpdateProcessor
> isn't used and can't be tested.
>
> Stack Trace:
> java.lang.AssertionError: Tests must be run with INFO level logging
> otherwise LogUpdateProcessor isn't used and can't be tested.
>         at
> __randomizedtesting.SeedInfo.seed([9F29715433B793A6:EECD8F82455CB46A]:0)
>         at org.junit.Assert.fail(Assert.java:93)
>         at org.junit.Assert.assertTrue(Assert.java:43)
>         at
> org.apache.solr.update.processor.UpdateRequestProcessorFactoryTest.testUpdateDistribChainSkipping(UpdateRequestProcessorFactoryTest.java:101)
>         at sun.reflect.NativeMethodAccessorImpl.invoke0(Native Method)
>         at
> sun.reflect.NativeMethodAccessorImpl.invoke(NativeMethodAccessorImpl.java:62)
>         at
> sun.reflect.DelegatingMethodAccessorImpl.invoke(DelegatingMethodAccessorImpl.java:43)
>         at java.lang.reflect.Method.invoke(Method.java:498)
>         at
> com.carrotsearch.randomizedtesting.RandomizedRunner.invoke(RandomizedRunner.java:1737)
>         at
> com.carrotsearch.randomizedtesting.RandomizedRunner$8.evaluate(RandomizedRunner.java:934)
>         at
> com.carrotsearch.randomizedtesting.RandomizedRunner$9.evaluate(RandomizedRunner.java:970)
>         at
> com.carrotsearch.randomizedtesting.RandomizedRunner$10.evaluate(RandomizedRunner.java:984)
>         at
> com.carrotsearch.randomizedtesting.rules.SystemPropertiesRestoreRule$1.evaluate(SystemPropertiesRestoreRule.java:57)
>         at
> org.apache.lucene.util.TestRuleSetupTeardownChained$1.evaluate(TestRuleSetupTeardownChained.java:49)
>         at
> org.apache.lucene.util.AbstractBeforeAfterRule$1.evaluate(AbstractBeforeAfterRule.java:45)
>         at
> org.apache.lucene.util.TestRuleThreadAndTestName$1.evaluate(TestRuleThreadAndTestName.java:48)
>         at
> org.apache.lucene.util.TestRuleIgnoreAfterMaxFailures$1.evaluate(TestRuleIgnoreAfterMaxFailures.java:64)
>         at
> org.apache.lucene.util.TestRuleMarkFailure$1.evaluate(TestRuleMarkFailure.java:47)
>         at
> com.carrotsearch.randomizedtesting.rules.StatementAdapter.evaluate(StatementAdapter.java:36)
>         at
> com.carrotsearch.randomizedtesting.ThreadLeakControl$StatementRunner.run(ThreadLeakControl.java:368)
>         at
> com.carrotsearch.randomizedtesting.ThreadLeakControl.forkTimeoutingTask(ThreadLeakControl.java:817)
>         at
> com.carrotsearch.randomizedtesting.ThreadLeakControl$3.evaluate(ThreadLeakControl.java:468)
>         at
> com.carrotsearch.randomizedtesting.RandomizedRunner.runSingleTest(RandomizedRunner.java:943)
>         at
> com.carrotsearch.randomizedtesting.RandomizedRunner$5.evaluate(RandomizedRunner.java:829)
>         at
> com.carrotsearch.randomizedtesting.RandomizedRunner$6.evaluate(RandomizedRunner.java:879)
>         at
> com.carrotsearch.randomizedtesting.RandomizedRunner$7.evaluate(RandomizedRunner.java:890)
>         at
> com.carrotsearch.randomizedtesting.rules.StatementAdapter.evaluate(StatementAdapter.java:36)
>         at
> com.carrotsearch.randomizedtesting.rules.SystemPropertiesRestoreRule$1.evaluate(SystemPropertiesRestoreRule.java:57)
>         at
> org.apache.lucene.util.AbstractBeforeAfterRule$1.evaluate(AbstractBeforeAfterRule.java:45)
>         at
> com.carrotsearch.randomizedtesting.rules.StatementAdapter.evaluate(StatementAdapter.java:36)
>         at
> org.apache.lucene.util.TestRuleStoreClassName$1.evaluate(TestRuleStoreClassName.java:41)
>         at
> com.carrotsearch.randomizedtesting.rules.NoShadowingOrOverridesOnMethodsRule$1.evaluate(NoShadowingOrOverridesOnMethodsRule.java:40)
>         at
> com.carrotsearch.randomizedtesting.rules.NoShadowingOrOverridesOnMethodsRule$1.evaluate(NoShadowingOrOverridesOnMethodsRule.java:40)
>         at
> com.carrotsearch.randomizedtesting.rules.StatementAdapter.evaluate(StatementAdapter.java:36)
>         at
> com.carrotsearch.randomizedtesting.rules.StatementAdapter.evaluate(StatementAdapter.java:36)
>         at
> com.carrotsearch.randomizedtesting.rules.StatementAdapter.evaluate(StatementAdapter.java:36)
>         at
> org.apache.lucene.util.TestRuleAssertionsRequired$1.evaluate(TestRuleAssertionsRequired.java:53)
>         at
> org.apache.lucene.util.TestRuleMarkFailure$1.evaluate(TestRuleMarkFailure.java:47)
>         at
> org.apache.lucene.util.TestRuleIgnoreAfterMaxFailures$1.evaluate(TestRuleIgnoreAfterMaxFailures.java:64)
>         at
> org.apache.lucene.util.TestRuleIgnoreTestSuites$1.evaluate(TestRuleIgnoreTestSuites.java:54)
>         at
> com.carrotsearch.randomizedtesting.rules.StatementAdapter.evaluate(StatementAdapter.java:36)
>         at
> com.carrotsearch.randomizedtesting.ThreadLeakControl$StatementRunner.run(ThreadLeakControl.java:368)
>         at java.lang.Thread.run(Thread.java:748)
>
>
>
>
> Build Log:
> [...truncated 12762 lines...]
>    [junit4] Suite:
> org.apache.solr.update.processor.UpdateRequestProcessorFactoryTest
>    [junit4]   2> Creating dataDir:
> /x1/jenkins/jenkins-slave/workspace/Lucene-Solr-Tests-7.x/solr/build/solr-core/test/J1/temp/solr.update.processor.UpdateRequestProcessorFactoryTest_9F29715433B793A6-001/init-core-data-001
>    [junit4]   2> NOTE: reproduce with: ant test
> -Dtestcase=UpdateRequestProcessorFactoryTest
> -Dtests.method=testUpdateDistribChainSkipping -Dtests.seed=9F29715433B793A6
> -Dtests.multiplier=2 -Dtests.slow=true -Dtests.locale=hi
> -Dtests.timezone=America/Lima -Dtests.asserts=true
> -Dtests.file.encoding=US-ASCII
>    [junit4] FAILURE 0.00s J1 |
> UpdateRequestProcessorFactoryTest.testUpdateDistribChainSkipping <<<
>    [junit4]    > Throwable #1: java.lang.AssertionError: Tests must be run
> with INFO level logging otherwise LogUpdateProcessor isn't used and can't
> be tested.
>    [junit4]    >        at
> __randomizedtesting.SeedInfo.seed([9F29715433B793A6:EECD8F82455CB46A]:0)
>    [junit4]    >        at
> org.apache.solr.update.processor.UpdateRequestProcessorFactoryTest.testUpdateDistribChainSkipping(UpdateRequestProcessorFactoryTest.java:101)
>    [junit4]    >        at java.lang.Thread.run(Thread.java:748)
>    [junit4]   2> NOTE: leaving temporary files on disk at:
> /x1/jenkins/jenkins-slave/workspace/Lucene-Solr-Tests-7.x/solr/build/solr-core/test/J1/temp/solr.update.processor.UpdateRequestProcessorFactoryTest_9F29715433B793A6-001
>    [junit4]   2> Jul 12, 2018 7:46:03 AM
> com.carrotsearch.randomizedtesting.ThreadLeakControl checkThreadLeaks
>    [junit4]   2> WARNING: Will linger awaiting termination of 1 leaked
> thread(s).
>    [junit4]   2> NOTE: test params are: codec=CheapBastard,
> sim=RandomSimilarity(queryNorm=false): {}, locale=hi, timezone=America/Lima
>    [junit4]   2> NOTE: Linux 3.13.0-88-generic amd64/Oracle Corporation
> 1.8.0_172 (64-bit)/cpus=4,threads=1,free=169160880,total=433586176
>    [junit4]   2> NOTE: All tests run in this JVM: [TestIndexSearcher,
> SuggesterTest, AddSchemaFieldsUpdateProcessorFactoryTest,
> TestFunctionQuery, TestConfig, TestConfigSetsAPIExclusivity,
> TestOverriddenPrefixQueryForCustomFieldType, CachingDirectoryFactoryTest,
> GraphQueryTest, TestSortByMinMaxFunction, QueryElevationComponentTest,
> UUIDFieldTest, TestDeleteCollectionOnDownNodes, SolrInfoBeanTest,
> TestSolrCloudSnapshots, TestExecutePlanAction,
> SpellPossibilityIteratorTest, MinimalSchemaTest, TestSortableTextField,
> TestComponentsName, ChaosMonkeyNothingIsSafeWithPullReplicasTest,
> TestReplicationHandlerBackup, TestSchemaSimilarityResource,
> MetricsHistoryIntegrationTest, TestLeaderElectionWithEmptyReplica,
> JsonLoaderTest, TestReversedWildcardFilterFactory, CSVRequestHandlerTest,
> TestRandomFlRTGCloud, SchemaVersionSpecificBehaviorTest,
> TestBinaryResponseWriter, TestTlogReplica, CurrencyRangeFacetCloudTest,
> PKIAuthenticationIntegrationTest, MBeansHandlerTest, TestDirectoryFactory,
> CheckHdfsIndexTest, HdfsRecoverLeaseTest,
> ClassificationUpdateProcessorFactoryTest, PropertiesRequestHandlerTest,
> RankQueryTest, TestImplicitCoreProperties,
> BigEndianAscendingWordDeserializerTest, TestSubQueryTransformerCrossCore,
> TestConfigSetProperties, TestDocTermOrds, CdcrBidirectionalTest,
> ExplicitHLLTest, TestJavabinTupleStreamParser, TestSolrJ,
> BlockJoinFacetDistribTest, NoCacheHeaderTest,
> TestRequestStatusCollectionAPI, TestMissingGroups, ZkCLITest,
> ScheduledTriggerIntegrationTest, UpdateRequestProcessorFactoryTest]
>    [junit4] Completed [161/823 (1!)] on J1 in 0.93s, 3 tests, 1 failure
> <<< FAILURES!
>
> [...truncated 1807 lines...]
>    [junit4] Suite: org.apache.solr.logging.TestLogWatcher
>    [junit4] FAILURE 0.00s J0 | TestLogWatcher.testLog4jWatcher <<<
>    [junit4]    > Throwable #1: java.lang.AssertionError
>    [junit4]    >        at
> org.apache.solr.logging.TestLogWatcher.testLog4jWatcher(TestLogWatcher.java:49)
>    [junit4] FAILURE 0.00s J0 | TestLogWatcher.testLog4jWatcherRepeat <<<
>    [junit4]    > Throwable #1: java.lang.AssertionError
>    [junit4]    >        at
> org.apache.solr.logging.TestLogWatcher.testLog4jWatcherRepeat(TestLogWatcher.java:69)
>    [junit4] Completed [631/823 (2!)] on J0 in 0.01s, 2 tests, 2 failures
> <<< FAILURES!
>
> [...truncated 19 lines...]
>    [junit4] Suite: org.apache.solr.metrics.reporters.SolrSlf4jReporterTest
>    [junit4]   2> Creating dataDir:
> /x1/jenkins/jenkins-slave/workspace/Lucene-Solr-Tests-7.x/solr/build/solr-core/test/J0/temp/solr.metrics.reporters.SolrSlf4jReporterTest_9F29715433B793A6-001/init-core-data-001
>    [junit4]   2> NOTE: reproduce with: ant test
> -Dtestcase=SolrSlf4jReporterTest -Dtests.method=testReporter
> -Dtests.seed=9F29715433B793A6 -Dtests.multiplier=2 -Dtests.slow=true
> -Dtests.locale=vi -Dtests.timezone=Antarctica/McMurdo -Dtests.asserts=true
> -Dtests.file.encoding=US-ASCII
>    [junit4] FAILURE 0.01s J0 | SolrSlf4jReporterTest.testReporter <<<
>    [junit4]    > Throwable #1: java.lang.AssertionError: Test requires
> that log-level is at-least INFO, but INFO is disabled
>    [junit4]    >        at
> __randomizedtesting.SeedInfo.seed([9F29715433B793A6:C0CD5C6358BB00E3]:0)
>    [junit4]    >        at
> org.apache.solr.metrics.reporters.SolrSlf4jReporterTest.ensureLoggingConfiguredAppropriately(SolrSlf4jReporterTest.java:100)
>    [junit4]    >        at
> org.apache.solr.metrics.reporters.SolrSlf4jReporterTest.testReporter(SolrSlf4jReporterTest.java:49)
>    [junit4]    >        at java.lang.Thread.run(Thread.java:748)
>    [junit4]   2> NOTE: leaving temporary files on disk at:
> /x1/jenkins/jenkins-slave/workspace/Lucene-Solr-Tests-7.x/solr/build/solr-core/test/J0/temp/solr.metrics.reporters.SolrSlf4jReporterTest_9F29715433B793A6-001
>    [junit4]   2> NOTE: test params are: codec=Asserting(Lucene70): {},
> docValues:{}, maxPointsInLeafNode=1706, maxMBSortInHeap=7.368901520000684,
> sim=RandomSimilarity(queryNorm=false): {}, locale=vi,
> timezone=Antarctica/McMurdo
>    [junit4]   2> NOTE: Linux 3.13.0-88-generic amd64/Oracle Corporation
> 1.8.0_172 (64-bit)/cpus=4,threads=1,free=104456824,total=532676608
>    [junit4]   2> NOTE: All tests run in this JVM: [ZkStateWriterTest,
> TestOrdValues, ChaosMonkeySafeLeaderWithPullReplicasTest,
> XmlInterpolationTest, ResponseLogComponentTest, TestLuceneMatchVersion,
> TestLegacyFieldCache, TestLMJelinekMercerSimilarityFactory,
> TestBulkSchemaAPI, HdfsLockFactoryTest, TestStreamBody,
> PingRequestHandlerTest, BitVectorTest, TestManagedSchema, ZkFailoverTest,
> SegmentsInfoRequestHandlerTest, DateRangeFieldTest, ResourceLoaderTest,
> SimpleFacetsTest, HdfsNNFailoverTest, TestOnReconnectListenerSupport,
> ConnectionReuseTest, TestStressRecovery, TestSkipOverseerOperations,
> TestSolrDeletionPolicy2, TestHighFrequencyDictionaryFactory,
> TestStressLiveNodes, TestHttpShardHandlerFactory, TestSolr4Spatial,
> XsltUpdateRequestHandlerTest, TestPerFieldSimilarityWithDefaultOverride,
> TestNumericRangeQuery64, TestJsonRequest,
> TestTolerantUpdateProcessorRandomCloud, TestConfigReload,
> PreAnalyzedFieldTest, TestPayloadScoreQParserPlugin,
> OpenExchangeRatesOrgProviderTest, TestReplicaProperties,
> WrapperMergePolicyFactoryTest, BinaryUpdateRequestHandlerTest,
> TestLegacyTerms, ShardSplitTest, LeaderElectionIntegrationTest,
> MultiTermTest, TestCloudDeleteByQuery,
> TestSolrCloudWithSecureImpersonation, TestFileDictionaryLookup,
> SolrMetricManagerTest, ReplicationFactorTest, TestSegmentSorting,
> AnalyticsQueryTest, TestFaceting, PrimUtilsTest, TestGroupingSearch,
> PathHierarchyTokenizerFactoryTest, TestLeaderInitiatedRecoveryThread,
> CustomHighlightComponentTest, CoreSorterTest,
> ConcurrentCreateRoutedAliasTest, HLLSerializationTest,
> TestDistribStateManager, TestOmitPositions, HighlighterMaxOffsetTest,
> SpellCheckComponentTest, InfixSuggestersTest, FileUtilsTest,
> SSLMigrationTest, SchemaApiFailureTest, DistributedFacetPivotLongTailTest,
> AliasIntegrationTest, TestFieldCacheSortRandom, MetricUtilsTest,
> SortByFunctionTest, PeerSyncReplicationTest, TestCloudJSONFacetSKG,
> SolrCLIZkUtilsTest, TransactionLogTest, TolerantUpdateProcessorTest,
> TestSearcherReuse, TestCollectionsAPIViaSolrCloudCluster,
> TestUseDocValuesAsStored2, IndexSchemaRuntimeFieldTest, TestFastLRUCache,
> TestBulkSchemaConcurrent, TestConfigSetsAPI, TestFiltering,
> TestMaxScoreQueryParser, TestNestedDocsSort, TestRTimerTree,
> DistribDocExpirationUpdateProcessorTest, AtomicUpdatesTest, TestQueryUtils,
> TestFastOutputStream, LeaderFailureAfterFreshStartTest,
> CdcrVersionReplicationTest, TestSolrFieldCacheBean,
> BasicAuthStandaloneTest, TlogReplayBufferedWhileIndexingTest,
> CloudExitableDirectoryReaderTest, AnalysisAfterCoreReloadTest,
> DeleteShardTest, TestLargeCluster, TestEmbeddedSolrServerConstructors,
> NodeAddedTriggerIntegrationTest, AutoAddReplicasPlanActionTest,
> SuggestComponentTest, TestCloudRecovery, TestDynamicFieldResource,
> TestConfigsApi, TestDelegationWithHadoopAuth, DocumentBuilderTest,
> SyncSliceTest, RemoteQueryErrorTest, HdfsBasicDistributedZkTest,
> TestCrossCoreJoin, CollectionPropsTest, TestCoreContainer,
> SolrJmxReporterTest, MissingSegmentRecoveryTest, CopyFieldTest,
> DistributedVersionInfoTest, TestComplexPhraseQParserPlugin,
> TestZkAclsWithHadoopAuth, HdfsRestartWhileUpdatingTest,
> TestBM25SimilarityFactory, TestRealTimeGet, TestCustomDocTransformer,
> TestQuerySenderNoQuery, TestHashPartitioner,
> DistributedExpandComponentTest, BadIndexSchemaTest, SystemInfoHandlerTest,
> TestAnalyzeInfixSuggestions, TestReload, TestDistributedMissingSort,
> TestDocumentBuilder, TestHighlightDedupGrouping, TestJoin,
> TestRandomDVFaceting, TestSolrCoreProperties, TestTolerantSearch,
> TokenizerChainTest, TestLuceneIndexBackCompat,
> ChaosMonkeyNothingIsSafeTest, DeleteLastCustomShardedReplicaTest,
> DeleteStatusTest, DistributedQueueTest, FullSolrCloudDistribCmdsTest,
> LeaderVoteWaitTimeoutTest, MoveReplicaTest, RecoveryAfterSoftCommitTest,
> SliceStateTest, TestCloudConsistency, TestPrepRecovery,
> TestRebalanceLeaders, TestSolrCloudWithKerberosAlt, TestZkChroot,
> ZkSolrClientTest, HdfsCollectionsAPIDistributedZkTest,
> TestHdfsCloudBackupRestore, ComputePlanActionTest, MetricTriggerTest,
> ScheduledMaintenanceTriggerTest, SearchRateTriggerIntegrationTest,
> TestPolicyCloud, HdfsUnloadDistributedZkTest, StressHdfsTest,
> ZkStateReaderTest, AlternateDirectoryTest, BlobRepositoryCloudTest,
> DirectoryFactoryTest, ExitableDirectoryReaderTest,
> HdfsDirectoryFactoryTest, TestInitParams, TestJmxIntegration,
> TestLazyCores, ResponseBuilderTest, TestBlobHandler,
> CoreAdminCreateDiscoverTest, CoreAdminHandlerTest, CoreAdminOperationTest,
> CoreAdminRequestStatusTest, CoreMergeIndexesAdminHandlerTest,
> LukeRequestHandlerTest, MetricsHistoryHandlerTest,
> ShowFileRequestHandlerTest, StatsReloadRaceTest, DebugComponentTest,
> DistributedDebugComponentTest, DistributedFacetPivotLargeTest,
> DistributedMLTComponentTest, DistributedSuggestComponentTest,
> TestExpandComponent, TestPivotHelperCode, TestTrackingShardHandlerFactory,
> JavabinLoaderTest, RandomizedTaggerTest, TaggingAttributeTest,
> TestSlowCompositeReaderWrapper, UninvertDocValuesMergePolicyTest,
> TestMultiValuedNumericRangeQuery, TestNumericTokenStream, JvmMetricsTest,
> MetricsConfigTest, SolrCoreMetricManagerTest, SolrSlf4jReporterTest]
>    [junit4] Completed [638/823 (3!)] on J0 in 0.06s, 1 test, 1 failure <<<
> FAILURES!
>
> [...truncated 48760 lines...]
> [asciidoctor:convert] asciidoctor: ERROR: about-this-guide.adoc: line 1:
> invalid part, must have at least one section (e.g., chapter, appendix, etc.)
> [asciidoctor:convert] asciidoctor: ERROR: solr-glossary.adoc: line 1:
> invalid part, must have at least one section (e.g., chapter, appendix, etc.)
>      [java] Processed 2220 links (1775 relative) to 2998 anchors in 229
> files
>      [echo] Validated Links & Anchors via:
> /x1/jenkins/jenkins-slave/workspace/Lucene-Solr-Tests-7.x/solr/build/solr-ref-guide/bare-bones-html/
>
> -documentation-lint:
>     [jtidy] Checking for broken html (such as invalid tags)...
>    [delete] Deleting directory
> /x1/jenkins/jenkins-slave/workspace/Lucene-Solr-Tests-7.x/lucene/build/jtidy_tmp
>      [echo] Checking for broken links...
>      [exec]
>      [exec] Crawl/parse...
>      [exec]
>      [exec] Verify...
>      [echo] Checking for malformed docs...
>
> jar-checksums:
>
> resolve:
>
> ivy-availability-check:
> [loadresource] Do not set property disallowed.ivy.jars.list as its length
> is 0.
>
> -ivy-fail-disallowed-ivy-version:
>
> ivy-fail:
>
> ivy-configure:
> [ivy:configure] :: loading settings :: file =
> /x1/jenkins/jenkins-slave/workspace/Lucene-Solr-Tests-7.x/lucene/top-level-ivy-settings.xml
>
> resolve:
>
> ivy-availability-check:
> [loadresource] Do not set property disallowed.ivy.jars.list as its length
> is 0.
>
> -ivy-fail-disallowed-ivy-version:
>
> ivy-fail:
>
> ivy-configure:
> [ivy:configure] :: loading settings :: file =
> /x1/jenkins/jenkins-slave/workspace/Lucene-Solr-Tests-7.x/lucene/top-level-ivy-settings.xml
>
> resolve:
>
> resolve:
>
> ivy-availability-check:
> [loadresource] Do not set property disallowed.ivy.jars.list as its length
> is 0.
>
> -ivy-fail-disallowed-ivy-version:
>
> ivy-fail:
>
> ivy-configure:
> [ivy:configure] :: loading settings :: file =
> /x1/jenkins/jenkins-slave/workspace/Lucene-Solr-Tests-7.x/lucene/top-level-ivy-settings.xml
>
> resolve:
>
> ivy-availability-check:
> [loadresource] Do not set property disallowed.ivy.jars.list as its length
> is 0.
>
> -ivy-fail-disallowed-ivy-version:
>
> ivy-fail:
>
> ivy-configure:
> [ivy:configure] :: loading settings :: file =
> /x1/jenkins/jenkins-slave/workspace/Lucene-Solr-Tests-7.x/lucene/top-level-ivy-settings.xml
>
> resolve:
>
> ivy-availability-check:
> [loadresource] Do not set property disallowed.ivy.jars.list as its length
> is 0.
>
> -ivy-fail-disallowed-ivy-version:
>
> ivy-fail:
>
> ivy-configure:
> [ivy:configure] :: loading settings :: file =
> /x1/jenkins/jenkins-slave/workspace/Lucene-Solr-Tests-7.x/lucene/top-level-ivy-settings.xml
>
> resolve:
>
> ivy-availability-check:
> [loadresource] Do not set property disallowed.ivy.jars.list as its length
> is 0.
>
> -ivy-fail-disallowed-ivy-version:
>
> ivy-fail:
>
> ivy-configure:
> [ivy:configure] :: loading settings :: file =
> /x1/jenkins/jenkins-slave/workspace/Lucene-Solr-Tests-7.x/lucene/top-level-ivy-settings.xml
>
> resolve:
>
> ivy-availability-check:
> [loadresource] Do not set property disallowed.ivy.jars.list as its length
> is 0.
>
> -ivy-fail-disallowed-ivy-version:
>
> ivy-fail:
>
> ivy-configure:
> [ivy:configure] :: loading settings :: file =
> /x1/jenkins/jenkins-slave/workspace/Lucene-Solr-Tests-7.x/lucene/top-level-ivy-settings.xml
>
> resolve:
>
> ivy-availability-check:
> [loadresource] Do not set property disallowed.ivy.jars.list as its length
> is 0.
>
> -ivy-fail-disallowed-ivy-version:
>
> ivy-fail:
>
> ivy-configure:
> [ivy:configure] :: loading settings :: file =
> /x1/jenkins/jenkins-slave/workspace/Lucene-Solr-Tests-7.x/lucene/top-level-ivy-settings.xml
>
> resolve:
>
> ivy-availability-check:
> [loadresource] Do not set property disallowed.ivy.jars.list as its length
> is 0.
>
> -ivy-fail-disallowed-ivy-version:
>
> ivy-fail:
>
> ivy-configure:
> [ivy:configure] :: loading settings :: file =
> /x1/jenkins/jenkins-slave/workspace/Lucene-Solr-Tests-7.x/lucene/top-level-ivy-settings.xml
>
> resolve:
>
> ivy-availability-check:
> [loadresource] Do not set property disallowed.ivy.jars.list as its length
> is 0.
>
> -ivy-fail-disallowed-ivy-version:
>
> ivy-fail:
>
> ivy-configure:
> [ivy:configure] :: loading settings :: file =
> /x1/jenkins/jenkins-slave/workspace/Lucene-Solr-Tests-7.x/lucene/top-level-ivy-settings.xml
>
> resolve:
>
> ivy-availability-check:
> [loadresource] Do not set property disallowed.ivy.jars.list as its length
> is 0.
>
> -ivy-fail-disallowed-ivy-version:
>
> ivy-fail:
>
> ivy-configure:
> [ivy:configure] :: loading settings :: file =
> /x1/jenkins/jenkins-slave/workspace/Lucene-Solr-Tests-7.x/lucene/top-level-ivy-settings.xml
>
> resolve:
>
> ivy-availability-check:
> [loadresource] Do not set property disallowed.ivy.jars.list as its length
> is 0.
>
> -ivy-fail-disallowed-ivy-version:
>
> ivy-fail:
>
> ivy-configure:
> [ivy:configure] :: loading settings :: file =
> /x1/jenkins/jenkins-slave/workspace/Lucene-Solr-Tests-7.x/lucene/top-level-ivy-settings.xml
>
> resolve:
>
> ivy-availability-check:
> [loadresource] Do not set property disallowed.ivy.jars.list as its length
> is 0.
>
> -ivy-fail-disallowed-ivy-version:
>
> ivy-fail:
>
> ivy-configure:
> [ivy:configure] :: loading settings :: file =
> /x1/jenkins/jenkins-slave/workspace/Lucene-Solr-Tests-7.x/lucene/top-level-ivy-settings.xml
>
> resolve:
>
> ivy-availability-check:
> [loadresource] Do not set property disallowed.ivy.jars.list as its length
> is 0.
>
> -ivy-fail-disallowed-ivy-version:
>
> ivy-fail:
>
> ivy-configure:
> [ivy:configure] :: loading settings :: file =
> /x1/jenkins/jenkins-slave/workspace/Lucene-Solr-Tests-7.x/lucene/top-level-ivy-settings.xml
>
> resolve:
>
> ivy-availability-check:
> [loadresource] Do not set property disallowed.ivy.jars.list as its length
> is 0.
>
> -ivy-fail-disallowed-ivy-version:
>
> ivy-fail:
>
> ivy-configure:
> [ivy:configure] :: loading settings :: file =
> /x1/jenkins/jenkins-slave/workspace/Lucene-Solr-Tests-7.x/lucene/top-level-ivy-settings.xml
>
> resolve:
>
> ivy-availability-check:
> [loadresource] Do not set property disallowed.ivy.jars.list as its length
> is 0.
>
> -ivy-fail-disallowed-ivy-version:
>
> ivy-fail:
>
> ivy-configure:
> [ivy:configure] :: loading settings :: file =
> /x1/jenkins/jenkins-slave/workspace/Lucene-Solr-Tests-7.x/lucene/top-level-ivy-settings.xml
>
> resolve:
>
> ivy-availability-check:
> [loadresource] Do not set property disallowed.ivy.jars.list as its length
> is 0.
>
> -ivy-fail-disallowed-ivy-version:
>
> ivy-fail:
>
> ivy-configure:
> [ivy:configure] :: loading settings :: file =
> /x1/jenkins/jenkins-slave/workspace/Lucene-Solr-Tests-7.x/lucene/top-level-ivy-settings.xml
>
> resolve:
>
> ivy-availability-check:
> [loadresource] Do not set property disallowed.ivy.jars.list as its length
> is 0.
>
> -ivy-fail-disallowed-ivy-version:
>
> ivy-fail:
>
> ivy-configure:
> [ivy:configure] :: loading settings :: file =
> /x1/jenkins/jenkins-slave/workspace/Lucene-Solr-Tests-7.x/lucene/top-level-ivy-settings.xml
>
> resolve:
>
> ivy-availability-check:
> [loadresource] Do not set property disallowed.ivy.jars.list as its length
> is 0.
>
> -ivy-fail-disallowed-ivy-version:
>
> ivy-fail:
>
> ivy-configure:
> [ivy:configure] :: loading settings :: file =
> /x1/jenkins/jenkins-slave/workspace/Lucene-Solr-Tests-7.x/lucene/top-level-ivy-settings.xml
>
> resolve:
>
> ivy-availability-check:
> [loadresource] Do not set property disallowed.ivy.jars.list as its length
> is 0.
>
> -ivy-fail-disallowed-ivy-version:
>
> ivy-fail:
>
> ivy-configure:
> [ivy:configure] :: loading settings :: file =
> /x1/jenkins/jenkins-slave/workspace/Lucene-Solr-Tests-7.x/lucene/top-level-ivy-settings.xml
>
> resolve:
>
> ivy-availability-check:
> [loadresource] Do not set property disallowed.ivy.jars.list as its length
> is 0.
>
> -ivy-fail-disallowed-ivy-version:
>
> ivy-fail:
>
> ivy-configure:
> [ivy:configure] :: loading settings :: file =
> /x1/jenkins/jenkins-slave/workspace/Lucene-Solr-Tests-7.x/lucene/top-level-ivy-settings.xml
>
> resolve:
>
> ivy-availability-check:
> [loadresource] Do not set property disallowed.ivy.jars.list as its length
> is 0.
>
> -ivy-fail-disallowed-ivy-version:
>
> ivy-fail:
>
> ivy-configure:
> [ivy:configure] :: loading settings :: file =
> /x1/jenkins/jenkins-slave/workspace/Lucene-Solr-Tests-7.x/lucene/top-level-ivy-settings.xml
>
> resolve:
>
> ivy-availability-check:
> [loadresource] Do not set property disallowed.ivy.jars.list as its length
> is 0.
>
> -ivy-fail-disallowed-ivy-version:
>
> ivy-fail:
>
> ivy-configure:
> [ivy:configure] :: loading settings :: file =
> /x1/jenkins/jenkins-slave/workspace/Lucene-Solr-Tests-7.x/lucene/top-level-ivy-settings.xml
>
> resolve:
>
> ivy-availability-check:
> [loadresource] Do not set property disallowed.ivy.jars.list as its length
> is 0.
>
> -ivy-fail-disallowed-ivy-version:
>
> ivy-fail:
>
> ivy-configure:
> [ivy:configure] :: loading settings :: file =
> /x1/jenkins/jenkins-slave/workspace/Lucene-Solr-Tests-7.x/lucene/top-level-ivy-settings.xml
>
> resolve:
>
> ivy-availability-check:
> [loadresource] Do not set property disallowed.ivy.jars.list as its length
> is 0.
>
> -ivy-fail-disallowed-ivy-version:
>
> ivy-fail:
>
> ivy-configure:
> [ivy:configure] :: loading settings :: file =
> /x1/jenkins/jenkins-slave/workspace/Lucene-Solr-Tests-7.x/lucene/top-level-ivy-settings.xml
>
> resolve:
>
> ivy-availability-check:
> [loadresource] Do not set property disallowed.ivy.jars.list as its length
> is 0.
>
> -ivy-fail-disallowed-ivy-version:
>
> ivy-fail:
>
> ivy-configure:
> [ivy:configure] :: loading settings :: file =
> /x1/jenkins/jenkins-slave/workspace/Lucene-Solr-Tests-7.x/lucene/top-level-ivy-settings.xml
>
> common.resolve:
>
> resolve:
>
> ivy-availability-check:
> [loadresource] Do not set property disallowed.ivy.jars.list as its length
> is 0.
>
> -ivy-fail-disallowed-ivy-version:
>
> ivy-fail:
>
> ivy-configure:
> [ivy:configure] :: loading settings :: file =
> /x1/jenkins/jenkins-slave/workspace/Lucene-Solr-Tests-7.x/lucene/top-level-ivy-settings.xml
>
> resolve:
>
> ivy-availability-check:
> [loadresource] Do not set property disallowed.ivy.jars.list as its length
> is 0.
>
> -ivy-fail-disallowed-ivy-version:
>
> ivy-fail:
>
> ivy-configure:
> [ivy:configure] :: loading settings :: file =
> /x1/jenkins/jenkins-slave/workspace/Lucene-Solr-Tests-7.x/lucene/top-level-ivy-settings.xml
>
> resolve:
>
> ivy-availability-check:
> [loadresource] Do not set property disallowed.ivy.jars.list as its length
> is 0.
>
> -ivy-fail-disallowed-ivy-version:
>
> ivy-fail:
>
> ivy-configure:
> [ivy:configure] :: loading settings :: file =
> /x1/jenkins/jenkins-slave/workspace/Lucene-Solr-Tests-7.x/lucene/top-level-ivy-settings.xml
>
> resolve:
>
> ivy-availability-check:
> [loadresource] Do not set property disallowed.ivy.jars.list as its length
> is 0.
>
> -ivy-fail-disallowed-ivy-version:
>
> ivy-fail:
>
> ivy-configure:
> [ivy:configure] :: loading settings :: file =
> /x1/jenkins/jenkins-slave/workspace/Lucene-Solr-Tests-7.x/lucene/top-level-ivy-settings.xml
>
> resolve:
>
> ivy-availability-check:
> [loadresource] Do not set property disallowed.ivy.jars.list as its length
> is 0.
>
> -ivy-fail-disallowed-ivy-version:
>
> ivy-fail:
>
> ivy-configure:
> [ivy:configure] :: loading settings :: file =
> /x1/jenkins/jenkins-slave/workspace/Lucene-Solr-Tests-7.x/lucene/top-level-ivy-settings.xml
>
> resolve:
>
> jar-checksums:
>     [mkdir] Created dir:
> /x1/jenkins/jenkins-slave/workspace/Lucene-Solr-Tests-7.x/lucene/null2060748928
>      [copy] Copying 36 files to
> /x1/jenkins/jenkins-slave/workspace/Lucene-Solr-Tests-7.x/lucene/null2060748928
>    [delete] Deleting directory
> /x1/jenkins/jenkins-slave/workspace/Lucene-Solr-Tests-7.x/lucene/null2060748928
>
> resolve-example:
>
> ivy-availability-check:
> [loadresource] Do not set property disallowed.ivy.jars.list as its length
> is 0.
>
> -ivy-fail-disallowed-ivy-version:
>
> ivy-fail:
>
> ivy-configure:
> [ivy:configure] :: loading settings :: file =
> /x1/jenkins/jenkins-slave/workspace/Lucene-Solr-Tests-7.x/lucene/top-level-ivy-settings.xml
>
> resolve:
>
> resolve-server:
>
> ivy-availability-check:
> [loadresource] Do not set property disallowed.ivy.jars.list as its length
> is 0.
>
> -ivy-fail-disallowed-ivy-version:
>
> ivy-fail:
>
> ivy-fail:
>
> ivy-configure:
> [ivy:configure] :: loading settings :: file =
> /x1/jenkins/jenkins-slave/workspace/Lucene-Solr-Tests-7.x/lucene/top-level-ivy-settings.xml
>
> resolve:
>
> resolve:
>
> ivy-availability-check:
> [loadresource] Do not set property disallowed.ivy.jars.list as its length
> is 0.
>
> -ivy-fail-disallowed-ivy-version:
>
> ivy-fail:
>
> ivy-fail:
>
> ivy-configure:
> [ivy:configure] :: loading settings :: file =
> /x1/jenkins/jenkins-slave/workspace/Lucene-Solr-Tests-7.x/lucene/top-level-ivy-settings.xml
>
> resolve:
>
> ivy-availability-check:
> [loadresource] Do not set property disallowed.ivy.jars.list as its length
> is 0.
>
> -ivy-fail-disallowed-ivy-version:
>
> ivy-fail:
>
> ivy-fail:
>
> ivy-configure:
> [ivy:configure] :: loading settings :: file =
> /x1/jenkins/jenkins-slave/workspace/Lucene-Solr-Tests-7.x/lucene/top-level-ivy-settings.xml
>
> resolve:
>
> ivy-availability-check:
> [loadresource] Do not set property disallowed.ivy.jars.list as its length
> is 0.
>
> -ivy-fail-disallowed-ivy-version:
>
> ivy-fail:
>
> ivy-configure:
> [ivy:configure] :: loading settings :: file =
> /x1/jenkins/jenkins-slave/workspace/Lucene-Solr-Tests-7.x/lucene/top-level-ivy-settings.xml
>
> resolve:
>
> ivy-availability-check:
> [loadresource] Do not set property disallowed.ivy.jars.list as its length
> is 0.
>
> -ivy-fail-disallowed-ivy-version:
>
> ivy-fail:
>
> ivy-fail:
>
> ivy-configure:
> [ivy:configure] :: loading settings :: file =
> /x1/jenkins/jenkins-slave/workspace/Lucene-Solr-Tests-7.x/lucene/top-level-ivy-settings.xml
>
> resolve:
>
> ivy-availability-check:
> [loadresource] Do not set property disallowed.ivy.jars.list as its length
> is 0.
>
> -ivy-fail-disallowed-ivy-version:
>
> ivy-fail:
>
> ivy-configure:
> [ivy:configure] :: loading settings :: file =
> /x1/jenkins/jenkins-slave/workspace/Lucene-Solr-Tests-7.x/lucene/top-level-ivy-settings.xml
>
> resolve:
>
> ivy-availability-check:
> [loadresource] Do not set property disallowed.ivy.jars.list as its length
> is 0.
>
> -ivy-fail-disallowed-ivy-version:
>
> ivy-fail:
>
> ivy-fail:
>
> ivy-configure:
> [ivy:configure] :: loading settings :: file =
> /x1/jenkins/jenkins-slave/workspace/Lucene-Solr-Tests-7.x/lucene/top-level-ivy-settings.xml
>
> resolve:
>
> ivy-availability-check:
> [loadresource] Do not set property disallowed.ivy.jars.list as its length
> is 0.
>
> -ivy-fail-disallowed-ivy-version:
>
> ivy-fail:
>
> ivy-fail:
>
> ivy-configure:
> [ivy:configure] :: loading settings :: file =
> /x1/jenkins/jenkins-slave/workspace/Lucene-Solr-Tests-7.x/lucene/top-level-ivy-settings.xml
>
> resolve:
>
> ivy-availability-check:
> [loadresource] Do not set property disallowed.ivy.jars.list as its length
> is 0.
>
> -ivy-fail-disallowed-ivy-version:
>
> ivy-fail:
>
> ivy-fail:
>
> ivy-configure:
> [ivy:configure] :: loading settings :: file =
> /x1/jenkins/jenkins-slave/workspace/Lucene-Solr-Tests-7.x/lucene/top-level-ivy-settings.xml
>
> resolve:
>
> ivy-availability-check:
> [loadresource] Do not set property disallowed.ivy.jars.list as its length
> is 0.
>
> -ivy-fail-disallowed-ivy-version:
>
> ivy-fail:
>
> ivy-fail:
>
> ivy-configure:
> [ivy:configure] :: loading settings :: file =
> /x1/jenkins/jenkins-slave/workspace/Lucene-Solr-Tests-7.x/lucene/top-level-ivy-settings.xml
>
> resolve:
>
> ivy-availability-check:
> [loadresource] Do not set property disallowed.ivy.jars.list as its length
> is 0.
>
> -ivy-fail-disallowed-ivy-version:
>
> ivy-fail:
>
> ivy-fail:
>
> ivy-configure:
> [ivy:configure] :: loading settings :: file =
> /x1/jenkins/jenkins-slave/workspace/Lucene-Solr-Tests-7.x/lucene/top-level-ivy-settings.xml
>
> resolve:
>
> ivy-availability-check:
> [loadresource] Do not set property disallowed.ivy.jars.list as its length
> is 0.
>
> -ivy-fail-disallowed-ivy-version:
>
> ivy-fail:
>
> ivy-fail:
>
> ivy-configure:
> [ivy:configure] :: loading settings :: file =
> /x1/jenkins/jenkins-slave/workspace/Lucene-Solr-Tests-7.x/lucene/top-level-ivy-settings.xml
>
> resolve:
>
> ivy-availability-check:
> [loadresource] Do not set property disallowed.ivy.jars.list as its length
> is 0.
>
> -ivy-fail-disallowed-ivy-version:
>
> ivy-fail:
>
> ivy-fail:
>
> ivy-configure:
> [ivy:configure] :: loading settings :: file =
> /x1/jenkins/jenkins-slave/workspace/Lucene-Solr-Tests-7.x/lucene/top-level-ivy-settings.xml
>
> resolve:
>
> ivy-availability-check:
> [loadresource] Do not set property disallowed.ivy.jars.list as its length
> is 0.
>
> -ivy-fail-disallowed-ivy-version:
>
> ivy-fail:
>
> ivy-fail:
>
> ivy-configure:
> [ivy:configure] :: loading settings :: file =
> /x1/jenkins/jenkins-slave/workspace/Lucene-Solr-Tests-7.x/lucene/top-level-ivy-settings.xml
>
> resolve:
>
> ivy-availability-check:
> [loadresource] Do not set property disallowed.ivy.jars.list as its length
> is 0.
>
> -ivy-fail-disallowed-ivy-version:
>
> ivy-fail:
>
> ivy-fail:
>
> ivy-configure:
> [ivy:configure] :: loading settings :: file =
> /x1/jenkins/jenkins-slave/workspace/Lucene-Solr-Tests-7.x/lucene/top-level-ivy-settings.xml
>
> resolve:
>
> ivy-availability-check:
> [loadresource] Do not set property disallowed.ivy.jars.list as its length
> is 0.
>
> -ivy-fail-disallowed-ivy-version:
>
> ivy-fail:
>
> ivy-fail:
>
> ivy-configure:
> [ivy:configure] :: loading settings :: file =
> /x1/jenkins/jenkins-slave/workspace/Lucene-Solr-Tests-7.x/lucene/top-level-ivy-settings.xml
>
> resolve:
>
> jar-checksums:
>     [mkdir] Created dir:
> /x1/jenkins/jenkins-slave/workspace/Lucene-Solr-Tests-7.x/solr/null760157224
>      [copy] Copying 241 files to
> /x1/jenkins/jenkins-slave/workspace/Lucene-Solr-Tests-7.x/solr/null760157224
>    [delete] Deleting directory
> /x1/jenkins/jenkins-slave/workspace/Lucene-Solr-Tests-7.x/solr/null760157224
>
> check-working-copy:
> [ivy:cachepath] :: resolving dependencies ::
> org.eclipse.jgit#org.eclipse.jgit-caller;working
> [ivy:cachepath]         confs: [default]
> [ivy:cachepath]         found
> org.eclipse.jgit#org.eclipse.jgit;4.6.0.201612231935-r in public
> [ivy:cachepath]         found com.jcraft#jsch;0.1.53 in public
> [ivy:cachepath]         found com.googlecode.javaewah#JavaEWAH;1.1.6 in
> public
> [ivy:cachepath]         found org.apache.httpcomponents#httpclient;4.3.6
> in public
> [ivy:cachepath]         found org.apache.httpcomponents#httpcore;4.3.3 in
> public
> [ivy:cachepath]         found commons-logging#commons-logging;1.1.3 in
> public
> [ivy:cachepath]         found commons-codec#commons-codec;1.6 in public
> [ivy:cachepath]         found org.slf4j#slf4j-api;1.7.2 in public
> [ivy:cachepath] :: resolution report :: resolve 101ms :: artifacts dl 1ms
>
> ---------------------------------------------------------------------
>         |                  |            modules            ||   artifacts
>  |
>         |       conf       | number| search|dwnlded|evicted||
> number|dwnlded|
>
> ---------------------------------------------------------------------
>         |      default     |   8   |   0   |   0   |   0   ||   8   |   0
>  |
>
> ---------------------------------------------------------------------
> [wc-checker] Initializing working copy...
> [wc-checker] SLF4J: Failed to load class
> "org.slf4j.impl.StaticLoggerBinder".
> [wc-checker] SLF4J: Defaulting to no-operation (NOP) logger implementation
> [wc-checker] SLF4J: See http://www.slf4j.org/codes.html#StaticLoggerBinder
> for further details.
> [wc-checker] Checking working copy status...
>
> -jenkins-base:
>
> BUILD SUCCESSFUL
> Total time: 133 minutes 43 seconds
> Archiving artifacts
> java.lang.InterruptedException: no matches found within 10000
>         at hudson.FilePath$34.hasMatch(FilePath.java:2678)
>         at hudson.FilePath$34.invoke(FilePath.java:2557)
>         at hudson.FilePath$34.invoke(FilePath.java:2547)
>         at hudson.FilePath$FileCallableWrapper.call(FilePath.java:2918)
> Also:   hudson.remoting.Channel$CallSiteStackTrace: Remote call to lucene
>                 at
> hudson.remoting.Channel.attachCallSiteStackTrace(Channel.java:1741)
>                 at
> hudson.remoting.UserRequest$ExceptionResponse.retrieve(UserRequest.java:357)
>                 at hudson.remoting.Channel.call(Channel.java:955)
>                 at hudson.FilePath.act(FilePath.java:1036)
>                 at hudson.FilePath.act(FilePath.java:1025)
>                 at hudson.FilePath.validateAntFileMask(FilePath.java:2547)
>                 at
> hudson.tasks.ArtifactArchiver.perform(ArtifactArchiver.java:243)
>                 at
> hudson.tasks.BuildStepCompatibilityLayer.perform(BuildStepCompatibilityLayer.java:81)
>                 at
> hudson.tasks.BuildStepMonitor$1.perform(BuildStepMonitor.java:20)
>                 at
> hudson.model.AbstractBuild$AbstractBuildExecution.perform(AbstractBuild.java:744)
>                 at
> hudson.model.AbstractBuild$AbstractBuildExecution.performAllBuildSteps(AbstractBuild.java:690)
>                 at hudson.model.Build$BuildExecution.post2(Build.java:186)
>                 at
> hudson.model.AbstractBuild$AbstractBuildExecution.post(AbstractBuild.java:635)
>                 at hudson.model.Run.execute(Run.java:1819)
>                 at hudson.model.FreeStyleBuild.run(FreeStyleBuild.java:43)
>                 at
> hudson.model.ResourceController.execute(ResourceController.java:97)
>                 at hudson.model.Executor.run(Executor.java:429)
> Caused: hudson.FilePath$TunneledInterruptedException
>         at hudson.FilePath$FileCallableWrapper.call(FilePath.java:2920)
>         at hudson.remoting.UserRequest.perform(UserRequest.java:212)
>         at hudson.remoting.UserRequest.perform(UserRequest.java:54)
>         at hudson.remoting.Request$2.run(Request.java:369)
>         at
> hudson.remoting.InterceptingExecutorService$1.call(InterceptingExecutorService.java:72)
>         at java.util.concurrent.FutureTask.run(FutureTask.java:266)
>         at
> java.util.concurrent.ThreadPoolExecutor.runWorker(ThreadPoolExecutor.java:1142)
>         at
> java.util.concurrent.ThreadPoolExecutor$Worker.run(ThreadPoolExecutor.java:617)
>         at java.lang.Thread.run(Thread.java:748)
> Caused: java.lang.InterruptedException: java.lang.InterruptedException: no
> matches found within 10000
>         at hudson.FilePath.act(FilePath.java:1038)
>         at hudson.FilePath.act(FilePath.java:1025)
>         at hudson.FilePath.validateAntFileMask(FilePath.java:2547)
>         at hudson.tasks.ArtifactArchiver.perform(ArtifactArchiver.java:243)
>         at
> hudson.tasks.BuildStepCompatibilityLayer.perform(BuildStepCompatibilityLayer.java:81)
>         at
> hudson.tasks.BuildStepMonitor$1.perform(BuildStepMonitor.java:20)
>         at
> hudson.model.AbstractBuild$AbstractBuildExecution.perform(AbstractBuild.java:744)
>         at
> hudson.model.AbstractBuild$AbstractBuildExecution.performAllBuildSteps(AbstractBuild.java:690)
>         at hudson.model.Build$BuildExecution.post2(Build.java:186)
>         at
> hudson.model.AbstractBuild$AbstractBuildExecution.post(AbstractBuild.java:635)
>         at hudson.model.Run.execute(Run.java:1819)
>         at hudson.model.FreeStyleBuild.run(FreeStyleBuild.java:43)
>         at
> hudson.model.ResourceController.execute(ResourceController.java:97)
>         at hudson.model.Executor.run(Executor.java:429)
> No artifacts found that match the file pattern
> "**/*.events,heapdumps/**,**/hs_err_pid*". Configuration error?
> Recording test results
> Build step 'Publish JUnit test result report' changed build result to
> UNSTABLE
> Email was triggered for: Unstable (Test Failures)
> Sending email for trigger: Unstable (Test Failures)
>
> ---------------------------------------------------------------------
> To unsubscribe, e-mail: dev-unsubscribe@lucene.apache.org
> For additional commands, e-mail: dev-help@lucene.apache.org

Mime
View raw message