lucene-dev mailing list archives

Site index · List index
Message view « Date » · « Thread »
Top « Date » · « Thread »
From Policeman Jenkins Server <jenk...@thetaphi.de>
Subject [JENKINS] Lucene-Solr-7.x-Solaris (64bit/jdk1.8.0) - Build # 793 - Still Unstable!
Date Sat, 01 Sep 2018 20:37:54 GMT
Build: https://jenkins.thetaphi.de/job/Lucene-Solr-7.x-Solaris/793/
Java: 64bit/jdk1.8.0 -XX:+UseCompressedOops -XX:+UseSerialGC

2 tests failed.
FAILED:  org.apache.solr.cloud.api.collections.CollectionsAPIAsyncDistributedZkTest.testAsyncRequests

Error Message:
No live SolrServers available to handle this request:[http://127.0.0.1:45021/solr/myalias, http://127.0.0.1:58907/solr/myalias]

Stack Trace:
org.apache.solr.client.solrj.SolrServerException: No live SolrServers available to handle this request:[http://127.0.0.1:45021/solr/myalias, http://127.0.0.1:58907/solr/myalias]
	at __randomizedtesting.SeedInfo.seed([A022F93B839D68E1:4466C58C2535263E]:0)
	at org.apache.solr.client.solrj.impl.LBHttpSolrClient.request(LBHttpSolrClient.java:462)
	at org.apache.solr.client.solrj.impl.CloudSolrClient.sendRequest(CloudSolrClient.java:1109)
	at org.apache.solr.client.solrj.impl.CloudSolrClient.requestWithRetryOnStaleState(CloudSolrClient.java:886)
	at org.apache.solr.client.solrj.impl.CloudSolrClient.request(CloudSolrClient.java:819)
	at org.apache.solr.client.solrj.SolrRequest.process(SolrRequest.java:194)
	at org.apache.solr.client.solrj.SolrClient.query(SolrClient.java:942)
	at org.apache.solr.cloud.api.collections.CollectionsAPIAsyncDistributedZkTest.testAsyncRequests(CollectionsAPIAsyncDistributedZkTest.java:168)
	at sun.reflect.NativeMethodAccessorImpl.invoke0(Native Method)
	at sun.reflect.NativeMethodAccessorImpl.invoke(NativeMethodAccessorImpl.java:62)
	at sun.reflect.DelegatingMethodAccessorImpl.invoke(DelegatingMethodAccessorImpl.java:43)
	at java.lang.reflect.Method.invoke(Method.java:498)
	at com.carrotsearch.randomizedtesting.RandomizedRunner.invoke(RandomizedRunner.java:1737)
	at com.carrotsearch.randomizedtesting.RandomizedRunner$8.evaluate(RandomizedRunner.java:934)
	at com.carrotsearch.randomizedtesting.RandomizedRunner$9.evaluate(RandomizedRunner.java:970)
	at com.carrotsearch.randomizedtesting.RandomizedRunner$10.evaluate(RandomizedRunner.java:984)
	at com.carrotsearch.randomizedtesting.rules.SystemPropertiesRestoreRule$1.evaluate(SystemPropertiesRestoreRule.java:57)
	at org.apache.lucene.util.TestRuleSetupTeardownChained$1.evaluate(TestRuleSetupTeardownChained.java:49)
	at org.apache.lucene.util.AbstractBeforeAfterRule$1.evaluate(AbstractBeforeAfterRule.java:45)
	at org.apache.lucene.util.TestRuleThreadAndTestName$1.evaluate(TestRuleThreadAndTestName.java:48)
	at org.apache.lucene.util.TestRuleIgnoreAfterMaxFailures$1.evaluate(TestRuleIgnoreAfterMaxFailures.java:64)
	at org.apache.lucene.util.TestRuleMarkFailure$1.evaluate(TestRuleMarkFailure.java:47)
	at com.carrotsearch.randomizedtesting.rules.StatementAdapter.evaluate(StatementAdapter.java:36)
	at com.carrotsearch.randomizedtesting.ThreadLeakControl$StatementRunner.run(ThreadLeakControl.java:368)
	at com.carrotsearch.randomizedtesting.ThreadLeakControl.forkTimeoutingTask(ThreadLeakControl.java:817)
	at com.carrotsearch.randomizedtesting.ThreadLeakControl$3.evaluate(ThreadLeakControl.java:468)
	at com.carrotsearch.randomizedtesting.RandomizedRunner.runSingleTest(RandomizedRunner.java:943)
	at com.carrotsearch.randomizedtesting.RandomizedRunner$5.evaluate(RandomizedRunner.java:829)
	at com.carrotsearch.randomizedtesting.RandomizedRunner$6.evaluate(RandomizedRunner.java:879)
	at com.carrotsearch.randomizedtesting.RandomizedRunner$7.evaluate(RandomizedRunner.java:890)
	at com.carrotsearch.randomizedtesting.rules.StatementAdapter.evaluate(StatementAdapter.java:36)
	at com.carrotsearch.randomizedtesting.rules.SystemPropertiesRestoreRule$1.evaluate(SystemPropertiesRestoreRule.java:57)
	at org.apache.lucene.util.AbstractBeforeAfterRule$1.evaluate(AbstractBeforeAfterRule.java:45)
	at com.carrotsearch.randomizedtesting.rules.StatementAdapter.evaluate(StatementAdapter.java:36)
	at org.apache.lucene.util.TestRuleStoreClassName$1.evaluate(TestRuleStoreClassName.java:41)
	at com.carrotsearch.randomizedtesting.rules.NoShadowingOrOverridesOnMethodsRule$1.evaluate(NoShadowingOrOverridesOnMethodsRule.java:40)
	at com.carrotsearch.randomizedtesting.rules.NoShadowingOrOverridesOnMethodsRule$1.evaluate(NoShadowingOrOverridesOnMethodsRule.java:40)
	at com.carrotsearch.randomizedtesting.rules.StatementAdapter.evaluate(StatementAdapter.java:36)
	at com.carrotsearch.randomizedtesting.rules.StatementAdapter.evaluate(StatementAdapter.java:36)
	at com.carrotsearch.randomizedtesting.rules.StatementAdapter.evaluate(StatementAdapter.java:36)
	at org.apache.lucene.util.TestRuleAssertionsRequired$1.evaluate(TestRuleAssertionsRequired.java:53)
	at org.apache.lucene.util.TestRuleMarkFailure$1.evaluate(TestRuleMarkFailure.java:47)
	at org.apache.lucene.util.TestRuleIgnoreAfterMaxFailures$1.evaluate(TestRuleIgnoreAfterMaxFailures.java:64)
	at org.apache.lucene.util.TestRuleIgnoreTestSuites$1.evaluate(TestRuleIgnoreTestSuites.java:54)
	at com.carrotsearch.randomizedtesting.rules.StatementAdapter.evaluate(StatementAdapter.java:36)
	at com.carrotsearch.randomizedtesting.ThreadLeakControl$StatementRunner.run(ThreadLeakControl.java:368)
	at java.lang.Thread.run(Thread.java:748)
Caused by: org.apache.solr.client.solrj.impl.HttpSolrClient$RemoteSolrException: Error from server at http://127.0.0.1:58907/solr/myalias: Expected mime type application/octet-stream but got text/html. <html>
<head>
<meta http-equiv="Content-Type" content="text/html;charset=utf-8"/>
<title>Error 404 Can not find: /solr/myalias/select</title>
</head>
<body><h2>HTTP ERROR 404</h2>
<p>Problem accessing /solr/myalias/select. Reason:
<pre>    Can not find: /solr/myalias/select</pre></p><hr><a href="http://eclipse.org/jetty">Powered by Jetty:// 9.4.11.v20180605</a><hr/>

</body>
</html>

	at org.apache.solr.client.solrj.impl.HttpSolrClient.executeMethod(HttpSolrClient.java:607)
	at org.apache.solr.client.solrj.impl.HttpSolrClient.request(HttpSolrClient.java:255)
	at org.apache.solr.client.solrj.impl.HttpSolrClient.request(HttpSolrClient.java:244)
	at org.apache.solr.client.solrj.impl.LBHttpSolrClient.doRequest(LBHttpSolrClient.java:483)
	at org.apache.solr.client.solrj.impl.LBHttpSolrClient.request(LBHttpSolrClient.java:413)
	... 45 more


FAILED:  org.apache.solr.handler.RequestLoggingTest.testLogBeforeExecuteWithRequestLogger

Error Message:


Stack Trace:
java.lang.AssertionError
	at __randomizedtesting.SeedInfo.seed([A022F93B839D68E1:114BD9342E6BD0AF]:0)
	at org.junit.Assert.fail(Assert.java:92)
	at org.junit.Assert.assertTrue(Assert.java:43)
	at org.junit.Assert.assertTrue(Assert.java:54)
	at org.apache.solr.handler.RequestLoggingTest.testLogBeforeExecute(RequestLoggingTest.java:88)
	at org.apache.solr.handler.RequestLoggingTest.testLogBeforeExecuteWithRequestLogger(RequestLoggingTest.java:71)
	at sun.reflect.NativeMethodAccessorImpl.invoke0(Native Method)
	at sun.reflect.NativeMethodAccessorImpl.invoke(NativeMethodAccessorImpl.java:62)
	at sun.reflect.DelegatingMethodAccessorImpl.invoke(DelegatingMethodAccessorImpl.java:43)
	at java.lang.reflect.Method.invoke(Method.java:498)
	at com.carrotsearch.randomizedtesting.RandomizedRunner.invoke(RandomizedRunner.java:1737)
	at com.carrotsearch.randomizedtesting.RandomizedRunner$8.evaluate(RandomizedRunner.java:934)
	at com.carrotsearch.randomizedtesting.RandomizedRunner$9.evaluate(RandomizedRunner.java:970)
	at com.carrotsearch.randomizedtesting.RandomizedRunner$10.evaluate(RandomizedRunner.java:984)
	at com.carrotsearch.randomizedtesting.rules.SystemPropertiesRestoreRule$1.evaluate(SystemPropertiesRestoreRule.java:57)
	at org.apache.lucene.util.TestRuleSetupTeardownChained$1.evaluate(TestRuleSetupTeardownChained.java:49)
	at org.apache.lucene.util.AbstractBeforeAfterRule$1.evaluate(AbstractBeforeAfterRule.java:45)
	at org.apache.lucene.util.TestRuleThreadAndTestName$1.evaluate(TestRuleThreadAndTestName.java:48)
	at org.apache.lucene.util.TestRuleIgnoreAfterMaxFailures$1.evaluate(TestRuleIgnoreAfterMaxFailures.java:64)
	at org.apache.lucene.util.TestRuleMarkFailure$1.evaluate(TestRuleMarkFailure.java:47)
	at com.carrotsearch.randomizedtesting.rules.StatementAdapter.evaluate(StatementAdapter.java:36)
	at com.carrotsearch.randomizedtesting.ThreadLeakControl$StatementRunner.run(ThreadLeakControl.java:368)
	at com.carrotsearch.randomizedtesting.ThreadLeakControl.forkTimeoutingTask(ThreadLeakControl.java:817)
	at com.carrotsearch.randomizedtesting.ThreadLeakControl$3.evaluate(ThreadLeakControl.java:468)
	at com.carrotsearch.randomizedtesting.RandomizedRunner.runSingleTest(RandomizedRunner.java:943)
	at com.carrotsearch.randomizedtesting.RandomizedRunner$5.evaluate(RandomizedRunner.java:829)
	at com.carrotsearch.randomizedtesting.RandomizedRunner$6.evaluate(RandomizedRunner.java:879)
	at com.carrotsearch.randomizedtesting.RandomizedRunner$7.evaluate(RandomizedRunner.java:890)
	at com.carrotsearch.randomizedtesting.rules.StatementAdapter.evaluate(StatementAdapter.java:36)
	at com.carrotsearch.randomizedtesting.rules.SystemPropertiesRestoreRule$1.evaluate(SystemPropertiesRestoreRule.java:57)
	at org.apache.lucene.util.AbstractBeforeAfterRule$1.evaluate(AbstractBeforeAfterRule.java:45)
	at com.carrotsearch.randomizedtesting.rules.StatementAdapter.evaluate(StatementAdapter.java:36)
	at org.apache.lucene.util.TestRuleStoreClassName$1.evaluate(TestRuleStoreClassName.java:41)
	at com.carrotsearch.randomizedtesting.rules.NoShadowingOrOverridesOnMethodsRule$1.evaluate(NoShadowingOrOverridesOnMethodsRule.java:40)
	at com.carrotsearch.randomizedtesting.rules.NoShadowingOrOverridesOnMethodsRule$1.evaluate(NoShadowingOrOverridesOnMethodsRule.java:40)
	at com.carrotsearch.randomizedtesting.rules.StatementAdapter.evaluate(StatementAdapter.java:36)
	at com.carrotsearch.randomizedtesting.rules.StatementAdapter.evaluate(StatementAdapter.java:36)
	at com.carrotsearch.randomizedtesting.rules.StatementAdapter.evaluate(StatementAdapter.java:36)
	at org.apache.lucene.util.TestRuleAssertionsRequired$1.evaluate(TestRuleAssertionsRequired.java:53)
	at org.apache.lucene.util.TestRuleMarkFailure$1.evaluate(TestRuleMarkFailure.java:47)
	at org.apache.lucene.util.TestRuleIgnoreAfterMaxFailures$1.evaluate(TestRuleIgnoreAfterMaxFailures.java:64)
	at org.apache.lucene.util.TestRuleIgnoreTestSuites$1.evaluate(TestRuleIgnoreTestSuites.java:54)
	at com.carrotsearch.randomizedtesting.rules.StatementAdapter.evaluate(StatementAdapter.java:36)
	at com.carrotsearch.randomizedtesting.ThreadLeakControl$StatementRunner.run(ThreadLeakControl.java:368)
	at java.lang.Thread.run(Thread.java:748)




Build Log:
[...truncated 12347 lines...]
   [junit4] Suite: org.apache.solr.cloud.api.collections.CollectionsAPIAsyncDistributedZkTest
   [junit4]   2> Creating dataDir: /export/home/jenkins/workspace/Lucene-Solr-7.x-Solaris/solr/build/solr-core/test/J1/temp/solr.cloud.api.collections.CollectionsAPIAsyncDistributedZkTest_A022F93B839D68E1-001/init-core-data-001
   [junit4]   2> 33460 WARN  (SUITE-CollectionsAPIAsyncDistributedZkTest-seed#[A022F93B839D68E1]-worker) [    ] o.a.s.SolrTestCaseJ4 startTrackingSearchers: numOpens=13 numCloses=13
   [junit4]   2> 33461 INFO  (SUITE-CollectionsAPIAsyncDistributedZkTest-seed#[A022F93B839D68E1]-worker) [    ] o.a.s.SolrTestCaseJ4 Using PointFields (NUMERIC_POINTS_SYSPROP=true) w/NUMERIC_DOCVALUES_SYSPROP=true
   [junit4]   2> 33462 INFO  (SUITE-CollectionsAPIAsyncDistributedZkTest-seed#[A022F93B839D68E1]-worker) [    ] o.a.s.SolrTestCaseJ4 Randomized ssl (false) and clientAuth (true) via: @org.apache.solr.util.RandomizeSSL(reason=, value=NaN, ssl=NaN, clientAuth=NaN)
   [junit4]   2> 33462 INFO  (SUITE-CollectionsAPIAsyncDistributedZkTest-seed#[A022F93B839D68E1]-worker) [    ] o.a.s.SolrTestCaseJ4 SecureRandom sanity checks: test.solr.allowed.securerandom=null & java.security.egd=file:/dev/./urandom
   [junit4]   2> 33467 INFO  (SUITE-CollectionsAPIAsyncDistributedZkTest-seed#[A022F93B839D68E1]-worker) [    ] o.a.s.c.MiniSolrCloudCluster Starting cluster of 2 servers in /export/home/jenkins/workspace/Lucene-Solr-7.x-Solaris/solr/build/solr-core/test/J1/temp/solr.cloud.api.collections.CollectionsAPIAsyncDistributedZkTest_A022F93B839D68E1-001/tempDir-001
   [junit4]   2> 33468 INFO  (SUITE-CollectionsAPIAsyncDistributedZkTest-seed#[A022F93B839D68E1]-worker) [    ] o.a.s.c.ZkTestServer STARTING ZK TEST SERVER
   [junit4]   2> 33468 INFO  (Thread-18) [    ] o.a.s.c.ZkTestServer client port:0.0.0.0/0.0.0.0:0
   [junit4]   2> 33468 INFO  (Thread-18) [    ] o.a.s.c.ZkTestServer Starting server
   [junit4]   2> 33471 ERROR (Thread-18) [    ] o.a.z.s.ZooKeeperServer ZKShutdownHandler is not registered, so ZooKeeper server won't take any action on ERROR or SHUTDOWN server state changes
   [junit4]   2> 33568 INFO  (SUITE-CollectionsAPIAsyncDistributedZkTest-seed#[A022F93B839D68E1]-worker) [    ] o.a.s.c.ZkTestServer start zk server on port:48012
   [junit4]   2> 33582 INFO  (zkConnectionManagerCallback-138-thread-1) [    ] o.a.s.c.c.ConnectionManager zkClient has connected
   [junit4]   2> 33978 INFO  (jetty-launcher-135-thread-2) [    ] o.e.j.s.Server jetty-9.4.11.v20180605; built: 2018-06-05T18:24:03.829Z; git: d5fc0523cfa96bfebfbda19606cad384d772f04c; jvm 1.8.0_172-b11
   [junit4]   2> 33985 INFO  (jetty-launcher-135-thread-1) [    ] o.e.j.s.Server jetty-9.4.11.v20180605; built: 2018-06-05T18:24:03.829Z; git: d5fc0523cfa96bfebfbda19606cad384d772f04c; jvm 1.8.0_172-b11
   [junit4]   2> 34011 INFO  (jetty-launcher-135-thread-2) [    ] o.e.j.s.session DefaultSessionIdManager workerName=node0
   [junit4]   2> 34011 INFO  (jetty-launcher-135-thread-2) [    ] o.e.j.s.session No SessionScavenger set, using defaults
   [junit4]   2> 34014 INFO  (jetty-launcher-135-thread-2) [    ] o.e.j.s.session node0 Scavenging every 660000ms
   [junit4]   2> 34039 INFO  (jetty-launcher-135-thread-2) [    ] o.e.j.s.h.ContextHandler Started o.e.j.s.ServletContextHandler@26845127{/solr,null,AVAILABLE}
   [junit4]   2> 34054 INFO  (jetty-launcher-135-thread-2) [    ] o.e.j.s.AbstractConnector Started ServerConnector@3f4771e3{HTTP/1.1,[http/1.1]}{127.0.0.1:58907}
   [junit4]   2> 34054 INFO  (jetty-launcher-135-thread-2) [    ] o.e.j.s.Server Started @34145ms
   [junit4]   2> 34054 INFO  (jetty-launcher-135-thread-2) [    ] o.a.s.c.s.e.JettySolrRunner Jetty properties: {hostContext=/solr, hostPort=58907}
   [junit4]   2> 34102 INFO  (jetty-launcher-135-thread-2) [    ] o.a.s.u.c.SSLCredentialProviderFactory Processing SSL Credential Provider chain: env;sysprop
   [junit4]   2> 34107 ERROR (jetty-launcher-135-thread-2) [    ] o.a.s.u.StartupLoggingUtils Missing Java Option solr.log.dir. Logging may be missing or incomplete.
   [junit4]   2> 34107 INFO  (jetty-launcher-135-thread-2) [    ] o.a.s.s.SolrDispatchFilter Using logger factory org.apache.logging.slf4j.Log4jLoggerFactory
   [junit4]   2> 34107 INFO  (jetty-launcher-135-thread-2) [    ] o.a.s.s.SolrDispatchFilter  ___      _       Welcome to Apache Solr? version 7.5.0
   [junit4]   2> 34108 INFO  (jetty-launcher-135-thread-2) [    ] o.a.s.s.SolrDispatchFilter / __| ___| |_ _   Starting in cloud mode on port null
   [junit4]   2> 34108 INFO  (jetty-launcher-135-thread-2) [    ] o.a.s.s.SolrDispatchFilter \__ \/ _ \ | '_|  Install dir: null
   [junit4]   2> 34108 INFO  (jetty-launcher-135-thread-2) [    ] o.a.s.s.SolrDispatchFilter |___/\___/_|_|    Start time: 2018-09-01T19:04:32.130Z
   [junit4]   2> 34110 INFO  (jetty-launcher-135-thread-2) [    ] o.a.s.c.SolrResourceLoader solr home defaulted to 'solr/' (could not find system property or JNDI)
   [junit4]   2> 34111 INFO  (jetty-launcher-135-thread-1) [    ] o.e.j.s.session DefaultSessionIdManager workerName=node0
   [junit4]   2> 34111 INFO  (jetty-launcher-135-thread-1) [    ] o.e.j.s.session No SessionScavenger set, using defaults
   [junit4]   2> 34111 INFO  (jetty-launcher-135-thread-1) [    ] o.e.j.s.session node0 Scavenging every 600000ms
   [junit4]   2> 34126 INFO  (jetty-launcher-135-thread-1) [    ] o.e.j.s.h.ContextHandler Started o.e.j.s.ServletContextHandler@721e9dbf{/solr,null,AVAILABLE}
   [junit4]   2> 34137 INFO  (jetty-launcher-135-thread-1) [    ] o.e.j.s.AbstractConnector Started ServerConnector@44d41546{HTTP/1.1,[http/1.1]}{127.0.0.1:45021}
   [junit4]   2> 34137 INFO  (jetty-launcher-135-thread-1) [    ] o.e.j.s.Server Started @34229ms
   [junit4]   2> 34137 INFO  (jetty-launcher-135-thread-1) [    ] o.a.s.c.s.e.JettySolrRunner Jetty properties: {hostContext=/solr, hostPort=45021}
   [junit4]   2> 34138 ERROR (jetty-launcher-135-thread-1) [    ] o.a.s.u.StartupLoggingUtils Missing Java Option solr.log.dir. Logging may be missing or incomplete.
   [junit4]   2> 34138 INFO  (jetty-launcher-135-thread-1) [    ] o.a.s.s.SolrDispatchFilter Using logger factory org.apache.logging.slf4j.Log4jLoggerFactory
   [junit4]   2> 34138 INFO  (jetty-launcher-135-thread-1) [    ] o.a.s.s.SolrDispatchFilter  ___      _       Welcome to Apache Solr? version 7.5.0
   [junit4]   2> 34138 INFO  (jetty-launcher-135-thread-1) [    ] o.a.s.s.SolrDispatchFilter / __| ___| |_ _   Starting in cloud mode on port null
   [junit4]   2> 34139 INFO  (jetty-launcher-135-thread-1) [    ] o.a.s.s.SolrDispatchFilter \__ \/ _ \ | '_|  Install dir: null
   [junit4]   2> 34139 INFO  (jetty-launcher-135-thread-1) [    ] o.a.s.s.SolrDispatchFilter |___/\___/_|_|    Start time: 2018-09-01T19:04:32.161Z
   [junit4]   2> 34153 INFO  (zkConnectionManagerCallback-140-thread-1) [    ] o.a.s.c.c.ConnectionManager zkClient has connected
   [junit4]   2> 34154 INFO  (zkConnectionManagerCallback-142-thread-1) [    ] o.a.s.c.c.ConnectionManager zkClient has connected
   [junit4]   2> 34154 INFO  (jetty-launcher-135-thread-2) [    ] o.a.s.s.SolrDispatchFilter solr.xml found in ZooKeeper. Loading...
   [junit4]   2> 34155 INFO  (jetty-launcher-135-thread-1) [    ] o.a.s.s.SolrDispatchFilter solr.xml found in ZooKeeper. Loading...
   [junit4]   2> 34884 INFO  (jetty-launcher-135-thread-1) [    ] o.a.s.c.ZkContainer Zookeeper client=127.0.0.1:48012/solr
   [junit4]   2> 34910 INFO  (zkConnectionManagerCallback-146-thread-1) [    ] o.a.s.c.c.ConnectionManager zkClient has connected
   [junit4]   2> 34921 INFO  (zkConnectionManagerCallback-148-thread-1) [    ] o.a.s.c.c.ConnectionManager zkClient has connected
   [junit4]   2> 34982 INFO  (jetty-launcher-135-thread-2) [    ] o.a.s.c.ZkContainer Zookeeper client=127.0.0.1:48012/solr
   [junit4]   2> 35013 INFO  (zkConnectionManagerCallback-152-thread-1) [    ] o.a.s.c.c.ConnectionManager zkClient has connected
   [junit4]   2> 35103 INFO  (zkConnectionManagerCallback-156-thread-1) [    ] o.a.s.c.c.ConnectionManager zkClient has connected
   [junit4]   2> 35340 INFO  (jetty-launcher-135-thread-1) [n:127.0.0.1:45021_solr    ] o.a.s.c.OverseerElectionContext I am going to be the leader 127.0.0.1:45021_solr
   [junit4]   2> 35342 INFO  (jetty-launcher-135-thread-1) [n:127.0.0.1:45021_solr    ] o.a.s.c.Overseer Overseer (id=72262791838760964-127.0.0.1:45021_solr-n_0000000000) starting
   [junit4]   2> 35416 INFO  (jetty-launcher-135-thread-2) [n:127.0.0.1:58907_solr    ] o.a.s.c.ZkController Register node as live in ZooKeeper:/live_nodes/127.0.0.1:58907_solr
   [junit4]   2> 35451 INFO  (zkCallback-155-thread-1) [    ] o.a.s.c.c.ZkStateReader Updated live nodes from ZooKeeper... (0) -> (1)
   [junit4]   2> 35454 INFO  (zkCallback-147-thread-1) [    ] o.a.s.c.c.ZkStateReader Updated live nodes from ZooKeeper... (0) -> (1)
   [junit4]   2> 35489 INFO  (zkConnectionManagerCallback-163-thread-1) [    ] o.a.s.c.c.ConnectionManager zkClient has connected
   [junit4]   2> 35510 INFO  (jetty-launcher-135-thread-1) [n:127.0.0.1:45021_solr    ] o.a.s.c.c.ZkStateReader Updated live nodes from ZooKeeper... (0) -> (1)
   [junit4]   2> 35513 INFO  (jetty-launcher-135-thread-1) [n:127.0.0.1:45021_solr    ] o.a.s.c.s.i.ZkClientClusterStateProvider Cluster at 127.0.0.1:48012/solr ready
   [junit4]   2> 35565 INFO  (zkConnectionManagerCallback-168-thread-1) [    ] o.a.s.c.c.ConnectionManager zkClient has connected
   [junit4]   2> 35567 INFO  (jetty-launcher-135-thread-2) [n:127.0.0.1:58907_solr    ] o.a.s.c.c.ZkStateReader Updated live nodes from ZooKeeper... (0) -> (1)
   [junit4]   2> 35569 INFO  (jetty-launcher-135-thread-2) [n:127.0.0.1:58907_solr    ] o.a.s.c.s.i.ZkClientClusterStateProvider Cluster at 127.0.0.1:48012/solr ready
   [junit4]   2> 35570 INFO  (jetty-launcher-135-thread-2) [n:127.0.0.1:58907_solr    ] o.a.s.h.a.MetricsHistoryHandler No .system collection, keeping metrics history in memory.
   [junit4]   2> 35635 INFO  (jetty-launcher-135-thread-2) [n:127.0.0.1:58907_solr    ] o.a.s.m.r.SolrJmxReporter JMX monitoring for 'solr_58907.solr.node' (registry 'solr.node') enabled at server: com.sun.jmx.mbeanserver.JmxMBeanServer@52f3ac22
   [junit4]   2> 35636 INFO  (jetty-launcher-135-thread-2) [n:127.0.0.1:58907_solr    ] o.a.s.m.r.SolrJmxReporter JMX monitoring for 'solr_58907.solr.jvm' (registry 'solr.jvm') enabled at server: com.sun.jmx.mbeanserver.JmxMBeanServer@52f3ac22
   [junit4]   2> 35636 INFO  (jetty-launcher-135-thread-2) [n:127.0.0.1:58907_solr    ] o.a.s.m.r.SolrJmxReporter JMX monitoring for 'solr_58907.solr.jetty' (registry 'solr.jetty') enabled at server: com.sun.jmx.mbeanserver.JmxMBeanServer@52f3ac22
   [junit4]   2> 35639 INFO  (jetty-launcher-135-thread-2) [n:127.0.0.1:58907_solr    ] o.a.s.c.CorePropertiesLocator Found 0 core definitions underneath /export/home/jenkins/workspace/Lucene-Solr-7.x-Solaris/solr/build/solr-core/test/J1/temp/solr.cloud.api.collections.CollectionsAPIAsyncDistributedZkTest_A022F93B839D68E1-001/tempDir-001/node2/.
   [junit4]   2> 35649 INFO  (OverseerStateUpdate-72262791838760964-127.0.0.1:45021_solr-n_0000000000) [n:127.0.0.1:45021_solr    ] o.a.s.c.Overseer Starting to work on the main queue : 127.0.0.1:45021_solr
   [junit4]   2> 35653 INFO  (jetty-launcher-135-thread-1) [n:127.0.0.1:45021_solr    ] o.a.s.c.TransientSolrCoreCacheDefault Allocating transient cache for 2147483647 transient cores
   [junit4]   2> 35653 INFO  (jetty-launcher-135-thread-1) [n:127.0.0.1:45021_solr    ] o.a.s.c.ZkController Register node as live in ZooKeeper:/live_nodes/127.0.0.1:45021_solr
   [junit4]   2> 35656 INFO  (zkCallback-155-thread-1) [    ] o.a.s.c.c.ZkStateReader Updated live nodes from ZooKeeper... (1) -> (2)
   [junit4]   2> 35663 INFO  (zkCallback-162-thread-1) [    ] o.a.s.c.c.ZkStateReader Updated live nodes from ZooKeeper... (1) -> (2)
   [junit4]   2> 35665 INFO  (zkCallback-167-thread-1) [    ] o.a.s.c.c.ZkStateReader Updated live nodes from ZooKeeper... (1) -> (2)
   [junit4]   2> 35668 INFO  (OverseerStateUpdate-72262791838760964-127.0.0.1:45021_solr-n_0000000000) [n:127.0.0.1:45021_solr    ] o.a.s.c.c.ZkStateReader Updated live nodes from ZooKeeper... (1) -> (2)
   [junit4]   2> 35780 INFO  (jetty-launcher-135-thread-1) [n:127.0.0.1:45021_solr    ] o.a.s.h.a.MetricsHistoryHandler No .system collection, keeping metrics history in memory.
   [junit4]   2> 35818 INFO  (jetty-launcher-135-thread-1) [n:127.0.0.1:45021_solr    ] o.a.s.m.r.SolrJmxReporter JMX monitoring for 'solr_45021.solr.node' (registry 'solr.node') enabled at server: com.sun.jmx.mbeanserver.JmxMBeanServer@52f3ac22
   [junit4]   2> 35826 INFO  (jetty-launcher-135-thread-1) [n:127.0.0.1:45021_solr    ] o.a.s.m.r.SolrJmxReporter JMX monitoring for 'solr_45021.solr.jvm' (registry 'solr.jvm') enabled at server: com.sun.jmx.mbeanserver.JmxMBeanServer@52f3ac22
   [junit4]   2> 35826 INFO  (jetty-launcher-135-thread-1) [n:127.0.0.1:45021_solr    ] o.a.s.m.r.SolrJmxReporter JMX monitoring for 'solr_45021.solr.jetty' (registry 'solr.jetty') enabled at server: com.sun.jmx.mbeanserver.JmxMBeanServer@52f3ac22
   [junit4]   2> 35827 INFO  (jetty-launcher-135-thread-1) [n:127.0.0.1:45021_solr    ] o.a.s.c.CorePropertiesLocator Found 0 core definitions underneath /export/home/jenkins/workspace/Lucene-Solr-7.x-Solaris/solr/build/solr-core/test/J1/temp/solr.cloud.api.collections.CollectionsAPIAsyncDistributedZkTest_A022F93B839D68E1-001/tempDir-001/node1/.
   [junit4]   2> 35910 INFO  (zkConnectionManagerCallback-172-thread-1) [    ] o.a.s.c.c.ConnectionManager zkClient has connected
   [junit4]   2> 35915 WARN  (NIOServerCxn.Factory:0.0.0.0/0.0.0.0:0) [    ] o.a.z.s.NIOServerCnxn Unable to read additional data from client sessionid 0x100baa056070009, likely client has closed socket
   [junit4]   2> 35918 INFO  (zkConnectionManagerCallback-177-thread-1) [    ] o.a.s.c.c.ConnectionManager zkClient has connected
   [junit4]   2> 35919 INFO  (SUITE-CollectionsAPIAsyncDistributedZkTest-seed#[A022F93B839D68E1]-worker) [    ] o.a.s.c.c.ZkStateReader Updated live nodes from ZooKeeper... (0) -> (2)
   [junit4]   2> 35921 INFO  (SUITE-CollectionsAPIAsyncDistributedZkTest-seed#[A022F93B839D68E1]-worker) [    ] o.a.s.c.s.i.ZkClientClusterStateProvider Cluster at 127.0.0.1:48012/solr ready
   [junit4] IGNOR/A 0.01s J1 | CollectionsAPIAsyncDistributedZkTest.testAsyncIdRaceCondition
   [junit4]    > Assumption #1: 'badapple' test group is disabled (@BadApple(bugUrl=https://issues.apache.org/jira/browse/SOLR-12028))
   [junit4]   2> 35987 INFO  (TEST-CollectionsAPIAsyncDistributedZkTest.testAsyncIdBackCompat-seed#[A022F93B839D68E1]) [    ] o.a.s.SolrTestCaseJ4 ###Starting testAsyncIdBackCompat
   [junit4]   2> 36425 INFO  (qtp74846242-292) [n:127.0.0.1:58907_solr    ] o.a.s.h.a.CollectionsHandler Invoked Collection Action :create with params async=testAsyncIdBackCompat&collection.configName=conf1&name=testAsyncIdBackCompat&nrtReplicas=1&action=CREATE&numShards=1&wt=javabin&version=2 and sendToOCPQueue=true
   [junit4]   2> 36440 INFO  (qtp74846242-292) [n:127.0.0.1:58907_solr    ] o.a.s.s.HttpSolrCall [admin] webapp=null path=/admin/collections params={async=testAsyncIdBackCompat&collection.configName=conf1&name=testAsyncIdBackCompat&nrtReplicas=1&action=CREATE&numShards=1&wt=javabin&version=2} status=0 QTime=19
   [junit4]   2> 36497 INFO  (TEST-CollectionsAPIAsyncDistributedZkTest.testAsyncIdBackCompat-seed#[A022F93B839D68E1]) [    ] o.a.s.SolrTestCaseJ4 ###Ending testAsyncIdBackCompat
   [junit4]   2> 36540 INFO  (TEST-CollectionsAPIAsyncDistributedZkTest.testSolrJAPICalls-seed#[A022F93B839D68E1]) [    ] o.a.s.SolrTestCaseJ4 ###Starting testSolrJAPICalls
   [junit4]   2> 36549 INFO  (qtp74846242-289) [n:127.0.0.1:58907_solr    ] o.a.s.h.a.CollectionsHandler Invoked Collection Action :create with params async=7a94bb4c-2f3d-4830-bfa0-e92804bd91e6&collection.configName=conf1&name=testasynccollectioncreation&nrtReplicas=1&action=CREATE&numShards=1&wt=javabin&version=2 and sendToOCPQueue=true
   [junit4]   2> 36557 INFO  (qtp74846242-289) [n:127.0.0.1:58907_solr    ] o.a.s.s.HttpSolrCall [admin] webapp=null path=/admin/collections params={async=7a94bb4c-2f3d-4830-bfa0-e92804bd91e6&collection.configName=conf1&name=testasynccollectioncreation&nrtReplicas=1&action=CREATE&numShards=1&wt=javabin&version=2} status=0 QTime=8
   [junit4]   2> 36573 INFO  (qtp74846242-288) [n:127.0.0.1:58907_solr    ] o.a.s.h.a.CollectionsHandler Invoked Collection Action :requeststatus with params requestid=7a94bb4c-2f3d-4830-bfa0-e92804bd91e6&action=REQUESTSTATUS&wt=javabin&version=2 and sendToOCPQueue=true
   [junit4]   2> 36575 INFO  (qtp74846242-288) [n:127.0.0.1:58907_solr    ] o.a.s.s.HttpSolrCall [admin] webapp=null path=/admin/collections params={requestid=7a94bb4c-2f3d-4830-bfa0-e92804bd91e6&action=REQUESTSTATUS&wt=javabin&version=2} status=0 QTime=1
   [junit4]   2> 36575 INFO  (OverseerThreadFactory-35-thread-1-processing-n:127.0.0.1:45021_solr) [n:127.0.0.1:45021_solr    ] o.a.s.c.a.c.CreateCollectionCmd Create collection testasynccollectioncreation
   [junit4]   2> 36725 INFO  (OverseerStateUpdate-72262791838760964-127.0.0.1:45021_solr-n_0000000000) [n:127.0.0.1:45021_solr    ] o.a.s.c.o.SliceMutator createReplica() {
   [junit4]   2>   "operation":"ADDREPLICA",
   [junit4]   2>   "collection":"testasynccollectioncreation",
   [junit4]   2>   "shard":"shard1",
   [junit4]   2>   "core":"testasynccollectioncreation_shard1_replica_n1",
   [junit4]   2>   "state":"down",
   [junit4]   2>   "base_url":"http://127.0.0.1:45021/solr",
   [junit4]   2>   "type":"NRT",
   [junit4]   2>   "waitForFinalState":"false"} 
   [junit4]   2> 36937 INFO  (qtp1397070419-303) [n:127.0.0.1:45021_solr    x:testasynccollectioncreation_shard1_replica_n1] o.a.s.s.HttpSolrCall [admin] webapp=null path=/admin/cores params={qt=/admin/cores&collection.configName=conf1&newCollection=true&collection=testasynccollectioncreation&version=2&replicaType=NRT&async=7a94bb4c-2f3d-4830-bfa0-e92804bd91e63131073211176545&coreNodeName=core_node2&name=testasynccollectioncreation_shard1_replica_n1&action=CREATE&numShards=1&shard=shard1&wt=javabin} status=0 QTime=2
   [junit4]   2> 36937 INFO  (parallelCoreAdminExecutor-36-thread-1-processing-n:127.0.0.1:45021_solr x:testasynccollectioncreation_shard1_replica_n1 7a94bb4c-2f3d-4830-bfa0-e92804bd91e63131073211176545 CREATE) [n:127.0.0.1:45021_solr    x:testasynccollectioncreation_shard1_replica_n1] o.a.s.h.a.CoreAdminOperation core create command qt=/admin/cores&collection.configName=conf1&newCollection=true&collection=testasynccollectioncreation&version=2&replicaType=NRT&async=7a94bb4c-2f3d-4830-bfa0-e92804bd91e63131073211176545&coreNodeName=core_node2&name=testasynccollectioncreation_shard1_replica_n1&action=CREATE&numShards=1&shard=shard1&wt=javabin
   [junit4]   2> 36943 INFO  (qtp1397070419-297) [n:127.0.0.1:45021_solr    ] o.a.s.h.a.CoreAdminOperation Checking request status for : 7a94bb4c-2f3d-4830-bfa0-e92804bd91e63131073211176545
   [junit4]   2> 36946 INFO  (qtp1397070419-297) [n:127.0.0.1:45021_solr    ] o.a.s.s.HttpSolrCall [admin] webapp=null path=/admin/cores params={qt=/admin/cores&requestid=7a94bb4c-2f3d-4830-bfa0-e92804bd91e63131073211176545&action=REQUESTSTATUS&wt=javabin&version=2} status=0 QTime=3
   [junit4]   2> 37579 INFO  (qtp74846242-294) [n:127.0.0.1:58907_solr    ] o.a.s.h.a.CollectionsHandler Invoked Collection Action :requeststatus with params requestid=7a94bb4c-2f3d-4830-bfa0-e92804bd91e6&action=REQUESTSTATUS&wt=javabin&version=2 and sendToOCPQueue=true
   [junit4]   2> 37581 INFO  (qtp74846242-294) [n:127.0.0.1:58907_solr    ] o.a.s.s.HttpSolrCall [admin] webapp=null path=/admin/collections params={requestid=7a94bb4c-2f3d-4830-bfa0-e92804bd91e6&action=REQUESTSTATUS&wt=javabin&version=2} status=0 QTime=2
   [junit4]   2> 37950 INFO  (qtp1397070419-301) [n:127.0.0.1:45021_solr    ] o.a.s.h.a.CoreAdminOperation Checking request status for : 7a94bb4c-2f3d-4830-bfa0-e92804bd91e63131073211176545
   [junit4]   2> 37950 INFO  (qtp1397070419-301) [n:127.0.0.1:45021_solr    ] o.a.s.s.HttpSolrCall [admin] webapp=null path=/admin/cores params={qt=/admin/cores&requestid=7a94bb4c-2f3d-4830-bfa0-e92804bd91e63131073211176545&action=REQUESTSTATUS&wt=javabin&version=2} status=0 QTime=0
   [junit4]   2> 37974 INFO  (parallelCoreAdminExecutor-36-thread-1-processing-n:127.0.0.1:45021_solr x:testasynccollectioncreation_shard1_replica_n1 7a94bb4c-2f3d-4830-bfa0-e92804bd91e63131073211176545 CREATE) [n:127.0.0.1:45021_solr c:testasynccollectioncreation s:shard1 r:core_node2 x:testasynccollectioncreation_shard1_replica_n1] o.a.s.c.SolrConfig Using Lucene MatchVersion: 7.5.0
   [junit4]   2> 37991 INFO  (parallelCoreAdminExecutor-36-thread-1-processing-n:127.0.0.1:45021_solr x:testasynccollectioncreation_shard1_replica_n1 7a94bb4c-2f3d-4830-bfa0-e92804bd91e63131073211176545 CREATE) [n:127.0.0.1:45021_solr c:testasynccollectioncreation s:shard1 r:core_node2 x:testasynccollectioncreation_shard1_replica_n1] o.a.s.s.IndexSchema [testasynccollectioncreation_shard1_replica_n1] Schema name=minimal
   [junit4]   2> 37998 INFO  (parallelCoreAdminExecutor-36-thread-1-processing-n:127.0.0.1:45021_solr x:testasynccollectioncreation_shard1_replica_n1 7a94bb4c-2f3d-4830-bfa0-e92804bd91e63131073211176545 CREATE) [n:127.0.0.1:45021_solr c:testasynccollectioncreation s:shard1 r:core_node2 x:testasynccollectioncreation_shard1_replica_n1] o.a.s.s.IndexSchema Loaded schema minimal/1.1 with uniqueid field id
   [junit4]   2> 37998 INFO  (parallelCoreAdminExecutor-36-thread-1-processing-n:127.0.0.1:45021_solr x:testasynccollectioncreation_shard1_replica_n1 7a94bb4c-2f3d-4830-bfa0-e92804bd91e63131073211176545 CREATE) [n:127.0.0.1:45021_solr c:testasynccollectioncreation s:shard1 r:core_node2 x:testasynccollectioncreation_shard1_replica_n1] o.a.s.c.CoreContainer Creating SolrCore 'testasynccollectioncreation_shard1_replica_n1' using configuration from collection testasynccollectioncreation, trusted=true
   [junit4]   2> 38000 INFO  (parallelCoreAdminExecutor-36-thread-1-processing-n:127.0.0.1:45021_solr x:testasynccollectioncreation_shard1_replica_n1 7a94bb4c-2f3d-4830-bfa0-e92804bd91e63131073211176545 CREATE) [n:127.0.0.1:45021_solr c:testasynccollectioncreation s:shard1 r:core_node2 x:testasynccollectioncreation_shard1_replica_n1] o.a.s.m.r.SolrJmxReporter JMX monitoring for 'solr_45021.solr.core.testasynccollectioncreation.shard1.replica_n1' (registry 'solr.core.testasynccollectioncreation.shard1.replica_n1') enabled at server: com.sun.jmx.mbeanserver.JmxMBeanServer@52f3ac22
   [junit4]   2> 38000 INFO  (parallelCoreAdminExecutor-36-thread-1-processing-n:127.0.0.1:45021_solr x:testasynccollectioncreation_shard1_replica_n1 7a94bb4c-2f3d-4830-bfa0-e92804bd91e63131073211176545 CREATE) [n:127.0.0.1:45021_solr c:testasynccollectioncreation s:shard1 r:core_node2 x:testasynccollectioncreation_shard1_replica_n1] o.a.s.c.SolrCore solr.RecoveryStrategy.Builder
   [junit4]   2> 38000 INFO  (parallelCoreAdminExecutor-36-thread-1-processing-n:127.0.0.1:45021_solr x:testasynccollectioncreation_shard1_replica_n1 7a94bb4c-2f3d-4830-bfa0-e92804bd91e63131073211176545 CREATE) [n:127.0.0.1:45021_solr c:testasynccollectioncreation s:shard1 r:core_node2 x:testasynccollectioncreation_shard1_replica_n1] o.a.s.c.SolrCore [[testasynccollectioncreation_shard1_replica_n1] ] Opening new SolrCore at [/export/home/jenkins/workspace/Lucene-Solr-7.x-Solaris/solr/build/solr-core/test/J1/temp/solr.cloud.api.collections.CollectionsAPIAsyncDistributedZkTest_A022F93B839D68E1-001/tempDir-001/node1/testasynccollectioncreation_shard1_replica_n1], dataDir=[/export/home/jenkins/workspace/Lucene-Solr-7.x-Solaris/solr/build/solr-core/test/J1/temp/solr.cloud.api.collections.CollectionsAPIAsyncDistributedZkTest_A022F93B839D68E1-001/tempDir-001/node1/./testasynccollectioncreation_shard1_replica_n1/data/]
   [junit4]   2> 38092 INFO  (parallelCoreAdminExecutor-36-thread-1-processing-n:127.0.0.1:45021_solr x:testasynccollectioncreation_shard1_replica_n1 7a94bb4c-2f3d-4830-bfa0-e92804bd91e63131073211176545 CREATE) [n:127.0.0.1:45021_solr c:testasynccollectioncreation s:shard1 r:core_node2 x:testasynccollectioncreation_shard1_replica_n1] o.a.s.u.UpdateHandler Using UpdateLog implementation: org.apache.solr.update.UpdateLog
   [junit4]   2> 38092 INFO  (parallelCoreAdminExecutor-36-thread-1-processing-n:127.0.0.1:45021_solr x:testasynccollectioncreation_shard1_replica_n1 7a94bb4c-2f3d-4830-bfa0-e92804bd91e63131073211176545 CREATE) [n:127.0.0.1:45021_solr c:testasynccollectioncreation s:shard1 r:core_node2 x:testasynccollectioncreation_shard1_replica_n1] o.a.s.u.UpdateLog Initializing UpdateLog: dataDir=null defaultSyncLevel=FLUSH numRecordsToKeep=100 maxNumLogsToKeep=10 numVersionBuckets=65536
   [junit4]   2> 38094 INFO  (parallelCoreAdminExecutor-36-thread-1-processing-n:127.0.0.1:45021_solr x:testasynccollectioncreation_shard1_replica_n1 7a94bb4c-2f3d-4830-bfa0-e92804bd91e63131073211176545 CREATE) [n:127.0.0.1:45021_solr c:testasynccollectioncreation s:shard1 r:core_node2 x:testasynccollectioncreation_shard1_replica_n1] o.a.s.u.CommitTracker Hard AutoCommit: disabled
   [junit4]   2> 38094 INFO  (parallelCoreAdminExecutor-36-thread-1-processing-n:127.0.0.1:45021_solr x:testasynccollectioncreation_shard1_replica_n1 7a94bb4c-2f3d-4830-bfa0-e92804bd91e63131073211176545 CREATE) [n:127.0.0.1:45021_solr c:testasynccollectioncreation s:shard1 r:core_node2 x:testasynccollectioncreation_shard1_replica_n1] o.a.s.u.CommitTracker Soft AutoCommit: disabled
   [junit4]   2> 38096 INFO  (parallelCoreAdminExecutor-36-thread-1-processing-n:127.0.0.1:45021_solr x:testasynccollectioncreation_shard1_replica_n1 7a94bb4c-2f3d-4830-bfa0-e92804bd91e63131073211176545 CREATE) [n:127.0.0.1:45021_solr c:testasynccollectioncreation s:shard1 r:core_node2 x:testasynccollectioncreation_shard1_replica_n1] o.a.s.s.SolrIndexSearcher Opening [Searcher@25d0fa46[testasynccollectioncreation_shard1_replica_n1] main]
   [junit4]   2> 38100 INFO  (parallelCoreAdminExecutor-36-thread-1-processing-n:127.0.0.1:45021_solr x:testasynccollectioncreation_shard1_replica_n1 7a94bb4c-2f3d-4830-bfa0-e92804bd91e63131073211176545 CREATE) [n:127.0.0.1:45021_solr c:testasynccollectioncreation s:shard1 r:core_node2 x:testasynccollectioncreation_shard1_replica_n1] o.a.s.r.ManagedResourceStorage Configured ZooKeeperStorageIO with znodeBase: /configs/conf1
   [junit4]   2> 38101 INFO  (parallelCoreAdminExecutor-36-thread-1-processing-n:127.0.0.1:45021_solr x:testasynccollectioncreation_shard1_replica_n1 7a94bb4c-2f3d-4830-bfa0-e92804bd91e63131073211176545 CREATE) [n:127.0.0.1:45021_solr c:testasynccollectioncreation s:shard1 r:core_node2 x:testasynccollectioncreation_shard1_replica_n1] o.a.s.r.ManagedResourceStorage Loaded null at path _rest_managed.json using ZooKeeperStorageIO:path=/configs/conf1
   [junit4]   2> 38102 INFO  (parallelCoreAdminExecutor-36-thread-1-processing-n:127.0.0.1:45021_solr x:testasynccollectioncreation_shard1_replica_n1 7a94bb4c-2f3d-4830-bfa0-e92804bd91e63131073211176545 CREATE) [n:127.0.0.1:45021_solr c:testasynccollectioncreation s:shard1 r:core_node2 x:testasynccollectioncreation_shard1_replica_n1] o.a.s.h.ReplicationHandler Commits will be reserved for 10000ms.
   [junit4]   2> 38104 INFO  (parallelCoreAdminExecutor-36-thread-1-processing-n:127.0.0.1:45021_solr x:testasynccollectioncreation_shard1_replica_n1 7a94bb4c-2f3d-4830-bfa0-e92804bd91e63131073211176545 CREATE) [n:127.0.0.1:45021_solr c:testasynccollectioncreation s:shard1 r:core_node2 x:testasynccollectioncreation_shard1_replica_n1] o.a.s.u.UpdateLog Could not find max version in index or recent updates, using new clock 1610433089897496576
   [junit4]   2> 38117 INFO  (searcherExecutor-40-thread-1-processing-x:testasynccollectioncreation_shard1_replica_n1 7a94bb4c-2f3d-4830-bfa0-e92804bd91e63131073211176545 r:core_node2 CREATE n:127.0.0.1:45021_solr c:testasynccollectioncreation s:shard1) [n:127.0.0.1:45021_solr c:testasynccollectioncreation s:shard1 r:core_node2 x:testasynccollectioncreation_shard1_replica_n1] o.a.s.c.SolrCore [testasynccollectioncreation_shard1_replica_n1] Registered new searcher Searcher@25d0fa46[testasynccollectioncreation_shard1_replica_n1] main{ExitableDirectoryReader(UninvertingDirectoryReader())}
   [junit4]   2> 38125 INFO  (parallelCoreAdminExecutor-36-thread-1-processing-n:127.0.0.1:45021_solr x:testasynccollectioncreation_shard1_replica_n1 7a94bb4c-2f3d-4830-bfa0-e92804bd91e63131073211176545 CREATE) [n:127.0.0.1:45021_solr c:testasynccollectioncreation s:shard1 r:core_node2 x:testasynccollectioncreation_shard1_replica_n1] o.a.s.c.ZkShardTerms Successful update of terms at /collections/testasynccollectioncreation/terms/shard1 to Terms{values={core_node2=0}, version=0}
   [junit4]   2> 38137 INFO  (parallelCoreAdminExecutor-36-thread-1-processing-n:127.0.0.1:45021_solr x:testasynccollectioncreation_shard1_replica_n1 7a94bb4c-2f3d-4830-bfa0-e92804bd91e63131073211176545 CREATE) [n:127.0.0.1:45021_solr c:testasynccollectioncreation s:shard1 r:core_node2 x:testasynccollectioncreation_shard1_replica_n1] o.a.s.c.ShardLeaderElectionContext Enough replicas found to continue.
   [junit4]   2> 38137 INFO  (parallelCoreAdminExecutor-36-thread-1-processing-n:127.0.0.1:45021_solr x:testasynccollectioncreation_shard1_replica_n1 7a94bb4c-2f3d-4830-bfa0-e92804bd91e63131073211176545 CREATE) [n:127.0.0.1:45021_solr c:testasynccollectioncreation s:shard1 r:core_node2 x:testasynccollectioncreation_shard1_replica_n1] o.a.s.c.ShardLeaderElectionContext I may be the new leader - try and sync
   [junit4]   2> 38138 INFO  (parallelCoreAdminExecutor-36-thread-1-processing-n:127.0.0.1:45021_solr x:testasynccollectioncreation_shard1_replica_n1 7a94bb4c-2f3d-4830-bfa0-e92804bd91e63131073211176545 CREATE) [n:127.0.0.1:45021_solr c:testasynccollectioncreation s:shard1 r:core_node2 x:testasynccollectioncreation_shard1_replica_n1] o.a.s.c.SyncStrategy Sync replicas to http://127.0.0.1:45021/solr/testasynccollectioncreation_shard1_replica_n1/
   [junit4]   2> 38140 INFO  (parallelCoreAdminExecutor-36-thread-1-processing-n:127.0.0.1:45021_solr x:testasynccollectioncreation_shard1_replica_n1 7a94bb4c-2f3d-4830-bfa0-e92804bd91e63131073211176545 CREATE) [n:127.0.0.1:45021_solr c:testasynccollectioncreation s:shard1 r:core_node2 x:testasynccollectioncreation_shard1_replica_n1] o.a.s.c.SyncStrategy Sync Success - now sync replicas to me
   [junit4]   2> 38140 INFO  (parallelCoreAdminExecutor-36-thread-1-processing-n:127.0.0.1:45021_solr x:testasynccollectioncreation_shard1_replica_n1 7a94bb4c-2f3d-4830-bfa0-e92804bd91e63131073211176545 CREATE) [n:127.0.0.1:45021_solr c:testasynccollectioncreation s:shard1 r:core_node2 x:testasynccollectioncreation_shard1_replica_n1] o.a.s.c.SyncStrategy http://127.0.0.1:45021/solr/testasynccollectioncreation_shard1_replica_n1/ has no replicas
   [junit4]   2> 38140 INFO  (parallelCoreAdminExecutor-36-thread-1-processing-n:127.0.0.1:45021_solr x:testasynccollectioncreation_shard1_replica_n1 7a94bb4c-2f3d-4830-bfa0-e92804bd91e63131073211176545 CREATE) [n:127.0.0.1:45021_solr c:testasynccollectioncreation s:shard1 r:core_node2 x:testasynccollectioncreation_shard1_replica_n1] o.a.s.c.ShardLeaderElectionContext Found all replicas participating in election, clear LIR
   [junit4]   2> 38148 INFO  (parallelCoreAdminExecutor-36-thread-1-processing-n:127.0.0.1:45021_solr x:testasynccollectioncreation_shard1_replica_n1 7a94bb4c-2f3d-4830-bfa0-e92804bd91e63131073211176545 CREATE) [n:127.0.0.1:45021_solr c:testasynccollectioncreation s:shard1 r:core_node2 x:testasynccollectioncreation_shard1_replica_n1] o.a.s.c.ShardLeaderElectionContext I am the new leader: http://127.0.0.1:45021/solr/testasynccollectioncreation_shard1_replica_n1/ shard1
   [junit4]   2> 38303 INFO  (parallelCoreAdminExecutor-36-thread-1-processing-n:127.0.0.1:45021_solr x:testasynccollectioncreation_shard1_replica_n1 7a94bb4c-2f3d-4830-bfa0-e92804bd91e63131073211176545 CREATE) [n:127.0.0.1:45021_solr c:testasynccollectioncreation s:shard1 r:core_node2 x:testasynccollectioncreation_shard1_replica_n1] o.a.s.c.ZkController I am the leader, no recovery necessary
   [junit4]   2> 38409 INFO  (zkCallback-147-thread-1) [    ] o.a.s.c.c.ZkStateReader A cluster state change: [WatchedEvent state:SyncConnected type:NodeDataChanged path:/collections/testasynccollectioncreation/state.json] for collection [testasynccollectioncreation] has occurred - updating... (live nodes size: [2])
   [junit4]   2> 38584 INFO  (qtp74846242-288) [n:127.0.0.1:58907_solr    ] o.a.s.h.a.CollectionsHandler Invoked Collection Action :requeststatus with params requestid=7a94bb4c-2f3d-4830-bfa0-e92804bd91e6&action=REQUESTSTATUS&wt=javabin&version=2 and sendToOCPQueue=true
   [junit4]   2> 38585 INFO  (qtp74846242-288) [n:127.0.0.1:58907_solr    ] o.a.s.s.HttpSolrCall [admin] webapp=null path=/admin/collections params={requestid=7a94bb4c-2f3d-4830-bfa0-e92804bd91e6&action=REQUESTSTATUS&wt=javabin&version=2} status=0 QTime=1
   [junit4]   2> 38953 INFO  (qtp1397070419-300) [n:127.0.0.1:45021_solr    ] o.a.s.h.a.CoreAdminOperation Checking request status for : 7a94bb4c-2f3d-4830-bfa0-e92804bd91e63131073211176545
   [junit4]   2> 38953 INFO  (qtp1397070419-300) [n:127.0.0.1:45021_solr    ] o.a.s.s.HttpSolrCall [admin] webapp=null path=/admin/cores params={qt=/admin/cores&requestid=7a94bb4c-2f3d-4830-bfa0-e92804bd91e63131073211176545&action=REQUESTSTATUS&wt=javabin&version=2} status=0 QTime=0
   [junit4]   2> 38974 INFO  (OverseerThreadFactory-35-thread-1-processing-n:127.0.0.1:45021_solr) [n:127.0.0.1:45021_solr    ] o.a.s.c.OverseerTaskQueue Response ZK path: /overseer/collection-queue-work/qnr-0000000000 doesn't exist.  Requestor may have disconnected from ZooKeeper
   [junit4]   2> 39588 INFO  (qtp74846242-294) [n:127.0.0.1:58907_solr    ] o.a.s.h.a.CollectionsHandler Invoked Collection Action :requeststatus with params requestid=7a94bb4c-2f3d-4830-bfa0-e92804bd91e6&action=REQUESTSTATUS&wt=javabin&version=2 and sendToOCPQueue=true
   [junit4]   2> 39594 INFO  (qtp74846242-294) [n:127.0.0.1:58907_solr    ] o.a.s.s.HttpSolrCall [admin] webapp=null path=/admin/collections params={requestid=7a94bb4c-2f3d-4830-bfa0-e92804bd91e6&action=REQUESTSTATUS&wt=javabin&version=2} status=0 QTime=5
   [junit4]   2> 39596 INFO  (qtp74846242-288) [n:127.0.0.1:58907_solr    ] o.a.s.h.a.CollectionsHandler Invoked Collection Action :deletestatus with params requestid=7a94bb4c-2f3d-4830-bfa0-e92804bd91e6&action=DELETESTATUS&wt=javabin&version=2 and sendToOCPQueue=true
   [junit4]   2> 39598 INFO  (qtp74846242-288) [n:127.0.0.1:58907_solr    ] o.a.s.s.HttpSolrCall [admin] webapp=null path=/admin/collections params={requestid=7a94bb4c-2f3d-4830-bfa0-e92804bd91e6&action=DELETESTATUS&wt=javabin&version=2} status=0 QTime=1
   [junit4]   2> 39600 INFO  (qtp74846242-294) [n:127.0.0.1:58907_solr    ] o.a.s.h.a.CollectionsHandler Invoked Collection Action :create with params async=469dec96-6e6d-4fe2-8f76-fc0585860568&collection.configName=conf1&name=testasynccollectioncreation&nrtReplicas=1&action=CREATE&numShards=1&wt=javabin&version=2 and sendToOCPQueue=true
   [junit4]   2> 39605 INFO  (qtp74846242-294) [n:127.0.0.1:58907_solr    ] o.a.s.s.HttpSolrCall [admin] webapp=null path=/admin/collections params={async=469dec96-6e6d-4fe2-8f76-fc0585860568&collection.configName=conf1&name=testasynccollectioncreation&nrtReplicas=1&action=CREATE&numShards=1&wt=javabin&version=2} status=0 QTime=4
   [junit4]   2> 39607 INFO  (qtp74846242-294) [n:127.0.0.1:58907_solr    ] o.a.s.h.a.CollectionsHandler Invoked Collection Action :requeststatus with params requestid=469dec96-6e6d-4fe2-8f76-fc0585860568&action=REQUESTSTATUS&wt=javabin&version=2 and sendToOCPQueue=true
   [junit4]   2> 39609 INFO  (qtp74846242-294) [n:127.0.0.1:58907_solr    ] o.a.s.s.HttpSolrCall [admin] webapp=null path=/admin/collections params={requestid=469dec96-6e6d-4fe2-8f76-fc0585860568&action=REQUESTSTATUS&wt=javabin&version=2} status=0 QTime=2
   [junit4]   2> 39615 INFO  (OverseerThreadFactory-35-thread-2-processing-n:127.0.0.1:45021_solr) [n:127.0.0.1:45021_solr    ] o.a.s.c.a.c.CreateCollectionCmd Create collection testasynccollectioncreation
   [junit4]   2> 39615 INFO  (OverseerCollectionConfigSetProcessor-72262791838760964-127.0.0.1:45021_solr-n_0000000000) [n:127.0.0.1:45021_solr    ] o.a.s.c.OverseerTaskQueue Response ZK path: /overseer/collection-queue-work/qnr-0000000000 doesn't exist.  Requestor may have disconnected from ZooKeeper
   [junit4]   2> 39617 ERROR (OverseerThreadFactory-35-thread-2-processing-n:127.0.0.1:45021_solr) [n:127.0.0.1:45021_solr    ] o.a.s.c.a.c.OverseerCollectionMessageHandler Collection: testasynccollectioncreation operation: create failed:org.apache.solr.common.SolrException: collection already exists: testasynccollectioncreation
   [junit4]   2> 	at org.apache.solr.cloud.api.collections.CreateCollectionCmd.call(CreateCollectionCmd.java:110)
   [junit4]   2> 	at org.apache.solr.cloud.api.collections.OverseerCollectionMessageHandler.processMessage(OverseerCollectionMessageHandler.java:259)
   [junit4]   2> 	at org.apache.solr.cloud.OverseerTaskProcessor$Runner.run(OverseerTaskProcessor.java:478)
   [junit4]   2> 	at org.apache.solr.common.util.ExecutorUtil$MDCAwareThreadPoolExecutor.lambda$execute$0(ExecutorUtil.java:209)
   [junit4]   2> 	at java.util.concurrent.ThreadPoolExecutor.runWorker(ThreadPoolExecutor.java:1149)
   [junit4]   2> 	at java.util.concurrent.ThreadPoolExecutor$Worker.run(ThreadPoolExecutor.java:624)
   [junit4]   2> 	at java.lang.Thread.run(Thread.java:748)
   [junit4]   2> 
   [junit4]   2> 39628 INFO  (OverseerThreadFactory-35-thread-2-processing-n:127.0.0.1:45021_solr) [n:127.0.0.1:45021_solr    ] o.a.s.c.OverseerTaskQueue Response ZK path: /overseer/collection-queue-work/qnr-0000000001 doesn't exist.  Requestor may have disconnected from ZooKeeper
   [junit4]   2> 40612 INFO  (qtp74846242-294) [n:127.0.0.1:58907_solr    ] o.a.s.h.a.CollectionsHandler Invoked Collection Action :requeststatus with params requestid=469dec96-6e6d-4fe2-8f76-fc0585860568&action=REQUESTSTATUS&wt=javabin&version=2 and sendToOCPQueue=true
   [junit4]   2> 40615 INFO  (qtp74846242-294) [n:127.0.0.1:58907_solr    ] o.a.s.s.HttpSolrCall [admin] webapp=null path=/admin/collections params={requestid=469dec96-6e6d-4fe2-8f76-fc0585860568&action=REQUESTSTATUS&wt=javabin&version=2} status=0 QTime=3
   [junit4]   2> 40619 INFO  (qtp74846242-288) [n:127.0.0.1:58907_solr    ] o.a.s.h.a.CollectionsHandler Invoked Collection Action :deletestatus with params requestid=469dec96-6e6d-4fe2-8f76-fc0585860568&action=DELETESTATUS&wt=javabin&version=2 and sendToOCPQueue=true
   [junit4]   2> 40620 INFO  (qtp74846242-288) [n:127.0.0.1:58907_solr    ] o.a.s.s.HttpSolrCall [admin] webapp=null path=/admin/collections params={requestid=469dec96-6e6d-4fe2-8f76-fc0585860568&action=DELETESTATUS&wt=javabin&version=2} status=0 QTime=1
   [junit4]   2> 40623 INFO  (qtp74846242-294) [n:127.0.0.1:58907_solr    ] o.a.s.h.a.CollectionsHandler Invoked Collection Action :addreplica with params async=be8132fb-2e66-48a9-b277-6a3901e75b04&action=ADDREPLICA&collection=testasynccollectioncreation&shard=shard1&type=NRT&wt=javabin&version=2 and sendToOCPQueue=true
   [junit4]   2> 40627 INFO  (qtp74846242-294) [n:127.0.0.1:58907_solr c:testasynccollectioncreation   ] o.a.s.s.HttpSolrCall [admin] webapp=null path=/admin/collections params={async=be8132fb-2e66-48a9-b277-6a3901e75b04&action=ADDREPLICA&collection=testasynccollectioncreation&shard=shard1&type=NRT&wt=javabin&version=2} status=0 QTime=4
   [junit4]   2> 40647 INFO  (OverseerCollectionConfigSetProcessor-72262791838760964-127.0.0.1:45021_solr-n_0000000000) [n:127.0.0.1:45021_solr    ] o.a.s.c.OverseerTaskQueue Response ZK path: /overseer/collection-queue-work/qnr-0000000001 doesn't exist.  Requestor may have disconnected from ZooKeeper
   [junit4]   2> 40657 INFO  (qtp74846242-294) [n:127.0.0.1:58907_solr    ] o.a.s.h.a.CollectionsHandler Invoked Collection Action :requeststatus with params requestid=be8132fb-2e66-48a9-b277-6a3901e75b04&action=REQUESTSTATUS&wt=javabin&version=2 and sendToOCPQueue=true
   [junit4]   2> 40658 INFO  (OverseerThreadFactory-35-thread-3-processing-n:127.0.0.1:45021_solr) [n:127.0.0.1:45021_solr c:testasynccollectioncreation s:shard1  ] o.a.s.c.a.c.AddReplicaCmd Node Identified 127.0.0.1:58907_solr for creating new replica of shard shard1
   [junit4]   2> 40659 INFO  (qtp74846242-294) [n:127.0.0.1:58907_solr    ] o.a.s.s.HttpSolrCall [admin] webapp=null path=/admin/collections params={requestid=be8132fb-2e66-48a9-b277-6a3901e75b04&action=REQUESTSTATUS&wt=javabin&version=2} status=0 QTime=2
   [junit4]   2> 40664 INFO  (OverseerStateUpdate-72262791838760964-127.0.0.1:45021_solr-n_0000000000) [n:127.0.0.1:45021_solr    ] o.a.s.c.o.SliceMutator createReplica() {
   [junit4]   2>   "operation":"addreplica",
   [junit4]   2>   "collection":"testasynccollectioncreation",
   [junit4]   2>   "shard":"shard1",
   [junit4]   2>   "core":"testasynccollectioncreation_shard1_replica_n3",
   [junit4]   2>   "state":"down",
   [junit4]   2>   "base_url":"http://127.0.0.1:58907/solr",
   [junit4]   2>   "node_name":"127.0.0.1:58907_solr",
   [junit4]   2>   "type":"NRT"} 
   [junit4]   2> 40669 INFO  (zkCallback-147-thread-1) [    ] o.a.s.c.c.ZkStateReader A cluster state change: [WatchedEvent state:SyncConnected type:NodeDataChanged path:/collections/testasynccollectioncreation/state.json] for collection [testasynccollectioncreation] has occurred - updating... (live nodes size: [2])
   [junit4]   2> 40770 INFO  (qtp74846242-288) [n:127.0.0.1:58907_solr    x:testasynccollectioncreation_shard1_replica_n3] o.a.s.s.HttpSolrCall [admin] webapp=null path=/admin/cores params={async=be8132fb-2e66-48a9-b277-6a3901e75b043131077257964865&qt=/admin/cores&coreNodeName=core_node4&collection.configName=conf1&name=testasynccollectioncreation_shard1_replica_n3&action=CREATE&collection=testasynccollectioncreation&shard=shard1&wt=javabin&version=2&replicaType=NRT} status=0 QTime=0
   [junit4]   2> 40770 INFO  (parallelCoreAdminExecutor-29-thread-1-processing-n:127.0.0.1:58907_solr x:testasynccollectioncreation_shard1_replica_n3 be8132fb-2e66-48a9-b277-6a3901e75b043131077257964865 CREATE) [n:127.0.0.1:58907_solr    x:testasynccollectioncreation_shard1_replica_n3] o.a.s.h.a.CoreAdminOperation core create command async=be8132fb-2e66-48a9-b277-6a3901e75b043131077257964865&qt=/admin/cores&coreNodeName=core_node4&collection.configName=conf1&name=testasynccollectioncreation_shard1_replica_n3&action=CREATE&collection=testasynccollectioncreation&shard=shard1&wt=javabin&version=2&replicaType=NRT
   [junit4]   2> 40771 INFO  (parallelCoreAdminExecutor-29-thread-1-processing-n:127.0.0.1:58907_solr x:testasynccollectioncreation_shard1_replica_n3 be8132fb-2e66-48a9-b277-6a3901e75b043131077257964865 CREATE) [n:127.0.0.1:58907_solr    x:testasynccollectioncreation_shard1_replica_n3] o.a.s.c.TransientSolrCoreCacheDefault Allocating transient cache for 2147483647 transient cores
   [junit4]   2> 40773 INFO  (qtp74846242-294) [n:127.0.0.1:58907_solr    ] o.a.s.h.a.CoreAdminOperation Checking request status for : be8132fb-2e66-48a9-b277-6a3901e75b043131077257964865
   [junit4]   2> 40773 INFO  (qtp74846242-294) [n:127.0.0.1:58907_solr    ] o.a.s.s.HttpSolrCall [admin] webapp=null path=/admin/cores params={qt=/admin/cores&requestid=be8132fb-2e66-48a9-b277-6a3901e75b043131077257964865&action=REQUESTSTATUS&wt=javabin&version=2} status=0 QTime=0
   [junit4]   2> 40793 INFO  (parallelCoreAdminExecutor-29-thread-1-processing-n:127.0.0.1:58907_solr x:testasynccollectioncreation_shard1_replica_n3 be8132fb-2e66-48a9-b277-6a3901e75b043131077257964865 CREATE) [n:127.0.0.1:58907_solr c:testasynccollectioncreation s:shard1 r:core_node4 x:testasynccollectioncreation_shard1_replica_n3] o.a.s.c.SolrConfig Using Lucene MatchVersion: 7.5.0
   [junit4]   2> 40816 INFO  (parallelCoreAdminExecutor-29-thread-1-processing-n:127.0.0.1:58907_solr x:testasynccollectioncreation_shard1_replica_n3 be8132fb-2e66-48a9-b277-6a3901e75b043131077257964865 CREATE) [n:127.0.0.1:58907_solr c:testasynccollectioncreation s:shard1 r:core_node4 x:testasynccollectioncreation_shard1_replica_n3] o.a.s.s.IndexSchema [testasynccollectioncreation_shard1_replica_n3] Schema name=minimal
   [junit4]   2> 40820 INFO  (parallelCoreAdminExecutor-29-thread-1-processing-n:127.0.0.1:58907_solr x:testasynccollectioncreation_shard1_replica_n3 be8132fb-2e66-48a9-b277-6a3901e75b043131077257964865 CREATE) [n:127.0.0.1:58907_solr c:testasynccollectioncreation s:shard1 r:core_node4 x:testasynccollectioncreation_shard1_replica_n3] o.a.s.s.IndexSchema Loaded schema minimal/1.1 with uniqueid field id
   [junit4]   2> 40821 INFO  (parallelCoreAdminExecutor-29-thread-1-processing-n:127.0.0.1:58907_solr x:testasynccollectioncreation_shard1_replica_n3 be8132fb-2e66-48a9-b277-6a3901e75b043131077257964865 CREATE) [n:127.0.0.1:58907_solr c:testasynccollectioncreation s:shard1 r:core_node4 x:testasynccollectioncreation_shard1_replica_n3] o.a.s.c.CoreContainer Creating SolrCore 'testasynccollectioncreation_shard1_replica_n3' using configuration from collection testasynccollectioncreation, trusted=true
   [junit4]   2> 40821 INFO  (parallelCoreAdminExecutor-29-thread-1-processing-n:127.0.0.1:58907_solr x:testasynccollectioncreation_shard1_replica_n3 be8132fb-2e66-48a9-b277-6a3901e75b043131077257964865 CREATE) [n:127.0.0.1:58907_solr c:testasynccollectioncreation s:shard1 r:core_node4 x:testasynccollectioncreation_shard1_replica_n3] o.a.s.m.r.SolrJmxReporter JMX monitoring for 'solr_58907.solr.core.testasynccollectioncreation.shard1.replica_n3' (registry 'solr.core.testasynccollectioncreation.shard1.replica_n3') enabled at server: com.sun.jmx.mbeanserver.JmxMBeanServer@52f3ac22
   [junit4]   2> 40821 INFO  (parallelCoreAdminExecutor-29-thread-1-processing-n:127.0.0.1:58907_solr x:testasynccollectioncreation_shard1_replica_n3 be8132fb-2e66-48a9-b277-6a3901e75b043131077257964865 CREATE) [n:127.0.0.1:58907_solr c:testasynccollectioncreation s:shard1 r:core_node4 x:testasynccollectioncreation_shard1_replica_n3] o.a.s.c.SolrCore solr.RecoveryStrategy.Builder
   [junit4]   2> 40821 INFO  (parallelCoreAdminExecutor-29-thread-1-processing-n:127.0.0.1:58907_solr x:testasynccollectioncreation_shard1_replica_n3 be8132fb-2e66-48a9-b277-6a3901e75b043131077257964865 CREATE) [n:127.0.0.1:58907_solr c:testasynccollectioncreation s:shard1 r:core_node4 x:testasynccollectioncreation_shard1_replica_n3] o.a.s.c.SolrCore [[testasynccollectioncreation_shard1_replica_n3] ] Opening new SolrCore at [/export/home/jenkins/workspace/Lucene-Solr-7.x-Solaris/solr/build/solr-core/test/J1/temp/solr.cloud.api.collections.CollectionsAPIAsyncDistributedZkTest_A022F93B839D68E1-001/tempDir-001/node2/testasynccollectioncreation_shard1_replica_n3], dataDir=[/export/home/jenkins/workspace/Lucene-Solr-7.x-Solaris/solr/build/solr-core/test/J1/temp/solr.cloud.api.collections.CollectionsAPIAsyncDistributedZkTest_A022F93B839D68E1-001/tempDir-001/node2/./testasynccollectioncreation_shard1_replica_n3/data/]
   [junit4]   2> 40888 INFO  (zkCallback-147-thread-2) [    ] o.a.s.c.c.ZkStateReader A cluster state change: [WatchedEvent state:SyncConnected type:NodeDataChanged path:/collections/testasynccollectioncreation/state.json] for collection [testasynccollectioncreation] has occurred - updating... (live nodes size: [2])
   [junit4]   2> 40944 INFO  (parallelCoreAdminExecutor-29-thread-1-processing-n:127.0.0.1:58907_solr x:testasynccollectioncreation_shard1_replica_n3 be8132fb-2e66-48a9-b277-6a3901e75b043131077257964865 CREATE) [n:127.0.0.1:58907_solr c:testasynccollectioncreation s:shard1 r:core_node4 x:testasynccollectioncreation_shard1_replica_n3] o.a.s.u.UpdateHandler Using UpdateLog implementation: org.apache.solr.update.UpdateLog
   [junit4]   2> 40944 INFO  (parallelCoreAdminExecutor-29-thread-1-processing-n:127.0.0.1:58907_solr x:testasynccollectioncreation_shard1_replica_n3 be8132fb-2e66-48a9-b277-6a3901e75b043131077257964865 CREATE) [n:127.0.0.1:58907_solr c:testasynccollectioncreation s:shard1 r:core_node4 x:testasynccollectioncreation_shard1_replica_n3] o.a.s.u.UpdateLog Initializing UpdateLog: dataDir=null defaultSyncLevel=FLUSH numRecordsToKeep=100 maxNumLogsToKeep=10 numVersionBuckets=65536
   [junit4]   2> 40946 INFO  (parallelCoreAdminExecutor-29-thread-1-processing-n:127.0.0.1:58907_solr x:testasynccollectioncreation_shard1_replica_n3 be8132fb-2e66-48a9-b277-6a3901e75b043131077257964865 CREATE) [n:127.0.0.1:58907_solr c:testasynccollectioncreation s:shard1 r:core_node4 x:testasynccollectioncreation_shard1_replica_n3] o.a.s.u.CommitTracker Hard AutoCommit: disabled
   [junit4]   2> 40946 INFO  (parallelCoreAdminExecutor-29-thread-1-processing-n:127.0.0.1:58907_solr x:testasynccollectioncreation_shard1_replica_n3 be8132fb-2e66-48a9-b277-6a3901e75b043131077257964865 CREATE) [n:127.0.0.1:58907_solr c:testasynccollectioncreation s:shard1 r:core_node4 x:testasynccollectioncreation_shard1_replica_n3] o.a.s.u.CommitTracker Soft AutoCommit: disabled
   [junit4]   2> 40947 INFO  (parallelCoreAdminExecutor-29-thread-1-processing-n:127.0.0.1:58907_solr x:testasynccollectioncreation_shard1_replica_n3 be8132fb-2e66-48a9-b277-6a3901e75b043131077257964865 CREATE) [n:127.0.0.1:58907_solr c:testasynccollectioncreation s:shard1 r:core_node4 x:testasynccollectioncreation_shard1_replica_n3] o.a.s.s.SolrIndexSearcher Opening [Searcher@7792d1bf[testasynccollectioncreation_shard1_replica_n3] main]
   [junit4]   2> 40952 INFO  (parallelCoreAdminExecutor-29-thread-1-processing-n:127.0.0.1:58907_solr x:testasynccollectioncreation_shard1_replica_n3 be8132fb-2e66-48a9-b277-6a3901e75b043131077257964865 CREATE) [n:127.0.0.1:58907_solr c:testasynccollectioncreation s:shard1 r:core_node4 x:testasynccollectioncreation_shard1_replica_n3] o.a.s.r.ManagedResourceStorage Configured ZooKeeperStorageIO with znodeBase: /configs/conf1
   [junit4]   2> 40954 INFO  (parallelCoreAdminExecutor-29-thread-1-processing-n:127.0.0.1:58907_solr x:testasynccollectioncreation_shard1_replica_n3 be8132fb-2e66-48a9-b277-6a3901e75b043131077257964865 CREATE) [n:127.0.0.1:58907_solr c:testasynccollectioncreation s:shard1 r:core_node4 x:testasynccollectioncreation_shard1_replica_n3] o.a.s.r.ManagedResourceStorage Loaded null at path _rest_managed.json using ZooKeeperStorageIO:path=/configs/conf1
   [junit4]   2> 40955 INFO  (parallelCoreAdminExecutor-29-thread-1-processing-n:127.0.0.1:58907_solr x:testasynccollectioncreation_shard1_replica_n3 be8132fb-2e66-48a9-b277-6a3901e75b043131077257964865 CREATE) [n:127.0.0.1:58907_solr c:testasynccollectioncreation s:shard1 r:core_node4 x:testasynccollectioncreation_shard1_replica_n3] o.a.s.h.ReplicationHandler Commits will be reserved for 10000ms.
   [junit4]   2> 40955 INFO  (parallelCoreAdminExecutor-29-thread-1-processing-n:127.0.0.1:58907_solr x:testasynccollectioncreation_shard1_replica_n3 be8132fb-2e66-48a9-b277-6a3901e75b043131077257964865 CREATE) [n:127.0.0.1:58907_solr c:testasynccollectioncreation s:shard1 r:core_node4 x:testasynccollectioncreation_shard1_replica_n3] o.a.s.u.UpdateLog Could not find max version in index or recent updates, using new clock 1610433092886986752
   [junit4]   2> 40958 INFO  (searcherExecutor-45-thread-1-processing-x:testasynccollectioncreation_shard1_replica_n3 be8132fb-2e66-48a9-b277-6a3901e75b043131077257964865 r:core_node4 CREATE n:127.0.0.1:58907_solr c:testasynccollectioncreation s:shard1) [n:127.0.0.1:58907_solr c:testasynccollectioncreation s:shard1 r:core_node4 x:testasynccollectioncreation_shard1_replica_n3] o.a.s.c.SolrCore [testasynccollectioncreation_shard1_replica_n3] Registered new searcher Searcher@7792d1bf[testasynccollectioncreation_shard1_replica_n3] main{ExitableDirectoryReader(UninvertingDirectoryReader())}
   [junit4]   2> 40965 INFO  (parallelCoreAdminExecutor-29-thread-1-processing-n:127.0.0.1:58907_solr x:testasynccollectioncreation_shard1_replica_n3 be8132fb-2e66-48a9-b277-6a3901e75b043131077257964865 CREATE) [n:127.0.0.1:58907_solr c:testasynccollectioncreation s:shard1 r:core_node4 x:testasynccollectioncreation_shard1_replica_n3] o.a.s.c.ZkShardTerms Successful update of terms at /collections/testasynccollectioncreation/terms/shard1 to Terms{values={core_node2=0, core_node4=0}, version=1}
   [junit4]   2> 40970 INFO  (parallelCoreAdminExecutor-29-thread-1-processing-n:127.0.0.1:58907_solr x:testasynccollectioncreation_shard1_replica_n3 be8132fb-2e66-48a9-b277-6a3901e75b043131077257964865 CREATE) [n:127.0.0.1:58907_solr c:testasynccollectioncreation s:shard1 r:core_node4 x:testasynccollectioncreation_shard1_replica_n3] o.a.s.c.ZkController Core needs to recover:testasynccollectioncreation_shard1_replica_n3
   [junit4]   2> 40973 INFO  (updateExecutor-149-thread-1-processing-x:testasynccollectioncreation_shard1_replica_n3 be8132fb-2e66-48a9-b277-6a3901e75b043131077257964865 r:core_node4 CREATE n:127.0.0.1:58907_solr c:testasynccollectioncreation s:shard1) [n:127.0.0.1:58907_solr c:testasynccollectioncreation s:shard1 r:core_node4 x:testasynccollectioncreation_shard1_replica_n3] o.a.s.u.DefaultSolrCoreState Running recovery
   [junit4]   2> 40984 INFO  (recoveryExecutor-150-thread-1-processing-x:testasynccollectioncreation_shard1_replica_n3 be8132fb-2e66-48a9-b277-6a3901e75b043131077257964865 r:core_node4 CREATE n:127.0.0.1:58907_solr c:testasynccollectioncreation s:shard1) [n:127.0.0.1:58907_solr c:testasynccollectioncreation s:shard1 r:core_node4 x:testasynccollectioncreation_shard1_replica_n3] o.a.s.c.RecoveryStrategy Starting recovery process. recoveringAfterStartup=true
   [junit4]   2> 40985 INFO  (recoveryExecutor-150-thread-1-processing-x:testasynccollectioncreation_shard1_replica_n3 be8132fb-2e66-48a9-b277-6a3901e75b043131077257964865 r:core_node4 CREATE n:127.0.0.1:58907_solr c:testasynccollectioncreation s:shard1) [n:127.0.0.1:58907_solr c:testasynccollectioncreation s:shard1 r:core_node4 x:testasynccollectioncreation_shard1_replica_n3] o.a.s.c.RecoveryStrategy ###### startupVersions=[[]]
   [junit4]   2> 41006 INFO  (qtp1397070419-301) [n:127.0.0.1:45021_solr c:testasynccollectioncreation s:shard1 r:core_node2 x:testasynccollectioncreation_shard1_replica_n1] o.a.s.c.S.Request [testasynccollectioncreation_shard1_replica_n1]  webapp=/solr path=/admin/ping params={wt=javabin&version=2} hits=0 status=0 QTime=15
   [junit4]   2> 41006 INFO  (qtp1397070419-301) [n:127.0.0.1:45021_solr c:testasynccollectioncreation s:shard1 r:core_node2 x:testasynccollectioncreation_shard1_replica_n1] o.a.s.c.S.Request [testasynccollectioncreation_shard1_replica_n1]  webapp=/solr path=/admin/ping params={wt=javabin&version=2} status=0 QTime=16
   [junit4]   2> 41008 INFO  (recoveryExecutor-150-thread-1-processing-x:testasynccollectioncreation_shard1_replica_n3 be8132fb-2e66-48a9-b277-6a3901e75b043131077257964865 r:core_node4 CREATE n:127.0.0.1:58907_solr c:testasynccollectioncreation s:shard1) [n:127.0.0.1:58907_solr c:testasynccollectioncreation s:shard1 r:core_node4 x:testasynccollectioncreation_shard1_replica_n3] o.a.s.c.RecoveryStrategy Begin buffering updates. core=[testasynccollectioncreation_shard1_replica_n3]
   [junit4]   2> 41008 INFO  (recoveryExecutor-150-thread-1-processing-x:testasynccollectioncreation_shard1_replica_n3 be8132fb-2e66-48a9-b277-6a3901e75b043131077257964865 r:core_node4 CREATE n:127.0.0.1:58907_solr c:testasynccollectioncreation s:shard1) [n:127.0.0.1:58907_solr c:testasynccollectioncreation s:shard1 r:core_node4 x:testasynccollectioncreation_shard1_replica_n3] o.a.s.u.UpdateLog Starting to buffer updates. FSUpdateLog{state=ACTIVE, tlog=null}
   [junit4]   2> 41009 INFO  (recoveryExecutor-150-thread-1-processing-x:testasynccollectioncreation_shard1_replica_n3 be8132fb-2e66-48a9-b277-6a3901e75b043131077257964865 r:core_node4 CREATE n:127.0.0.1:58907_solr c:testasynccollectioncreation s:shard1) [n:127.0.0.1:58907_solr c:testasynccollectioncreation s:shard1 r:core_node4 x:testasynccollectioncreation_shard1_replica_n3] o.a.s.c.RecoveryStrategy Publishing state of core [testasynccollectioncreation_shard1_replica_n3] as recovering, leader is [http://127.0.0.1:45021/solr/testasynccollectioncreation_shard1_replica_n1/] and I am [http://127.0.0.1:58907/solr/testasynccollectioncreation_shard1_replica_n3/]
   [junit4]   2> 41016 INFO  (recoveryExecutor-150-thread-1-processing-x:testasynccollectioncreation_shard1_replica_n3 be8132fb-2e66-48a9-b277-6a3901e75b043131077257964865 r:core_node4 CREATE n:127.0.0.1:58907_solr c:testasynccollectioncreation s:shard1) [n:127.0.0.1:58907_solr c:testasynccollectioncreation s:shard1 r:core_node4 x:testasynccollectioncreation_shard1_replica_n3] o.a.s.c.ZkShardTerms Successful update of terms at /collections/testasynccollectioncreation/terms/shard1 to Terms{values={core_node2=0, core_node4_recovering=0, core_node4=0}, version=2}
   [junit4]   2> 41022 INFO  (recoveryExecutor-150-thread-1-processing-x:testasynccollectioncreation_shard1_replica_n3 be8132fb-2e66-48a9-b277-6a3901e75b043131077257964865 r:core_node4 CREATE n:127.0.0.1:58907_solr c:testasynccollectioncreation s:shard1) [n:127.0.0.1:58907_solr c:testasynccollectioncreation s:shard1 r:core_node4 x:testasynccollectioncreation_shard1_replica_n3] o.a.s.c.RecoveryStrategy Sending prep recovery command to [http://127.0.0.1:45021/solr]; [WaitForState: action=PREPRECOVERY&core=testasynccollectioncreation_shard1_replica_n1&nodeName=127.0.0.1:58907_solr&coreNodeName=core_node4&state=recovering&checkLive=true&onlyIfLeader=true&onlyIfLeaderActive=true]
   [junit4]   2> 41030 INFO  (qtp1397070419-301) [n:127.0.0.1:45021_solr    x:testasynccollectioncreation_shard1_replica_n1] o.a.s.h.a.PrepRecoveryOp Going to wait for coreNodeName: core_node4, state: recovering, checkLive: true, onlyIfLeader: true, onlyIfLeaderActive: true, maxTime: 183 s
   [junit4]   2> 41032 INFO  (qtp1397070419-301) [n:127.0.0.1:45021_solr    x:testasynccollectioncreation_shard1_replica_n1] o.a.s.h.a.PrepRecoveryOp In WaitForState(recovering): collection=testasynccollectioncreation, shard=shard1, thisCore=testasynccollectioncreation_shard1_replica_n1, leaderDoesNotNeedRecovery=false, isLeader? true, live=true, checkLive=true, currentState=down, localState=active, nodeName=127.0.0.1:58907_solr, coreNodeName=core_node4, onlyIfActiveCheckResult=false, nodeProps: core_node4:{"core":"testasynccollectioncreation_shard1_replica_n3","base_url":"http://127.0.0.1:58907/solr","node_name":"127.0.0.1:58907_solr","state":"down","type":"NRT","force_set_state":"false"}
   [junit4]   2> 41139 INFO  (zkCallback-155-thread-1) [    ] o.a.s.c.c.ZkStateReader A cluster state change: [WatchedEvent state:SyncConnected type:NodeDataChanged path:/collections/testasynccollectioncreation/state.json] for collection [testasynccollectioncreation] has occurred - updating... (live nodes size: [2])
   [junit4]   2> 41140 INFO  (zkCallback-155-thread-2) [    ] o.a.s.c.c.ZkStateReader A cluster state change: [WatchedEvent state:SyncConnected type:NodeDataChanged path:/collections/testasynccollectioncreation/state.json] for collection [testasynccollectioncreation] has occurred - updating... (live nodes size: [2])
   [junit4]   2> 41140 INFO  (zkCallback-147-thread-1) [    ] o.a.s.c.c.ZkStateReader A cluster state change: [WatchedEvent state:SyncConnected type:NodeDataChanged path:/collections/testasynccollectioncreation/state.json] for collection [testasynccollectioncreation] has occurred - updating... (live nodes size: [2])
   [junit4]   2> 41671 INFO  (qtp74846242-294) [n:127.0.0.1:58907_solr    ] o.a.s.h.a.CollectionsHandler Invoked Collection Action :requeststatus with params requestid=be8132fb-2e66-48a9-b277-6a3901e75b04&action=REQUESTSTATUS&wt=javabin&version=2 and sendToOCPQueue=true
   [junit4]   2> 41673 INFO  (qtp74846242-294) [n:127.0.0.1:58907_solr    ] o.a.s.s.HttpSolrCall [admin] webapp=null path=/admin/collections params={requestid=be8132fb-2e66-48a9-b277-6a3901e75b04&action=REQUESTSTATUS&wt=javabin&version=2} status=0 QTime=1
   [junit4]   2> 41778 INFO  (qtp74846242-288) [n:127.0.0.1:58907_solr    ] o.a.s.h.a.CoreAdminOperation Checking request status for : be8132fb-2e66-48a9-b277-6a3901e75b043131077257964865
   [junit4]   2> 41778 INFO  (qtp74846242-288) [n:127.0.0.1:58907_solr    ] o.a.s.s.HttpSolrCall [admin] webapp=null path=/admin/cores params={qt=/admin/cores&requestid=be8132fb-2e66-48a9-b277-6a3901e75b043131077257964865&action=REQUESTSTATUS&wt=javabin&version=2} status=0 QTime=0
   [junit4]   2> 41783 INFO  (OverseerThreadFactory-35-thread-3-processing-n:127.0.0.1:45021_solr) [n:127.0.0.1:45021_solr c:testasynccollectioncreation s:shard1  ] o.a.s.c.OverseerTaskQueue Response ZK path: /overseer/collection-queue-work/qnr-0000000002 doesn't exist.  Requestor may have disconnected from ZooKeeper
   [junit4]   2> 42033 INFO  (qtp1397070419-301) [n:127.0.0.1:45021_solr    x:testasynccollectioncreation_shard1_replica_n1] o.a.s.h.a.PrepRecoveryOp In WaitForState(recovering): collection=testasynccollectioncreation, shard=shard1, thisCore=testasynccollectioncreation_shard1_replica_n1, leaderDoesNotNeedRecovery=false, isLeader? true, live=true, checkLive=true, currentState=recovering, localState=active, nodeName=127.0.0.1:58907_solr, coreNodeName=core_node4, onlyIfActiveCheckResult=false, nodeProps: core_node4:{"core":"testasynccollectioncreation_shard1_replica_n3","base_url":"http://127.0.0.1:58907/solr","node_name":"127.0.0.1:58907_solr","state":"recovering","type":"NRT","force_set_state":"false"}
   [junit4]   2> 42033 INFO  (qtp1397070419-301) [n:127.0.0.1:45021_solr    x:testasynccollectioncreation_shard1_replica_n1] o.a.s.h.a.PrepRecoveryOp Waited coreNodeName: core_node4, state: recovering, checkLive: true, onlyIfLeader: true for: 1 seconds.
   [junit4]   2> 42033 INFO  (qtp1397070419-301) [n:127.0.0.1:45021_solr    x:testasynccollectioncreation_shard1_replica_n1] o.a.s.s.HttpSolrCall [admin] webapp=null path=/admin/cores params={nodeName=127.0.0.1:58907_solr&onlyIfLeaderActive=true&core=testasynccollectioncreation_shard1_replica_n1&coreNodeName=core_node4&action=PREPRECOVERY&checkLive=true&state=recovering&onlyIfLeader=true&wt=javabin&version=2} status=0 QTime=1008
   [junit4]   2> 42535 INFO  (recoveryExecutor-150-thread-1-processing-x:testasynccollectioncreation_shard1_replica_n3 be8132fb-2e66-48a9-b277-6a3901e75b043131077257964865 r:core_node4 CREATE n:127.0.0.1:58907_solr c:testasynccollectioncreation s:shard1) [n:127.0.0.1:58907_solr c:testasynccollectioncreation s:shard1 r:core_node4 x:testasynccollectioncreation_shard1_replica_n3] o.a.s.c.RecoveryStrategy Attempting to PeerSync from [http://127.0.0.1:45021/solr/testasynccollectioncreation_shard1_replica_n1/] - recoveringAfterStartup=[true]
   [junit4]   2> 42542 WARN  (recoveryExecutor-150-thread-1-processing-x:testasynccollectioncreation_shard1_replica_n3 be8132fb-2e66-48a9-b277-6a3901e75b043131077257964865 r:core_node4 CREATE n:127.0.0.1:58907_solr c:testasynccollectioncreation s:shard1) [n:127.0.0.1:58907_solr c:testasynccollectioncreation s:shard1 r:core_node4 x:testasynccollectioncreation_shard1_replica_n3] o.a.s.u.PeerSyncWithLeader no frame of reference to tell if we've missed updates
   [junit4]   2> 42542 INFO  (recoveryExecutor-150-thread-1-processing-x:testasynccollectioncreation_shard1_replica_n3 be8132fb-2e66-48a9-b277-6a3901e75b043131077257964865 r:core_node4 CREATE n:127.0.0.1:58907_solr c:testasynccollectioncreation s:shard1) [n:127.0.0.1:58907_solr c:testasynccollectioncreation s:shard1 r:core_node4 x:testasynccollectioncreation_shard1_replica_n3] o.a.s.c.RecoveryStrategy PeerSync Recovery was not successful - trying replication.
   [junit4]   2> 42542 INFO  (recoveryExecutor-150-thread-1-processing-x:testasynccollectioncreation_shard1_replica_n3 be8132fb-2e66-48a9-b277-6a3901e75b043131077257964865 r:core_node4 CREATE n:127.0.0.1:58907_solr c:testasynccollectioncreation s:shard1) [n:127.0.0.1:58907_solr c:testasynccollectioncreation s:shard1 r:core_node4 x:testasynccollectioncreation_shard1_replica_n3] o.a.s.c.RecoveryStrategy Starting Replication Recovery.
   [junit4]   2> 42542 INFO  (recoveryExecutor-150-thread-1-processing-x:testasynccollectioncreation_shard1_replica_n3 be8132fb-2e66-48a9-b277-6a3901e75b043131077257964865 r:core_node4 CREATE n:127.0.0.1:58907_solr c:testasynccollectioncreation s:shard1) [n:127.0.0.1:58907_solr c:testasynccollectioncreation s:shard1 r:core_node4 x:testasynccollectioncreation_shard1_replica_n3] o.a.s.c.RecoveryStrategy Attempting to replicate from [http://127.0.0.1:45021/solr/testasynccollectioncreation_shard1_replica_n1/].
   [junit4]   2> 42554 INFO  (qtp1397070419-301) [n:127.0.0.1:45021_solr c:testasynccollectioncreation s:shard1 r:core_node2 x:testasynccollectioncreation_shard1_replica_n1] o.a.s.u.DirectUpdateHandler2 start commit{_version_=1610433094563659776,optimize=false,openSearcher=false,waitSearcher=true,expungeDeletes=false,softCommit=false,prepareCommit=false}
   [junit4]   2> 42554 INFO  (qtp1397070419-301) [n:127.0.0.1:45021_solr c:testasynccollectioncreation s:shard1 r:core_node2 x:testasynccollectioncreation_shard1_replica_n1] o.a.s.u.DirectUpdateHandler2 No uncommitted changes. Skipping IW.commit.
   [junit4]   2> 42555 INFO  (qtp1397070419-301) [n:127.0.0.1:45021_solr c:testasynccollectioncreation s:shard1 r:core_node2 x:testasynccollectioncreation_shard1_replica_n1] o.a.s.u.DirectUpdateHandler2 end_commit_flush
   [junit4]   2> 42556 INFO  (qtp1397070419-301) [n:127.0.0.1:45021_solr c:testasynccollectioncreation s:shard1 r:core_node2 x:testasynccollectioncreation_shard1_replica_n1] o.a.s.u.p.LogUpdateProcessorFactory [testasynccollectioncreation_shard1_replica_n1]  webapp=/solr path=/update params={waitSearcher=true&openSearcher=false&commit=true&softCommit=false&commit_end_point=true&wt=javabin&version=2}{commit=} 0 8
   [junit4]   2> 42575 INFO  (qtp1397070419-300) [n:127.0.0.1:45021_solr c:testasynccollectioncreation s:shard1 r:core_node2 x:testasynccollectioncreation_shard1_replica_n1] o.a.s.c.S.Request [testasynccollectioncreation_shard1_replica_n1]  webapp=/solr path=/replication params={qt=/replication&wt=javabin&version=2&command=indexversion} status=0 QTime=0
   [junit4]   2> 42575 INFO  (recoveryExecutor-150-thread-1-processing-x:testasynccollectioncreation_shard1_replica_n3 be8132fb-2e66-48a9-b277-6a3901e75b043131077257964865 r:core_node4 CREATE n:127.0.0.1:58907_solr c:testasynccollectioncreation s:shard1) [n:127.0.0.1:58907_solr c:testasynccollectioncreation s:shard1 r:core_node4 x:testasynccollectioncreation_shard1_replica_n3] o.a.s.h.IndexFetcher Master's generation: 1
   [junit4]   2> 42576 INFO  (recoveryExecutor-150-thread-1-processing-x:testasynccollectioncreation_shard1_replica_n3 be8132fb-2e66-48a9-b277-6a3901e75b043131077257964865 r:core_node4 CREATE n:127.0.0.1:58907_solr c:testasynccollectioncreation s:shard1) [n:127.0.0.1:58907_solr c:testasynccollectioncreation s:shard1 r:core_node4 x:testasynccollectioncreation_shard1_replica_n3] o.a.s.h.IndexFetcher Master's version: 0
   [junit4]   2> 42576 INFO  (recoveryExecutor-150-thread-1-processing-x:testasynccollectioncreation_shard1_replica_n3 be8132fb-2e66-48a9-b277-6a3901e75b043131077257964865 r:core_node4 CREATE n:127.0.0.1:58907_solr c:testasynccollectioncreation s:shard1) [n:127.0.0.1:58907_solr c:testasynccollectioncreation s:shard1 r:core_node4 x:testasynccollectioncreation_shard1_replica_n3] o.a.s.h.IndexFetcher Slave's generation: 1
   [junit4]   2> 42576 INFO  (recoveryExecutor-150-thread-1-processing-x:testasynccollectioncreation_shard1_replica_n3 be8132fb-2e66-48a9-b277-6a3901e75b043131077257964865 r:core_node4 CREATE n:127.0.0.1:58907_solr c:testasynccollectioncreation s:shard1) [n:127.0.0.1:58907_solr c:testasynccollectioncreation s:shard1 r:core_node4 x:testasynccollectioncreation_shard1_replica_n3] o.a.s.h.IndexFetcher Slave's version: 0
   [junit4]   2> 42576 INFO  (recoveryExecutor-150-thread-1-processing-x:testasynccollectioncreation_shard1_replica_n3 be8132fb-2e66-48a9-b277-6a3901e75b043131077257964865 r:core_node4 CREATE n:127.0.0.1:58907_solr c:testasynccollectioncreation s:shard1) [n:127.0.0.1:58907_solr c:testasynccollectioncreation s:shard1 r:core_node4 x:testasynccollectioncreation_shard1_replica_n3] o.a.s.h.IndexFetcher New index in Master. Deleting mine...
   [junit4]   2> 42578 INFO  (recoveryExecutor-150-thread-1-processing-x:testasynccollectioncreation_shard1_replica_n3 be8132fb-2e66-48a9-b277-6a3901e75b043131077257964865 r:core_node4 CREATE n:127.0.0.1:58907_solr c:testasynccollectioncreation s:shard1) [n:127.0.0.1:58907_solr c:testasynccollectioncreation s:shard1 r:core_node4 x:testasynccollectioncreation_shard1_replica_n3] o.a.s.s.SolrIndexSearcher Opening [Searcher@11365c91[testasynccollectioncreation_shard1_replica_n3] main]
   [junit4]   2> 42581 INFO  (searcherExecutor-45-thread-1-processing-x:testasynccollectioncreation_shard1_replica_n3 be8132fb-2e66-48a9-b277-6a3901e75b043131077257964865 r:core_node4 CREATE n:127.0.0.1:58907_solr c:testasynccollectioncreation s:shard1) [n:127.0.0.1:58907_solr c:testasynccollectioncreation s:shard1 r:core_node4 x:testasynccollectioncreation_shard1_replica_n3] o.a.s.c.SolrCore [testasynccollectioncreation_shard1_replica_n3] Registered new searcher Searcher@11365c91[testasynccollectioncreation_shard1_replica_n3] main{ExitableDirectoryReader(UninvertingDirectoryReader())}
   [junit4]   2> 42582 INFO  (recoveryExecutor-150-thread-1-processing-x:testasynccollectioncreation_shard1_replica_n3 be8132fb-2e66-48a9-b277-6a3901e75b043131077257964865 r:core_node4 CREATE n:127.0.0.1:58907_solr c:testasynccollectioncreation s:shard1) [n:127.0.0.1:58907_solr c:testasynccollectioncreation s:shard1 r:core_node4 x:testasynccollectioncreation_shard1_replica_n3] o.a.s.c.RecoveryStrategy No replay needed.
   [junit4]   2> 42582 INFO  (recoveryExecutor-150-thread-1-processing-x:testasynccollectioncreation_shard1_replica_n3 be8132fb-2e66-48a9-b277-6a3901e75b043131077257964865 r:core_node4 CREATE n:127.0.0.1:58907_solr c:testasynccollectioncreation s:shard1) [n:127.0.0.1:58907_solr c:testasynccollectioncreation s:shard1 r:core_node4 x:testasynccollectioncreation_shard1_replica_n3] o.a.s.c.RecoveryStrategy Replication Recovery was successful.
   [junit4]   2> 42582 INFO  (recoveryExecutor-150-thread-1-processing-x:testasynccollectioncreation_shard1_replica_n3 be8132fb-2e66-48a9-b277-6a3901e75b043131077257964865 r:core_node4 CREATE n:127.0.0.1:58907_solr c:testasynccollectioncreation s:shard1) [n:127.0.0.1:58907_solr c:testasynccollectioncreation s:shard1 r:core_node4 x:testasynccollectioncreation_shard1_replica_n3] o.a.s.c.RecoveryStrategy Registering as Active after recovery.
   [junit4]   2> 42584 INFO  (recoveryExecutor-150-thread-1-processing-x:testasynccollectioncreation_shard1_replica_n3 be8132fb-2e66-48a9-b277-6a3901e75b043131077257964865 r:core_node4 CREATE n:127.0.0.1:58907_solr c:testasynccollectioncreation s:shard1) [n:127.0.0.1:58907_solr c:testasynccollectioncreation s:shard1 r:core_node4 x:testasynccollectioncreation_shard1_replica_n3] o.a.s.c.ZkShardTerms Successful update of terms at /collections/testasynccollectioncreation/terms/shard1 to Terms{values={core_node2=0, core_node4=0}, version=3}
   [junit4]   2> 42584 INFO  (recoveryExecutor-150-thread-1-processing-x:testasynccollectioncreation_shard1_replica_n3 be8132fb-2e66-48a9-b277-6a3901e75b043131077257964865 r:core_node4 CREATE n:127.0.0.1:58907_solr c:testasynccollectioncreation s:shard1) [n:127.0.0.1:58907_solr c:testasynccollectioncreation s:shard1 r:core_node4 x:testasynccollectioncreation_shard1_replica_n3] o.a.s.c.RecoveryStrategy Updating version bucket highest from index after successful recovery.
   [junit4]   2> 42584 INFO  (recoveryExecutor-150-thread-1-processing-x:testasynccollectioncreation_shard1_replica_n3 be8132fb-2e66-48a9-b277-6a3901e75b043131077257964865 r:core_node4 CREATE n:127.0.0.1:58907_solr c:testasynccollectioncreation s:shard1) [n:127.0.0.1:58907_solr c:testasynccollectioncreation s:shard1 r:core_node4 x:testasynccollectioncreation_shard1_replica_n3] o.a.s.u.UpdateLog Could not find max version in index or recent updates, using new clock 1610433094595117056
   [junit4]   2> 42601 INFO  (recoveryExecutor-150-thread-1-processing-x:testasynccollectioncreation_shard1_replica_n3 be8132fb-2e66-48a9-b277-6a3901e75b043131077257964865 r:core_node4 CREATE n:127.0.0.1:58907_solr c:testasynccollectioncreation s:shard1) [n:127.0.0.1:58907_solr c:testasynccollectioncreation s:shard1 r:core_node4 x:testasynccollectioncreation_shard1_replica_n3] o.a.s.c.RecoveryStrategy Finished recovery process, successful=[true]
   [junit4]   2> 42677 INFO  (qtp74846242-294) [n:127.0.0.1:58907_solr    ] o.a.s.h.a.CollectionsHandler Invoked Collection Action :requeststatus with params requestid=be8132fb-2e66-48a9-b277-6a3901e75b04&action=REQUESTSTATUS&wt=javabin&version=2 and sendToOCPQueue=true
   [junit4]   2> 42680 INFO  (qtp74846242-294) [n:127.0.0.1:58907_solr    ] o.a.s.s.HttpSolrCall [admin] webapp=null path=/admin/collections params={requestid=be8132fb-2e66-48a9-b277-6a3901e75b04&action=REQUESTSTATUS&wt=javabin&version=2} status=0 QTime=2
   [junit4]   2> 42682 INFO  (qtp74846242-288) [n:127.0.0.1:58907_solr    ] o.a.s.h.a.CollectionsHandler Invoked Collection Action :deletestatus with params requestid=be8132fb-2e66-48a9-b277-6a3901e75b04&action=DELETESTATUS&wt=javabin&version=2 and sendToOCPQueue=true
   [junit4]   2> 42684 INFO  (qtp74846242-288) [n:127.0.0.1:58907_solr    ] o.a.s.s.HttpSolrCall [admin] webapp=null path=/admin/collections params={requestid=be8132fb-2e66-48a9-b277-6a3901e75b04&action=DELETESTATUS&wt=javabin&version=2} status=0 QTime=2
   [junit4]   2> 42686 INFO  (qtp74846242-294) [n:127.0.0.1:58907_solr    ] o.a.s.h.a.CollectionsHandler Invoked Collection Action :splitshard with params async=46dc2749-9633-4b0c-ae96-ea10e226419d&action=SPLITSHARD&collection=testasynccollectioncreation&shard=shard1&wt=javabin&version=2 and sendToOCPQueue=true
   [junit4]   2> 42689 INFO  (OverseerCollectionConfigSetProcessor-72262791838760964-127.0.0.1:45021_solr-n_0000000000) [n:127.0.0.1:45021_solr    ] o.a.s.c.OverseerTaskQueue Response ZK path: /overseer/collection-queue-work/qnr-0000000002 doesn't exist.  Requestor may have disconnected from ZooKeeper
   [junit4]   2> 42692 INFO  (qtp74846242-294) [n:127.0.0.1:58907_solr c:testasynccollectioncreation   ] o.a.s.s.HttpSolrCall [admin] webapp=null path=/admin/collections params={async=46dc2749-9633-4b0c-ae96-ea10e226419d&action=SPLITSHARD&collection=testasynccollectioncreation&shard=shard1&wt=javabin&version=2} status=0 QTime=6
   [junit4]   2> 42694 INFO  (qtp74846242-288) [n:127.0.0.1:58907_solr    ] o.a.s.h.a.CollectionsHandler Invoked Collection Action :requeststatus with params requestid=46dc2749-9633-4b0c-ae96-ea10e226419d&action=REQUESTSTATUS&wt=javabin&version=2 and sendToOCPQueue=true
   [junit4]   2> 42695 INFO  (zkCallback-147-thread-1) [    ] o.a.s.c.c.ZkStateReader A cluster state change: [WatchedEvent state:SyncConnected type:NodeDataChanged path:/collections/testasynccollectioncreation/state.json] for collection [testasynccollectioncreation] has occurred - updating... (live nodes size: [2])
   [junit4]   2> 42697 INFO  (zkCallback-155-thread-2) [    ] o.a.s.c.c.ZkStateReader A cluster state change: [WatchedEvent state:SyncConnected type:NodeDataChanged path:/collections/testasynccollectioncreation/state.json] for collection [testasynccollectioncreation] has occurred - updating... (live nodes size: [2])
   [junit4]   2> 42697 INFO  (zkCallback-155-thread-1) [    ] o.a.s.c.c.ZkStateReader A cluster state change: [WatchedEvent state:SyncConnected type:NodeDataChanged path:/collections/testasynccollectioncreation/state.json] for collection [testasynccollectioncreation] has occurred - updating... (live nodes size: [2])
   [junit4]   2> 42701 INFO  (qtp74846242-288) [n:127.0.0.1:58907_solr    ] o.a.s.s.HttpSolrCall [admin] webapp=null path=/admin/collections params={requestid=46dc2749-9633-4b0c-ae96-ea10e226419d&action=REQUESTSTATUS&wt=javabin&version=2} status=0 QTime=7
   [junit4]   2> 42750 INFO  (qtp1397070419-300) [n:127.0.0.1:45021_solr    ] o.a.s.s.HttpSolrCall [admin] webapp=null path=/admin/metrics params={prefix=CONTAINER.fs.usableSpace&wt=javabin&version=2&group=solr.node} status=0 QTime=14
   [junit4]   2> 42761 INFO  (qtp1397070419-301) [n:127.0.0.1:45021_solr    ] o.a.s.s.HttpSolrCall [admin] webapp=null path=/admin/metrics params={wt=javabin&version=2&key=solr.core.testasynccollectioncreation.shard1.replica_n1:INDEX.sizeInBytes} status=0 QTime=1
   [junit4]   2> 42893 INFO  (zkCallback-155-thread-1) [    ] o.a.s.c.c.ZkStateReader A cluster state change: [WatchedEvent state:SyncConnected type:NodeDataChanged path:/collections/testasynccollectioncreation/state.json] for collection [testasynccollectioncreation] has occurred - updating... (live nodes size: [2])
   [junit4]   2> 42894 INFO  (zkCallback-147-thread-1) [    ] o.a.s.c.c.ZkStateReader A cluster state change: [WatchedEvent state:SyncConnected type:NodeDataChanged path:/collections/testasynccollectioncreation/state.json] for collection [testasynccollectioncreation] has occurred - updating... (live nodes size: [2])
   [junit4]   2> 42895 INFO  (zkCallback-155-thread-2) [    ] o.a.s.c.c.ZkStateReader A cluster state change: [WatchedEvent state:SyncConnected type:NodeDataChanged path:/collections/testasynccollectioncreation/state.json] for collection [testasynccollectioncreation] has occurred - updating... (live nodes size: [2])
   [junit4]   2> 43705 INFO  (qtp74846242-294) [n:127.0.0.1:58907_solr    ] o.a.s.h.a.CollectionsHandler Invoked Collection Action :requeststatus with params requestid=46dc2749-9633-4b0c-ae96-ea10e226419d&action=REQUESTSTATUS&wt=javabin&version=2 and sendToOCPQueue=true
   [junit4]   2> 43706 INFO  (qtp74846242-294) [n:127.0.0.1:58907_solr    ] o.a.s.s.HttpSolrCall [admin] webapp=null path=/admin/collections params={requestid=46dc2749-9633-4b0c-ae96-ea10e226419d&action=REQUESTSTATUS&wt=javabin&version=2} status=0 QTime=1
   [junit4]   2> 43779 INFO  (OverseerThreadFactory-35-thread-4-processing-n:127.0.0.1:45021_solr) [n:127.0.0.1:45021_solr c:testasynccollectioncreation s:shard1  ] o.a.s.c.a.c.AddReplicaCmd Node Identified 127.0.0.1:45021_solr for creating new replica of shard shard1_0
   [junit4]   2> 43782 INFO  (OverseerStateUpdate-72262791838760964-127.0.0.1:45021_solr-n_0000000000) [n:127.0.0.1:45021_solr    ] o.a.s.c.o.SliceMutator createReplica() {
   [junit4]   2>   "operation":"addreplica",
   [junit4]   2>   "collection":"testasynccollectioncreation",
   [junit4]   2>   "shard":"shard1_0",
   [junit4]   2>   "core":"testasynccollectioncreation_shard1_0_replica_n5",
   [junit4]   2>   "state":"down",
   [junit4]   2>   "base_url":"http://127.0.0.1:45021/solr",
   [junit4]   2>   "node_name":"127.0.0.1:45021_solr",
   [junit4]   2>   "type":"NRT"} 
   [junit4]   2> 43886 INFO  (zkCallback-155-thread-2) [    ] o.a.s.c.c.ZkStateReader A cluster state change: [WatchedEvent state:SyncConnected type:NodeDataChanged path:/collections/testasynccollectioncreation/stat

[...truncated too long message...]

rJAPICalls
   [junit4] OK      22.7s J1 | CollectionsAPIAsyncDistributedZkTest.testAsyncRequests
   [junit4] Completed [2/10] on J1 in 50.72s, 4 tests
   [junit4] 
   [junit4] Duplicate suite name used with XML reports: org.apache.solr.cloud.api.collections.CollectionsAPIAsyncDistributedZkTest. This may confuse tools that process XML reports. Set 'ignoreDuplicateSuites' to true to skip this message.
   [junit4] Suite: org.apache.solr.handler.RequestLoggingTest
   [junit4] OK      0.02s J1 | RequestLoggingTest.testLogBeforeExecuteWithCoreLogger
   [junit4] OK      0.01s J1 | RequestLoggingTest.testLogBeforeExecuteWithRequestLogger
   [junit4] Completed [3/10] on J1 in 2.07s, 2 tests
   [junit4] 
   [junit4] Suite: org.apache.solr.cloud.api.collections.CollectionsAPIAsyncDistributedZkTest
   [junit4] OK      3.08s J0 | CollectionsAPIAsyncDistributedZkTest.testAsyncIdRaceCondition
   [junit4] OK      0.04s J0 | CollectionsAPIAsyncDistributedZkTest.testAsyncIdBackCompat
   [junit4] OK      16.2s J0 | CollectionsAPIAsyncDistributedZkTest.testSolrJAPICalls
   [junit4] OK      22.3s J0 | CollectionsAPIAsyncDistributedZkTest.testAsyncRequests
   [junit4] Completed [4/10] on J0 in 44.95s, 4 tests
   [junit4] 
   [junit4] Suite: org.apache.solr.cloud.api.collections.CollectionsAPIAsyncDistributedZkTest
   [junit4] OK      3.08s J1 | CollectionsAPIAsyncDistributedZkTest.testAsyncIdRaceCondition
   [junit4] OK      0.03s J1 | CollectionsAPIAsyncDistributedZkTest.testAsyncIdBackCompat
   [junit4] OK      15.2s J1 | CollectionsAPIAsyncDistributedZkTest.testSolrJAPICalls
   [junit4] OK      22.4s J1 | CollectionsAPIAsyncDistributedZkTest.testAsyncRequests
   [junit4] Completed [5/10] on J1 in 43.11s, 4 tests
   [junit4] 
   [junit4] Suite: org.apache.solr.handler.RequestLoggingTest
   [junit4] OK      0.02s J1 | RequestLoggingTest.testLogBeforeExecuteWithCoreLogger
   [junit4] OK      0.01s J1 | RequestLoggingTest.testLogBeforeExecuteWithRequestLogger
   [junit4] Completed [6/10] on J1 in 1.03s, 2 tests
   [junit4] 
   [junit4] Duplicate suite name used with XML reports: org.apache.solr.handler.RequestLoggingTest. This may confuse tools that process XML reports. Set 'ignoreDuplicateSuites' to true to skip this message.
   [junit4] Suite: org.apache.solr.handler.RequestLoggingTest
   [junit4] OK      0.01s J1 | RequestLoggingTest.testLogBeforeExecuteWithCoreLogger
   [junit4] OK      0.00s J1 | RequestLoggingTest.testLogBeforeExecuteWithRequestLogger
   [junit4] Completed [7/10] on J1 in 0.89s, 2 tests
   [junit4] 
   [junit4] Suite: org.apache.solr.handler.RequestLoggingTest
   [junit4] OK      0.01s J1 | RequestLoggingTest.testLogBeforeExecuteWithCoreLogger
   [junit4] OK      0.01s J1 | RequestLoggingTest.testLogBeforeExecuteWithRequestLogger
   [junit4] Completed [8/10] on J1 in 1.07s, 2 tests
   [junit4] 
   [junit4] Suite: org.apache.solr.handler.RequestLoggingTest
   [junit4] OK      0.01s J1 | RequestLoggingTest.testLogBeforeExecuteWithCoreLogger
   [junit4] OK      0.01s J1 | RequestLoggingTest.testLogBeforeExecuteWithRequestLogger
   [junit4] Completed [9/10] on J1 in 0.90s, 2 tests
   [junit4] 
   [junit4] Suite: org.apache.solr.cloud.api.collections.CollectionsAPIAsyncDistributedZkTest
   [junit4] OK      3.09s J0 | CollectionsAPIAsyncDistributedZkTest.testAsyncIdRaceCondition
   [junit4] OK      0.06s J0 | CollectionsAPIAsyncDistributedZkTest.testAsyncIdBackCompat
   [junit4] OK      15.1s J0 | CollectionsAPIAsyncDistributedZkTest.testSolrJAPICalls
   [junit4] OK      22.3s J0 | CollectionsAPIAsyncDistributedZkTest.testAsyncRequests
   [junit4] Completed [10/10] on J0 in 44.07s, 4 tests
   [junit4] 
   [junit4] JVM J0:     0.69 ..   139.43 =   138.74s
   [junit4] JVM J1:     0.69 ..   101.55 =   100.86s
   [junit4] Execution time total: 2 minutes 19 seconds
   [junit4] Tests summary: 10 suites, 30 tests
   [junit4] Could not remove temporary path: /export/home/jenkins/workspace/Lucene-Solr-7.x-Solaris/solr/build/solr-core/test/J1 (java.nio.file.DirectoryNotEmptyException: Remaining files: [/export/home/jenkins/workspace/Lucene-Solr-7.x-Solaris/solr/build/solr-core/test/J1/temp])
   [junit4] Could not remove temporary path: /export/home/jenkins/workspace/Lucene-Solr-7.x-Solaris/solr/build/solr-core/test/J0 (java.nio.file.DirectoryNotEmptyException: Remaining files: [/export/home/jenkins/workspace/Lucene-Solr-7.x-Solaris/solr/build/solr-core/test/J0/temp])
     [echo] 5 slowest tests:
[junit4:tophints] 453.38s | org.apache.solr.cloud.api.collections.ShardSplitTest
[junit4:tophints] 344.33s | org.apache.solr.cloud.cdcr.CdcrWithNodesRestartsTest
[junit4:tophints] 263.62s | org.apache.solr.cloud.cdcr.CdcrOpsAndBoundariesTest
[junit4:tophints] 130.93s | org.apache.solr.cloud.autoscaling.IndexSizeTriggerTest
[junit4:tophints] 118.07s | org.apache.solr.cloud.autoscaling.SearchRateTriggerIntegrationTest

-check-totals:

test-nocompile:

BUILD SUCCESSFUL
Total time: 2 minutes 21 seconds
[repro] Failures:
[repro]   0/5 failed: org.apache.solr.cloud.api.collections.CollectionsAPIAsyncDistributedZkTest
[repro]   0/5 failed: org.apache.solr.handler.RequestLoggingTest
[repro] Exiting with code 0
+ mv lucene/build lucene/build.repro
+ mv solr/build solr/build.repro
+ mv lucene/build.orig lucene/build
+ mv solr/build.orig solr/build
Archiving artifacts
Setting ANT_1_8_2_HOME=/export/home/jenkins/tools/hudson.tasks.Ant_AntInstallation/ANT_1.8.2
java.lang.InterruptedException: no matches found within 10000
	at hudson.FilePath$ValidateAntFileMask.hasMatch(FilePath.java:2846)
	at hudson.FilePath$ValidateAntFileMask.invoke(FilePath.java:2725)
	at hudson.FilePath$ValidateAntFileMask.invoke(FilePath.java:2706)
	at hudson.FilePath$FileCallableWrapper.call(FilePath.java:3085)
Also:   hudson.remoting.Channel$CallSiteStackTrace: Remote call to Solaris VBOX
		at hudson.remoting.Channel.attachCallSiteStackTrace(Channel.java:1741)
		at hudson.remoting.UserRequest$ExceptionResponse.retrieve(UserRequest.java:357)
		at hudson.remoting.Channel.call(Channel.java:955)
		at hudson.FilePath.act(FilePath.java:1071)
		at hudson.FilePath.act(FilePath.java:1060)
		at hudson.FilePath.validateAntFileMask(FilePath.java:2704)
		at hudson.tasks.ArtifactArchiver.perform(ArtifactArchiver.java:243)
		at hudson.tasks.BuildStepCompatibilityLayer.perform(BuildStepCompatibilityLayer.java:81)
		at hudson.tasks.BuildStepMonitor$1.perform(BuildStepMonitor.java:20)
		at hudson.model.AbstractBuild$AbstractBuildExecution.perform(AbstractBuild.java:744)
		at hudson.model.AbstractBuild$AbstractBuildExecution.performAllBuildSteps(AbstractBuild.java:690)
		at hudson.model.Build$BuildExecution.post2(Build.java:186)
		at hudson.model.AbstractBuild$AbstractBuildExecution.post(AbstractBuild.java:635)
		at hudson.model.Run.execute(Run.java:1840)
		at hudson.model.FreeStyleBuild.run(FreeStyleBuild.java:43)
		at hudson.model.ResourceController.execute(ResourceController.java:97)
		at hudson.model.Executor.run(Executor.java:429)
Caused: hudson.FilePath$TunneledInterruptedException
	at hudson.FilePath$FileCallableWrapper.call(FilePath.java:3087)
	at hudson.remoting.UserRequest.perform(UserRequest.java:212)
	at hudson.remoting.UserRequest.perform(UserRequest.java:54)
	at hudson.remoting.Request$2.run(Request.java:369)
	at hudson.remoting.InterceptingExecutorService$1.call(InterceptingExecutorService.java:72)
	at java.util.concurrent.FutureTask.run(FutureTask.java:266)
	at java.util.concurrent.ThreadPoolExecutor.runWorker(ThreadPoolExecutor.java:1149)
	at java.util.concurrent.ThreadPoolExecutor$Worker.run(ThreadPoolExecutor.java:624)
	at java.lang.Thread.run(Thread.java:748)
Caused: java.lang.InterruptedException: java.lang.InterruptedException: no matches found within 10000
	at hudson.FilePath.act(FilePath.java:1073)
	at hudson.FilePath.act(FilePath.java:1060)
	at hudson.FilePath.validateAntFileMask(FilePath.java:2704)
	at hudson.tasks.ArtifactArchiver.perform(ArtifactArchiver.java:243)
	at hudson.tasks.BuildStepCompatibilityLayer.perform(BuildStepCompatibilityLayer.java:81)
	at hudson.tasks.BuildStepMonitor$1.perform(BuildStepMonitor.java:20)
	at hudson.model.AbstractBuild$AbstractBuildExecution.perform(AbstractBuild.java:744)
	at hudson.model.AbstractBuild$AbstractBuildExecution.performAllBuildSteps(AbstractBuild.java:690)
	at hudson.model.Build$BuildExecution.post2(Build.java:186)
	at hudson.model.AbstractBuild$AbstractBuildExecution.post(AbstractBuild.java:635)
	at hudson.model.Run.execute(Run.java:1840)
	at hudson.model.FreeStyleBuild.run(FreeStyleBuild.java:43)
	at hudson.model.ResourceController.execute(ResourceController.java:97)
	at hudson.model.Executor.run(Executor.java:429)
No artifacts found that match the file pattern "**/*.events,heapdumps/**,**/*_pid*.log". Configuration error?
[WARNINGS] Parsing warnings in console log with parser Java Compiler (javac)
Setting ANT_1_8_2_HOME=/export/home/jenkins/tools/hudson.tasks.Ant_AntInstallation/ANT_1.8.2
Setting ANT_1_8_2_HOME=/export/home/jenkins/tools/hudson.tasks.Ant_AntInstallation/ANT_1.8.2
<Git Blamer> Using GitBlamer to create author and commit information for all warnings.
<Git Blamer> GIT_COMMIT=d35b615c66e8974363b7a938abc0d74a85a798dd, workspace=/export/home/jenkins/workspace/Lucene-Solr-7.x-Solaris
[WARNINGS] Computing warning deltas based on reference build #792
Recording test results
Setting ANT_1_8_2_HOME=/export/home/jenkins/tools/hudson.tasks.Ant_AntInstallation/ANT_1.8.2
Build step 'Publish JUnit test result report' changed build result to UNSTABLE
Email was triggered for: Unstable (Test Failures)
Sending email for trigger: Unstable (Test Failures)
Setting ANT_1_8_2_HOME=/export/home/jenkins/tools/hudson.tasks.Ant_AntInstallation/ANT_1.8.2
Setting ANT_1_8_2_HOME=/export/home/jenkins/tools/hudson.tasks.Ant_AntInstallation/ANT_1.8.2
Setting ANT_1_8_2_HOME=/export/home/jenkins/tools/hudson.tasks.Ant_AntInstallation/ANT_1.8.2
Setting ANT_1_8_2_HOME=/export/home/jenkins/tools/hudson.tasks.Ant_AntInstallation/ANT_1.8.2

Mime
View raw message