lucene-dev mailing list archives

Site index · List index
Message view « Date » · « Thread »
Top « Date » · « Thread »
From Policeman Jenkins Server <jenk...@thetaphi.de>
Subject [JENKINS] Lucene-Solr-BadApples-master-Linux (64bit/jdk-10.0.1) - Build # 94 - Still unstable!
Date Tue, 18 Sep 2018 04:10:22 GMT
Build: https://jenkins.thetaphi.de/job/Lucene-Solr-BadApples-master-Linux/94/
Java: 64bit/jdk-10.0.1 -XX:+UseCompressedOops -XX:+UseParallelGC

2 tests failed.
FAILED:  org.apache.solr.cloud.SSLMigrationTest.test

Error Message:
Replica didn't have the proper urlScheme in the ClusterState

Stack Trace:
java.lang.AssertionError: Replica didn't have the proper urlScheme in the ClusterState
	at __randomizedtesting.SeedInfo.seed([493FAE3B5C9B0227:C16B91E1F2676FDF]:0)
	at org.junit.Assert.fail(Assert.java:93)
	at org.junit.Assert.assertTrue(Assert.java:43)
	at org.apache.solr.cloud.SSLMigrationTest.assertReplicaInformation(SSLMigrationTest.java:104)
	at org.apache.solr.cloud.SSLMigrationTest.testMigrateSSL(SSLMigrationTest.java:97)
	at org.apache.solr.cloud.SSLMigrationTest.test(SSLMigrationTest.java:61)
	at java.base/jdk.internal.reflect.NativeMethodAccessorImpl.invoke0(Native Method)
	at java.base/jdk.internal.reflect.NativeMethodAccessorImpl.invoke(NativeMethodAccessorImpl.java:62)
	at java.base/jdk.internal.reflect.DelegatingMethodAccessorImpl.invoke(DelegatingMethodAccessorImpl.java:43)
	at java.base/java.lang.reflect.Method.invoke(Method.java:564)
	at com.carrotsearch.randomizedtesting.RandomizedRunner.invoke(RandomizedRunner.java:1742)
	at com.carrotsearch.randomizedtesting.RandomizedRunner$8.evaluate(RandomizedRunner.java:935)
	at com.carrotsearch.randomizedtesting.RandomizedRunner$9.evaluate(RandomizedRunner.java:971)
	at com.carrotsearch.randomizedtesting.RandomizedRunner$10.evaluate(RandomizedRunner.java:985)
	at org.apache.solr.BaseDistributedSearchTestCase$ShardsRepeatRule$ShardsFixedStatement.callStatement(BaseDistributedSearchTestCase.java:1008)
	at org.apache.solr.BaseDistributedSearchTestCase$ShardsRepeatRule$ShardsStatement.evaluate(BaseDistributedSearchTestCase.java:983)
	at com.carrotsearch.randomizedtesting.rules.SystemPropertiesRestoreRule$1.evaluate(SystemPropertiesRestoreRule.java:57)
	at org.apache.lucene.util.TestRuleSetupTeardownChained$1.evaluate(TestRuleSetupTeardownChained.java:49)
	at org.apache.lucene.util.AbstractBeforeAfterRule$1.evaluate(AbstractBeforeAfterRule.java:45)
	at org.apache.lucene.util.TestRuleThreadAndTestName$1.evaluate(TestRuleThreadAndTestName.java:48)
	at org.apache.lucene.util.TestRuleIgnoreAfterMaxFailures$1.evaluate(TestRuleIgnoreAfterMaxFailures.java:64)
	at org.apache.lucene.util.TestRuleMarkFailure$1.evaluate(TestRuleMarkFailure.java:47)
	at com.carrotsearch.randomizedtesting.rules.StatementAdapter.evaluate(StatementAdapter.java:36)
	at com.carrotsearch.randomizedtesting.ThreadLeakControl$StatementRunner.run(ThreadLeakControl.java:368)
	at com.carrotsearch.randomizedtesting.ThreadLeakControl.forkTimeoutingTask(ThreadLeakControl.java:817)
	at com.carrotsearch.randomizedtesting.ThreadLeakControl$3.evaluate(ThreadLeakControl.java:468)
	at com.carrotsearch.randomizedtesting.RandomizedRunner.runSingleTest(RandomizedRunner.java:944)
	at com.carrotsearch.randomizedtesting.RandomizedRunner$5.evaluate(RandomizedRunner.java:830)
	at com.carrotsearch.randomizedtesting.RandomizedRunner$6.evaluate(RandomizedRunner.java:880)
	at com.carrotsearch.randomizedtesting.RandomizedRunner$7.evaluate(RandomizedRunner.java:891)
	at com.carrotsearch.randomizedtesting.rules.StatementAdapter.evaluate(StatementAdapter.java:36)
	at com.carrotsearch.randomizedtesting.rules.SystemPropertiesRestoreRule$1.evaluate(SystemPropertiesRestoreRule.java:57)
	at org.apache.lucene.util.AbstractBeforeAfterRule$1.evaluate(AbstractBeforeAfterRule.java:45)
	at com.carrotsearch.randomizedtesting.rules.StatementAdapter.evaluate(StatementAdapter.java:36)
	at org.apache.lucene.util.TestRuleStoreClassName$1.evaluate(TestRuleStoreClassName.java:41)
	at com.carrotsearch.randomizedtesting.rules.NoShadowingOrOverridesOnMethodsRule$1.evaluate(NoShadowingOrOverridesOnMethodsRule.java:40)
	at com.carrotsearch.randomizedtesting.rules.NoShadowingOrOverridesOnMethodsRule$1.evaluate(NoShadowingOrOverridesOnMethodsRule.java:40)
	at com.carrotsearch.randomizedtesting.rules.StatementAdapter.evaluate(StatementAdapter.java:36)
	at com.carrotsearch.randomizedtesting.rules.StatementAdapter.evaluate(StatementAdapter.java:36)
	at org.apache.lucene.util.TestRuleAssertionsRequired$1.evaluate(TestRuleAssertionsRequired.java:53)
	at org.apache.lucene.util.TestRuleMarkFailure$1.evaluate(TestRuleMarkFailure.java:47)
	at org.apache.lucene.util.TestRuleIgnoreAfterMaxFailures$1.evaluate(TestRuleIgnoreAfterMaxFailures.java:64)
	at org.apache.lucene.util.TestRuleIgnoreTestSuites$1.evaluate(TestRuleIgnoreTestSuites.java:54)
	at com.carrotsearch.randomizedtesting.rules.StatementAdapter.evaluate(StatementAdapter.java:36)
	at com.carrotsearch.randomizedtesting.ThreadLeakControl$StatementRunner.run(ThreadLeakControl.java:368)
	at java.base/java.lang.Thread.run(Thread.java:844)


FAILED:  org.apache.solr.cloud.SSLMigrationTest.test

Error Message:
Replica didn't have the proper urlScheme in the ClusterState

Stack Trace:
java.lang.AssertionError: Replica didn't have the proper urlScheme in the ClusterState
	at __randomizedtesting.SeedInfo.seed([493FAE3B5C9B0227:C16B91E1F2676FDF]:0)
	at org.junit.Assert.fail(Assert.java:93)
	at org.junit.Assert.assertTrue(Assert.java:43)
	at org.apache.solr.cloud.SSLMigrationTest.assertReplicaInformation(SSLMigrationTest.java:104)
	at org.apache.solr.cloud.SSLMigrationTest.testMigrateSSL(SSLMigrationTest.java:97)
	at org.apache.solr.cloud.SSLMigrationTest.test(SSLMigrationTest.java:61)
	at java.base/jdk.internal.reflect.NativeMethodAccessorImpl.invoke0(Native Method)
	at java.base/jdk.internal.reflect.NativeMethodAccessorImpl.invoke(NativeMethodAccessorImpl.java:62)
	at java.base/jdk.internal.reflect.DelegatingMethodAccessorImpl.invoke(DelegatingMethodAccessorImpl.java:43)
	at java.base/java.lang.reflect.Method.invoke(Method.java:564)
	at com.carrotsearch.randomizedtesting.RandomizedRunner.invoke(RandomizedRunner.java:1742)
	at com.carrotsearch.randomizedtesting.RandomizedRunner$8.evaluate(RandomizedRunner.java:935)
	at com.carrotsearch.randomizedtesting.RandomizedRunner$9.evaluate(RandomizedRunner.java:971)
	at com.carrotsearch.randomizedtesting.RandomizedRunner$10.evaluate(RandomizedRunner.java:985)
	at org.apache.solr.BaseDistributedSearchTestCase$ShardsRepeatRule$ShardsFixedStatement.callStatement(BaseDistributedSearchTestCase.java:1008)
	at org.apache.solr.BaseDistributedSearchTestCase$ShardsRepeatRule$ShardsStatement.evaluate(BaseDistributedSearchTestCase.java:983)
	at com.carrotsearch.randomizedtesting.rules.SystemPropertiesRestoreRule$1.evaluate(SystemPropertiesRestoreRule.java:57)
	at org.apache.lucene.util.TestRuleSetupTeardownChained$1.evaluate(TestRuleSetupTeardownChained.java:49)
	at org.apache.lucene.util.AbstractBeforeAfterRule$1.evaluate(AbstractBeforeAfterRule.java:45)
	at org.apache.lucene.util.TestRuleThreadAndTestName$1.evaluate(TestRuleThreadAndTestName.java:48)
	at org.apache.lucene.util.TestRuleIgnoreAfterMaxFailures$1.evaluate(TestRuleIgnoreAfterMaxFailures.java:64)
	at org.apache.lucene.util.TestRuleMarkFailure$1.evaluate(TestRuleMarkFailure.java:47)
	at com.carrotsearch.randomizedtesting.rules.StatementAdapter.evaluate(StatementAdapter.java:36)
	at com.carrotsearch.randomizedtesting.ThreadLeakControl$StatementRunner.run(ThreadLeakControl.java:368)
	at com.carrotsearch.randomizedtesting.ThreadLeakControl.forkTimeoutingTask(ThreadLeakControl.java:817)
	at com.carrotsearch.randomizedtesting.ThreadLeakControl$3.evaluate(ThreadLeakControl.java:468)
	at com.carrotsearch.randomizedtesting.RandomizedRunner.runSingleTest(RandomizedRunner.java:944)
	at com.carrotsearch.randomizedtesting.RandomizedRunner$5.evaluate(RandomizedRunner.java:830)
	at com.carrotsearch.randomizedtesting.RandomizedRunner$6.evaluate(RandomizedRunner.java:880)
	at com.carrotsearch.randomizedtesting.RandomizedRunner$7.evaluate(RandomizedRunner.java:891)
	at com.carrotsearch.randomizedtesting.rules.StatementAdapter.evaluate(StatementAdapter.java:36)
	at com.carrotsearch.randomizedtesting.rules.SystemPropertiesRestoreRule$1.evaluate(SystemPropertiesRestoreRule.java:57)
	at org.apache.lucene.util.AbstractBeforeAfterRule$1.evaluate(AbstractBeforeAfterRule.java:45)
	at com.carrotsearch.randomizedtesting.rules.StatementAdapter.evaluate(StatementAdapter.java:36)
	at org.apache.lucene.util.TestRuleStoreClassName$1.evaluate(TestRuleStoreClassName.java:41)
	at com.carrotsearch.randomizedtesting.rules.NoShadowingOrOverridesOnMethodsRule$1.evaluate(NoShadowingOrOverridesOnMethodsRule.java:40)
	at com.carrotsearch.randomizedtesting.rules.NoShadowingOrOverridesOnMethodsRule$1.evaluate(NoShadowingOrOverridesOnMethodsRule.java:40)
	at com.carrotsearch.randomizedtesting.rules.StatementAdapter.evaluate(StatementAdapter.java:36)
	at com.carrotsearch.randomizedtesting.rules.StatementAdapter.evaluate(StatementAdapter.java:36)
	at org.apache.lucene.util.TestRuleAssertionsRequired$1.evaluate(TestRuleAssertionsRequired.java:53)
	at org.apache.lucene.util.TestRuleMarkFailure$1.evaluate(TestRuleMarkFailure.java:47)
	at org.apache.lucene.util.TestRuleIgnoreAfterMaxFailures$1.evaluate(TestRuleIgnoreAfterMaxFailures.java:64)
	at org.apache.lucene.util.TestRuleIgnoreTestSuites$1.evaluate(TestRuleIgnoreTestSuites.java:54)
	at com.carrotsearch.randomizedtesting.rules.StatementAdapter.evaluate(StatementAdapter.java:36)
	at com.carrotsearch.randomizedtesting.ThreadLeakControl$StatementRunner.run(ThreadLeakControl.java:368)
	at java.base/java.lang.Thread.run(Thread.java:844)




Build Log:
[...truncated 13761 lines...]
   [junit4] Suite: org.apache.solr.cloud.SSLMigrationTest
   [junit4]   2> Creating dataDir: /home/jenkins/workspace/Lucene-Solr-BadApples-master-Linux/solr/build/solr-core/test/J0/temp/solr.cloud.SSLMigrationTest_493FAE3B5C9B0227-001/init-core-data-001
   [junit4]   2> 2388941 WARN  (SUITE-SSLMigrationTest-seed#[493FAE3B5C9B0227]-worker) [    ] o.a.s.SolrTestCaseJ4 startTrackingSearchers: numOpens=2 numCloses=2
   [junit4]   2> 2388941 INFO  (SUITE-SSLMigrationTest-seed#[493FAE3B5C9B0227]-worker) [    ] o.a.s.SolrTestCaseJ4 Using PointFields (NUMERIC_POINTS_SYSPROP=true) w/NUMERIC_DOCVALUES_SYSPROP=true
   [junit4]   2> 2388941 INFO  (SUITE-SSLMigrationTest-seed#[493FAE3B5C9B0227]-worker) [    ] o.a.s.SolrTestCaseJ4 Randomized ssl (false) and clientAuth (false) via: @org.apache.solr.SolrTestCaseJ4$SuppressSSL(bugUrl="None")
   [junit4]   2> 2388941 INFO  (SUITE-SSLMigrationTest-seed#[493FAE3B5C9B0227]-worker) [    ] o.a.s.SolrTestCaseJ4 SecureRandom sanity checks: test.solr.allowed.securerandom=null & java.security.egd=file:/dev/./urandom
   [junit4]   2> 2388942 INFO  (SUITE-SSLMigrationTest-seed#[493FAE3B5C9B0227]-worker) [    ] o.a.s.BaseDistributedSearchTestCase Setting hostContext system property: /
   [junit4]   2> 2388943 INFO  (TEST-SSLMigrationTest.test-seed#[493FAE3B5C9B0227]) [    ] o.a.s.c.ZkTestServer STARTING ZK TEST SERVER
   [junit4]   2> 2388943 INFO  (Thread-6137) [    ] o.a.s.c.ZkTestServer client port:0.0.0.0/0.0.0.0:0
   [junit4]   2> 2388943 INFO  (Thread-6137) [    ] o.a.s.c.ZkTestServer Starting server
   [junit4]   2> 2388944 ERROR (Thread-6137) [    ] o.a.z.s.ZooKeeperServer ZKShutdownHandler is not registered, so ZooKeeper server won't take any action on ERROR or SHUTDOWN server state changes
   [junit4]   2> 2389043 INFO  (TEST-SSLMigrationTest.test-seed#[493FAE3B5C9B0227]) [    ] o.a.s.c.ZkTestServer start zk server on port:35065
   [junit4]   2> 2389045 INFO  (zkConnectionManagerCallback-8009-thread-1) [    ] o.a.s.c.c.ConnectionManager zkClient has connected
   [junit4]   2> 2389047 INFO  (zkConnectionManagerCallback-8011-thread-1) [    ] o.a.s.c.c.ConnectionManager zkClient has connected
   [junit4]   2> 2389050 INFO  (TEST-SSLMigrationTest.test-seed#[493FAE3B5C9B0227]) [    ] o.a.s.c.AbstractZkTestCase put /home/jenkins/workspace/Lucene-Solr-BadApples-master-Linux/solr/core/src/test-files/solr/collection1/conf/solrconfig-tlog.xml to /configs/conf1/solrconfig.xml
   [junit4]   2> 2389050 INFO  (TEST-SSLMigrationTest.test-seed#[493FAE3B5C9B0227]) [    ] o.a.s.c.AbstractZkTestCase put /home/jenkins/workspace/Lucene-Solr-BadApples-master-Linux/solr/core/src/test-files/solr/collection1/conf/schema.xml to /configs/conf1/schema.xml
   [junit4]   2> 2389051 INFO  (TEST-SSLMigrationTest.test-seed#[493FAE3B5C9B0227]) [    ] o.a.s.c.AbstractZkTestCase put /home/jenkins/workspace/Lucene-Solr-BadApples-master-Linux/solr/core/src/test-files/solr/collection1/conf/solrconfig.snippet.randomindexconfig.xml to /configs/conf1/solrconfig.snippet.randomindexconfig.xml
   [junit4]   2> 2389052 INFO  (TEST-SSLMigrationTest.test-seed#[493FAE3B5C9B0227]) [    ] o.a.s.c.AbstractZkTestCase put /home/jenkins/workspace/Lucene-Solr-BadApples-master-Linux/solr/core/src/test-files/solr/collection1/conf/stopwords.txt to /configs/conf1/stopwords.txt
   [junit4]   2> 2389052 INFO  (TEST-SSLMigrationTest.test-seed#[493FAE3B5C9B0227]) [    ] o.a.s.c.AbstractZkTestCase put /home/jenkins/workspace/Lucene-Solr-BadApples-master-Linux/solr/core/src/test-files/solr/collection1/conf/protwords.txt to /configs/conf1/protwords.txt
   [junit4]   2> 2389053 INFO  (TEST-SSLMigrationTest.test-seed#[493FAE3B5C9B0227]) [    ] o.a.s.c.AbstractZkTestCase put /home/jenkins/workspace/Lucene-Solr-BadApples-master-Linux/solr/core/src/test-files/solr/collection1/conf/currency.xml to /configs/conf1/currency.xml
   [junit4]   2> 2389053 INFO  (TEST-SSLMigrationTest.test-seed#[493FAE3B5C9B0227]) [    ] o.a.s.c.AbstractZkTestCase put /home/jenkins/workspace/Lucene-Solr-BadApples-master-Linux/solr/core/src/test-files/solr/collection1/conf/enumsConfig.xml to /configs/conf1/enumsConfig.xml
   [junit4]   2> 2389053 INFO  (TEST-SSLMigrationTest.test-seed#[493FAE3B5C9B0227]) [    ] o.a.s.c.AbstractZkTestCase put /home/jenkins/workspace/Lucene-Solr-BadApples-master-Linux/solr/core/src/test-files/solr/collection1/conf/open-exchange-rates.json to /configs/conf1/open-exchange-rates.json
   [junit4]   2> 2389054 INFO  (TEST-SSLMigrationTest.test-seed#[493FAE3B5C9B0227]) [    ] o.a.s.c.AbstractZkTestCase put /home/jenkins/workspace/Lucene-Solr-BadApples-master-Linux/solr/core/src/test-files/solr/collection1/conf/mapping-ISOLatin1Accent.txt to /configs/conf1/mapping-ISOLatin1Accent.txt
   [junit4]   2> 2389054 INFO  (TEST-SSLMigrationTest.test-seed#[493FAE3B5C9B0227]) [    ] o.a.s.c.AbstractZkTestCase put /home/jenkins/workspace/Lucene-Solr-BadApples-master-Linux/solr/core/src/test-files/solr/collection1/conf/old_synonyms.txt to /configs/conf1/old_synonyms.txt
   [junit4]   2> 2389055 INFO  (TEST-SSLMigrationTest.test-seed#[493FAE3B5C9B0227]) [    ] o.a.s.c.AbstractZkTestCase put /home/jenkins/workspace/Lucene-Solr-BadApples-master-Linux/solr/core/src/test-files/solr/collection1/conf/synonyms.txt to /configs/conf1/synonyms.txt
   [junit4]   2> 2389055 INFO  (TEST-SSLMigrationTest.test-seed#[493FAE3B5C9B0227]) [    ] o.a.s.c.AbstractFullDistribZkTestBase Will use NRT replicas unless explicitly asked otherwise
   [junit4]   2> 2389115 INFO  (TEST-SSLMigrationTest.test-seed#[493FAE3B5C9B0227]) [    ] o.e.j.s.Server jetty-9.4.11.v20180605; built: 2018-06-05T18:24:03.829Z; git: d5fc0523cfa96bfebfbda19606cad384d772f04c; jvm 10.0.1+10
   [junit4]   2> 2389116 INFO  (TEST-SSLMigrationTest.test-seed#[493FAE3B5C9B0227]) [    ] o.e.j.s.session DefaultSessionIdManager workerName=node0
   [junit4]   2> 2389116 INFO  (TEST-SSLMigrationTest.test-seed#[493FAE3B5C9B0227]) [    ] o.e.j.s.session No SessionScavenger set, using defaults
   [junit4]   2> 2389116 INFO  (TEST-SSLMigrationTest.test-seed#[493FAE3B5C9B0227]) [    ] o.e.j.s.session node0 Scavenging every 600000ms
   [junit4]   2> 2389116 INFO  (TEST-SSLMigrationTest.test-seed#[493FAE3B5C9B0227]) [    ] o.e.j.s.h.ContextHandler Started o.e.j.s.ServletContextHandler@2443209f{/,null,AVAILABLE}
   [junit4]   2> 2389118 INFO  (TEST-SSLMigrationTest.test-seed#[493FAE3B5C9B0227]) [    ] o.e.j.s.AbstractConnector Started ServerConnector@6f2a3e07{HTTP/1.1,[http/1.1]}{127.0.0.1:44137}
   [junit4]   2> 2389118 INFO  (TEST-SSLMigrationTest.test-seed#[493FAE3B5C9B0227]) [    ] o.e.j.s.Server Started @2389142ms
   [junit4]   2> 2389118 INFO  (TEST-SSLMigrationTest.test-seed#[493FAE3B5C9B0227]) [    ] o.a.s.c.s.e.JettySolrRunner Jetty properties: {hostContext=/, solr.data.dir=/home/jenkins/workspace/Lucene-Solr-BadApples-master-Linux/solr/build/solr-core/test/J0/temp/solr.cloud.SSLMigrationTest_493FAE3B5C9B0227-001/tempDir-001/control/data, hostPort=44137, coreRootDirectory=/home/jenkins/workspace/Lucene-Solr-BadApples-master-Linux/solr/build/solr-core/test/J0/../../../../../../../../../home/jenkins/workspace/Lucene-Solr-BadApples-master-Linux/solr/build/solr-core/test/J0/temp/solr.cloud.SSLMigrationTest_493FAE3B5C9B0227-001/control-001/cores}
   [junit4]   2> 2389118 ERROR (TEST-SSLMigrationTest.test-seed#[493FAE3B5C9B0227]) [    ] o.a.s.u.StartupLoggingUtils Missing Java Option solr.log.dir. Logging may be missing or incomplete.
   [junit4]   2> 2389118 INFO  (TEST-SSLMigrationTest.test-seed#[493FAE3B5C9B0227]) [    ] o.a.s.s.SolrDispatchFilter Using logger factory org.apache.logging.slf4j.Log4jLoggerFactory
   [junit4]   2> 2389118 INFO  (TEST-SSLMigrationTest.test-seed#[493FAE3B5C9B0227]) [    ] o.a.s.s.SolrDispatchFilter  ___      _       Welcome to Apache Solr? version 8.0.0
   [junit4]   2> 2389118 INFO  (TEST-SSLMigrationTest.test-seed#[493FAE3B5C9B0227]) [    ] o.a.s.s.SolrDispatchFilter / __| ___| |_ _   Starting in cloud mode on port null
   [junit4]   2> 2389118 INFO  (TEST-SSLMigrationTest.test-seed#[493FAE3B5C9B0227]) [    ] o.a.s.s.SolrDispatchFilter \__ \/ _ \ | '_|  Install dir: null
   [junit4]   2> 2389118 INFO  (TEST-SSLMigrationTest.test-seed#[493FAE3B5C9B0227]) [    ] o.a.s.s.SolrDispatchFilter |___/\___/_|_|    Start time: 2018-09-18T03:36:55.633645Z
   [junit4]   2> 2389119 INFO  (zkConnectionManagerCallback-8013-thread-1) [    ] o.a.s.c.c.ConnectionManager zkClient has connected
   [junit4]   2> 2389120 INFO  (TEST-SSLMigrationTest.test-seed#[493FAE3B5C9B0227]) [    ] o.a.s.s.SolrDispatchFilter Loading solr.xml from SolrHome (not found in ZooKeeper)
   [junit4]   2> 2389120 INFO  (TEST-SSLMigrationTest.test-seed#[493FAE3B5C9B0227]) [    ] o.a.s.c.SolrXmlConfig Loading container configuration from /home/jenkins/workspace/Lucene-Solr-BadApples-master-Linux/solr/build/solr-core/test/J0/temp/solr.cloud.SSLMigrationTest_493FAE3B5C9B0227-001/control-001/solr.xml
   [junit4]   2> 2389122 INFO  (TEST-SSLMigrationTest.test-seed#[493FAE3B5C9B0227]) [    ] o.a.s.c.SolrXmlConfig Configuration parameter autoReplicaFailoverWorkLoopDelay is ignored
   [junit4]   2> 2389122 INFO  (TEST-SSLMigrationTest.test-seed#[493FAE3B5C9B0227]) [    ] o.a.s.c.SolrXmlConfig Configuration parameter autoReplicaFailoverBadNodeExpiration is ignored
   [junit4]   2> 2389123 INFO  (TEST-SSLMigrationTest.test-seed#[493FAE3B5C9B0227]) [    ] o.a.s.c.SolrXmlConfig MBean server found: com.sun.jmx.mbeanserver.JmxMBeanServer@562b7cc1, but no JMX reporters were configured - adding default JMX reporter.
   [junit4]   2> 2389215 INFO  (TEST-SSLMigrationTest.test-seed#[493FAE3B5C9B0227]) [    ] o.a.s.c.ZkContainer Zookeeper client=127.0.0.1:35065/solr
   [junit4]   2> 2389216 INFO  (zkConnectionManagerCallback-8017-thread-1) [    ] o.a.s.c.c.ConnectionManager zkClient has connected
   [junit4]   2> 2389221 INFO  (zkConnectionManagerCallback-8019-thread-1) [    ] o.a.s.c.c.ConnectionManager zkClient has connected
   [junit4]   2> 2389250 INFO  (TEST-SSLMigrationTest.test-seed#[493FAE3B5C9B0227]) [n:127.0.0.1:44137_    ] o.a.s.c.OverseerElectionContext I am going to be the leader 127.0.0.1:44137_
   [junit4]   2> 2389251 INFO  (TEST-SSLMigrationTest.test-seed#[493FAE3B5C9B0227]) [n:127.0.0.1:44137_    ] o.a.s.c.Overseer Overseer (id=72243551984877572-127.0.0.1:44137_-n_0000000000) starting
   [junit4]   2> 2389254 INFO  (zkConnectionManagerCallback-8026-thread-1) [    ] o.a.s.c.c.ConnectionManager zkClient has connected
   [junit4]   2> 2389254 INFO  (TEST-SSLMigrationTest.test-seed#[493FAE3B5C9B0227]) [n:127.0.0.1:44137_    ] o.a.s.c.s.i.ZkClientClusterStateProvider Cluster at 127.0.0.1:35065/solr ready
   [junit4]   2> 2389255 INFO  (OverseerStateUpdate-72243551984877572-127.0.0.1:44137_-n_0000000000) [n:127.0.0.1:44137_    ] o.a.s.c.Overseer Starting to work on the main queue : 127.0.0.1:44137_
   [junit4]   2> 2389255 INFO  (TEST-SSLMigrationTest.test-seed#[493FAE3B5C9B0227]) [n:127.0.0.1:44137_    ] o.a.s.c.ZkController Register node as live in ZooKeeper:/live_nodes/127.0.0.1:44137_
   [junit4]   2> 2389256 INFO  (zkCallback-8018-thread-1) [    ] o.a.s.c.c.ZkStateReader Updated live nodes from ZooKeeper... (0) -> (1)
   [junit4]   2> 2389256 INFO  (zkCallback-8025-thread-1) [    ] o.a.s.c.c.ZkStateReader Updated live nodes from ZooKeeper... (0) -> (1)
   [junit4]   2> 2389263 INFO  (TEST-SSLMigrationTest.test-seed#[493FAE3B5C9B0227]) [n:127.0.0.1:44137_    ] o.a.s.h.a.MetricsHistoryHandler No .system collection, keeping metrics history in memory.
   [junit4]   2> 2389272 INFO  (TEST-SSLMigrationTest.test-seed#[493FAE3B5C9B0227]) [n:127.0.0.1:44137_    ] o.a.s.m.r.SolrJmxReporter JMX monitoring for 'solr.node' (registry 'solr.node') enabled at server: com.sun.jmx.mbeanserver.JmxMBeanServer@562b7cc1
   [junit4]   2> 2389278 INFO  (TEST-SSLMigrationTest.test-seed#[493FAE3B5C9B0227]) [n:127.0.0.1:44137_    ] o.a.s.m.r.SolrJmxReporter JMX monitoring for 'solr.jvm' (registry 'solr.jvm') enabled at server: com.sun.jmx.mbeanserver.JmxMBeanServer@562b7cc1
   [junit4]   2> 2389278 INFO  (TEST-SSLMigrationTest.test-seed#[493FAE3B5C9B0227]) [n:127.0.0.1:44137_    ] o.a.s.m.r.SolrJmxReporter JMX monitoring for 'solr.jetty' (registry 'solr.jetty') enabled at server: com.sun.jmx.mbeanserver.JmxMBeanServer@562b7cc1
   [junit4]   2> 2389279 INFO  (TEST-SSLMigrationTest.test-seed#[493FAE3B5C9B0227]) [n:127.0.0.1:44137_    ] o.a.s.c.CorePropertiesLocator Found 0 core definitions underneath /home/jenkins/workspace/Lucene-Solr-BadApples-master-Linux/solr/build/solr-core/test/J0/../../../../../../../../../home/jenkins/workspace/Lucene-Solr-BadApples-master-Linux/solr/build/solr-core/test/J0/temp/solr.cloud.SSLMigrationTest_493FAE3B5C9B0227-001/control-001/cores
   [junit4]   2> 2389289 INFO  (zkConnectionManagerCallback-8032-thread-1) [    ] o.a.s.c.c.ConnectionManager zkClient has connected
   [junit4]   2> 2389290 INFO  (TEST-SSLMigrationTest.test-seed#[493FAE3B5C9B0227]) [    ] o.a.s.c.c.ZkStateReader Updated live nodes from ZooKeeper... (0) -> (1)
   [junit4]   2> 2389291 INFO  (TEST-SSLMigrationTest.test-seed#[493FAE3B5C9B0227]) [    ] o.a.s.c.s.i.ZkClientClusterStateProvider Cluster at 127.0.0.1:35065/solr ready
   [junit4]   2> 2389292 INFO  (qtp457242413-26524) [n:127.0.0.1:44137_    ] o.a.s.h.a.CollectionsHandler Invoked Collection Action :create with params collection.configName=conf1&name=control_collection&nrtReplicas=1&action=CREATE&numShards=1&createNodeSet=127.0.0.1:44137_&wt=javabin&version=2 and sendToOCPQueue=true
   [junit4]   2> 2389294 INFO  (OverseerThreadFactory-9347-thread-1-processing-n:127.0.0.1:44137_) [n:127.0.0.1:44137_    ] o.a.s.c.a.c.CreateCollectionCmd Create collection control_collection
   [junit4]   2> 2389398 INFO  (qtp457242413-26519) [n:127.0.0.1:44137_    x:control_collection_shard1_replica_n1] o.a.s.h.a.CoreAdminOperation core create command qt=/admin/cores&collection.configName=conf1&newCollection=true&name=control_collection_shard1_replica_n1&action=CREATE&numShards=1&collection=control_collection&shard=shard1&wt=javabin&version=2&replicaType=NRT
   [junit4]   2> 2389398 INFO  (qtp457242413-26519) [n:127.0.0.1:44137_    x:control_collection_shard1_replica_n1] o.a.s.c.TransientSolrCoreCacheDefault Allocating transient cache for 4 transient cores
   [junit4]   2> 2390406 INFO  (qtp457242413-26519) [n:127.0.0.1:44137_ c:control_collection s:shard1  x:control_collection_shard1_replica_n1] o.a.s.c.SolrConfig Using Lucene MatchVersion: 8.0.0
   [junit4]   2> 2390413 INFO  (qtp457242413-26519) [n:127.0.0.1:44137_ c:control_collection s:shard1  x:control_collection_shard1_replica_n1] o.a.s.s.IndexSchema [control_collection_shard1_replica_n1] Schema name=test
   [junit4]   2> 2390457 INFO  (qtp457242413-26519) [n:127.0.0.1:44137_ c:control_collection s:shard1  x:control_collection_shard1_replica_n1] o.a.s.s.IndexSchema Loaded schema test/1.0 with uniqueid field id
   [junit4]   2> 2390465 INFO  (qtp457242413-26519) [n:127.0.0.1:44137_ c:control_collection s:shard1  x:control_collection_shard1_replica_n1] o.a.s.c.CoreContainer Creating SolrCore 'control_collection_shard1_replica_n1' using configuration from collection control_collection, trusted=true
   [junit4]   2> 2390465 INFO  (qtp457242413-26519) [n:127.0.0.1:44137_ c:control_collection s:shard1  x:control_collection_shard1_replica_n1] o.a.s.m.r.SolrJmxReporter JMX monitoring for 'solr.core.control_collection.shard1.replica_n1' (registry 'solr.core.control_collection.shard1.replica_n1') enabled at server: com.sun.jmx.mbeanserver.JmxMBeanServer@562b7cc1
   [junit4]   2> 2390465 INFO  (qtp457242413-26519) [n:127.0.0.1:44137_ c:control_collection s:shard1  x:control_collection_shard1_replica_n1] o.a.s.c.SolrCore [[control_collection_shard1_replica_n1] ] Opening new SolrCore at [/home/jenkins/workspace/Lucene-Solr-BadApples-master-Linux/solr/build/solr-core/test/J0/temp/solr.cloud.SSLMigrationTest_493FAE3B5C9B0227-001/control-001/cores/control_collection_shard1_replica_n1], dataDir=[/home/jenkins/workspace/Lucene-Solr-BadApples-master-Linux/solr/build/solr-core/test/J0/../../../../../../../../../home/jenkins/workspace/Lucene-Solr-BadApples-master-Linux/solr/build/solr-core/test/J0/temp/solr.cloud.SSLMigrationTest_493FAE3B5C9B0227-001/control-001/cores/control_collection_shard1_replica_n1/data/]
   [junit4]   2> 2390467 INFO  (qtp457242413-26519) [n:127.0.0.1:44137_ c:control_collection s:shard1  x:control_collection_shard1_replica_n1] o.a.s.u.RandomMergePolicy RandomMergePolicy wrapping class org.apache.lucene.index.TieredMergePolicy: [TieredMergePolicy: maxMergeAtOnce=24, maxMergeAtOnceExplicit=18, maxMergedSegmentMB=47.2646484375, floorSegmentMB=1.443359375, forceMergeDeletesPctAllowed=18.599446894855937, segmentsPerTier=45.0, maxCFSSegmentSizeMB=8.796093022207999E12, noCFSRatio=0.38529411145844294, deletesPctAllowed=44.6850998251747
   [junit4]   2> 2390467 WARN  (qtp457242413-26519) [n:127.0.0.1:44137_ c:control_collection s:shard1  x:control_collection_shard1_replica_n1] o.a.s.c.RequestHandlers INVALID paramSet a in requestHandler {type = requestHandler,name = /dump,class = DumpRequestHandler,attributes = {initParams=a, name=/dump, class=DumpRequestHandler},args = {defaults={a=A,b=B}}}
   [junit4]   2> 2390488 INFO  (qtp457242413-26519) [n:127.0.0.1:44137_ c:control_collection s:shard1  x:control_collection_shard1_replica_n1] o.a.s.u.UpdateHandler Using UpdateLog implementation: org.apache.solr.update.UpdateLog
   [junit4]   2> 2390488 INFO  (qtp457242413-26519) [n:127.0.0.1:44137_ c:control_collection s:shard1  x:control_collection_shard1_replica_n1] o.a.s.u.UpdateLog Initializing UpdateLog: dataDir= defaultSyncLevel=FLUSH numRecordsToKeep=100 maxNumLogsToKeep=10 numVersionBuckets=65536
   [junit4]   2> 2390489 INFO  (qtp457242413-26519) [n:127.0.0.1:44137_ c:control_collection s:shard1  x:control_collection_shard1_replica_n1] o.a.s.u.CommitTracker Hard AutoCommit: disabled
   [junit4]   2> 2390489 INFO  (qtp457242413-26519) [n:127.0.0.1:44137_ c:control_collection s:shard1  x:control_collection_shard1_replica_n1] o.a.s.u.CommitTracker Soft AutoCommit: disabled
   [junit4]   2> 2390490 INFO  (qtp457242413-26519) [n:127.0.0.1:44137_ c:control_collection s:shard1  x:control_collection_shard1_replica_n1] o.a.s.u.RandomMergePolicy RandomMergePolicy wrapping class org.apache.lucene.index.LogByteSizeMergePolicy: [LogByteSizeMergePolicy: minMergeSize=1677721, mergeFactor=46, maxMergeSize=2147483648, maxMergeSizeForForcedMerge=9223372036854775807, calibrateSizeByDeletes=false, maxMergeDocs=2147483647, maxCFSSegmentSizeMB=8.796093022207999E12, noCFSRatio=0.822330233832736]
   [junit4]   2> 2390490 INFO  (qtp457242413-26519) [n:127.0.0.1:44137_ c:control_collection s:shard1  x:control_collection_shard1_replica_n1] o.a.s.s.SolrIndexSearcher Opening [Searcher@4d96eb8d[control_collection_shard1_replica_n1] main]
   [junit4]   2> 2390491 INFO  (qtp457242413-26519) [n:127.0.0.1:44137_ c:control_collection s:shard1  x:control_collection_shard1_replica_n1] o.a.s.r.ManagedResourceStorage Configured ZooKeeperStorageIO with znodeBase: /configs/conf1
   [junit4]   2> 2390491 INFO  (qtp457242413-26519) [n:127.0.0.1:44137_ c:control_collection s:shard1  x:control_collection_shard1_replica_n1] o.a.s.r.ManagedResourceStorage Loaded null at path _rest_managed.json using ZooKeeperStorageIO:path=/configs/conf1
   [junit4]   2> 2390491 INFO  (qtp457242413-26519) [n:127.0.0.1:44137_ c:control_collection s:shard1  x:control_collection_shard1_replica_n1] o.a.s.h.ReplicationHandler Commits will be reserved for 10000ms.
   [junit4]   2> 2390491 INFO  (qtp457242413-26519) [n:127.0.0.1:44137_ c:control_collection s:shard1  x:control_collection_shard1_replica_n1] o.a.s.u.UpdateLog Could not find max version in index or recent updates, using new clock 1611914875508883456
   [junit4]   2> 2390492 INFO  (searcherExecutor-9352-thread-1-processing-n:127.0.0.1:44137_ x:control_collection_shard1_replica_n1 c:control_collection s:shard1) [n:127.0.0.1:44137_ c:control_collection s:shard1  x:control_collection_shard1_replica_n1] o.a.s.c.SolrCore [control_collection_shard1_replica_n1] Registered new searcher Searcher@4d96eb8d[control_collection_shard1_replica_n1] main{ExitableDirectoryReader(UninvertingDirectoryReader())}
   [junit4]   2> 2390494 INFO  (qtp457242413-26519) [n:127.0.0.1:44137_ c:control_collection s:shard1  x:control_collection_shard1_replica_n1] o.a.s.c.ZkShardTerms Successful update of terms at /collections/control_collection/terms/shard1 to Terms{values={core_node2=0}, version=0}
   [junit4]   2> 2390495 INFO  (qtp457242413-26519) [n:127.0.0.1:44137_ c:control_collection s:shard1  x:control_collection_shard1_replica_n1] o.a.s.c.ShardLeaderElectionContext Enough replicas found to continue.
   [junit4]   2> 2390495 INFO  (qtp457242413-26519) [n:127.0.0.1:44137_ c:control_collection s:shard1  x:control_collection_shard1_replica_n1] o.a.s.c.ShardLeaderElectionContext I may be the new leader - try and sync
   [junit4]   2> 2390495 INFO  (qtp457242413-26519) [n:127.0.0.1:44137_ c:control_collection s:shard1  x:control_collection_shard1_replica_n1] o.a.s.c.SyncStrategy Sync replicas to http://127.0.0.1:44137/control_collection_shard1_replica_n1/
   [junit4]   2> 2390495 INFO  (qtp457242413-26519) [n:127.0.0.1:44137_ c:control_collection s:shard1  x:control_collection_shard1_replica_n1] o.a.s.c.SyncStrategy Sync Success - now sync replicas to me
   [junit4]   2> 2390495 INFO  (qtp457242413-26519) [n:127.0.0.1:44137_ c:control_collection s:shard1  x:control_collection_shard1_replica_n1] o.a.s.c.SyncStrategy http://127.0.0.1:44137/control_collection_shard1_replica_n1/ has no replicas
   [junit4]   2> 2390495 INFO  (qtp457242413-26519) [n:127.0.0.1:44137_ c:control_collection s:shard1  x:control_collection_shard1_replica_n1] o.a.s.c.ShardLeaderElectionContext Found all replicas participating in election, clear LIR
   [junit4]   2> 2390497 INFO  (qtp457242413-26519) [n:127.0.0.1:44137_ c:control_collection s:shard1  x:control_collection_shard1_replica_n1] o.a.s.c.ShardLeaderElectionContext I am the new leader: http://127.0.0.1:44137/control_collection_shard1_replica_n1/ shard1
   [junit4]   2> 2390598 INFO  (qtp457242413-26519) [n:127.0.0.1:44137_ c:control_collection s:shard1  x:control_collection_shard1_replica_n1] o.a.s.c.ZkController I am the leader, no recovery necessary
   [junit4]   2> 2390624 INFO  (qtp457242413-26519) [n:127.0.0.1:44137_ c:control_collection s:shard1  x:control_collection_shard1_replica_n1] o.a.s.s.HttpSolrCall [admin] webapp=null path=/admin/cores params={qt=/admin/cores&collection.configName=conf1&newCollection=true&name=control_collection_shard1_replica_n1&action=CREATE&numShards=1&collection=control_collection&shard=shard1&wt=javabin&version=2&replicaType=NRT} status=0 QTime=1226
   [junit4]   2> 2390627 INFO  (qtp457242413-26524) [n:127.0.0.1:44137_    ] o.a.s.h.a.CollectionsHandler Wait for new collection to be active for at most 30 seconds. Check all shard replicas
   [junit4]   2> 2390700 INFO  (zkCallback-8018-thread-1) [    ] o.a.s.c.c.ZkStateReader A cluster state change: [WatchedEvent state:SyncConnected type:NodeDataChanged path:/collections/control_collection/state.json] for collection [control_collection] has occurred - updating... (live nodes size: [1])
   [junit4]   2> 2391295 INFO  (OverseerCollectionConfigSetProcessor-72243551984877572-127.0.0.1:44137_-n_0000000000) [n:127.0.0.1:44137_    ] o.a.s.c.OverseerTaskQueue Response ZK path: /overseer/collection-queue-work/qnr-0000000000 doesn't exist.  Requestor may have disconnected from ZooKeeper
   [junit4]   2> 2391627 INFO  (qtp457242413-26524) [n:127.0.0.1:44137_    ] o.a.s.s.HttpSolrCall [admin] webapp=null path=/admin/collections params={collection.configName=conf1&name=control_collection&nrtReplicas=1&action=CREATE&numShards=1&createNodeSet=127.0.0.1:44137_&wt=javabin&version=2} status=0 QTime=2334
   [junit4]   2> 2391630 INFO  (zkConnectionManagerCallback-8037-thread-1) [    ] o.a.s.c.c.ConnectionManager zkClient has connected
   [junit4]   2> 2391631 INFO  (TEST-SSLMigrationTest.test-seed#[493FAE3B5C9B0227]) [    ] o.a.s.c.c.ZkStateReader Updated live nodes from ZooKeeper... (0) -> (1)
   [junit4]   2> 2391631 INFO  (TEST-SSLMigrationTest.test-seed#[493FAE3B5C9B0227]) [    ] o.a.s.c.s.i.ZkClientClusterStateProvider Cluster at 127.0.0.1:35065/solr ready
   [junit4]   2> 2391631 INFO  (TEST-SSLMigrationTest.test-seed#[493FAE3B5C9B0227]) [    ] o.a.s.c.ChaosMonkey monkey: init - expire sessions:false cause connection loss:false
   [junit4]   2> 2391632 INFO  (qtp457242413-26520) [n:127.0.0.1:44137_    ] o.a.s.h.a.CollectionsHandler Invoked Collection Action :create with params collection.configName=conf1&name=collection1&nrtReplicas=1&action=CREATE&numShards=2&createNodeSet=&stateFormat=1&wt=javabin&version=2 and sendToOCPQueue=true
   [junit4]   2> 2391633 INFO  (OverseerThreadFactory-9347-thread-2-processing-n:127.0.0.1:44137_) [n:127.0.0.1:44137_    ] o.a.s.c.a.c.CreateCollectionCmd Create collection collection1
   [junit4]   2> 2391835 WARN  (OverseerThreadFactory-9347-thread-2-processing-n:127.0.0.1:44137_) [n:127.0.0.1:44137_    ] o.a.s.c.a.c.CreateCollectionCmd It is unusual to create a collection (collection1) without cores.
   [junit4]   2> 2391836 INFO  (qtp457242413-26520) [n:127.0.0.1:44137_    ] o.a.s.h.a.CollectionsHandler Wait for new collection to be active for at most 30 seconds. Check all shard replicas
   [junit4]   2> 2391836 INFO  (qtp457242413-26520) [n:127.0.0.1:44137_    ] o.a.s.s.HttpSolrCall [admin] webapp=null path=/admin/collections params={collection.configName=conf1&name=collection1&nrtReplicas=1&action=CREATE&numShards=2&createNodeSet=&stateFormat=1&wt=javabin&version=2} status=0 QTime=204
   [junit4]   2> 2391899 INFO  (TEST-SSLMigrationTest.test-seed#[493FAE3B5C9B0227]) [    ] o.a.s.c.AbstractFullDistribZkTestBase create jetty 1 in directory /home/jenkins/workspace/Lucene-Solr-BadApples-master-Linux/solr/build/solr-core/test/J0/temp/solr.cloud.SSLMigrationTest_493FAE3B5C9B0227-001/shard-1-001 of type NRT
   [junit4]   2> 2391899 INFO  (TEST-SSLMigrationTest.test-seed#[493FAE3B5C9B0227]) [    ] o.e.j.s.Server jetty-9.4.11.v20180605; built: 2018-06-05T18:24:03.829Z; git: d5fc0523cfa96bfebfbda19606cad384d772f04c; jvm 10.0.1+10
   [junit4]   2> 2391900 INFO  (TEST-SSLMigrationTest.test-seed#[493FAE3B5C9B0227]) [    ] o.e.j.s.session DefaultSessionIdManager workerName=node0
   [junit4]   2> 2391900 INFO  (TEST-SSLMigrationTest.test-seed#[493FAE3B5C9B0227]) [    ] o.e.j.s.session No SessionScavenger set, using defaults
   [junit4]   2> 2391900 INFO  (TEST-SSLMigrationTest.test-seed#[493FAE3B5C9B0227]) [    ] o.e.j.s.session node0 Scavenging every 600000ms
   [junit4]   2> 2391900 INFO  (TEST-SSLMigrationTest.test-seed#[493FAE3B5C9B0227]) [    ] o.e.j.s.h.ContextHandler Started o.e.j.s.ServletContextHandler@651c62d2{/,null,AVAILABLE}
   [junit4]   2> 2391900 INFO  (TEST-SSLMigrationTest.test-seed#[493FAE3B5C9B0227]) [    ] o.e.j.s.AbstractConnector Started ServerConnector@61ad4676{HTTP/1.1,[http/1.1]}{127.0.0.1:45025}
   [junit4]   2> 2391901 INFO  (TEST-SSLMigrationTest.test-seed#[493FAE3B5C9B0227]) [    ] o.e.j.s.Server Started @2391925ms
   [junit4]   2> 2391901 INFO  (TEST-SSLMigrationTest.test-seed#[493FAE3B5C9B0227]) [    ] o.a.s.c.s.e.JettySolrRunner Jetty properties: {hostContext=/, solrconfig=solrconfig.xml, solr.data.dir=/home/jenkins/workspace/Lucene-Solr-BadApples-master-Linux/solr/build/solr-core/test/J0/temp/solr.cloud.SSLMigrationTest_493FAE3B5C9B0227-001/tempDir-001/jetty1, hostPort=45025, coreRootDirectory=/home/jenkins/workspace/Lucene-Solr-BadApples-master-Linux/solr/build/solr-core/test/J0/temp/solr.cloud.SSLMigrationTest_493FAE3B5C9B0227-001/shard-1-001/cores}
   [junit4]   2> 2391901 ERROR (TEST-SSLMigrationTest.test-seed#[493FAE3B5C9B0227]) [    ] o.a.s.u.StartupLoggingUtils Missing Java Option solr.log.dir. Logging may be missing or incomplete.
   [junit4]   2> 2391901 INFO  (TEST-SSLMigrationTest.test-seed#[493FAE3B5C9B0227]) [    ] o.a.s.s.SolrDispatchFilter Using logger factory org.apache.logging.slf4j.Log4jLoggerFactory
   [junit4]   2> 2391901 INFO  (TEST-SSLMigrationTest.test-seed#[493FAE3B5C9B0227]) [    ] o.a.s.s.SolrDispatchFilter  ___      _       Welcome to Apache Solr? version 8.0.0
   [junit4]   2> 2391901 INFO  (TEST-SSLMigrationTest.test-seed#[493FAE3B5C9B0227]) [    ] o.a.s.s.SolrDispatchFilter / __| ___| |_ _   Starting in cloud mode on port null
   [junit4]   2> 2391901 INFO  (TEST-SSLMigrationTest.test-seed#[493FAE3B5C9B0227]) [    ] o.a.s.s.SolrDispatchFilter \__ \/ _ \ | '_|  Install dir: null
   [junit4]   2> 2391901 INFO  (TEST-SSLMigrationTest.test-seed#[493FAE3B5C9B0227]) [    ] o.a.s.s.SolrDispatchFilter |___/\___/_|_|    Start time: 2018-09-18T03:36:58.416457Z
   [junit4]   2> 2391902 INFO  (zkConnectionManagerCallback-8039-thread-1) [    ] o.a.s.c.c.ConnectionManager zkClient has connected
   [junit4]   2> 2391903 INFO  (TEST-SSLMigrationTest.test-seed#[493FAE3B5C9B0227]) [    ] o.a.s.s.SolrDispatchFilter Loading solr.xml from SolrHome (not found in ZooKeeper)
   [junit4]   2> 2391903 INFO  (TEST-SSLMigrationTest.test-seed#[493FAE3B5C9B0227]) [    ] o.a.s.c.SolrXmlConfig Loading container configuration from /home/jenkins/workspace/Lucene-Solr-BadApples-master-Linux/solr/build/solr-core/test/J0/temp/solr.cloud.SSLMigrationTest_493FAE3B5C9B0227-001/shard-1-001/solr.xml
   [junit4]   2> 2391904 INFO  (TEST-SSLMigrationTest.test-seed#[493FAE3B5C9B0227]) [    ] o.a.s.c.SolrXmlConfig Configuration parameter autoReplicaFailoverWorkLoopDelay is ignored
   [junit4]   2> 2391904 INFO  (TEST-SSLMigrationTest.test-seed#[493FAE3B5C9B0227]) [    ] o.a.s.c.SolrXmlConfig Configuration parameter autoReplicaFailoverBadNodeExpiration is ignored
   [junit4]   2> 2391904 INFO  (TEST-SSLMigrationTest.test-seed#[493FAE3B5C9B0227]) [    ] o.a.s.c.SolrXmlConfig MBean server found: com.sun.jmx.mbeanserver.JmxMBeanServer@562b7cc1, but no JMX reporters were configured - adding default JMX reporter.
   [junit4]   2> 2391976 INFO  (TEST-SSLMigrationTest.test-seed#[493FAE3B5C9B0227]) [    ] o.a.s.c.ZkContainer Zookeeper client=127.0.0.1:35065/solr
   [junit4]   2> 2391977 INFO  (zkConnectionManagerCallback-8043-thread-1) [    ] o.a.s.c.c.ConnectionManager zkClient has connected
   [junit4]   2> 2391979 INFO  (zkConnectionManagerCallback-8045-thread-1) [    ] o.a.s.c.c.ConnectionManager zkClient has connected
   [junit4]   2> 2391981 INFO  (TEST-SSLMigrationTest.test-seed#[493FAE3B5C9B0227]) [    ] o.a.s.c.c.ZkStateReader Updated live nodes from ZooKeeper... (0) -> (1)
   [junit4]   2> 2391982 INFO  (TEST-SSLMigrationTest.test-seed#[493FAE3B5C9B0227]) [    ] o.a.s.c.TransientSolrCoreCacheDefault Allocating transient cache for 4 transient cores
   [junit4]   2> 2391982 INFO  (TEST-SSLMigrationTest.test-seed#[493FAE3B5C9B0227]) [    ] o.a.s.c.ZkController Register node as live in ZooKeeper:/live_nodes/127.0.0.1:45025_
   [junit4]   2> 2391983 INFO  (zkCallback-8018-thread-2) [    ] o.a.s.c.c.ZkStateReader Updated live nodes from ZooKeeper... (1) -> (2)
   [junit4]   2> 2391983 INFO  (zkCallback-8025-thread-1) [    ] o.a.s.c.c.ZkStateReader Updated live nodes from ZooKeeper... (1) -> (2)
   [junit4]   2> 2391983 INFO  (zkCallback-8036-thread-1) [    ] o.a.s.c.c.ZkStateReader Updated live nodes from ZooKeeper... (1) -> (2)
   [junit4]   2> 2391983 INFO  (zkCallback-8044-thread-1) [    ] o.a.s.c.c.ZkStateReader Updated live nodes from ZooKeeper... (1) -> (2)
   [junit4]   2> 2391991 INFO  (zkConnectionManagerCallback-8052-thread-1) [    ] o.a.s.c.c.ConnectionManager zkClient has connected
   [junit4]   2> 2391992 INFO  (TEST-SSLMigrationTest.test-seed#[493FAE3B5C9B0227]) [    ] o.a.s.c.c.ZkStateReader Updated live nodes from ZooKeeper... (0) -> (2)
   [junit4]   2> 2391992 INFO  (TEST-SSLMigrationTest.test-seed#[493FAE3B5C9B0227]) [    ] o.a.s.c.s.i.ZkClientClusterStateProvider Cluster at 127.0.0.1:35065/solr ready
   [junit4]   2> 2391992 INFO  (TEST-SSLMigrationTest.test-seed#[493FAE3B5C9B0227]) [    ] o.a.s.h.a.MetricsHistoryHandler No .system collection, keeping metrics history in memory.
   [junit4]   2> 2392002 INFO  (TEST-SSLMigrationTest.test-seed#[493FAE3B5C9B0227]) [    ] o.a.s.m.r.SolrJmxReporter JMX monitoring for 'solr.node' (registry 'solr.node') enabled at server: com.sun.jmx.mbeanserver.JmxMBeanServer@562b7cc1
   [junit4]   2> 2392009 INFO  (TEST-SSLMigrationTest.test-seed#[493FAE3B5C9B0227]) [    ] o.a.s.m.r.SolrJmxReporter JMX monitoring for 'solr.jvm' (registry 'solr.jvm') enabled at server: com.sun.jmx.mbeanserver.JmxMBeanServer@562b7cc1
   [junit4]   2> 2392009 INFO  (TEST-SSLMigrationTest.test-seed#[493FAE3B5C9B0227]) [    ] o.a.s.m.r.SolrJmxReporter JMX monitoring for 'solr.jetty' (registry 'solr.jetty') enabled at server: com.sun.jmx.mbeanserver.JmxMBeanServer@562b7cc1
   [junit4]   2> 2392010 INFO  (TEST-SSLMigrationTest.test-seed#[493FAE3B5C9B0227]) [    ] o.a.s.c.CorePropertiesLocator Found 0 core definitions underneath /home/jenkins/workspace/Lucene-Solr-BadApples-master-Linux/solr/build/solr-core/test/J0/temp/solr.cloud.SSLMigrationTest_493FAE3B5C9B0227-001/shard-1-001/cores
   [junit4]   2> 2392024 INFO  (qtp457242413-26522) [n:127.0.0.1:44137_    ] o.a.s.h.a.CollectionsHandler Invoked Collection Action :addreplica with params node=127.0.0.1:45025_&action=ADDREPLICA&collection=collection1&shard=shard2&type=NRT&wt=javabin&version=2 and sendToOCPQueue=true
   [junit4]   2> 2392026 INFO  (OverseerCollectionConfigSetProcessor-72243551984877572-127.0.0.1:44137_-n_0000000000) [n:127.0.0.1:44137_    ] o.a.s.c.OverseerTaskQueue Response ZK path: /overseer/collection-queue-work/qnr-0000000002 doesn't exist.  Requestor may have disconnected from ZooKeeper
   [junit4]   2> 2392026 INFO  (OverseerThreadFactory-9347-thread-3-processing-n:127.0.0.1:44137_) [n:127.0.0.1:44137_ c:collection1 s:shard2  ] o.a.s.c.a.c.AddReplicaCmd Node Identified 127.0.0.1:45025_ for creating new replica of shard shard2
   [junit4]   2> 2392028 INFO  (qtp427299976-26581) [n:127.0.0.1:45025_    x:collection1_shard2_replica_n41] o.a.s.h.a.CoreAdminOperation core create command qt=/admin/cores&collection.configName=conf1&name=collection1_shard2_replica_n41&action=CREATE&collection=collection1&shard=shard2&wt=javabin&version=2&replicaType=NRT
   [junit4]   2> 2393035 INFO  (qtp427299976-26581) [n:127.0.0.1:45025_ c:collection1 s:shard2  x:collection1_shard2_replica_n41] o.a.s.c.SolrConfig Using Lucene MatchVersion: 8.0.0
   [junit4]   2> 2393041 INFO  (qtp427299976-26581) [n:127.0.0.1:45025_ c:collection1 s:shard2  x:collection1_shard2_replica_n41] o.a.s.s.IndexSchema [collection1_shard2_replica_n41] Schema name=test
   [junit4]   2> 2393087 INFO  (qtp427299976-26581) [n:127.0.0.1:45025_ c:collection1 s:shard2  x:collection1_shard2_replica_n41] o.a.s.s.IndexSchema Loaded schema test/1.0 with uniqueid field id
   [junit4]   2> 2393094 INFO  (qtp427299976-26581) [n:127.0.0.1:45025_ c:collection1 s:shard2  x:collection1_shard2_replica_n41] o.a.s.c.CoreContainer Creating SolrCore 'collection1_shard2_replica_n41' using configuration from collection collection1, trusted=true
   [junit4]   2> 2393095 INFO  (qtp427299976-26581) [n:127.0.0.1:45025_ c:collection1 s:shard2  x:collection1_shard2_replica_n41] o.a.s.m.r.SolrJmxReporter JMX monitoring for 'solr.core.collection1.shard2.replica_n41' (registry 'solr.core.collection1.shard2.replica_n41') enabled at server: com.sun.jmx.mbeanserver.JmxMBeanServer@562b7cc1
   [junit4]   2> 2393095 INFO  (qtp427299976-26581) [n:127.0.0.1:45025_ c:collection1 s:shard2  x:collection1_shard2_replica_n41] o.a.s.c.SolrCore [[collection1_shard2_replica_n41] ] Opening new SolrCore at [/home/jenkins/workspace/Lucene-Solr-BadApples-master-Linux/solr/build/solr-core/test/J0/temp/solr.cloud.SSLMigrationTest_493FAE3B5C9B0227-001/shard-1-001/cores/collection1_shard2_replica_n41], dataDir=[/home/jenkins/workspace/Lucene-Solr-BadApples-master-Linux/solr/build/solr-core/test/J0/temp/solr.cloud.SSLMigrationTest_493FAE3B5C9B0227-001/shard-1-001/cores/collection1_shard2_replica_n41/data/]
   [junit4]   2> 2393096 INFO  (qtp427299976-26581) [n:127.0.0.1:45025_ c:collection1 s:shard2  x:collection1_shard2_replica_n41] o.a.s.u.RandomMergePolicy RandomMergePolicy wrapping class org.apache.lucene.index.TieredMergePolicy: [TieredMergePolicy: maxMergeAtOnce=24, maxMergeAtOnceExplicit=18, maxMergedSegmentMB=47.2646484375, floorSegmentMB=1.443359375, forceMergeDeletesPctAllowed=18.599446894855937, segmentsPerTier=45.0, maxCFSSegmentSizeMB=8.796093022207999E12, noCFSRatio=0.38529411145844294, deletesPctAllowed=44.6850998251747
   [junit4]   2> 2393097 WARN  (qtp427299976-26581) [n:127.0.0.1:45025_ c:collection1 s:shard2  x:collection1_shard2_replica_n41] o.a.s.c.RequestHandlers INVALID paramSet a in requestHandler {type = requestHandler,name = /dump,class = DumpRequestHandler,attributes = {initParams=a, name=/dump, class=DumpRequestHandler},args = {defaults={a=A,b=B}}}
   [junit4]   2> 2393120 INFO  (qtp427299976-26581) [n:127.0.0.1:45025_ c:collection1 s:shard2  x:collection1_shard2_replica_n41] o.a.s.u.UpdateHandler Using UpdateLog implementation: org.apache.solr.update.UpdateLog
   [junit4]   2> 2393120 INFO  (qtp427299976-26581) [n:127.0.0.1:45025_ c:collection1 s:shard2  x:collection1_shard2_replica_n41] o.a.s.u.UpdateLog Initializing UpdateLog: dataDir= defaultSyncLevel=FLUSH numRecordsToKeep=100 maxNumLogsToKeep=10 numVersionBuckets=65536
   [junit4]   2> 2393120 INFO  (qtp427299976-26581) [n:127.0.0.1:45025_ c:collection1 s:shard2  x:collection1_shard2_replica_n41] o.a.s.u.CommitTracker Hard AutoCommit: disabled
   [junit4]   2> 2393121 INFO  (qtp427299976-26581) [n:127.0.0.1:45025_ c:collection1 s:shard2  x:collection1_shard2_replica_n41] o.a.s.u.CommitTracker Soft AutoCommit: disabled
   [junit4]   2> 2393121 INFO  (qtp427299976-26581) [n:127.0.0.1:45025_ c:collection1 s:shard2  x:collection1_shard2_replica_n41] o.a.s.u.RandomMergePolicy RandomMergePolicy wrapping class org.apache.lucene.index.LogByteSizeMergePolicy: [LogByteSizeMergePolicy: minMergeSize=1677721, mergeFactor=46, maxMergeSize=2147483648, maxMergeSizeForForcedMerge=9223372036854775807, calibrateSizeByDeletes=false, maxMergeDocs=2147483647, maxCFSSegmentSizeMB=8.796093022207999E12, noCFSRatio=0.822330233832736]
   [junit4]   2> 2393121 INFO  (qtp427299976-26581) [n:127.0.0.1:45025_ c:collection1 s:shard2  x:collection1_shard2_replica_n41] o.a.s.s.SolrIndexSearcher Opening [Searcher@186ab5d9[collection1_shard2_replica_n41] main]
   [junit4]   2> 2393122 INFO  (qtp427299976-26581) [n:127.0.0.1:45025_ c:collection1 s:shard2  x:collection1_shard2_replica_n41] o.a.s.r.ManagedResourceStorage Configured ZooKeeperStorageIO with znodeBase: /configs/conf1
   [junit4]   2> 2393123 INFO  (qtp427299976-26581) [n:127.0.0.1:45025_ c:collection1 s:shard2  x:collection1_shard2_replica_n41] o.a.s.r.ManagedResourceStorage Loaded null at path _rest_managed.json using ZooKeeperStorageIO:path=/configs/conf1
   [junit4]   2> 2393123 INFO  (qtp427299976-26581) [n:127.0.0.1:45025_ c:collection1 s:shard2  x:collection1_shard2_replica_n41] o.a.s.h.ReplicationHandler Commits will be reserved for 10000ms.
   [junit4]   2> 2393123 INFO  (qtp427299976-26581) [n:127.0.0.1:45025_ c:collection1 s:shard2  x:collection1_shard2_replica_n41] o.a.s.u.UpdateLog Could not find max version in index or recent updates, using new clock 1611914878268735488
   [junit4]   2> 2393124 INFO  (searcherExecutor-9366-thread-1-processing-n:127.0.0.1:45025_ x:collection1_shard2_replica_n41 c:collection1 s:shard2) [n:127.0.0.1:45025_ c:collection1 s:shard2  x:collection1_shard2_replica_n41] o.a.s.c.SolrCore [collection1_shard2_replica_n41] Registered new searcher Searcher@186ab5d9[collection1_shard2_replica_n41] main{ExitableDirectoryReader(UninvertingDirectoryReader())}
   [junit4]   2> 2393126 INFO  (qtp427299976-26581) [n:127.0.0.1:45025_ c:collection1 s:shard2  x:collection1_shard2_replica_n41] o.a.s.c.ZkShardTerms Successful update of terms at /collections/collection1/terms/shard2 to Terms{values={core_node42=0}, version=0}
   [junit4]   2> 2393127 INFO  (qtp427299976-26581) [n:127.0.0.1:45025_ c:collection1 s:shard2  x:collection1_shard2_replica_n41] o.a.s.c.ShardLeaderElectionContext Enough replicas found to continue.
   [junit4]   2> 2393127 INFO  (qtp427299976-26581) [n:127.0.0.1:45025_ c:collection1 s:shard2  x:collection1_shard2_replica_n41] o.a.s.c.ShardLeaderElectionContext I may be the new leader - try and sync
   [junit4]   2> 2393127 INFO  (qtp427299976-26581) [n:127.0.0.1:45025_ c:collection1 s:shard2  x:collection1_shard2_replica_n41] o.a.s.c.SyncStrategy Sync replicas to http://127.0.0.1:45025/collection1_shard2_replica_n41/
   [junit4]   2> 2393127 INFO  (qtp427299976-26581) [n:127.0.0.1:45025_ c:collection1 s:shard2  x:collection1_shard2_replica_n41] o.a.s.c.SyncStrategy Sync Success - now sync replicas to me
   [junit4]   2> 2393127 INFO  (qtp427299976-26581) [n:127.0.0.1:45025_ c:collection1 s:shard2  x:collection1_shard2_replica_n41] o.a.s.c.SyncStrategy http://127.0.0.1:45025/collection1_shard2_replica_n41/ has no replicas
   [junit4]   2> 2393127 INFO  (qtp427299976-26581) [n:127.0.0.1:45025_ c:collection1 s:shard2  x:collection1_shard2_replica_n41] o.a.s.c.ShardLeaderElectionContext Found all replicas participating in election, clear LIR
   [junit4]   2> 2393128 INFO  (qtp427299976-26581) [n:127.0.0.1:45025_ c:collection1 s:shard2  x:collection1_shard2_replica_n41] o.a.s.c.ShardLeaderElectionContext I am the new leader: http://127.0.0.1:45025/collection1_shard2_replica_n41/ shard2
   [junit4]   2> 2393279 INFO  (qtp427299976-26581) [n:127.0.0.1:45025_ c:collection1 s:shard2  x:collection1_shard2_replica_n41] o.a.s.c.ZkController I am the leader, no recovery necessary
   [junit4]   2> 2393281 INFO  (qtp427299976-26581) [n:127.0.0.1:45025_ c:collection1 s:shard2  x:collection1_shard2_replica_n41] o.a.s.s.HttpSolrCall [admin] webapp=null path=/admin/cores params={qt=/admin/cores&collection.configName=conf1&name=collection1_shard2_replica_n41&action=CREATE&collection=collection1&shard=shard2&wt=javabin&version=2&replicaType=NRT} status=0 QTime=1253
   [junit4]   2> 2393282 INFO  (qtp457242413-26522) [n:127.0.0.1:44137_ c:collection1   ] o.a.s.s.HttpSolrCall [admin] webapp=null path=/admin/collections params={node=127.0.0.1:45025_&action=ADDREPLICA&collection=collection1&shard=shard2&type=NRT&wt=javabin&version=2} status=0 QTime=1258
   [junit4]   2> 2393340 INFO  (TEST-SSLMigrationTest.test-seed#[493FAE3B5C9B0227]) [    ] o.a.s.c.AbstractFullDistribZkTestBase create jetty 2 in directory /home/jenkins/workspace/Lucene-Solr-BadApples-master-Linux/solr/build/solr-core/test/J0/temp/solr.cloud.SSLMigrationTest_493FAE3B5C9B0227-001/shard-2-001 of type NRT
   [junit4]   2> 2393340 INFO  (TEST-SSLMigrationTest.test-seed#[493FAE3B5C9B0227]) [    ] o.e.j.s.Server jetty-9.4.11.v20180605; built: 2018-06-05T18:24:03.829Z; git: d5fc0523cfa96bfebfbda19606cad384d772f04c; jvm 10.0.1+10
   [junit4]   2> 2393341 INFO  (TEST-SSLMigrationTest.test-seed#[493FAE3B5C9B0227]) [    ] o.e.j.s.session DefaultSessionIdManager workerName=node0
   [junit4]   2> 2393341 INFO  (TEST-SSLMigrationTest.test-seed#[493FAE3B5C9B0227]) [    ] o.e.j.s.session No SessionScavenger set, using defaults
   [junit4]   2> 2393341 INFO  (TEST-SSLMigrationTest.test-seed#[493FAE3B5C9B0227]) [    ] o.e.j.s.session node0 Scavenging every 660000ms
   [junit4]   2> 2393341 INFO  (TEST-SSLMigrationTest.test-seed#[493FAE3B5C9B0227]) [    ] o.e.j.s.h.ContextHandler Started o.e.j.s.ServletContextHandler@4d4df01d{/,null,AVAILABLE}
   [junit4]   2> 2393342 INFO  (TEST-SSLMigrationTest.test-seed#[493FAE3B5C9B0227]) [    ] o.e.j.s.AbstractConnector Started ServerConnector@7c3fe187{HTTP/1.1,[http/1.1]}{127.0.0.1:35467}
   [junit4]   2> 2393342 INFO  (TEST-SSLMigrationTest.test-seed#[493FAE3B5C9B0227]) [    ] o.e.j.s.Server Started @2393366ms
   [junit4]   2> 2393342 INFO  (TEST-SSLMigrationTest.test-seed#[493FAE3B5C9B0227]) [    ] o.a.s.c.s.e.JettySolrRunner Jetty properties: {hostContext=/, solrconfig=solrconfig.xml, solr.data.dir=/home/jenkins/workspace/Lucene-Solr-BadApples-master-Linux/solr/build/solr-core/test/J0/temp/solr.cloud.SSLMigrationTest_493FAE3B5C9B0227-001/tempDir-001/jetty2, hostPort=35467, coreRootDirectory=/home/jenkins/workspace/Lucene-Solr-BadApples-master-Linux/solr/build/solr-core/test/J0/temp/solr.cloud.SSLMigrationTest_493FAE3B5C9B0227-001/shard-2-001/cores, replicaType=NRT}
   [junit4]   2> 2393342 ERROR (TEST-SSLMigrationTest.test-seed#[493FAE3B5C9B0227]) [    ] o.a.s.u.StartupLoggingUtils Missing Java Option solr.log.dir. Logging may be missing or incomplete.
   [junit4]   2> 2393342 INFO  (TEST-SSLMigrationTest.test-seed#[493FAE3B5C9B0227]) [    ] o.a.s.s.SolrDispatchFilter Using logger factory org.apache.logging.slf4j.Log4jLoggerFactory
   [junit4]   2> 2393342 INFO  (TEST-SSLMigrationTest.test-seed#[493FAE3B5C9B0227]) [    ] o.a.s.s.SolrDispatchFilter  ___      _       Welcome to Apache Solr? version 8.0.0
   [junit4]   2> 2393342 INFO  (TEST-SSLMigrationTest.test-seed#[493FAE3B5C9B0227]) [    ] o.a.s.s.SolrDispatchFilter / __| ___| |_ _   Starting in cloud mode on port null
   [junit4]   2> 2393342 INFO  (TEST-SSLMigrationTest.test-seed#[493FAE3B5C9B0227]) [    ] o.a.s.s.SolrDispatchFilter \__ \/ _ \ | '_|  Install dir: null
   [junit4]   2> 2393342 INFO  (TEST-SSLMigrationTest.test-seed#[493FAE3B5C9B0227]) [    ] o.a.s.s.SolrDispatchFilter |___/\___/_|_|    Start time: 2018-09-18T03:36:59.857604Z
   [junit4]   2> 2393343 INFO  (zkConnectionManagerCallback-8055-thread-1) [    ] o.a.s.c.c.ConnectionManager zkClient has connected
   [junit4]   2> 2393344 INFO  (TEST-SSLMigrationTest.test-seed#[493FAE3B5C9B0227]) [    ] o.a.s.s.SolrDispatchFilter Loading solr.xml from SolrHome (not found in ZooKeeper)
   [junit4]   2> 2393344 INFO  (TEST-SSLMigrationTest.test-seed#[493FAE3B5C9B0227]) [    ] o.a.s.c.SolrXmlConfig Loading container configuration from /home/jenkins/workspace/Lucene-Solr-BadApples-master-Linux/solr/build/solr-core/test/J0/temp/solr.cloud.SSLMigrationTest_493FAE3B5C9B0227-001/shard-2-001/solr.xml
   [junit4]   2> 2393345 INFO  (TEST-SSLMigrationTest.test-seed#[493FAE3B5C9B0227]) [    ] o.a.s.c.SolrXmlConfig Configuration parameter autoReplicaFailoverWorkLoopDelay is ignored
   [junit4]   2> 2393345 INFO  (TEST-SSLMigrationTest.test-seed#[493FAE3B5C9B0227]) [    ] o.a.s.c.SolrXmlConfig Configuration parameter autoReplicaFailoverBadNodeExpiration is ignored
   [junit4]   2> 2393346 INFO  (TEST-SSLMigrationTest.test-seed#[493FAE3B5C9B0227]) [    ] o.a.s.c.SolrXmlConfig MBean server found: com.sun.jmx.mbeanserver.JmxMBeanServer@562b7cc1, but no JMX reporters were configured - adding default JMX reporter.
   [junit4]   2> 2393469 INFO  (TEST-SSLMigrationTest.test-seed#[493FAE3B5C9B0227]) [    ] o.a.s.c.ZkContainer Zookeeper client=127.0.0.1:35065/solr
   [junit4]   2> 2393471 INFO  (zkConnectionManagerCallback-8059-thread-1) [    ] o.a.s.c.c.ConnectionManager zkClient has connected
   [junit4]   2> 2393472 INFO  (zkConnectionManagerCallback-8061-thread-1) [    ] o.a.s.c.c.ConnectionManager zkClient has connected
   [junit4]   2> 2393476 INFO  (TEST-SSLMigrationTest.test-seed#[493FAE3B5C9B0227]) [    ] o.a.s.c.c.ZkStateReader Updated live nodes from ZooKeeper... (0) -> (2)
   [junit4]   2> 2393477 INFO  (TEST-SSLMigrationTest.test-seed#[493FAE3B5C9B0227]) [    ] o.a.s.c.TransientSolrCoreCacheDefault Allocating transient cache for 4 transient cores
   [junit4]   2> 2393477 INFO  (TEST-SSLMigrationTest.test-seed#[493FAE3B5C9B0227]) [    ] o.a.s.c.ZkController Register node as live in ZooKeeper:/live_nodes/127.0.0.1:35467_
   [junit4]   2> 2393478 INFO  (zkCallback-8036-thread-1) [    ] o.a.s.c.c.ZkStateReader Updated live nodes from ZooKeeper... (2) -> (3)
   [junit4]   2> 2393478 INFO  (zkCallback-8044-thread-1) [    ] o.a.s.c.c.ZkStateReader Updated live nodes from ZooKeeper... (2) -> (3)
   [junit4]   2> 2393478 INFO  (zkCallback-8025-thread-1) [    ] o.a.s.c.c.ZkStateReader Updated live nodes from ZooKeeper... (2) -> (3)
   [junit4]   2> 2393478 INFO  (zkCallback-8051-thread-1) [    ] o.a.s.c.c.ZkStateReader Updated live nodes from ZooKeeper... (2) -> (3)
   [junit4]   2> 2393478 INFO  (zkCallback-8018-thread-1) [    ] o.a.s.c.c.ZkStateReader Updated live nodes from ZooKeeper... (2) -> (3)
   [junit4]   2> 2393478 INFO  (zkCallback-8060-thread-1) [    ] o.a.s.c.c.ZkStateReader Updated live nodes from ZooKeeper... (2) -> (3)
   [junit4]   2> 2393486 INFO  (zkConnectionManagerCallback-8068-thread-1) [    ] o.a.s.c.c.ConnectionManager zkClient has connected
   [junit4]   2> 2393487 INFO  (TEST-SSLMigrationTest.test-seed#[493FAE3B5C9B0227]) [    ] o.a.s.c.c.ZkStateReader Updated live nodes from ZooKeeper... (0) -> (3)
   [junit4]   2> 2393487 INFO  (TEST-SSLMigrationTest.test-seed#[493FAE3B5C9B0227]) [    ] o.a.s.c.s.i.ZkClientClusterStateProvider Cluster at 127.0.0.1:35065/solr ready
   [junit4]   2> 2393487 INFO  (TEST-SSLMigrationTest.test-seed#[493FAE3B5C9B0227]) [    ] o.a.s.h.a.MetricsHistoryHandler No .system collection, keeping metrics history in memory.
   [junit4]   2> 2393497 INFO  (TEST-SSLMigrationTest.test-seed#[493FAE3B5C9B0227]) [    ] o.a.s.m.r.SolrJmxReporter JMX monitoring for 'solr.node' (registry 'solr.node') enabled at server: com.sun.jmx.mbeanserver.JmxMBeanServer@562b7cc1
   [junit4]   2> 2393504 INFO  (TEST-SSLMigrationTest.test-seed#[493FAE3B5C9B0227]) [    ] o.a.s.m.r.SolrJmxReporter JMX monitoring for 'solr.jvm' (registry 'solr.jvm') enabled at server: com.sun.jmx.mbeanserver.JmxMBeanServer@562b7cc1
   [junit4]   2> 2393504 INFO  (TEST-SSLMigrationTest.test-seed#[493FAE3B5C9B0227]) [    ] o.a.s.m.r.SolrJmxReporter JMX monitoring for 'solr.jetty' (registry 'solr.jetty') enabled at server: com.sun.jmx.mbeanserver.JmxMBeanServer@562b7cc1
   [junit4]   2> 2393505 INFO  (TEST-SSLMigrationTest.test-seed#[493FAE3B5C9B0227]) [    ] o.a.s.c.CorePropertiesLocator Found 0 core definitions underneath /home/jenkins/workspace/Lucene-Solr-BadApples-master-Linux/solr/build/solr-core/test/J0/temp/solr.cloud.SSLMigrationTest_493FAE3B5C9B0227-001/shard-2-001/cores
   [junit4]   2> 2393526 INFO  (qtp969672432-26619) [n:127.0.0.1:35467_    ] o.a.s.h.a.CollectionsHandler Invoked Collection Action :addreplica with params node=127.0.0.1:35467_&action=ADDREPLICA&collection=collection1&shard=shard1&type=NRT&wt=javabin&version=2 and sendToOCPQueue=true
   [junit4]   2> 2393527 INFO  (OverseerCollectionConfigSetProcessor-72243551984877572-127.0.0.1:44137_-n_0000000000) [n:127.0.0.1:44137_    ] o.a.s.c.OverseerTaskQueue Response ZK path: /overseer/collection-queue-work/qnr-0000000004 doesn't exist.  Requestor may have disconnected from ZooKeeper
   [junit4]   2> 2393527 INFO  (OverseerThreadFactory-9347-thread-4-processing-n:127.0.0.1:44137_) [n:127.0.0.1:44137_ c:collection1 s:shard1  ] o.a.s.c.a.c.AddReplicaCmd Node Identified 127.0.0.1:35467_ for creating new replica of shard shard1
   [junit4]   2> 2393528 INFO  (qtp969672432-26614) [n:127.0.0.1:35467_    x:collection1_shard1_replica_n43] o.a.s.h.a.CoreAdminOperation core create command qt=/admin/cores&collection.configName=conf1&name=collection1_shard1_replica_n43&action=CREATE&collection=collection1&shard=shard1&wt=javabin&version=2&replicaType=NRT
   [junit4]   2> 2394535 INFO  (qtp969672432-26614) [n:127.0.0.1:35467_ c:collection1 s:shard1  x:collection1_shard1_replica_n43] o.a.s.c.SolrConfig Using Lucene MatchVersion: 8.0.0
   [junit4]   2> 2394545 INFO  (qtp969672432-26614) [n:127.0.0.1:35467_ c:collection1 s:shard1  x:collection1_shard1_replica_n43] o.a.s.s.IndexSchema [collection1_shard1_replica_n43] Schema name=test
   [junit4]   2> 2394585 INFO  (qtp969672432-26614) [n:127.0.0.1:35467_ c:collection1 s:shard1  x:collection1_shard1_replica_n43] o.a.s.s.IndexSchema Loaded schema test/1.0 with uniqueid field id
   [junit4]   2> 2394594 INFO  (qtp969672432-26614) [n:127.0.0.1:35467_ c:collection1 s:shard1  x:collection1_shard1_replica_n43] o.a.s.c.CoreContainer Creating SolrCore 'collection1_shard1_replica_n43' using configuration from collection collection1, trusted=true
   [junit4]   2> 2394594 INFO  (qtp969672432-26614) [n:127.0.0.1:35467_ c:collection1 s:shard1  x:collection1_shard1_replica_n43] o.a.s.m.r.SolrJmxReporter JMX monitoring for 'solr.core.collection1.shard1.replica_n43' (registry 'solr.core.collection1.shard1.replica_n43') enabled at server: com.sun.jmx.mbeanserver.JmxMBeanServer@562b7cc1
   [junit4]   2> 2394594 INFO  (qtp969672432-26614) [n:127.0.0.1:35467_ c:collection1 s:shard1  x:collection1_shard1_replica_n43] o.a.s.c.SolrCore [[collection1_shard1_replica_n43] ] Opening new SolrCore at [/home/jenkins/workspace/Lucene-Solr-BadApples-master-Linux/solr/build/solr-core/test/J0/temp/solr.cloud.SSLMigrationTest_493FAE3B5C9B0227-001/shard-2-001/cores/collection1_shard1_replica_n43], dataDir=[/home/jenkins/workspace/Lucene-Solr-BadApples-master-Linux/solr/build/solr-core/test/J0/temp/solr.cloud.SSLMigrationTest_493FAE3B5C9B0227-001/shard-2-001/cores/collection1_shard1_replica_n43/data/]
   [junit4]   2> 2394596 INFO  (qtp969672432-26614) [n:127.0.0.1:35467_ c:collection1 s:shard1  x:collection1_shard1_replica_n43] o.a.s.u.RandomMergePolicy RandomMergePolicy wrapping class org.apache.lucene.index.TieredMergePolicy: [TieredMergePolicy: maxMergeAtOnce=24, maxMergeAtOnceExplicit=18, maxMergedSegmentMB=47.2646484375, floorSegmentMB=1.443359375, forceMergeDeletesPctAllowed=18.599446894855937, segmentsPerTier=45.0, maxCFSSegmentSizeMB=8.796093022207999E12, noCFSRatio=0.38529411145844294, deletesPctAllowed=44.6850998251747
   [junit4]   2> 2394596 WARN  (qtp969672432-26614) [n:127.0.0.1:35467_ c:collection1 s:shard1  x:collection1_shard1_replica_n43] o.a.s.c.RequestHandlers INVALID paramSet a in requestHandler {type = requestHandler,name = /dump,class = DumpRequestHandler,attributes = {initParams=a, name=/dump, class=DumpRequestHandler},args = {defaults={a=A,b=B}}}
   [junit4]   2> 2394619 INFO  (qtp969672432-26614) [n:127.0.0.1:35467_ c:collection1 s:shard1  x:collection1_shard1_replica_n43] o.a.s.u.UpdateHandler Using UpdateLog implementation: org.apache.solr.update.UpdateLog
   [junit4]   2> 2394619 INFO  (qtp969672432-26614) [n:127.0.0.1:35467_ c:collection1 s:shard1  x:collection1_shard1_replica_n43] o.a.s.u.UpdateLog Initializing UpdateLog: dataDir= defaultSyncLevel=FLUSH numRecordsToKeep=100 maxNumLogsToKeep=10 numVersionBuckets=65536
   [junit4]   2> 2394620 INFO  (qtp969672432-26614) [n:127.0.0.1:35467_ c:collection1 s:shard1  x:collection1_shard1_replica_n43] o.a.s.u.CommitTracker Hard AutoCommit: disabled
   [junit4]   2> 2394620 INFO  (qtp969672432-26614) [n:127.0.0.1:35467_ c:collection1 s:shard1  x:collection1_shard1_replica_n43] o.a.s.u.CommitTracker Soft AutoCommit: disabled
   [junit4]   2> 2394620 INFO  (qtp969672432-26614) [n:127.0.0.1:35467_ c:collection1 s:shard1  x:collection1_shard1_replica_n43] o.a.s.u.RandomMergePolicy RandomMergePolicy wrapping class org.apache.lucene.index.LogByteSizeMergePolicy: [LogByteSizeMergePolicy: minMergeSize=1677721, mergeFactor=46, maxMergeSize=2147483648, maxMergeSizeForForcedMerge=9223372036854775807, calibrateSizeByDeletes=false, maxMergeDocs=2147483647, maxCFSSegmentSizeMB=8.796093022207999E12, noCFSRatio=0.822330233832736]
   [junit4]   2> 2394621 INFO  (qtp969672432-26614) [n:127.0.0.1:35467_ c:collection1 s:shard1  x:collection1_shard1_replica_n43] o.a.s.s.SolrIndexSearcher Opening [Searcher@40131727[collection1_shard1_replica_n43] main]
   [junit4]   2> 2394622 INFO  (qtp969672432-26614) [n:127.0.0.1:35467_ c:collection1 s:shard1  x:collection1_shard1_replica_n43] o.a.s.r.ManagedResourceStorage Configured ZooKeeperStorageIO with znodeBase: /configs/conf1
   [junit4]   2> 2394622 INFO  (qtp969672432-26614) [n:127.0.0.1:35467_ c:collection1 s:shard1  x:collection1_shard1_replica_n43] o.a.s.r.ManagedResourceStorage Loaded null at path _rest_managed.json using ZooKeeperStorageIO:path=/configs/conf1
   [junit4]   2> 2394622 INFO  (qtp969672432-26614) [n:127.0.0.1:35467_ c:collection1 s:shard1  x:collection1_shard1_replica_n43] o.a.s.h.ReplicationHandler Commits will be reserved for 10000ms.
   [junit4]   2> 2394622 INFO  (qtp969672432-26614) [n:127.0.0.1:35467_ c:collection1 s:shard1  x:collection1_shard1_replica_n43] o.a.s.u.UpdateLog Could not find max version in index or recent updates, using new clock 1611914879840550912
   [junit4]   2> 2394623 INFO  (searcherExecutor-9380-thread-1-processing-n:127.0.0.1:35467_ x:collection1_shard1_replica_n43 c:collection1 s:shard1) [n:127.0.0.1:35467_ c:collection1 s:shard1  x:collection1_shard1_replica_n43] o.a.s.c.SolrCore [collection1_shard1_replica_n43] Registered new searcher Searcher@40131727[collection1_shard1_replica_n43] main{ExitableDirectoryReader(UninvertingDirectoryReader())}
   [junit4]   2> 2394625 INFO  (qtp969672432-26614) [n:127.0.0.1:35467_ c:collection1 s:shard1  x:collection1_shard1_replica_n43] o.a.s.c.ZkShardTerms Successful update of terms at /collections/collection1/terms/shard1 to Terms{values={core_node44=0}, version=0}
   [junit4]   2> 2394626 INFO  (qtp969672432-26614) [n:127.0.0.1:35467_ c:collection1 s:shard1  x:collection1_shard1_replica_n43] o.a.s.c.ShardLeaderElectionContext Enough replicas found to continue.
   [junit4]   2> 2394626 INFO  (qtp969672432-26614) [n:127.0.0.1:35467_ c:collection1 s:shard1  x:collection1_shard1_replica_n43] o.a.s.c.ShardLeaderElectionContext I may be the new leader - try and sync
   [junit4]   2> 2394626 INFO  (qtp969672432-26614) [n:127.0.0.1:35467_ c:collection1 s:shard1  x:collection1_shard1_replica_n43] o.a.s.c.SyncStrategy Sync replicas to http://127.0.0.1:35467/collection1_shard1_replica_n43/
   [junit4]   2> 2394626 INFO  (qtp969672432-26614) [n:127.0.0.1:35467_ c:collection1 s:shard1  x:collection1_shard1_replica_n43] o.a.s.c.SyncStrategy Sync Success - now sync replicas to me
   [junit4]   2> 2394626 INFO  (qtp969672432-26614) [n:127.0.0.1:35467_ c:collection1 s:shard1  x:collection1_shard1_replica_n43] o.a.s.c.SyncStrategy http://127.0.0.1:35467/collection1_shard1_replica_n43/ has no replicas
   [junit4]   2> 2394626 INFO  (qtp969672432-26614) [n:127.0.0.1:35467_ c:collection1 s:shard1  x:collection1_shard1_replica_n43] o.a.s.c.ShardLeaderElectionContext Found all replicas participating in election, clear LIR
   [junit4]   2> 2394627 INFO  (qtp969672432-26614) [n:127.0.0.1:35467_ c:collection1 s:shard1  x:collection1_shard1_replica_n43] o.a.s.c.ShardLeaderElectionContext I am the new leader: http://127.0.0.1:35467/collection1_shard1_replica_n43/ shard1
   [junit4]   2> 2394778 INFO  (qtp969672432-26614) [n:127.0.0.1:35467_ c:collection1 s:shard1  x:collection1_shard1_replica_n43] o.a.s.c.ZkController I am the leader, no recovery necessary
   [junit4]   2> 2394780 INFO  (qtp969672432-26614) [n:127.0.0.1:35467_ c:collection1 s:shard1  x:collection1_shard1_replica_n43] o.a.s.s.HttpSolrCall [admin] webapp=null path=/admin/cores params={qt=/admin/cores&collection.configName=conf1&name=collection1_shard1_replica_n43&action=CREATE&collection=collection1&shard=shard1&wt=javabin&version=2&replicaType=NRT} status=0 QTime=1252
   [junit4]   2> 2394782 INFO  (qtp969672432-26619) [n:127.0.0.1:35467_ c:collection1   ] o.a.s.s.HttpSolrCall [admin] webapp=null path=/admin/collections params={node=127.0.0.1:35467_&action=ADDREPLICA&collection=collection1&shard=shard1&type=NRT&wt=javabin&version=2} status=0 QTime=1256
   [junit4]   2> 2394841 INFO  (TEST-SSLMigrationTest.test-seed#[493FAE3B5C9B0227]) [    ] o.a.s.c.AbstractFullDistribZkTestBase create jetty 3 in directory /home/jenkins/workspace/Lucene-Solr-BadApples-master-Linux/solr/build/solr-core/test/J0/temp/solr.cloud.SSLMigrationTest_493FAE3B5C9B0227-001/shard-3-001 of type NRT
   [junit4]   2> 2394841 INFO  (TEST-SSLMigrationTest.test-seed#[493FAE3B5C9B0227]) [    ] o.e.j.s.Server jetty-9.4.11.v20180605; built: 2018-06-05T18:24:03.829Z; git: d5fc0523cfa96bfebfbda19606cad384d772f04c; jvm 10.0.1+10
   [junit4]   2> 2394842 INFO  (TEST-SSLMigrationTest.test-seed#[493FAE3B5C9B0227]) [    ] o.e.j.s.session DefaultSessionIdManager workerName=node0
   [junit4]   2> 2394842 INFO  (TEST-SSLMigrationTest.test-seed#[493FAE3B5C9B0227]) [    ] o.e.j.s.session No SessionScavenger set, using defaults
   [junit4]   2> 2394842 INFO  (TEST-SSLMigrationTest.test-seed#[493FAE3B5C9B0227]) [    ] o.e.j.s.session node0 Scavenging every 600000ms
   [junit4]   2> 2394842 INFO  (TEST-SSLMigrationTest.test-seed#[493FAE3B5C9B0227]) [    ] o.e.j.s.h.ContextHandler Started o.e.j.s.ServletContextHandler@7951ff05{/,null,AVAILABLE}
   [junit4]   2> 2394843 INFO  (TEST-SSLMigrationTest.test-seed#[493FAE3B5C9B0227]) [    ] o.e.j.s.AbstractConnector Started ServerConnector@7fa3ed3{HTTP/1.1,[http/1.1]}{127.0.0.1:38323}
   [junit4]   2> 2394843 INFO  (TEST-SSLMigrationTest.test-seed#[493FAE3B5C9B0227]) [    ] o.e.j.s.Server Started @2394867ms
   [junit4]   2> 2394843 INFO  (TEST-SSLMigrationTest.test-seed#[493FAE3B5C9B0227]) [    ] o.a.s.c.s.e.JettySolrRunner Jetty properties: {hostContext=/, solrconfig=solrconfig.xml, solr.data.dir=/home/jenkins/workspace/Lucene-Solr-BadApples-master-Linux/solr/build/solr-core/test/J0/temp/solr.cloud.SSLMigrationTest_493FAE3B5C9B0227-001/tempDir-001/jetty3, hostPort=38323, coreRootDirectory=/home/jenkins/workspace/Lucene-Solr-BadApples-master-Linux/solr/build/solr-core/test/J0/temp/solr.cloud.SSLMigrationTest_493FAE3B5C9B0227-001/shard-3-001/cores}
   [junit4]   2> 2394843 ERROR (TEST-SSLMigrationTest.test-seed#[493FAE3B5C9B0227]) [    ] o.a.s.u.StartupLoggingUtils Missing Java Option solr.log.dir. Logging may be missing or incomplete.
   [junit4]   2> 2394843 INFO  (TEST-SSLMigrationTest.test-seed#[493FAE3B5C9B0227]) [    ] o.a.s.s.SolrDispatchFilter Using logger factory org.apache.logging.slf4j.Log4jLoggerFactory
   [junit4]   2> 2394843 INFO  (TEST-SSLMigrationTest.test-seed#[493FAE3B5C9B0227]) [    ] o.a.s.s.SolrDispatchFilter  ___      _       Welcome to Apache Solr? version 8.0.0
   [junit4]   2> 2394843 INFO  (TEST-SSLMigrationTest.test-seed#[493FAE3B5C9B0227]) [    ] o.a.s.s.SolrDispatchFilter / __| ___| |_ _   Starting in cloud mode on port null
   [junit4]   2> 2394843 INFO  (TEST-SSLMigrationTest.test-seed#[493FAE3B5C9B0227]) [    ] o.a.s.s.SolrDispatchFilter \__ \/ _ \ | '_|  Install dir: null
   [junit4]   2> 2394843 INFO  (TEST-SSLMigrationTest.test-seed#[493FAE3B5C9B0227]) [    ] o.a.s.s.SolrDispatchFilter |___/\___/_|_|    Start time: 2018-09-18T03:37:01.358509Z
   [junit4]   2> 2394844 INFO  (zkConnectionManagerCallback-8071-thread-1) [    ] o.a.s.c.c.ConnectionManager zkClient has connected
   [junit4]   2> 2394845 INFO  (TEST-SSLMigrationTest.test-seed#[493FAE3B5C9B0227]) [    ] o.a.s.s.SolrDispatchFilter Loading solr.xml from SolrHome (not found in ZooKeeper)
   [junit4]   2> 2394845 INFO  (TEST-SSLMigrationTest.test-seed#[493FAE3B5C9B0227]) [    ] o.a.s.c.SolrXmlConfig Loading container configuration from /home/jenkins/workspace/Lucene-Solr-BadApples-master-Linux/solr/build/solr-core/test/J0/temp/solr.cloud.SSLMigrationTest_493FAE3B5C9B0227-001/shard-3-001/solr.xml
   [junit4]   2> 2394847 INFO  (TEST-SSLMigrationTest.test-seed#[493FAE3B5C9B0227]) [    ] o.a.s.c.SolrXmlConfig Configuration parameter autoReplicaFailoverWorkLoopDelay is ignored
   [junit4]   2> 2394847 INFO  (TEST-SSLMigrationTest.test-seed#[493FAE3B5C9B0227]) [    ] o.a.s.c.SolrXmlConfig Configuration parameter autoReplicaFailoverBadNodeExpiration is ignored
   [junit4]   2> 2394847 INFO  (TEST-SSLMigrationTest.test-seed#[493FAE3B5C9B0227]) [    ] o.a.s.c.SolrXmlConfig MBean server found: com.sun.jmx.mbeanserver.JmxMBeanServer@562b7cc1, but no JMX reporters were configured - adding default JMX reporter.
   [junit4]   2> 2394962 INFO  (TEST-SSLMigrationTest.test-seed#[493FAE3B5C9B0227]) [    ] o.a.s.c.ZkContainer Zookeeper client=127.0.0.1:35065/solr
   [junit4]   2> 2394962 INFO  (zkConnectionManagerCallback-8075-thread-1) [    ] o.a.s.c.c.ConnectionManager zkClient has connected
   [junit4]   2> 2394964 INFO  (zkConnectionManagerCallback-8077-thread-1) [    ] o.a.s.c.c.ConnectionManager zkClient has connected
   [junit4]   2> 2394967 INFO  (TEST-SSLMigrationTest.test-seed#[493FAE3B5C9B0227]) [    ] o.a.s.c.c.ZkStateReader Updated live nodes from ZooKeeper... (0) -> (3)
   [junit4]   2> 2394968 INFO  (TEST-SSLMigrationTest.test-seed#[493FAE3B5C9B0227]) [    ] o.a.s.c.TransientSolrCoreCacheDefault Allocating transient cache for 4 transient cores
   [junit4]   2> 2394968 INFO  (TEST-SSLMigrationTest.test-seed#[493FAE3B5C9B0227]) [    ] o.a.s.c.ZkController Register node as live in ZooKeeper:/live_nodes/127.0.0.1:38323_
   [junit4]   2> 2394969 INFO  (zkCallback-8025-thread-1) [    ] o.a.s.c.c.ZkStateReader Updated live nodes from ZooKeeper... (3) -> (4)
   [junit4]   2> 2394969 INFO  (zkCallback-8067-thread-1) [    ] o.a.s.c.c.ZkStateReader Updated live nodes from ZooKeeper... (3) -> (4)
   [junit4]   2> 2394969 INFO  (zkCallback-8044-thread-1) [    ] o.a.s.c.c.ZkStateReader Updated live nodes from ZooKeeper... (3) -> (4)
   [junit4]   2> 2394969 INFO  (zkCallback-8051-thread-1) [    ] o.a.s.c.c.ZkStateReader Updated live nodes from ZooKeeper... (3) -> (4)
   [junit4]   2> 2394969 INFO  (zkCallback-8060-thread-1) [    ] o.a.s.c.c.ZkStateReader Updated live nodes from ZooKeeper... (3) -> (4)
   [junit4]   2> 2394969 INFO  (zkCallback-8018-thread-1) [    ] o.a.s.c.c.ZkStateReader Updated live nodes from ZooKeeper... (3) -> (4)
   [junit4]   2> 2394969 INFO  (zkCallback-8036-thread-1) [    ] o.a.s.c.c.ZkStateReader Updated live nodes from ZooKeeper... (3) -> (4)
   [junit4]   2> 2394969 INFO  (zkCallback-8076-thread-1) [    ] o.a.s.c.c.ZkStateReader Updated live nodes from ZooKeeper... (3) -> (4)
   [junit4]   2> 2394977 INFO  (zkConnectionManagerCallback-8084-thread-1) [    ] o.a.s.c.c.ConnectionManager zkClient has connected
   [junit4]   2> 2394977 INFO  (TEST-SSLMigrationTest.test-seed#[493FAE3B5C9B0227]) [    ] o.a.s.c.c.ZkStateReader Updated live nodes from ZooKeeper... (0) -> (4)
   [junit4]   2> 2394977 INFO  (TEST-SSLMigrationTest.test-seed#[493FAE3B5C9B0227]) [    ] o.a.s.c.s.i.ZkClientClusterStateProvider Cluster at 127.0.0.1:35065/solr ready
   [junit4]   2> 2394978 INFO  (TEST-SSLMigrationTest.test-seed#[493FAE3B5C9B0227]) [    ] o.a.s.h.a.MetricsHistoryHandler No .system collection, keeping metrics history in memory.
   [junit4]   2> 2394987 INFO  (TEST-SSLMigrationTest.test-seed#[493FAE3B5C9B0227]) [    ] o.a.s.m.r.SolrJmxReporter JMX monitoring for 'solr.node' (registry 'solr.node') enabled at server: com.sun.jmx.mbeanserver.JmxMBeanServer@562b7cc1
   [junit4]   2> 2394994 INFO  (TEST-SSLMigrationTest.test-seed#[493FAE3B5C9B0227]) [    ] o.a.s.m.r.SolrJmxReporter JMX monitoring for 'solr.jvm' (registry 'solr.jvm') enabled at server: com.sun.jmx.mbeanserver.JmxMBeanServer@562b7cc1
   [junit4]   2> 2394994 INFO  (TEST-SSLMigrationTest.test-seed#[493FAE3B5C9B0227]) [    ] o.a.s.m.r.SolrJmxReporter JMX monitoring for 'solr.jetty' (registry 'solr.jetty') enabled at server: com.sun.jmx.mbeanserver.JmxMBeanServer@562b7cc1
   [junit4]   2> 2394995 INFO  (TEST-SSLMigrationTest.test-seed#[493FAE3B5C9B0227]) [    ] o.a.s.c.CorePropertiesLocator Found 0 core definitions underneath /home/jenkins/workspace/Lucene-Solr-BadApples-master-Linux/solr/build/solr-core/test/J0/temp/solr.cloud.SSLMigrationTest_493FAE3B5C9B0227-001/shard-3-001/cores
   [junit4]   2> 2395021 INFO  (qtp969672432-26613) [n:127.0.0.1:35467_    ] o.a.s.h.a.CollectionsHandler Invoked Collection Action :addreplica with params node=127.0.0.1:38323_&action=ADDREPLICA&collection=collection1&shard=shard2&type=NRT&wt=javabin&version=2 and sendToOCPQueue=true
   [junit4]   2> 2395023 INFO  (OverseerCollectionConfigSetProcessor-72243551984877572-127.0.0.1:44137_-n_0000000000) [n:127.0.0.1:44137_    ] o.a.s.c.OverseerTaskQueue Response ZK path: /overseer/collection-queue-work/qnr-0000000006 doesn't exist.  Requestor may have disconnected from ZooKeeper
   [junit4]   2> 2395023 INFO  (OverseerThreadFactory-9347-thread-5-processing-n:127.0.0.1:44137_) [n:127.0.0.1:44137_ c:collection1 s:shard2  ] o.a.s.c.a.c.AddReplicaCmd Node Identified 127.0.0.1:38323_ for creating new replica of shard shard2
   [junit4]   2> 2395025 INFO  (qtp517311213-26658) [n:127.0.0.1:38323_    x:collection1_shard2_replica_n45] o.a.s.h.a.CoreAdminOperation core create command qt=/admin/cores&collection.configName=conf1&name=collection1_shard2_replica_n45&action=CREATE&collection=collection1&shard=shard2&wt=javabin&version=2&replicaType=NRT
   [junit4]   2> 2396109 INFO  (qtp517311213-26658) [n:127.0.0.1:38323_ c:collection1 s:shard2  x:collection1_shard2_replica_n45] o.a.s.c.SolrConfig Using Lucene MatchVersion: 8.0.0
   [junit4]   2> 2396116 INFO  (qtp517311213-26658) [n:127.0.0.1:38323_ c:collection1 s:shard2  x:collection1_shard2_replica_n45] o.a.s.s.IndexSchema [collection1_shard2_replica_n45] Schema name=test
   [junit4]   2> 2396160 INFO  (qtp517311213-26658) [n:127.0.0.1:38323_ c:collection1 s:shard2  x:collection1_shard2_replica_n45] o.a.s.s.IndexSchema Loaded schema test/1.0 with uniqueid field id
   [junit4]   2> 2396167 INFO  (qtp517311213-26658) [n:127.0.0.1:38323_ c:collection1 s:shard2  x:collection1_shard2_replica_n45] o.a.s.c.CoreContainer Creating SolrCore 'collection1_shard2_replica_n45' using configuration from collection collection1, trusted=true
   [junit4]   2> 2396167 INFO  (qtp517311213-26658) [n:127.0.0.1:38323_ c:collection1 s:shard2  x:collection1_shard2_replica_n45] o.a.s.m.r.SolrJmxReporter JMX monitoring for 'solr.core.collection1.shard2.replica_n45' (registry 'solr.core.collection1.shard2.replica_n45') enabled at server: com.sun.jmx.mbeanserver.JmxMBeanServer@562b7cc1
   [junit4]   2> 2396167 INFO  (qtp517311213-26658) [n:127.0.0.1:38323_ c:collection1 s:shard2  x:collection1_shard2_replica_n45] o.a.s.c.SolrCore [[collection1_shard2_replica_n45] ] Opening new SolrCore at [/home/jenkins/workspace/Lucene-Solr-BadApples-master-Linux/solr/build/solr-core/test/J0/temp/solr.cloud.SSLMigrationTest_493FAE3B5C9B0227-001/shard-3-001/cores/collection1_shard2_replica_n45], dataDir=[/home/jenkins/workspace/Lucene-Solr-BadApples-master-Linux/solr/build/solr-core/test/J0/temp/solr.cloud.SSLMigrationTest_493FAE3B5C9B0227-001/shard-3-001/cores/collection1_shard2_replica_n45/data/]
   [junit4]   2> 2396168 INFO  (qtp517311213-26658) [n:127.0.0.1:38323_ c:collection1 s:shard2  x:collection1_shard2_replica_n45] o.a.s.u.RandomMergePolicy RandomMergePolicy wrapping class org.apache.lucene.index.TieredMergePolicy: [TieredMergePolicy: maxMergeAtOnce=24, maxMergeAtOnceExplicit=18, maxMergedSegmentMB=47.2646484375, floorSegmentMB=1.443359375, forceMergeDeletesPctAllowed=18.599446894855937, segmentsPerTier=45.0, maxCFSSegmentSizeMB=8.796093022207999E12, noCFSRatio=0.38529411145844294, deletesPctAllowed=44.6850998251747
   [junit4]   2> 2396169 WARN  (qtp517311213-26658) [n:127.0.0.1:38323_ c:collection1 s:shard2  x:collection1_shard2_replica_n45] o.a.s.c.RequestHandlers INVALID paramSet a in requestHandler {type = requestHandler,name = /dump,class = DumpRequestHandler,attributes = {initParams=a, name=/dump, class=DumpRequestHandler},args = {defaults={a=A,b=B}}}
   [junit4]   2> 2396191 INFO  (qtp517311213-26658) [n:127.0.0.1:38323_ c:collection1 s:shard2  x:collection1_shard2_replica_n45] o.a.s.u.UpdateHandler Using UpdateLog implementation: org.apache.solr.update.UpdateLog
   [junit4]   2> 2396191 INFO  (qtp517311213-26658) [n:127.0.0.1:38323_ c:collection1 s:shard2  x:collection1_shard2_replica_n45] o.a.s.u.UpdateLog Initializing UpdateLog: dataDir= defaultSyncLevel=FLUSH numRecordsToKeep=100 maxNumLogsToKeep=10 numVersionBuckets=65536
   [junit4]   2> 2396192 INFO  (qtp517311213-26658) [n:127.0.0.1:38323_ c:collection1 s:shard2  x:collection1_shard2_replica_n45] o.a.s.u.CommitTracker Hard AutoCommit: disabled
   [junit4]   2> 2396192 INFO  (qtp517311213-26658) [n:127.0.0.1:38323_ c:collection1 s:shard2  x:collection1_shard2_replica_n45] o.a.s.u.CommitTracker Soft AutoCommit: disabled
   [junit4]   2> 2396192 INFO  (qtp517311213-26658) [n:127.0.0.1:38323_ c:collection1 s:shard2  x:collection1_shard2_replica_n45] o.a.s.u.RandomMergePolicy RandomMergePolicy wrapping class org.apache.lucene.index.LogByteSizeMergePolicy: [LogByteSizeMergePolicy: minMergeSize=1677721, mergeFactor=46, maxMergeSize=2147483648, maxMergeSizeForForcedMerge=9223372036854775807, calibrateSizeByDeletes=false, maxMergeDocs=2147483647, maxCFSSegmentSizeMB=8.796093022207999E12, noCFSRatio=0.822330233832736]
   [junit4]   2> 2396192 INFO  (qtp517311213-26658) [n:127.0.0.1:38323_ c:collection1 s:shard2  x:collection1_shard2_replica_n45] o.a.s.s.SolrIndexSearcher Opening [Searcher@390746e8[collection1_shard2_replica_n45] main]
   [junit4]   2> 2396193 INFO  (qtp517311213-26658) [n:127.0.0.1:38323_ c:collection1 s:shard2  x:collection1_shard2_replica_n45] o.a.s.r.ManagedResourceStorage Configured ZooKeeperStorageIO with znodeBase: /configs/conf1
   [junit4]   2> 2396193 INFO  (qtp517311213-26658) [n:127.0.0.1:38323_ c:collection1 s:shard2  x:collection1_shard2_replica_n45] o.a.s.r.ManagedResourceStorage Loaded null at path _rest_managed.json using ZooKeeperStorageIO:path=/configs/conf1
   [junit4]   2> 2396193 INFO  (qtp517311213-26658) [n:127.0.0.1:38323_ c:collection1 s:shard2  x:collection1_shard2_replica_n45] o.a.s.h.ReplicationHandler Commits will be reserved for 10000ms.
   [junit4]   2> 2396193 INFO  (qtp517311213-26658) [n:127.0.0.1:38323_ c:collection1 s:shard2  x:collection1_shard2_replica_n45] o.a.s.u.UpdateLog Could not find max version in index or recent updates, using new clock 1611914881487863808
   [junit4]   2> 2396194 INFO  (searcherExecutor-9394-thread-1-processing-n:127.0.0.1:38323_ x:collection1_shard2_replica_n45 c:collection1 s:shard2) [n:127.0.0.1:38323_ c:collection1 s:shard2  x:collection1_shard2_replica_n45] o.a.s.c.SolrCore [collection1_shard2_replica_n45] Registered new searcher Searcher@390746e8[collection1_shard2_replica_n45] main{ExitableDirectoryReader(UninvertingDirectoryReader())}
   [junit4]   2> 2396196 INFO  (qtp517311213-26658) [n:127.0.0.1:38323_ c:collection1 s:shard2  x:collection1_shard2_replica_n45] o.a.s.c.ZkShardTerms Successful update of terms at /collections/collection1/terms/shard2 to Terms{values={core_node42=0, core_node46=0}, version=1}
   [junit4]   2> 2396196 INFO  (qtp517311213-26658) [n:127.0.0.1:38323_ c:collection1 s:shard2  x:collection1_shard2_replica_n45] o.a.s.c.ZkController Core needs to recover:collection1_shard2_replica_n45
   [junit4]   2> 2396196 INFO  (updateExecutor-8072-thread-1-processing-n:127.0.0.1:38323_ x:collection1_shard2_replica_n45 c:collection1 s:shard2) [n:127.0.0.1:38323_ c:collection1 s:shard2 r:core_node46 x:collection1_shard2_replica_n45] o.a.s.u.DefaultSolrCoreState Running recovery
   [junit4]   2> 2396197 INFO  (recoveryExecutor-8073-thread-1-processing-n:127.0.0.1:38323_ x:collection1_shard2_replica_n45 c:collection1 s:shard2 r:core_node46) [n:127.0.0.1:38323_ c:collection1 s:shard2 r:core_node46 x:collection1_shard2_replica_n45] o.a.s.c.RecoveryStrategy Starting recovery process. recoveringAfterStartup=true
   [junit4]   2> 2396197 ERROR (recoveryExecutor-8073-thread-1-processing-n:127.0.0.1:38323_ x:collection1_shard2_replica_n45 c:collection1 s:shard2 r:core_node46) [n:127.0.0.1:38323_ c:collection1 s:shard2 r:core_node46 x:collection1_shard2_replica_n45] o.a.s.c.RecoveryStrategy Error getting recent versions.:java.lang.IndexOutOfBoundsException: Index 0 out-of-bounds for length 0
   [junit4]   2> 	at java.base/jdk.internal.util.Preconditions.outOfBounds(Preconditions.java:64)
   [junit4]   2> 	at java.base/jdk.internal.util.Preconditions.outOfBoundsCheckIndex(Preconditions.java:70)
   [junit4]   2> 	at java.base/jdk.internal.util.Preconditions.checkIndex(Preconditions.java:248)
   [junit4]   2> 	at java.base/java.util.Objects.checkIndex(Objects.java:372)
   [junit4]   2> 	at java.base/java.util.ArrayList.get(ArrayList.java:440)
   [junit4]   2> 	at org.apache.solr.cloud.RecoveryStrategy.doSyncOrReplicateRecovery(RecoveryStrategy.java:491)
   [junit4]   2> 	at org.apache.solr.cloud.RecoveryStrategy.doRecovery(RecoveryStrategy.java:310)
   [junit4]   2> 	at org.apache.solr.cloud.RecoveryStrategy.run(RecoveryStrategy.java:294)
   [junit4]   2> 	at com.codahale.metrics.InstrumentedExecutorService$InstrumentedRunnable.run(InstrumentedExecutorService.java:176)
   [junit4]   2> 	at java.base/java.util.concurrent.Executors$RunnableAdapter.call(Executors.java:514)
   [junit4]   2> 	at java.base/java.util.concurrent.FutureTask.run(FutureTask.java:264)
   [junit4]   2> 	at org.apache.solr.common.util.ExecutorUtil$MDCAwareThreadPoolExecutor.lambda$execute$0(ExecutorUtil.java:209)
   [junit4]   2> 	at java.base/java.util.concurrent.ThreadPoolExecutor.runWorker(ThreadPoolExecutor.java:1135)
   [junit4]   2> 	at java.base/java.util.concurrent.ThreadPoolExecutor$Worker.run(ThreadPoolExecutor.java:635)
   [junit4]   2> 	at java.base/java.lang.Thread.run(Thread.java:844)
   [junit4]   2> 
   [junit4]   2> 2396197 INFO  (qtp517311213-26658) [n:127.0.0.1:38323_ c:collection1 s:shard2  x:collection1_shard2_replica_n45] o.a.s.s.HttpSolrCall [admin] webapp=null path=/admin/cores params={qt=/admin/cores&collection.configName=conf1&name=collection1_shard2_replica_n45&action=CREATE&collection=collection1&shard=shard2&wt=javabin&version=2&replicaType=NRT} status=0 QTime=1172
   [junit4]   2> 2396198 INFO  (qtp427299976-26576) [n:127.0.0.1:45025_ c:collection1 s:shard2 r:core_node42 x:collection1_shard2_replica_n41] o.a.s.c.S.Request [collection1_shard2_replica_n41]  webapp= path=/admin/ping params={wt=javabin&version=2} hits=0 status=0 QTime=0
   [junit4]   2> 2396198 INFO  (qtp427299976-26576) [n:127.0.0.1:45025_ c:collection1 s:shard2 r:core_node42 x:collection1_shard2_replica_n41] o.a.s.c.S.Request [collection1_shard2_replica_n41]  webapp= path=/admin/ping params={wt=javabin&version=2} status=0 QTime=0
   [junit4]   2> 2396198 INFO  (recoveryExecutor-8073-thread-1-processing-n:127.0.0.1:38323_ x:collection1_shard2_replica_n45 c:collection1 s:shard2 r:core_node46) [n:127.0.0.1:38323_ c:collection1 s:shard2 r:core_node46 x:collection1_shard2_replica_n45] o.a.s.c.RecoveryStrategy Begin buffering updates. core=[collection1_shard2_replica_n45]
   [junit4]   2> 2396198 INFO  (recoveryExecutor-8073-thread-1-processing-n:127.0.0.1:38323_ x:collection1_shard2_replica_n45 c:collection1 s:shard2 r:core_node46) [n:127.0.0.1:38323_ c:collection1 s:shard2 r:core_node46 x:collection1_shard2_replica_n45] o.a.s.u.UpdateLog Starting to buffer updates. FSUpdateLog{state=ACTIVE, tlog=null}
   [junit4]   2> 2396198 INFO  (recoveryExecutor-8073-thread-1-processing-n:127.0.0.1:38323_ x:collection1_shard2_replica_n45 c:collection1 s:shard2 r:core_node46) [n:127.0.0.1:38323_ c:collection1 s:shard2 r:core_node46 x:collection1_shard2_replica_n45] o.a.s.c.RecoveryStrategy Publishing state of core [collection1_shard2_replica_n45] as recovering, leader is [http://127.0.0.1:45025/collection1_shard2_replica_n41/] and I am [http://127.0.0.1:38323/collection1_shard2_replica_n45/]
   [junit4]   2> 2396198 INFO  (qtp969672432-26613) [n:127.0.0.1:35467_ c:collection1   ] o.a.s.s.HttpSolrCall [admin] webapp=null path=/admin/collections params={node=127.0.0.1:38323_&action=ADDREPLICA&collection=collection1&shard=shard2&type=NRT&wt=javabin&version=2} status=0 QTime=1177
   [junit4]   2> 2396199 INFO  (recoveryExecutor-8073-thread-1-processing-n:127.0.0.1:38323_ x:collection1_shard2_replica_n45 c:collection1 s:shard2 r:core_node46) [n:127.0.0.1:38323_ c:collection1 s:shard2 r:core_node46 x:collection1_shard2_replica_n45] o.a.s.c.ZkShardTerms Successful update of terms at /collections/collection1/terms/shard2 to Terms{values={core_node42=0, core_node46=0, core_node46_recovering=0}, version=2}
   [junit4]   2> 2396200 INFO  (recoveryExecutor-8073-thread-1-processing-n:127.0.0.1:38323_ x:collection1_shard2_replica_n45 c:collection1 s:shard2 r:core_node46) [n:127.0.0

[...truncated too long message...]

ion1.shard1.replica_n47 / com.codahale.metrics.MetricRegistry@4ad987ce
   [junit4]   2> 52889 INFO  (zkCallback-375-thread-1) [n:127.0.0.1:35145_ c:collection1 s:shard1 r:core_node48 x:collection1_shard1_replica_n47] o.a.s.m.SolrMetricManager Closing metric reporters for registry=solr.collection.collection1.shard1.leader, tag=79284aaf
   [junit4]   2> 53292 ERROR (coreZkRegister-349-thread-1-processing-n:127.0.0.1:35145_ x:collection1_shard1_replica_n47 c:collection1 s:shard1 r:core_node48) [n:127.0.0.1:35145_ c:collection1 s:shard1 r:core_node48 x:collection1_shard1_replica_n47] o.a.s.c.ZkController Error getting leader from zk
   [junit4]   2> org.apache.solr.common.SolrException: CoreContainer is closed
   [junit4]   2> 	at org.apache.solr.cloud.ZkController.getLeaderProps(ZkController.java:1342) ~[java/:?]
   [junit4]   2> 	at org.apache.solr.cloud.ZkController.getLeaderProps(ZkController.java:1309) ~[java/:?]
   [junit4]   2> 	at org.apache.solr.cloud.ZkController.getLeader(ZkController.java:1265) [java/:?]
   [junit4]   2> 	at org.apache.solr.cloud.ZkController.register(ZkController.java:1149) [java/:?]
   [junit4]   2> 	at org.apache.solr.cloud.ZkController.register(ZkController.java:1080) [java/:?]
   [junit4]   2> 	at org.apache.solr.core.ZkContainer.lambda$registerInZk$0(ZkContainer.java:187) [java/:?]
   [junit4]   2> 	at org.apache.solr.common.util.ExecutorUtil$MDCAwareThreadPoolExecutor.lambda$execute$0(ExecutorUtil.java:209) [java/:?]
   [junit4]   2> 	at java.util.concurrent.ThreadPoolExecutor.runWorker(ThreadPoolExecutor.java:1135) [?:?]
   [junit4]   2> 	at java.util.concurrent.ThreadPoolExecutor$Worker.run(ThreadPoolExecutor.java:635) [?:?]
   [junit4]   2> 	at java.lang.Thread.run(Thread.java:844) [?:?]
   [junit4]   2> 53293 ERROR (coreZkRegister-349-thread-1-processing-n:127.0.0.1:35145_ x:collection1_shard1_replica_n47 c:collection1 s:shard1 r:core_node48) [n:127.0.0.1:35145_ c:collection1 s:shard1 r:core_node48 x:collection1_shard1_replica_n47] o.a.s.c.ZkContainer :org.apache.solr.common.SolrException: Error getting leader from zk for shard shard1
   [junit4]   2> 	at org.apache.solr.cloud.ZkController.getLeader(ZkController.java:1298)
   [junit4]   2> 	at org.apache.solr.cloud.ZkController.register(ZkController.java:1149)
   [junit4]   2> 	at org.apache.solr.cloud.ZkController.register(ZkController.java:1080)
   [junit4]   2> 	at org.apache.solr.core.ZkContainer.lambda$registerInZk$0(ZkContainer.java:187)
   [junit4]   2> 	at org.apache.solr.common.util.ExecutorUtil$MDCAwareThreadPoolExecutor.lambda$execute$0(ExecutorUtil.java:209)
   [junit4]   2> 	at java.base/java.util.concurrent.ThreadPoolExecutor.runWorker(ThreadPoolExecutor.java:1135)
   [junit4]   2> 	at java.base/java.util.concurrent.ThreadPoolExecutor$Worker.run(ThreadPoolExecutor.java:635)
   [junit4]   2> 	at java.base/java.lang.Thread.run(Thread.java:844)
   [junit4]   2> Caused by: org.apache.solr.common.SolrException: CoreContainer is closed
   [junit4]   2> 	at org.apache.solr.cloud.ZkController.getLeaderProps(ZkController.java:1342)
   [junit4]   2> 	at org.apache.solr.cloud.ZkController.getLeaderProps(ZkController.java:1309)
   [junit4]   2> 	at org.apache.solr.cloud.ZkController.getLeader(ZkController.java:1265)
   [junit4]   2> 	... 7 more
   [junit4]   2> 
   [junit4]   2> 53294 INFO  (TEST-SSLMigrationTest.test-seed#[493FAE3B5C9B0227]) [    ] o.e.j.s.AbstractConnector Stopped ServerConnector@4934b555{SSL,[ssl, http/1.1]}{127.0.0.1:35145}
   [junit4]   2> 53294 INFO  (TEST-SSLMigrationTest.test-seed#[493FAE3B5C9B0227]) [    ] o.e.j.s.h.ContextHandler Stopped o.e.j.s.ServletContextHandler@12799820{/,null,UNAVAILABLE}
   [junit4]   2> 53294 INFO  (TEST-SSLMigrationTest.test-seed#[493FAE3B5C9B0227]) [    ] o.e.j.s.session node0 Stopped scavenging
   [junit4]   2> 53295 ERROR (TEST-SSLMigrationTest.test-seed#[493FAE3B5C9B0227]) [    ] o.a.z.s.ZooKeeperServer ZKShutdownHandler is not registered, so ZooKeeper server won't take any action on ERROR or SHUTDOWN server state changes
   [junit4]   2> 53295 INFO  (TEST-SSLMigrationTest.test-seed#[493FAE3B5C9B0227]) [    ] o.a.s.c.ZkTestServer connecting to 127.0.0.1:40839 40839
   [junit4]   2> 53400 INFO  (Thread-139) [    ] o.a.s.c.ZkTestServer connecting to 127.0.0.1:40839 40839
   [junit4]   2> 53401 WARN  (Thread-139) [    ] o.a.s.c.ZkTestServer Watch limit violations: 
   [junit4]   2> Maximum concurrent create/delete watches above limit:
   [junit4]   2> 
   [junit4]   2> 	20	/solr/aliases.json
   [junit4]   2> 	12	/solr/collections/collection1/state.json
   [junit4]   2> 	11	/solr/collections/collection1/terms/shard2
   [junit4]   2> 	9	/solr/security.json
   [junit4]   2> 	9	/solr/configs/conf1
   [junit4]   2> 	9	/solr/collections/collection1/terms/shard1
   [junit4]   2> 	2	/solr/collections/control_collection/terms/shard1
   [junit4]   2> 
   [junit4]   2> Maximum concurrent data watches above limit:
   [junit4]   2> 
   [junit4]   2> 	20	/solr/clusterprops.json
   [junit4]   2> 	20	/solr/clusterstate.json
   [junit4]   2> 	5	/solr/overseer_elect/election/72243676330590212-127.0.0.1:45643_-n_0000000000
   [junit4]   2> 	5	/solr/autoscaling.json
   [junit4]   2> 
   [junit4]   2> Maximum concurrent children watches above limit:
   [junit4]   2> 
   [junit4]   2> 	20	/solr/live_nodes
   [junit4]   2> 	20	/solr/collections
   [junit4]   2> 	5	/solr/overseer/queue
   [junit4]   2> 	5	/solr/autoscaling/events/.scheduled_maintenance
   [junit4]   2> 	5	/solr/autoscaling/events/.auto_add_replicas
   [junit4]   2> 	5	/solr/overseer/collection-queue-work
   [junit4]   2> 	5	/solr/overseer/queue-work
   [junit4]   2> 
   [junit4]   2> NOTE: reproduce with: ant test  -Dtestcase=SSLMigrationTest -Dtests.method=test -Dtests.seed=493FAE3B5C9B0227 -Dtests.multiplier=3 -Dtests.slow=true -Dtests.badapples=true -Dtests.locale=kam-KE -Dtests.timezone=Europe/Lisbon -Dtests.asserts=true -Dtests.file.encoding=US-ASCII
   [junit4] FAILURE 18.6s J2 | SSLMigrationTest.test <<<
   [junit4]    > Throwable #1: java.lang.AssertionError: Replica didn't have the proper urlScheme in the ClusterState
   [junit4]    > 	at __randomizedtesting.SeedInfo.seed([493FAE3B5C9B0227:C16B91E1F2676FDF]:0)
   [junit4]    > 	at org.apache.solr.cloud.SSLMigrationTest.assertReplicaInformation(SSLMigrationTest.java:104)
   [junit4]    > 	at org.apache.solr.cloud.SSLMigrationTest.testMigrateSSL(SSLMigrationTest.java:97)
   [junit4]    > 	at org.apache.solr.cloud.SSLMigrationTest.test(SSLMigrationTest.java:61)
   [junit4]    > 	at java.base/jdk.internal.reflect.NativeMethodAccessorImpl.invoke0(Native Method)
   [junit4]    > 	at java.base/jdk.internal.reflect.NativeMethodAccessorImpl.invoke(NativeMethodAccessorImpl.java:62)
   [junit4]    > 	at java.base/jdk.internal.reflect.DelegatingMethodAccessorImpl.invoke(DelegatingMethodAccessorImpl.java:43)
   [junit4]    > 	at java.base/java.lang.reflect.Method.invoke(Method.java:564)
   [junit4]    > 	at org.apache.solr.BaseDistributedSearchTestCase$ShardsRepeatRule$ShardsFixedStatement.callStatement(BaseDistributedSearchTestCase.java:1008)
   [junit4]    > 	at org.apache.solr.BaseDistributedSearchTestCase$ShardsRepeatRule$ShardsStatement.evaluate(BaseDistributedSearchTestCase.java:983)
   [junit4]    > 	at java.base/java.lang.Thread.run(Thread.java:844)
   [junit4]   2> NOTE: leaving temporary files on disk at: /home/jenkins/workspace/Lucene-Solr-BadApples-master-Linux/solr/build/solr-core/test/J2/temp/solr.cloud.SSLMigrationTest_493FAE3B5C9B0227-001
   [junit4]   2> NOTE: test params are: codec=Asserting(Lucene80), sim=Asserting(org.apache.lucene.search.similarities.AssertingSimilarity@1e894bbf), locale=kam-KE, timezone=Europe/Lisbon
   [junit4]   2> NOTE: Linux 4.15.0-32-generic amd64/Oracle Corporation 10.0.1 (64-bit)/cpus=8,threads=1,free=232074944,total=536870912
   [junit4]   2> NOTE: All tests run in this JVM: [SSLMigrationTest, SSLMigrationTest]
   [junit4] Completed [4/5 (1!)] on J2 in 18.66s, 1 test, 1 failure <<< FAILURES!

[...truncated 15 lines...]
BUILD FAILED
/home/jenkins/workspace/Lucene-Solr-BadApples-master-Linux/lucene/common-build.xml:1567: The following error occurred while executing this line:
/home/jenkins/workspace/Lucene-Solr-BadApples-master-Linux/lucene/common-build.xml:1092: There were test failures: 5 suites, 5 tests, 1 failure [seed: 493FAE3B5C9B0227]

Total time: 1 minute 8 seconds

[repro] Setting last failure code to 256

[repro] Failures:
[repro]   1/5 failed: org.apache.solr.cloud.SSLMigrationTest
[repro] Exiting with code 256
+ mv lucene/build lucene/build.repro
+ mv solr/build solr/build.repro
+ mv lucene/build.orig lucene/build
+ mv solr/build.orig solr/build
Archiving artifacts
Setting ANT_1_8_2_HOME=/var/lib/jenkins/tools/hudson.tasks.Ant_AntInstallation/ANT_1.8.2
[WARNINGS] Parsing warnings in console log with parser Java Compiler (javac)
Setting ANT_1_8_2_HOME=/var/lib/jenkins/tools/hudson.tasks.Ant_AntInstallation/ANT_1.8.2
Setting ANT_1_8_2_HOME=/var/lib/jenkins/tools/hudson.tasks.Ant_AntInstallation/ANT_1.8.2
<Git Blamer> Using GitBlamer to create author and commit information for all warnings.
<Git Blamer> GIT_COMMIT=7d0a7782fa7e99250bccfb4d3e995485c3f0ca19, workspace=/var/lib/jenkins/workspace/Lucene-Solr-BadApples-master-Linux
[WARNINGS] Computing warning deltas based on reference build #92
Recording test results
Setting ANT_1_8_2_HOME=/var/lib/jenkins/tools/hudson.tasks.Ant_AntInstallation/ANT_1.8.2
Build step 'Publish JUnit test result report' changed build result to UNSTABLE
Email was triggered for: Unstable (Test Failures)
Sending email for trigger: Unstable (Test Failures)
Setting ANT_1_8_2_HOME=/var/lib/jenkins/tools/hudson.tasks.Ant_AntInstallation/ANT_1.8.2
Setting ANT_1_8_2_HOME=/var/lib/jenkins/tools/hudson.tasks.Ant_AntInstallation/ANT_1.8.2
Setting ANT_1_8_2_HOME=/var/lib/jenkins/tools/hudson.tasks.Ant_AntInstallation/ANT_1.8.2
Setting ANT_1_8_2_HOME=/var/lib/jenkins/tools/hudson.tasks.Ant_AntInstallation/ANT_1.8.2

Mime
View raw message