lucene-dev mailing list archives

Site index · List index
Message view « Date » · « Thread »
Top « Date » · « Thread »
From Policeman Jenkins Server <jenk...@thetaphi.de>
Subject [JENKINS] Lucene-Solr-master-Linux (64bit/jdk-9.0.4) - Build # 22874 - Unstable!
Date Mon, 17 Sep 2018 18:01:10 GMT
Build: https://jenkins.thetaphi.de/job/Lucene-Solr-master-Linux/22874/
Java: 64bit/jdk-9.0.4 -XX:+UseCompressedOops -XX:+UseG1GC

1 tests failed.
FAILED:  org.apache.solr.cloud.autoscaling.ScheduledTriggerTest.testTrigger

Error Message:
expected:<3> but was:<2>

Stack Trace:
java.lang.AssertionError: expected:<3> but was:<2>
	at __randomizedtesting.SeedInfo.seed([4C2CF97D84714382:2FE7CFFF1DBE30AF]:0)
	at org.junit.Assert.fail(Assert.java:93)
	at org.junit.Assert.failNotEquals(Assert.java:647)
	at org.junit.Assert.assertEquals(Assert.java:128)
	at org.junit.Assert.assertEquals(Assert.java:472)
	at org.junit.Assert.assertEquals(Assert.java:456)
	at org.apache.solr.cloud.autoscaling.ScheduledTriggerTest.scheduledTriggerTest(ScheduledTriggerTest.java:113)
	at org.apache.solr.cloud.autoscaling.ScheduledTriggerTest.testTrigger(ScheduledTriggerTest.java:66)
	at java.base/jdk.internal.reflect.NativeMethodAccessorImpl.invoke0(Native Method)
	at java.base/jdk.internal.reflect.NativeMethodAccessorImpl.invoke(NativeMethodAccessorImpl.java:62)
	at java.base/jdk.internal.reflect.DelegatingMethodAccessorImpl.invoke(DelegatingMethodAccessorImpl.java:43)
	at java.base/java.lang.reflect.Method.invoke(Method.java:564)
	at com.carrotsearch.randomizedtesting.RandomizedRunner.invoke(RandomizedRunner.java:1742)
	at com.carrotsearch.randomizedtesting.RandomizedRunner$8.evaluate(RandomizedRunner.java:935)
	at com.carrotsearch.randomizedtesting.RandomizedRunner$9.evaluate(RandomizedRunner.java:971)
	at com.carrotsearch.randomizedtesting.RandomizedRunner$10.evaluate(RandomizedRunner.java:985)
	at com.carrotsearch.randomizedtesting.rules.SystemPropertiesRestoreRule$1.evaluate(SystemPropertiesRestoreRule.java:57)
	at org.apache.lucene.util.TestRuleSetupTeardownChained$1.evaluate(TestRuleSetupTeardownChained.java:49)
	at org.apache.lucene.util.AbstractBeforeAfterRule$1.evaluate(AbstractBeforeAfterRule.java:45)
	at org.apache.lucene.util.TestRuleThreadAndTestName$1.evaluate(TestRuleThreadAndTestName.java:48)
	at org.apache.lucene.util.TestRuleIgnoreAfterMaxFailures$1.evaluate(TestRuleIgnoreAfterMaxFailures.java:64)
	at org.apache.lucene.util.TestRuleMarkFailure$1.evaluate(TestRuleMarkFailure.java:47)
	at com.carrotsearch.randomizedtesting.rules.StatementAdapter.evaluate(StatementAdapter.java:36)
	at com.carrotsearch.randomizedtesting.ThreadLeakControl$StatementRunner.run(ThreadLeakControl.java:368)
	at com.carrotsearch.randomizedtesting.ThreadLeakControl.forkTimeoutingTask(ThreadLeakControl.java:817)
	at com.carrotsearch.randomizedtesting.ThreadLeakControl$3.evaluate(ThreadLeakControl.java:468)
	at com.carrotsearch.randomizedtesting.RandomizedRunner.runSingleTest(RandomizedRunner.java:944)
	at com.carrotsearch.randomizedtesting.RandomizedRunner$5.evaluate(RandomizedRunner.java:830)
	at com.carrotsearch.randomizedtesting.RandomizedRunner$6.evaluate(RandomizedRunner.java:880)
	at com.carrotsearch.randomizedtesting.RandomizedRunner$7.evaluate(RandomizedRunner.java:891)
	at com.carrotsearch.randomizedtesting.rules.StatementAdapter.evaluate(StatementAdapter.java:36)
	at com.carrotsearch.randomizedtesting.rules.SystemPropertiesRestoreRule$1.evaluate(SystemPropertiesRestoreRule.java:57)
	at org.apache.lucene.util.AbstractBeforeAfterRule$1.evaluate(AbstractBeforeAfterRule.java:45)
	at com.carrotsearch.randomizedtesting.rules.StatementAdapter.evaluate(StatementAdapter.java:36)
	at org.apache.lucene.util.TestRuleStoreClassName$1.evaluate(TestRuleStoreClassName.java:41)
	at com.carrotsearch.randomizedtesting.rules.NoShadowingOrOverridesOnMethodsRule$1.evaluate(NoShadowingOrOverridesOnMethodsRule.java:40)
	at com.carrotsearch.randomizedtesting.rules.NoShadowingOrOverridesOnMethodsRule$1.evaluate(NoShadowingOrOverridesOnMethodsRule.java:40)
	at com.carrotsearch.randomizedtesting.rules.StatementAdapter.evaluate(StatementAdapter.java:36)
	at com.carrotsearch.randomizedtesting.rules.StatementAdapter.evaluate(StatementAdapter.java:36)
	at org.apache.lucene.util.TestRuleAssertionsRequired$1.evaluate(TestRuleAssertionsRequired.java:53)
	at org.apache.lucene.util.TestRuleMarkFailure$1.evaluate(TestRuleMarkFailure.java:47)
	at org.apache.lucene.util.TestRuleIgnoreAfterMaxFailures$1.evaluate(TestRuleIgnoreAfterMaxFailures.java:64)
	at org.apache.lucene.util.TestRuleIgnoreTestSuites$1.evaluate(TestRuleIgnoreTestSuites.java:54)
	at com.carrotsearch.randomizedtesting.rules.StatementAdapter.evaluate(StatementAdapter.java:36)
	at com.carrotsearch.randomizedtesting.ThreadLeakControl$StatementRunner.run(ThreadLeakControl.java:368)
	at java.base/java.lang.Thread.run(Thread.java:844)




Build Log:
[...truncated 14221 lines...]
   [junit4] Suite: org.apache.solr.cloud.autoscaling.ScheduledTriggerTest
   [junit4]   2> Creating dataDir: /home/jenkins/workspace/Lucene-Solr-master-Linux/solr/build/solr-core/test/J2/temp/solr.cloud.autoscaling.ScheduledTriggerTest_4C2CF97D84714382-001/init-core-data-001
   [junit4]   2> 2211955 WARN  (SUITE-ScheduledTriggerTest-seed#[4C2CF97D84714382]-worker)
[    ] o.a.s.SolrTestCaseJ4 startTrackingSearchers: numOpens=5 numCloses=5
   [junit4]   2> 2211955 INFO  (SUITE-ScheduledTriggerTest-seed#[4C2CF97D84714382]-worker)
[    ] o.a.s.SolrTestCaseJ4 Using PointFields (NUMERIC_POINTS_SYSPROP=true) w/NUMERIC_DOCVALUES_SYSPROP=true
   [junit4]   2> 2211956 INFO  (SUITE-ScheduledTriggerTest-seed#[4C2CF97D84714382]-worker)
[    ] o.a.s.SolrTestCaseJ4 Randomized ssl (false) and clientAuth (true) via: @org.apache.solr.util.RandomizeSSL(reason="",
ssl=0.0/0.0, value=0.0/0.0, clientAuth=0.0/0.0)
   [junit4]   2> 2211956 INFO  (SUITE-ScheduledTriggerTest-seed#[4C2CF97D84714382]-worker)
[    ] o.a.s.SolrTestCaseJ4 SecureRandom sanity checks: test.solr.allowed.securerandom=null
& java.security.egd=file:/dev/./urandom
   [junit4]   2> 2211956 INFO  (SUITE-ScheduledTriggerTest-seed#[4C2CF97D84714382]-worker)
[    ] o.a.s.c.MiniSolrCloudCluster Starting cluster of 1 servers in /home/jenkins/workspace/Lucene-Solr-master-Linux/solr/build/solr-core/test/J2/temp/solr.cloud.autoscaling.ScheduledTriggerTest_4C2CF97D84714382-001/tempDir-001
   [junit4]   2> 2211956 INFO  (SUITE-ScheduledTriggerTest-seed#[4C2CF97D84714382]-worker)
[    ] o.a.s.c.ZkTestServer STARTING ZK TEST SERVER
   [junit4]   2> 2211956 INFO  (Thread-3667) [    ] o.a.s.c.ZkTestServer client port:0.0.0.0/0.0.0.0:0
   [junit4]   2> 2211957 INFO  (Thread-3667) [    ] o.a.s.c.ZkTestServer Starting server
   [junit4]   2> 2211958 ERROR (Thread-3667) [    ] o.a.z.s.ZooKeeperServer ZKShutdownHandler
is not registered, so ZooKeeper server won't take any action on ERROR or SHUTDOWN server state
changes
   [junit4]   2> 2212057 INFO  (SUITE-ScheduledTriggerTest-seed#[4C2CF97D84714382]-worker)
[    ] o.a.s.c.ZkTestServer start zk server on port:34269
   [junit4]   2> 2212058 INFO  (zkConnectionManagerCallback-13432-thread-1) [    ] o.a.s.c.c.ConnectionManager
zkClient has connected
   [junit4]   2> 2212060 INFO  (jetty-launcher-13429-thread-1) [    ] o.e.j.s.Server jetty-9.4.11.v20180605;
built: 2018-06-05T18:24:03.829Z; git: d5fc0523cfa96bfebfbda19606cad384d772f04c; jvm 9.0.4+11
   [junit4]   2> 2212061 INFO  (jetty-launcher-13429-thread-1) [    ] o.e.j.s.session DefaultSessionIdManager
workerName=node0
   [junit4]   2> 2212061 INFO  (jetty-launcher-13429-thread-1) [    ] o.e.j.s.session No
SessionScavenger set, using defaults
   [junit4]   2> 2212061 INFO  (jetty-launcher-13429-thread-1) [    ] o.e.j.s.session node0
Scavenging every 600000ms
   [junit4]   2> 2212061 INFO  (jetty-launcher-13429-thread-1) [    ] o.e.j.s.h.ContextHandler
Started o.e.j.s.ServletContextHandler@4ad422d5{/solr,null,AVAILABLE}
   [junit4]   2> 2212062 INFO  (jetty-launcher-13429-thread-1) [    ] o.e.j.s.AbstractConnector
Started ServerConnector@4cbda9b7{HTTP/1.1,[http/1.1]}{127.0.0.1:43849}
   [junit4]   2> 2212062 INFO  (jetty-launcher-13429-thread-1) [    ] o.e.j.s.Server Started
@2212136ms
   [junit4]   2> 2212062 INFO  (jetty-launcher-13429-thread-1) [    ] o.a.s.c.s.e.JettySolrRunner
Jetty properties: {hostContext=/solr, hostPort=43849}
   [junit4]   2> 2212062 ERROR (jetty-launcher-13429-thread-1) [    ] o.a.s.u.StartupLoggingUtils
Missing Java Option solr.log.dir. Logging may be missing or incomplete.
   [junit4]   2> 2212062 INFO  (jetty-launcher-13429-thread-1) [    ] o.a.s.s.SolrDispatchFilter
Using logger factory org.apache.logging.slf4j.Log4jLoggerFactory
   [junit4]   2> 2212062 INFO  (jetty-launcher-13429-thread-1) [    ] o.a.s.s.SolrDispatchFilter
 ___      _       Welcome to Apache Solr? version 8.0.0
   [junit4]   2> 2212062 INFO  (jetty-launcher-13429-thread-1) [    ] o.a.s.s.SolrDispatchFilter
/ __| ___| |_ _   Starting in cloud mode on port null
   [junit4]   2> 2212062 INFO  (jetty-launcher-13429-thread-1) [    ] o.a.s.s.SolrDispatchFilter
\__ \/ _ \ | '_|  Install dir: null
   [junit4]   2> 2212062 INFO  (jetty-launcher-13429-thread-1) [    ] o.a.s.s.SolrDispatchFilter
|___/\___/_|_|    Start time: 2018-09-17T17:35:21.544985Z
   [junit4]   2> 2212064 INFO  (zkConnectionManagerCallback-13434-thread-1) [    ] o.a.s.c.c.ConnectionManager
zkClient has connected
   [junit4]   2> 2212064 INFO  (jetty-launcher-13429-thread-1) [    ] o.a.s.s.SolrDispatchFilter
solr.xml found in ZooKeeper. Loading...
   [junit4]   2> 2212151 INFO  (jetty-launcher-13429-thread-1) [    ] o.a.s.c.ZkContainer
Zookeeper client=127.0.0.1:34269/solr
   [junit4]   2> 2212154 INFO  (zkConnectionManagerCallback-13438-thread-1) [    ] o.a.s.c.c.ConnectionManager
zkClient has connected
   [junit4]   2> 2212161 INFO  (zkConnectionManagerCallback-13440-thread-1) [    ] o.a.s.c.c.ConnectionManager
zkClient has connected
   [junit4]   2> 2212194 INFO  (jetty-launcher-13429-thread-1) [n:127.0.0.1:43849_solr
   ] o.a.s.c.OverseerElectionContext I am going to be the leader 127.0.0.1:43849_solr
   [junit4]   2> 2212195 INFO  (jetty-launcher-13429-thread-1) [n:127.0.0.1:43849_solr
   ] o.a.s.c.Overseer Overseer (id=72241186527248387-127.0.0.1:43849_solr-n_0000000000) starting
   [junit4]   2> 2212198 INFO  (zkConnectionManagerCallback-13447-thread-1) [    ] o.a.s.c.c.ConnectionManager
zkClient has connected
   [junit4]   2> 2212199 INFO  (jetty-launcher-13429-thread-1) [n:127.0.0.1:43849_solr
   ] o.a.s.c.s.i.ZkClientClusterStateProvider Cluster at 127.0.0.1:34269/solr ready
   [junit4]   2> 2212199 INFO  (OverseerStateUpdate-72241186527248387-127.0.0.1:43849_solr-n_0000000000)
[n:127.0.0.1:43849_solr    ] o.a.s.c.Overseer Starting to work on the main queue : 127.0.0.1:43849_solr
   [junit4]   2> 2212199 INFO  (jetty-launcher-13429-thread-1) [n:127.0.0.1:43849_solr
   ] o.a.s.c.ZkController Register node as live in ZooKeeper:/live_nodes/127.0.0.1:43849_solr
   [junit4]   2> 2212200 DEBUG (OverseerAutoScalingTriggerThread-72241186527248387-127.0.0.1:43849_solr-n_0000000000)
[    ] o.a.s.c.a.OverseerTriggerThread Adding .auto_add_replicas and .scheduled_maintenance
triggers
   [junit4]   2> 2212200 INFO  (OverseerStateUpdate-72241186527248387-127.0.0.1:43849_solr-n_0000000000)
[n:127.0.0.1:43849_solr    ] o.a.s.c.c.ZkStateReader Updated live nodes from ZooKeeper...
(0) -> (1)
   [junit4]   2> 2212200 DEBUG (OverseerAutoScalingTriggerThread-72241186527248387-127.0.0.1:43849_solr-n_0000000000)
[    ] o.a.s.c.a.OverseerTriggerThread Refreshing /autoscaling.json with znode version 1
   [junit4]   2> 2212200 INFO  (zkCallback-13446-thread-1) [    ] o.a.s.c.c.ZkStateReader
Updated live nodes from ZooKeeper... (0) -> (1)
   [junit4]   2> 2212200 DEBUG (OverseerAutoScalingTriggerThread-72241186527248387-127.0.0.1:43849_solr-n_0000000000)
[    ] o.a.s.c.a.OverseerTriggerThread Current znodeVersion 1, lastZnodeVersion -1
   [junit4]   2> 2212200 DEBUG (OverseerAutoScalingTriggerThread-72241186527248387-127.0.0.1:43849_solr-n_0000000000)
[    ] o.a.s.c.a.OverseerTriggerThread Processed trigger updates upto znodeVersion 1
   [junit4]   2> 2212202 DEBUG (OverseerAutoScalingTriggerThread-72241186527248387-127.0.0.1:43849_solr-n_0000000000)
[    ] o.a.s.c.a.NodeLostTrigger NodeLostTrigger .auto_add_replicas - Initial livenodes: [127.0.0.1:43849_solr]
   [junit4]   2> 2212202 DEBUG (OverseerAutoScalingTriggerThread-72241186527248387-127.0.0.1:43849_solr-n_0000000000)
[    ] o.a.s.c.a.OverseerTriggerThread -- clean old nodeAdded markers
   [junit4]   2> 2212202 DEBUG (OverseerAutoScalingTriggerThread-72241186527248387-127.0.0.1:43849_solr-n_0000000000)
[    ] o.a.s.c.a.OverseerTriggerThread Current znodeVersion 1, lastZnodeVersion 1
   [junit4]   2> 2212202 DEBUG (ScheduledTrigger-7131-thread-1) [    ] o.a.s.c.a.NodeLostTrigger
Running NodeLostTrigger: .auto_add_replicas with currently live nodes: 1
   [junit4]   2> 2212209 INFO  (jetty-launcher-13429-thread-1) [n:127.0.0.1:43849_solr
   ] o.a.s.h.a.MetricsHistoryHandler No .system collection, keeping metrics history in memory.
   [junit4]   2> 2212220 INFO  (jetty-launcher-13429-thread-1) [n:127.0.0.1:43849_solr
   ] o.a.s.m.r.SolrJmxReporter JMX monitoring for 'solr_43849.solr.node' (registry 'solr.node')
enabled at server: com.sun.jmx.mbeanserver.JmxMBeanServer@5ef46ee6
   [junit4]   2> 2212225 INFO  (jetty-launcher-13429-thread-1) [n:127.0.0.1:43849_solr
   ] o.a.s.m.r.SolrJmxReporter JMX monitoring for 'solr_43849.solr.jvm' (registry 'solr.jvm')
enabled at server: com.sun.jmx.mbeanserver.JmxMBeanServer@5ef46ee6
   [junit4]   2> 2212225 INFO  (jetty-launcher-13429-thread-1) [n:127.0.0.1:43849_solr
   ] o.a.s.m.r.SolrJmxReporter JMX monitoring for 'solr_43849.solr.jetty' (registry 'solr.jetty')
enabled at server: com.sun.jmx.mbeanserver.JmxMBeanServer@5ef46ee6
   [junit4]   2> 2212226 INFO  (jetty-launcher-13429-thread-1) [n:127.0.0.1:43849_solr
   ] o.a.s.c.CorePropertiesLocator Found 0 core definitions underneath /home/jenkins/workspace/Lucene-Solr-master-Linux/solr/build/solr-core/test/J2/temp/solr.cloud.autoscaling.ScheduledTriggerTest_4C2CF97D84714382-001/tempDir-001/node1/.
   [junit4]   2> 2212234 INFO  (zkConnectionManagerCallback-13450-thread-1) [    ] o.a.s.c.c.ConnectionManager
zkClient has connected
   [junit4]   2> 2212236 INFO  (zkConnectionManagerCallback-13455-thread-1) [    ] o.a.s.c.c.ConnectionManager
zkClient has connected
   [junit4]   2> 2212237 INFO  (SUITE-ScheduledTriggerTest-seed#[4C2CF97D84714382]-worker)
[    ] o.a.s.c.c.ZkStateReader Updated live nodes from ZooKeeper... (0) -> (1)
   [junit4]   2> 2212237 INFO  (SUITE-ScheduledTriggerTest-seed#[4C2CF97D84714382]-worker)
[    ] o.a.s.c.s.i.ZkClientClusterStateProvider Cluster at 127.0.0.1:34269/solr ready
   [junit4]   2> 2212245 INFO  (TEST-ScheduledTriggerTest.testIgnoredEvent-seed#[4C2CF97D84714382])
[    ] o.a.s.SolrTestCaseJ4 ###Starting testIgnoredEvent
   [junit4]   2> 2212247 WARN  (TEST-ScheduledTriggerTest.testIgnoredEvent-seed#[4C2CF97D84714382])
[    ] o.a.s.c.a.ScheduledTrigger ScheduledTrigger was not able to run event at scheduled
time: 2018-09-16T17:35:21.727Z. Now: 2018-09-17T17:35:21.727Z
   [junit4]   2> 2212247 INFO  (TEST-ScheduledTriggerTest.testIgnoredEvent-seed#[4C2CF97D84714382])
[    ] o.a.s.SolrTestCaseJ4 ###Ending testIgnoredEvent
   [junit4]   2> 2212254 INFO  (TEST-ScheduledTriggerTest.testTrigger-seed#[4C2CF97D84714382])
[    ] o.a.s.SolrTestCaseJ4 ###Starting testTrigger
   [junit4]   2> 2213203 DEBUG (ScheduledTrigger-7131-thread-3) [    ] o.a.s.c.a.NodeLostTrigger
Running NodeLostTrigger: .auto_add_replicas with currently live nodes: 1
   [junit4]   2> 2214203 DEBUG (ScheduledTrigger-7131-thread-4) [    ] o.a.s.c.a.NodeLostTrigger
Running NodeLostTrigger: .auto_add_replicas with currently live nodes: 1
   [junit4]   2> 2215203 DEBUG (ScheduledTrigger-7131-thread-3) [    ] o.a.s.c.a.NodeLostTrigger
Running NodeLostTrigger: .auto_add_replicas with currently live nodes: 1
   [junit4]   2> 2216203 DEBUG (ScheduledTrigger-7131-thread-4) [    ] o.a.s.c.a.NodeLostTrigger
Running NodeLostTrigger: .auto_add_replicas with currently live nodes: 1
   [junit4]   2> 2217204 DEBUG (ScheduledTrigger-7131-thread-3) [    ] o.a.s.c.a.NodeLostTrigger
Running NodeLostTrigger: .auto_add_replicas with currently live nodes: 1
   [junit4]   2> 2218206 DEBUG (ScheduledTrigger-7131-thread-4) [    ] o.a.s.c.a.NodeLostTrigger
Running NodeLostTrigger: .auto_add_replicas with currently live nodes: 1
   [junit4]   2> 2218255 WARN  (TEST-ScheduledTriggerTest.testTrigger-seed#[4C2CF97D84714382])
[    ] o.a.s.c.a.ScheduledTrigger ScheduledTrigger was not able to run event at scheduled
time: 2018-09-17T17:35:24.736Z. Now: 2018-09-17T17:35:27.735Z
   [junit4]   2> 2219206 DEBUG (ScheduledTrigger-7131-thread-4) [    ] o.a.s.c.a.NodeLostTrigger
Running NodeLostTrigger: .auto_add_replicas with currently live nodes: 1
   [junit4]   2> 2220207 DEBUG (ScheduledTrigger-7131-thread-4) [    ] o.a.s.c.a.NodeLostTrigger
Running NodeLostTrigger: .auto_add_replicas with currently live nodes: 1
   [junit4]   2> 2221207 DEBUG (ScheduledTrigger-7131-thread-2) [    ] o.a.s.c.a.NodeLostTrigger
Running NodeLostTrigger: .auto_add_replicas with currently live nodes: 1
   [junit4]   2> 2221255 WARN  (TEST-ScheduledTriggerTest.testTrigger-seed#[4C2CF97D84714382])
[    ] o.a.s.c.a.ScheduledTrigger ScheduledTrigger was not able to run event at scheduled
time: 2018-09-17T17:35:27.736Z. Now: 2018-09-17T17:35:30.735Z
   [junit4]   2> 2221256 INFO  (TEST-ScheduledTriggerTest.testTrigger-seed#[4C2CF97D84714382])
[    ] o.a.s.SolrTestCaseJ4 ###Ending testTrigger
   [junit4]   2> NOTE: reproduce with: ant test  -Dtestcase=ScheduledTriggerTest -Dtests.method=testTrigger
-Dtests.seed=4C2CF97D84714382 -Dtests.multiplier=3 -Dtests.slow=true -Dtests.locale=tk -Dtests.timezone=Navajo
-Dtests.asserts=true -Dtests.file.encoding=US-ASCII
   [junit4] FAILURE 9.01s J2 | ScheduledTriggerTest.testTrigger <<<
   [junit4]    > Throwable #1: java.lang.AssertionError: expected:<3> but was:<2>
   [junit4]    > 	at __randomizedtesting.SeedInfo.seed([4C2CF97D84714382:2FE7CFFF1DBE30AF]:0)
   [junit4]    > 	at org.apache.solr.cloud.autoscaling.ScheduledTriggerTest.scheduledTriggerTest(ScheduledTriggerTest.java:113)
   [junit4]    > 	at org.apache.solr.cloud.autoscaling.ScheduledTriggerTest.testTrigger(ScheduledTriggerTest.java:66)
   [junit4]    > 	at java.base/jdk.internal.reflect.NativeMethodAccessorImpl.invoke0(Native
Method)
   [junit4]    > 	at java.base/jdk.internal.reflect.NativeMethodAccessorImpl.invoke(NativeMethodAccessorImpl.java:62)
   [junit4]    > 	at java.base/jdk.internal.reflect.DelegatingMethodAccessorImpl.invoke(DelegatingMethodAccessorImpl.java:43)
   [junit4]    > 	at java.base/java.lang.reflect.Method.invoke(Method.java:564)
   [junit4]    > 	at java.base/java.lang.Thread.run(Thread.java:844)
   [junit4]   2> 2221259 INFO  (jetty-closer-13430-thread-1) [    ] o.e.j.s.AbstractConnector
Stopped ServerConnector@4cbda9b7{HTTP/1.1,[http/1.1]}{127.0.0.1:0}
   [junit4]   2> 2221259 INFO  (jetty-closer-13430-thread-1) [    ] o.a.s.c.CoreContainer
Shutting down CoreContainer instance=1833269659
   [junit4]   2> 2221260 INFO  (jetty-closer-13430-thread-1) [    ] o.a.s.m.SolrMetricManager
Closing metric reporters for registry=solr.node, tag=null
   [junit4]   2> 2221260 INFO  (jetty-closer-13430-thread-1) [    ] o.a.s.m.r.SolrJmxReporter
Closing reporter [org.apache.solr.metrics.reporters.SolrJmxReporter@4ab09438: rootName = solr_43849,
domain = solr.node, service url = null, agent id = null] for registry solr.node / com.codahale.metrics.MetricRegistry@4bba60c4
   [junit4]   2> 2221264 INFO  (jetty-closer-13430-thread-1) [    ] o.a.s.m.SolrMetricManager
Closing metric reporters for registry=solr.jvm, tag=null
   [junit4]   2> 2221264 INFO  (jetty-closer-13430-thread-1) [    ] o.a.s.m.r.SolrJmxReporter
Closing reporter [org.apache.solr.metrics.reporters.SolrJmxReporter@32543ad4: rootName = solr_43849,
domain = solr.jvm, service url = null, agent id = null] for registry solr.jvm / com.codahale.metrics.MetricRegistry@1f30b82d
   [junit4]   2> 2221266 INFO  (jetty-closer-13430-thread-1) [    ] o.a.s.m.SolrMetricManager
Closing metric reporters for registry=solr.jetty, tag=null
   [junit4]   2> 2221266 INFO  (jetty-closer-13430-thread-1) [    ] o.a.s.m.r.SolrJmxReporter
Closing reporter [org.apache.solr.metrics.reporters.SolrJmxReporter@ec32831: rootName = solr_43849,
domain = solr.jetty, service url = null, agent id = null] for registry solr.jetty / com.codahale.metrics.MetricRegistry@74552560
   [junit4]   2> 2221267 INFO  (jetty-closer-13430-thread-1) [    ] o.a.s.c.ZkController
Remove node as live in ZooKeeper:/live_nodes/127.0.0.1:43849_solr
   [junit4]   2> 2221268 INFO  (jetty-closer-13430-thread-1) [    ] o.a.s.m.SolrMetricManager
Closing metric reporters for registry=solr.cluster, tag=null
   [junit4]   2> 2221268 INFO  (zkCallback-13439-thread-1) [    ] o.a.s.c.c.ZkStateReader
Updated live nodes from ZooKeeper... (1) -> (0)
   [junit4]   2> 2221268 INFO  (jetty-closer-13430-thread-1) [    ] o.a.s.c.TransientSolrCoreCacheDefault
Allocating transient cache for 2147483647 transient cores
   [junit4]   2> 2221268 INFO  (jetty-closer-13430-thread-1) [    ] o.a.s.c.Overseer Overseer
(id=72241186527248387-127.0.0.1:43849_solr-n_0000000000) closing
   [junit4]   2> 2221268 INFO  (zkCallback-13446-thread-1) [    ] o.a.s.c.c.ZkStateReader
Updated live nodes from ZooKeeper... (1) -> (0)
   [junit4]   2> 2221268 INFO  (OverseerStateUpdate-72241186527248387-127.0.0.1:43849_solr-n_0000000000)
[n:127.0.0.1:43849_solr    ] o.a.s.c.Overseer Overseer Loop exiting : 127.0.0.1:43849_solr
   [junit4]   2> 2221268 WARN  (OverseerAutoScalingTriggerThread-72241186527248387-127.0.0.1:43849_solr-n_0000000000)
[    ] o.a.s.c.a.OverseerTriggerThread OverseerTriggerThread woken up but we are closed, exiting.
   [junit4]   2> 2221268 DEBUG (jetty-closer-13430-thread-1) [    ] o.a.s.c.a.ScheduledTriggers
Shutting down scheduled thread pool executor now
   [junit4]   2> 2221269 DEBUG (jetty-closer-13430-thread-1) [    ] o.a.s.c.a.ScheduledTriggers
Shutting down action executor now
   [junit4]   2> 2221269 DEBUG (jetty-closer-13430-thread-1) [    ] o.a.s.c.a.ScheduledTriggers
Awaiting termination for action executor
   [junit4]   2> 2221269 DEBUG (jetty-closer-13430-thread-1) [    ] o.a.s.c.a.ScheduledTriggers
Awaiting termination for scheduled thread pool executor
   [junit4]   2> 2221269 DEBUG (jetty-closer-13430-thread-1) [    ] o.a.s.c.a.ScheduledTriggers
ScheduledTriggers closed completely
   [junit4]   2> 2221269 DEBUG (jetty-closer-13430-thread-1) [    ] o.a.s.c.a.OverseerTriggerThread
OverseerTriggerThread has been closed explicitly
   [junit4]   2> 2221270 INFO  (jetty-closer-13430-thread-1) [    ] o.e.j.s.h.ContextHandler
Stopped o.e.j.s.ServletContextHandler@4ad422d5{/solr,null,UNAVAILABLE}
   [junit4]   2> 2221270 INFO  (jetty-closer-13430-thread-1) [    ] o.e.j.s.session node0
Stopped scavenging
   [junit4]   2> 2221270 ERROR (SUITE-ScheduledTriggerTest-seed#[4C2CF97D84714382]-worker)
[    ] o.a.z.s.ZooKeeperServer ZKShutdownHandler is not registered, so ZooKeeper server won't
take any action on ERROR or SHUTDOWN server state changes
   [junit4]   2> 2221270 INFO  (SUITE-ScheduledTriggerTest-seed#[4C2CF97D84714382]-worker)
[    ] o.a.s.c.ZkTestServer connecting to 127.0.0.1:34269 34269
   [junit4]   2> 2221296 INFO  (Thread-3667) [    ] o.a.s.c.ZkTestServer connecting to
127.0.0.1:34269 34269
   [junit4]   2> 2221297 WARN  (Thread-3667) [    ] o.a.s.c.ZkTestServer Watch limit violations:

   [junit4]   2> Maximum concurrent create/delete watches above limit:
   [junit4]   2> 
   [junit4]   2> 	3	/solr/aliases.json
   [junit4]   2> 	3	/solr/clusterprops.json
   [junit4]   2> 
   [junit4]   2> Maximum concurrent data watches above limit:
   [junit4]   2> 
   [junit4]   2> 	3	/solr/clusterstate.json
   [junit4]   2> 
   [junit4]   2> Maximum concurrent children watches above limit:
   [junit4]   2> 
   [junit4]   2> 	3	/solr/live_nodes
   [junit4]   2> 	3	/solr/collections
   [junit4]   2> 
   [junit4]   2> NOTE: leaving temporary files on disk at: /home/jenkins/workspace/Lucene-Solr-master-Linux/solr/build/solr-core/test/J2/temp/solr.cloud.autoscaling.ScheduledTriggerTest_4C2CF97D84714382-001
   [junit4]   2> Sep 17, 2018 5:35:30 PM com.carrotsearch.randomizedtesting.ThreadLeakControl
checkThreadLeaks
   [junit4]   2> WARNING: Will linger awaiting termination of 4 leaked thread(s).
   [junit4]   2> NOTE: test params are: codec=Asserting(Lucene80): {}, docValues:{}, maxPointsInLeafNode=1848,
maxMBSortInHeap=5.7918158732266845, sim=Asserting(org.apache.lucene.search.similarities.AssertingSimilarity@676d7880),
locale=tk, timezone=Navajo
   [junit4]   2> NOTE: Linux 4.15.0-32-generic amd64/Oracle Corporation 9.0.4 (64-bit)/cpus=8,threads=1,free=322621616,total=536870912
   [junit4]   2> NOTE: All tests run in this JVM: [TestReplicationHandler, MetricsHistoryIntegrationTest,
SaslZkACLProviderTest, SolrCloudReportersTest, TestCloudPhrasesIdentificationComponent, TestConfigSetsAPI,
TestRestManager, TestSegmentSorting, TestTrie, BitVectorTest, PeerSyncWithIndexFingerprintCachingTest,
CoreAdminCreateDiscoverTest, PrimUtilsTest, JSONWriterTest, StressHdfsTest, DistributedFacetExistsSmallTest,
BufferStoreTest, MetricsHandlerTest, OverseerTaskQueueTest, RegexBoostProcessorTest, TestDocBasedVersionConstraints,
ClassificationUpdateProcessorFactoryTest, StatsReloadRaceTest, OutOfBoxZkACLAndCredentialsProvidersTest,
HLLSerializationTest, TestCloudSchemaless, TestDynamicURP, CollectionsAPIDistributedZkTest,
TestLegacyNumericRangeQueryBuilder, TestAuthenticationFramework, SuggestComponentTest, TestStressUserVersions,
UniqFieldsUpdateProcessorFactoryTest, AsyncCallRequestStatusResponseTest, TestFieldCacheVsDocValues,
TestOnReconnectListenerSupport, TestHalfAndHalfDocValues, TestSchemaManager, CdcrWithNodesRestartsTest,
DocValuesMultiTest, TermsComponentTest, RulesTest, PhrasesIdentificationComponentTest, TestTrieFacet,
TestInitParams, TestInPlaceUpdatesDistrib, TestQueryTypes, HdfsTlogReplayBufferedWhileIndexingTest,
TestCryptoKeys, LeaderElectionTest, TestClassicSimilarityFactory, HttpTriggerListenerTest,
SecurityConfHandlerTest, UnloadDistributedZkTest, TestFilteredDocIdSet, ChaosMonkeySafeLeaderTest,
SpellCheckComponentTest, TestCollectionAPI, TestMultiWordSynonyms, ReturnFieldsTest, TestCloudRecovery,
QueryEqualityTest, MetricUtilsTest, TestDistributedMap, TestXIncludeConfig, DocExpirationUpdateProcessorFactoryTest,
CleanupOldIndexTest, ConvertedLegacyTest, TestFastOutputStream, AnalyticsMergeStrategyTest,
FileUtilsTest, TestWordDelimiterFilterFactory, TestRestoreCore, DeleteInactiveReplicaTest,
TestStressLiveNodes, AddSchemaFieldsUpdateProcessorFactoryTest, TaggingAttributeTest, TestManagedStopFilterFactory,
TestSolrDeletionPolicy2, SolrMetricsIntegrationTest, SuggesterTest, TestSolrCloudWithSecureImpersonation,
SolrJmxReporterCloudTest, IndexBasedSpellCheckerTest, TestSimpleTrackingShardHandler, SolrTestCaseJ4Test,
CursorMarkTest, LeaderTragicEventTest, TestRecoveryHdfs, RestartWhileUpdatingTest, TestTolerantUpdateProcessorRandomCloud,
TestCustomStream, CacheHeaderTest, TestWriterPerf, ComputePlanActionTest, TestNumericTerms32,
PreAnalyzedFieldManagedSchemaCloudTest, NoCacheHeaderTest, TestReRankQParserPlugin, AutoAddReplicasIntegrationTest,
SpatialFilterTest, ExternalFileFieldSortTest, TestJoin, UpdateLogTest, BadCopyFieldTest, CloudMLTQParserTest,
TolerantUpdateProcessorTest, TestDistribIDF, TestRuleBasedAuthorizationPlugin, SearchHandlerTest,
TestCloudInspectUtil, TestCharFilters, TestScoreJoinQPNoScore, XsltUpdateRequestHandlerTest,
DistributedIntervalFacetingTest, RandomizedTaggerTest, SystemLogListenerTest, TestSolrQueryParser,
TestSystemIdResolver, TestHashPartitioner, NumericFieldsTest, AddReplicaTest, TestExtendedDismaxParser,
TestSolrCoreParser, TestExportWriter, TestInitQParser, TestFreeTextSuggestions, BasicZkTest,
FieldAnalysisRequestHandlerTest, DistributedQueueTest, ZkShardTermsTest, GraphQueryTest, TestSimLargeCluster,
TestPullReplica, TestRebalanceLeaders, TestWithCollection, HdfsCollectionsAPIDistributedZkTest,
TestCollectionsAPIViaSolrCloudCluster, MetricTriggerIntegrationTest, NodeAddedTriggerTest,
NodeLostTriggerIntegrationTest, NodeMarkersRegistrationTest, ScheduledMaintenanceTriggerTest,
ScheduledTriggerIntegrationTest, ScheduledTriggerTest]
   [junit4] Completed [515/834 (1!)] on J2 in 10.10s, 2 tests, 1 failure <<< FAILURES!

[...truncated 43281 lines...]
[repro] Jenkins log URL: https://jenkins.thetaphi.de/job/Lucene-Solr-master-Linux/22874/consoleText

[repro] Revision: 895bff46b2c3d3d027e693e11a2feac9f518191d

[repro] Ant options: "-Dargs=-XX:+UseCompressedOops -XX:+UseG1GC"
[repro] Repro line:  ant test  -Dtestcase=ScheduledTriggerTest -Dtests.method=testTrigger
-Dtests.seed=4C2CF97D84714382 -Dtests.multiplier=3 -Dtests.slow=true -Dtests.locale=tk -Dtests.timezone=Navajo
-Dtests.asserts=true -Dtests.file.encoding=US-ASCII

[repro] ant clean

[...truncated 6 lines...]
[repro] Test suites by module:
[repro]    solr/core
[repro]       ScheduledTriggerTest
[repro] ant compile-test

[...truncated 3428 lines...]
[repro] ant test-nocompile -Dtests.dups=5 -Dtests.maxfailures=5 -Dtests.class="*.ScheduledTriggerTest"
-Dtests.showOutput=onerror "-Dargs=-XX:+UseCompressedOops -XX:+UseG1GC" -Dtests.seed=4C2CF97D84714382
-Dtests.multiplier=3 -Dtests.slow=true -Dtests.locale=tk -Dtests.timezone=Navajo -Dtests.asserts=true
-Dtests.file.encoding=US-ASCII

[...truncated 81 lines...]
[repro] Failures:
[repro]   0/5 failed: org.apache.solr.cloud.autoscaling.ScheduledTriggerTest
[repro] Exiting with code 0

[...truncated 40 lines...]

Mime
View raw message