lucene-dev mailing list archives

Site index · List index
Message view « Date » · « Thread »
Top « Date » · « Thread »
From Policeman Jenkins Server <jenk...@thetaphi.de>
Subject [JENKINS-EA] Lucene-Solr-master-Linux (64bit/jdk-11-ea+28) - Build # 22862 - Still Unstable!
Date Sat, 15 Sep 2018 15:27:27 GMT
Build: https://jenkins.thetaphi.de/job/Lucene-Solr-master-Linux/22862/
Java: 64bit/jdk-11-ea+28 -XX:-UseCompressedOops -XX:+UseSerialGC

43 tests failed.
FAILED:  junit.framework.TestSuite.org.apache.solr.schema.SchemaApiFailureTest

Error Message:


Stack Trace:
java.util.concurrent.TimeoutException
	at __randomizedtesting.SeedInfo.seed([AECB038BD7CD4B3D]:0)
	at org.apache.solr.common.cloud.ZkStateReader.waitForState(ZkStateReader.java:1469)
	at org.apache.solr.client.solrj.impl.CloudSolrClient.waitForState(CloudSolrClient.java:450)
	at org.apache.solr.schema.SchemaApiFailureTest.setupCluster(SchemaApiFailureTest.java:43)
	at java.base/jdk.internal.reflect.NativeMethodAccessorImpl.invoke0(Native Method)
	at java.base/jdk.internal.reflect.NativeMethodAccessorImpl.invoke(NativeMethodAccessorImpl.java:62)
	at java.base/jdk.internal.reflect.DelegatingMethodAccessorImpl.invoke(DelegatingMethodAccessorImpl.java:43)
	at java.base/java.lang.reflect.Method.invoke(Method.java:566)
	at com.carrotsearch.randomizedtesting.RandomizedRunner.invoke(RandomizedRunner.java:1742)
	at com.carrotsearch.randomizedtesting.RandomizedRunner$6.evaluate(RandomizedRunner.java:875)
	at com.carrotsearch.randomizedtesting.RandomizedRunner$7.evaluate(RandomizedRunner.java:891)
	at com.carrotsearch.randomizedtesting.rules.StatementAdapter.evaluate(StatementAdapter.java:36)
	at com.carrotsearch.randomizedtesting.rules.SystemPropertiesRestoreRule$1.evaluate(SystemPropertiesRestoreRule.java:57)
	at org.apache.lucene.util.AbstractBeforeAfterRule$1.evaluate(AbstractBeforeAfterRule.java:45)
	at com.carrotsearch.randomizedtesting.rules.StatementAdapter.evaluate(StatementAdapter.java:36)
	at org.apache.lucene.util.TestRuleStoreClassName$1.evaluate(TestRuleStoreClassName.java:41)
	at com.carrotsearch.randomizedtesting.rules.NoShadowingOrOverridesOnMethodsRule$1.evaluate(NoShadowingOrOverridesOnMethodsRule.java:40)
	at com.carrotsearch.randomizedtesting.rules.NoShadowingOrOverridesOnMethodsRule$1.evaluate(NoShadowingOrOverridesOnMethodsRule.java:40)
	at com.carrotsearch.randomizedtesting.rules.StatementAdapter.evaluate(StatementAdapter.java:36)
	at com.carrotsearch.randomizedtesting.rules.StatementAdapter.evaluate(StatementAdapter.java:36)
	at org.apache.lucene.util.TestRuleAssertionsRequired$1.evaluate(TestRuleAssertionsRequired.java:53)
	at org.apache.lucene.util.TestRuleMarkFailure$1.evaluate(TestRuleMarkFailure.java:47)
	at org.apache.lucene.util.TestRuleIgnoreAfterMaxFailures$1.evaluate(TestRuleIgnoreAfterMaxFailures.java:64)
	at org.apache.lucene.util.TestRuleIgnoreTestSuites$1.evaluate(TestRuleIgnoreTestSuites.java:54)
	at com.carrotsearch.randomizedtesting.rules.StatementAdapter.evaluate(StatementAdapter.java:36)
	at com.carrotsearch.randomizedtesting.ThreadLeakControl$StatementRunner.run(ThreadLeakControl.java:368)
	at java.base/java.lang.Thread.run(Thread.java:834)


FAILED:  junit.framework.TestSuite.org.apache.solr.schema.SchemaApiFailureTest

Error Message:


Stack Trace:
java.util.concurrent.TimeoutException
	at __randomizedtesting.SeedInfo.seed([AECB038BD7CD4B3D]:0)
	at org.apache.solr.common.cloud.ZkStateReader.waitForState(ZkStateReader.java:1469)
	at org.apache.solr.client.solrj.impl.CloudSolrClient.waitForState(CloudSolrClient.java:450)
	at org.apache.solr.schema.SchemaApiFailureTest.setupCluster(SchemaApiFailureTest.java:43)
	at java.base/jdk.internal.reflect.NativeMethodAccessorImpl.invoke0(Native Method)
	at java.base/jdk.internal.reflect.NativeMethodAccessorImpl.invoke(NativeMethodAccessorImpl.java:62)
	at java.base/jdk.internal.reflect.DelegatingMethodAccessorImpl.invoke(DelegatingMethodAccessorImpl.java:43)
	at java.base/java.lang.reflect.Method.invoke(Method.java:566)
	at com.carrotsearch.randomizedtesting.RandomizedRunner.invoke(RandomizedRunner.java:1742)
	at com.carrotsearch.randomizedtesting.RandomizedRunner$6.evaluate(RandomizedRunner.java:875)
	at com.carrotsearch.randomizedtesting.RandomizedRunner$7.evaluate(RandomizedRunner.java:891)
	at com.carrotsearch.randomizedtesting.rules.StatementAdapter.evaluate(StatementAdapter.java:36)
	at com.carrotsearch.randomizedtesting.rules.SystemPropertiesRestoreRule$1.evaluate(SystemPropertiesRestoreRule.java:57)
	at org.apache.lucene.util.AbstractBeforeAfterRule$1.evaluate(AbstractBeforeAfterRule.java:45)
	at com.carrotsearch.randomizedtesting.rules.StatementAdapter.evaluate(StatementAdapter.java:36)
	at org.apache.lucene.util.TestRuleStoreClassName$1.evaluate(TestRuleStoreClassName.java:41)
	at com.carrotsearch.randomizedtesting.rules.NoShadowingOrOverridesOnMethodsRule$1.evaluate(NoShadowingOrOverridesOnMethodsRule.java:40)
	at com.carrotsearch.randomizedtesting.rules.NoShadowingOrOverridesOnMethodsRule$1.evaluate(NoShadowingOrOverridesOnMethodsRule.java:40)
	at com.carrotsearch.randomizedtesting.rules.StatementAdapter.evaluate(StatementAdapter.java:36)
	at com.carrotsearch.randomizedtesting.rules.StatementAdapter.evaluate(StatementAdapter.java:36)
	at org.apache.lucene.util.TestRuleAssertionsRequired$1.evaluate(TestRuleAssertionsRequired.java:53)
	at org.apache.lucene.util.TestRuleMarkFailure$1.evaluate(TestRuleMarkFailure.java:47)
	at org.apache.lucene.util.TestRuleIgnoreAfterMaxFailures$1.evaluate(TestRuleIgnoreAfterMaxFailures.java:64)
	at org.apache.lucene.util.TestRuleIgnoreTestSuites$1.evaluate(TestRuleIgnoreTestSuites.java:54)
	at com.carrotsearch.randomizedtesting.rules.StatementAdapter.evaluate(StatementAdapter.java:36)
	at com.carrotsearch.randomizedtesting.ThreadLeakControl$StatementRunner.run(ThreadLeakControl.java:368)
	at java.base/java.lang.Thread.run(Thread.java:834)


FAILED:  junit.framework.TestSuite.org.apache.solr.schema.SchemaApiFailureTest

Error Message:


Stack Trace:
java.util.concurrent.TimeoutException
	at __randomizedtesting.SeedInfo.seed([AECB038BD7CD4B3D]:0)
	at org.apache.solr.common.cloud.ZkStateReader.waitForState(ZkStateReader.java:1469)
	at org.apache.solr.client.solrj.impl.CloudSolrClient.waitForState(CloudSolrClient.java:450)
	at org.apache.solr.schema.SchemaApiFailureTest.setupCluster(SchemaApiFailureTest.java:43)
	at java.base/jdk.internal.reflect.NativeMethodAccessorImpl.invoke0(Native Method)
	at java.base/jdk.internal.reflect.NativeMethodAccessorImpl.invoke(NativeMethodAccessorImpl.java:62)
	at java.base/jdk.internal.reflect.DelegatingMethodAccessorImpl.invoke(DelegatingMethodAccessorImpl.java:43)
	at java.base/java.lang.reflect.Method.invoke(Method.java:566)
	at com.carrotsearch.randomizedtesting.RandomizedRunner.invoke(RandomizedRunner.java:1742)
	at com.carrotsearch.randomizedtesting.RandomizedRunner$6.evaluate(RandomizedRunner.java:875)
	at com.carrotsearch.randomizedtesting.RandomizedRunner$7.evaluate(RandomizedRunner.java:891)
	at com.carrotsearch.randomizedtesting.rules.StatementAdapter.evaluate(StatementAdapter.java:36)
	at com.carrotsearch.randomizedtesting.rules.SystemPropertiesRestoreRule$1.evaluate(SystemPropertiesRestoreRule.java:57)
	at org.apache.lucene.util.AbstractBeforeAfterRule$1.evaluate(AbstractBeforeAfterRule.java:45)
	at com.carrotsearch.randomizedtesting.rules.StatementAdapter.evaluate(StatementAdapter.java:36)
	at org.apache.lucene.util.TestRuleStoreClassName$1.evaluate(TestRuleStoreClassName.java:41)
	at com.carrotsearch.randomizedtesting.rules.NoShadowingOrOverridesOnMethodsRule$1.evaluate(NoShadowingOrOverridesOnMethodsRule.java:40)
	at com.carrotsearch.randomizedtesting.rules.NoShadowingOrOverridesOnMethodsRule$1.evaluate(NoShadowingOrOverridesOnMethodsRule.java:40)
	at com.carrotsearch.randomizedtesting.rules.StatementAdapter.evaluate(StatementAdapter.java:36)
	at com.carrotsearch.randomizedtesting.rules.StatementAdapter.evaluate(StatementAdapter.java:36)
	at org.apache.lucene.util.TestRuleAssertionsRequired$1.evaluate(TestRuleAssertionsRequired.java:53)
	at org.apache.lucene.util.TestRuleMarkFailure$1.evaluate(TestRuleMarkFailure.java:47)
	at org.apache.lucene.util.TestRuleIgnoreAfterMaxFailures$1.evaluate(TestRuleIgnoreAfterMaxFailures.java:64)
	at org.apache.lucene.util.TestRuleIgnoreTestSuites$1.evaluate(TestRuleIgnoreTestSuites.java:54)
	at com.carrotsearch.randomizedtesting.rules.StatementAdapter.evaluate(StatementAdapter.java:36)
	at com.carrotsearch.randomizedtesting.ThreadLeakControl$StatementRunner.run(ThreadLeakControl.java:368)
	at java.base/java.lang.Thread.run(Thread.java:834)


FAILED:  junit.framework.TestSuite.org.apache.solr.schema.SchemaApiFailureTest

Error Message:


Stack Trace:
java.util.concurrent.TimeoutException
	at __randomizedtesting.SeedInfo.seed([AECB038BD7CD4B3D]:0)
	at org.apache.solr.common.cloud.ZkStateReader.waitForState(ZkStateReader.java:1469)
	at org.apache.solr.client.solrj.impl.CloudSolrClient.waitForState(CloudSolrClient.java:450)
	at org.apache.solr.schema.SchemaApiFailureTest.setupCluster(SchemaApiFailureTest.java:43)
	at java.base/jdk.internal.reflect.NativeMethodAccessorImpl.invoke0(Native Method)
	at java.base/jdk.internal.reflect.NativeMethodAccessorImpl.invoke(NativeMethodAccessorImpl.java:62)
	at java.base/jdk.internal.reflect.DelegatingMethodAccessorImpl.invoke(DelegatingMethodAccessorImpl.java:43)
	at java.base/java.lang.reflect.Method.invoke(Method.java:566)
	at com.carrotsearch.randomizedtesting.RandomizedRunner.invoke(RandomizedRunner.java:1742)
	at com.carrotsearch.randomizedtesting.RandomizedRunner$6.evaluate(RandomizedRunner.java:875)
	at com.carrotsearch.randomizedtesting.RandomizedRunner$7.evaluate(RandomizedRunner.java:891)
	at com.carrotsearch.randomizedtesting.rules.StatementAdapter.evaluate(StatementAdapter.java:36)
	at com.carrotsearch.randomizedtesting.rules.SystemPropertiesRestoreRule$1.evaluate(SystemPropertiesRestoreRule.java:57)
	at org.apache.lucene.util.AbstractBeforeAfterRule$1.evaluate(AbstractBeforeAfterRule.java:45)
	at com.carrotsearch.randomizedtesting.rules.StatementAdapter.evaluate(StatementAdapter.java:36)
	at org.apache.lucene.util.TestRuleStoreClassName$1.evaluate(TestRuleStoreClassName.java:41)
	at com.carrotsearch.randomizedtesting.rules.NoShadowingOrOverridesOnMethodsRule$1.evaluate(NoShadowingOrOverridesOnMethodsRule.java:40)
	at com.carrotsearch.randomizedtesting.rules.NoShadowingOrOverridesOnMethodsRule$1.evaluate(NoShadowingOrOverridesOnMethodsRule.java:40)
	at com.carrotsearch.randomizedtesting.rules.StatementAdapter.evaluate(StatementAdapter.java:36)
	at com.carrotsearch.randomizedtesting.rules.StatementAdapter.evaluate(StatementAdapter.java:36)
	at org.apache.lucene.util.TestRuleAssertionsRequired$1.evaluate(TestRuleAssertionsRequired.java:53)
	at org.apache.lucene.util.TestRuleMarkFailure$1.evaluate(TestRuleMarkFailure.java:47)
	at org.apache.lucene.util.TestRuleIgnoreAfterMaxFailures$1.evaluate(TestRuleIgnoreAfterMaxFailures.java:64)
	at org.apache.lucene.util.TestRuleIgnoreTestSuites$1.evaluate(TestRuleIgnoreTestSuites.java:54)
	at com.carrotsearch.randomizedtesting.rules.StatementAdapter.evaluate(StatementAdapter.java:36)
	at com.carrotsearch.randomizedtesting.ThreadLeakControl$StatementRunner.run(ThreadLeakControl.java:368)
	at java.base/java.lang.Thread.run(Thread.java:834)


FAILED:  junit.framework.TestSuite.org.apache.solr.schema.SchemaApiFailureTest

Error Message:


Stack Trace:
java.util.concurrent.TimeoutException
	at __randomizedtesting.SeedInfo.seed([AECB038BD7CD4B3D]:0)
	at org.apache.solr.common.cloud.ZkStateReader.waitForState(ZkStateReader.java:1469)
	at org.apache.solr.client.solrj.impl.CloudSolrClient.waitForState(CloudSolrClient.java:450)
	at org.apache.solr.schema.SchemaApiFailureTest.setupCluster(SchemaApiFailureTest.java:43)
	at java.base/jdk.internal.reflect.NativeMethodAccessorImpl.invoke0(Native Method)
	at java.base/jdk.internal.reflect.NativeMethodAccessorImpl.invoke(NativeMethodAccessorImpl.java:62)
	at java.base/jdk.internal.reflect.DelegatingMethodAccessorImpl.invoke(DelegatingMethodAccessorImpl.java:43)
	at java.base/java.lang.reflect.Method.invoke(Method.java:566)
	at com.carrotsearch.randomizedtesting.RandomizedRunner.invoke(RandomizedRunner.java:1742)
	at com.carrotsearch.randomizedtesting.RandomizedRunner$6.evaluate(RandomizedRunner.java:875)
	at com.carrotsearch.randomizedtesting.RandomizedRunner$7.evaluate(RandomizedRunner.java:891)
	at com.carrotsearch.randomizedtesting.rules.StatementAdapter.evaluate(StatementAdapter.java:36)
	at com.carrotsearch.randomizedtesting.rules.SystemPropertiesRestoreRule$1.evaluate(SystemPropertiesRestoreRule.java:57)
	at org.apache.lucene.util.AbstractBeforeAfterRule$1.evaluate(AbstractBeforeAfterRule.java:45)
	at com.carrotsearch.randomizedtesting.rules.StatementAdapter.evaluate(StatementAdapter.java:36)
	at org.apache.lucene.util.TestRuleStoreClassName$1.evaluate(TestRuleStoreClassName.java:41)
	at com.carrotsearch.randomizedtesting.rules.NoShadowingOrOverridesOnMethodsRule$1.evaluate(NoShadowingOrOverridesOnMethodsRule.java:40)
	at com.carrotsearch.randomizedtesting.rules.NoShadowingOrOverridesOnMethodsRule$1.evaluate(NoShadowingOrOverridesOnMethodsRule.java:40)
	at com.carrotsearch.randomizedtesting.rules.StatementAdapter.evaluate(StatementAdapter.java:36)
	at com.carrotsearch.randomizedtesting.rules.StatementAdapter.evaluate(StatementAdapter.java:36)
	at org.apache.lucene.util.TestRuleAssertionsRequired$1.evaluate(TestRuleAssertionsRequired.java:53)
	at org.apache.lucene.util.TestRuleMarkFailure$1.evaluate(TestRuleMarkFailure.java:47)
	at org.apache.lucene.util.TestRuleIgnoreAfterMaxFailures$1.evaluate(TestRuleIgnoreAfterMaxFailures.java:64)
	at org.apache.lucene.util.TestRuleIgnoreTestSuites$1.evaluate(TestRuleIgnoreTestSuites.java:54)
	at com.carrotsearch.randomizedtesting.rules.StatementAdapter.evaluate(StatementAdapter.java:36)
	at com.carrotsearch.randomizedtesting.ThreadLeakControl$StatementRunner.run(ThreadLeakControl.java:368)
	at java.base/java.lang.Thread.run(Thread.java:834)


FAILED:  junit.framework.TestSuite.org.apache.solr.schema.SchemaApiFailureTest

Error Message:


Stack Trace:
java.util.concurrent.TimeoutException
	at __randomizedtesting.SeedInfo.seed([AECB038BD7CD4B3D]:0)
	at org.apache.solr.common.cloud.ZkStateReader.waitForState(ZkStateReader.java:1469)
	at org.apache.solr.client.solrj.impl.CloudSolrClient.waitForState(CloudSolrClient.java:450)
	at org.apache.solr.schema.SchemaApiFailureTest.setupCluster(SchemaApiFailureTest.java:43)
	at java.base/jdk.internal.reflect.NativeMethodAccessorImpl.invoke0(Native Method)
	at java.base/jdk.internal.reflect.NativeMethodAccessorImpl.invoke(NativeMethodAccessorImpl.java:62)
	at java.base/jdk.internal.reflect.DelegatingMethodAccessorImpl.invoke(DelegatingMethodAccessorImpl.java:43)
	at java.base/java.lang.reflect.Method.invoke(Method.java:566)
	at com.carrotsearch.randomizedtesting.RandomizedRunner.invoke(RandomizedRunner.java:1742)
	at com.carrotsearch.randomizedtesting.RandomizedRunner$6.evaluate(RandomizedRunner.java:875)
	at com.carrotsearch.randomizedtesting.RandomizedRunner$7.evaluate(RandomizedRunner.java:891)
	at com.carrotsearch.randomizedtesting.rules.StatementAdapter.evaluate(StatementAdapter.java:36)
	at com.carrotsearch.randomizedtesting.rules.SystemPropertiesRestoreRule$1.evaluate(SystemPropertiesRestoreRule.java:57)
	at org.apache.lucene.util.AbstractBeforeAfterRule$1.evaluate(AbstractBeforeAfterRule.java:45)
	at com.carrotsearch.randomizedtesting.rules.StatementAdapter.evaluate(StatementAdapter.java:36)
	at org.apache.lucene.util.TestRuleStoreClassName$1.evaluate(TestRuleStoreClassName.java:41)
	at com.carrotsearch.randomizedtesting.rules.NoShadowingOrOverridesOnMethodsRule$1.evaluate(NoShadowingOrOverridesOnMethodsRule.java:40)
	at com.carrotsearch.randomizedtesting.rules.NoShadowingOrOverridesOnMethodsRule$1.evaluate(NoShadowingOrOverridesOnMethodsRule.java:40)
	at com.carrotsearch.randomizedtesting.rules.StatementAdapter.evaluate(StatementAdapter.java:36)
	at com.carrotsearch.randomizedtesting.rules.StatementAdapter.evaluate(StatementAdapter.java:36)
	at org.apache.lucene.util.TestRuleAssertionsRequired$1.evaluate(TestRuleAssertionsRequired.java:53)
	at org.apache.lucene.util.TestRuleMarkFailure$1.evaluate(TestRuleMarkFailure.java:47)
	at org.apache.lucene.util.TestRuleIgnoreAfterMaxFailures$1.evaluate(TestRuleIgnoreAfterMaxFailures.java:64)
	at org.apache.lucene.util.TestRuleIgnoreTestSuites$1.evaluate(TestRuleIgnoreTestSuites.java:54)
	at com.carrotsearch.randomizedtesting.rules.StatementAdapter.evaluate(StatementAdapter.java:36)
	at com.carrotsearch.randomizedtesting.ThreadLeakControl$StatementRunner.run(ThreadLeakControl.java:368)
	at java.base/java.lang.Thread.run(Thread.java:834)


FAILED:  junit.framework.TestSuite.org.apache.solr.client.solrj.io.stream.StreamDecoratorTest

Error Message:
14 threads leaked from SUITE scope at org.apache.solr.client.solrj.io.stream.StreamDecoratorTest:     1) Thread[id=494, name=TEST-StreamDecoratorTest.testExecutorStream-seed#[D1C1AC8FE0928F20]-SendThread(127.0.0.1:44995), state=TIMED_WAITING, group=TGRP-StreamDecoratorTest]         at java.base@11/java.lang.Thread.sleep(Native Method)         at app//org.apache.zookeeper.client.StaticHostProvider.next(StaticHostProvider.java:105)         at app//org.apache.zookeeper.ClientCnxn$SendThread.startConnect(ClientCnxn.java:1000)         at app//org.apache.zookeeper.ClientCnxn$SendThread.run(ClientCnxn.java:1063)    2) Thread[id=495, name=TEST-StreamDecoratorTest.testExecutorStream-seed#[D1C1AC8FE0928F20]-EventThread, state=WAITING, group=TGRP-StreamDecoratorTest]         at java.base@11/jdk.internal.misc.Unsafe.park(Native Method)         at java.base@11/java.util.concurrent.locks.LockSupport.park(LockSupport.java:194)         at java.base@11/java.util.concurrent.locks.AbstractQueuedSynchronizer$ConditionObject.await(AbstractQueuedSynchronizer.java:2081)         at java.base@11/java.util.concurrent.LinkedBlockingQueue.take(LinkedBlockingQueue.java:433)         at app//org.apache.zookeeper.ClientCnxn$EventThread.run(ClientCnxn.java:502)    3) Thread[id=425, name=zkConnectionManagerCallback-198-thread-1, state=WAITING, group=TGRP-StreamDecoratorTest]         at java.base@11/jdk.internal.misc.Unsafe.park(Native Method)         at java.base@11/java.util.concurrent.locks.LockSupport.park(LockSupport.java:194)         at java.base@11/java.util.concurrent.locks.AbstractQueuedSynchronizer$ConditionObject.await(AbstractQueuedSynchronizer.java:2081)         at java.base@11/java.util.concurrent.LinkedBlockingQueue.take(LinkedBlockingQueue.java:433)         at java.base@11/java.util.concurrent.ThreadPoolExecutor.getTask(ThreadPoolExecutor.java:1054)         at java.base@11/java.util.concurrent.ThreadPoolExecutor.runWorker(ThreadPoolExecutor.java:1114)         at java.base@11/java.util.concurrent.ThreadPoolExecutor$Worker.run(ThreadPoolExecutor.java:628)         at java.base@11/java.lang.Thread.run(Thread.java:834)    4) Thread[id=423, name=TEST-StreamDecoratorTest.testParallelHavingStream-seed#[D1C1AC8FE0928F20]-SendThread(127.0.0.1:44995), state=TIMED_WAITING, group=TGRP-StreamDecoratorTest]         at java.base@11/java.lang.Thread.sleep(Native Method)         at app//org.apache.zookeeper.ClientCnxn$SendThread.run(ClientCnxn.java:1054)    5) Thread[id=496, name=zkConnectionManagerCallback-231-thread-1, state=WAITING, group=TGRP-StreamDecoratorTest]         at java.base@11/jdk.internal.misc.Unsafe.park(Native Method)         at java.base@11/java.util.concurrent.locks.LockSupport.park(LockSupport.java:194)         at java.base@11/java.util.concurrent.locks.AbstractQueuedSynchronizer$ConditionObject.await(AbstractQueuedSynchronizer.java:2081)         at java.base@11/java.util.concurrent.LinkedBlockingQueue.take(LinkedBlockingQueue.java:433)         at java.base@11/java.util.concurrent.ThreadPoolExecutor.getTask(ThreadPoolExecutor.java:1054)         at java.base@11/java.util.concurrent.ThreadPoolExecutor.runWorker(ThreadPoolExecutor.java:1114)         at java.base@11/java.util.concurrent.ThreadPoolExecutor$Worker.run(ThreadPoolExecutor.java:628)         at java.base@11/java.lang.Thread.run(Thread.java:834)    6) Thread[id=499, name=Connection evictor, state=TIMED_WAITING, group=TGRP-StreamDecoratorTest]         at java.base@11/java.lang.Thread.sleep(Native Method)         at app//org.apache.http.impl.client.IdleConnectionEvictor$1.run(IdleConnectionEvictor.java:66)         at java.base@11/java.lang.Thread.run(Thread.java:834)    7) Thread[id=428, name=Connection evictor, state=TIMED_WAITING, group=TGRP-StreamDecoratorTest]         at java.base@11/java.lang.Thread.sleep(Native Method)         at app//org.apache.http.impl.client.IdleConnectionEvictor$1.run(IdleConnectionEvictor.java:66)         at java.base@11/java.lang.Thread.run(Thread.java:834)    8) Thread[id=429, name=Connection evictor, state=TIMED_WAITING, group=TGRP-StreamDecoratorTest]         at java.base@11/java.lang.Thread.sleep(Native Method)         at app//org.apache.http.impl.client.IdleConnectionEvictor$1.run(IdleConnectionEvictor.java:66)         at java.base@11/java.lang.Thread.run(Thread.java:834)    9) Thread[id=500, name=Connection evictor, state=TIMED_WAITING, group=TGRP-StreamDecoratorTest]         at java.base@11/java.lang.Thread.sleep(Native Method)         at app//org.apache.http.impl.client.IdleConnectionEvictor$1.run(IdleConnectionEvictor.java:66)         at java.base@11/java.lang.Thread.run(Thread.java:834)   10) Thread[id=424, name=TEST-StreamDecoratorTest.testParallelHavingStream-seed#[D1C1AC8FE0928F20]-EventThread, state=WAITING, group=TGRP-StreamDecoratorTest]         at java.base@11/jdk.internal.misc.Unsafe.park(Native Method)         at java.base@11/java.util.concurrent.locks.LockSupport.park(LockSupport.java:194)         at java.base@11/java.util.concurrent.locks.AbstractQueuedSynchronizer$ConditionObject.await(AbstractQueuedSynchronizer.java:2081)         at java.base@11/java.util.concurrent.LinkedBlockingQueue.take(LinkedBlockingQueue.java:433)         at app//org.apache.zookeeper.ClientCnxn$EventThread.run(ClientCnxn.java:502)   11) Thread[id=422, name=Connection evictor, state=TIMED_WAITING, group=TGRP-StreamDecoratorTest]         at java.base@11/java.lang.Thread.sleep(Native Method)         at app//org.apache.http.impl.client.IdleConnectionEvictor$1.run(IdleConnectionEvictor.java:66)         at java.base@11/java.lang.Thread.run(Thread.java:834)   12) Thread[id=511, name=Connection evictor, state=TIMED_WAITING, group=TGRP-StreamDecoratorTest]         at java.base@11/java.lang.Thread.sleep(Native Method)         at app//org.apache.http.impl.client.IdleConnectionEvictor$1.run(IdleConnectionEvictor.java:66)         at java.base@11/java.lang.Thread.run(Thread.java:834)   13) Thread[id=508, name=Connection evictor, state=TIMED_WAITING, group=TGRP-StreamDecoratorTest]         at java.base@11/java.lang.Thread.sleep(Native Method)         at app//org.apache.http.impl.client.IdleConnectionEvictor$1.run(IdleConnectionEvictor.java:66)         at java.base@11/java.lang.Thread.run(Thread.java:834)   14) Thread[id=493, name=Connection evictor, state=TIMED_WAITING, group=TGRP-StreamDecoratorTest]         at java.base@11/java.lang.Thread.sleep(Native Method)         at app//org.apache.http.impl.client.IdleConnectionEvictor$1.run(IdleConnectionEvictor.java:66)         at java.base@11/java.lang.Thread.run(Thread.java:834)

Stack Trace:
com.carrotsearch.randomizedtesting.ThreadLeakError: 14 threads leaked from SUITE scope at org.apache.solr.client.solrj.io.stream.StreamDecoratorTest: 
   1) Thread[id=494, name=TEST-StreamDecoratorTest.testExecutorStream-seed#[D1C1AC8FE0928F20]-SendThread(127.0.0.1:44995), state=TIMED_WAITING, group=TGRP-StreamDecoratorTest]
        at java.base@11/java.lang.Thread.sleep(Native Method)
        at app//org.apache.zookeeper.client.StaticHostProvider.next(StaticHostProvider.java:105)
        at app//org.apache.zookeeper.ClientCnxn$SendThread.startConnect(ClientCnxn.java:1000)
        at app//org.apache.zookeeper.ClientCnxn$SendThread.run(ClientCnxn.java:1063)
   2) Thread[id=495, name=TEST-StreamDecoratorTest.testExecutorStream-seed#[D1C1AC8FE0928F20]-EventThread, state=WAITING, group=TGRP-StreamDecoratorTest]
        at java.base@11/jdk.internal.misc.Unsafe.park(Native Method)
        at java.base@11/java.util.concurrent.locks.LockSupport.park(LockSupport.java:194)
        at java.base@11/java.util.concurrent.locks.AbstractQueuedSynchronizer$ConditionObject.await(AbstractQueuedSynchronizer.java:2081)
        at java.base@11/java.util.concurrent.LinkedBlockingQueue.take(LinkedBlockingQueue.java:433)
        at app//org.apache.zookeeper.ClientCnxn$EventThread.run(ClientCnxn.java:502)
   3) Thread[id=425, name=zkConnectionManagerCallback-198-thread-1, state=WAITING, group=TGRP-StreamDecoratorTest]
        at java.base@11/jdk.internal.misc.Unsafe.park(Native Method)
        at java.base@11/java.util.concurrent.locks.LockSupport.park(LockSupport.java:194)
        at java.base@11/java.util.concurrent.locks.AbstractQueuedSynchronizer$ConditionObject.await(AbstractQueuedSynchronizer.java:2081)
        at java.base@11/java.util.concurrent.LinkedBlockingQueue.take(LinkedBlockingQueue.java:433)
        at java.base@11/java.util.concurrent.ThreadPoolExecutor.getTask(ThreadPoolExecutor.java:1054)
        at java.base@11/java.util.concurrent.ThreadPoolExecutor.runWorker(ThreadPoolExecutor.java:1114)
        at java.base@11/java.util.concurrent.ThreadPoolExecutor$Worker.run(ThreadPoolExecutor.java:628)
        at java.base@11/java.lang.Thread.run(Thread.java:834)
   4) Thread[id=423, name=TEST-StreamDecoratorTest.testParallelHavingStream-seed#[D1C1AC8FE0928F20]-SendThread(127.0.0.1:44995), state=TIMED_WAITING, group=TGRP-StreamDecoratorTest]
        at java.base@11/java.lang.Thread.sleep(Native Method)
        at app//org.apache.zookeeper.ClientCnxn$SendThread.run(ClientCnxn.java:1054)
   5) Thread[id=496, name=zkConnectionManagerCallback-231-thread-1, state=WAITING, group=TGRP-StreamDecoratorTest]
        at java.base@11/jdk.internal.misc.Unsafe.park(Native Method)
        at java.base@11/java.util.concurrent.locks.LockSupport.park(LockSupport.java:194)
        at java.base@11/java.util.concurrent.locks.AbstractQueuedSynchronizer$ConditionObject.await(AbstractQueuedSynchronizer.java:2081)
        at java.base@11/java.util.concurrent.LinkedBlockingQueue.take(LinkedBlockingQueue.java:433)
        at java.base@11/java.util.concurrent.ThreadPoolExecutor.getTask(ThreadPoolExecutor.java:1054)
        at java.base@11/java.util.concurrent.ThreadPoolExecutor.runWorker(ThreadPoolExecutor.java:1114)
        at java.base@11/java.util.concurrent.ThreadPoolExecutor$Worker.run(ThreadPoolExecutor.java:628)
        at java.base@11/java.lang.Thread.run(Thread.java:834)
   6) Thread[id=499, name=Connection evictor, state=TIMED_WAITING, group=TGRP-StreamDecoratorTest]
        at java.base@11/java.lang.Thread.sleep(Native Method)
        at app//org.apache.http.impl.client.IdleConnectionEvictor$1.run(IdleConnectionEvictor.java:66)
        at java.base@11/java.lang.Thread.run(Thread.java:834)
   7) Thread[id=428, name=Connection evictor, state=TIMED_WAITING, group=TGRP-StreamDecoratorTest]
        at java.base@11/java.lang.Thread.sleep(Native Method)
        at app//org.apache.http.impl.client.IdleConnectionEvictor$1.run(IdleConnectionEvictor.java:66)
        at java.base@11/java.lang.Thread.run(Thread.java:834)
   8) Thread[id=429, name=Connection evictor, state=TIMED_WAITING, group=TGRP-StreamDecoratorTest]
        at java.base@11/java.lang.Thread.sleep(Native Method)
        at app//org.apache.http.impl.client.IdleConnectionEvictor$1.run(IdleConnectionEvictor.java:66)
        at java.base@11/java.lang.Thread.run(Thread.java:834)
   9) Thread[id=500, name=Connection evictor, state=TIMED_WAITING, group=TGRP-StreamDecoratorTest]
        at java.base@11/java.lang.Thread.sleep(Native Method)
        at app//org.apache.http.impl.client.IdleConnectionEvictor$1.run(IdleConnectionEvictor.java:66)
        at java.base@11/java.lang.Thread.run(Thread.java:834)
  10) Thread[id=424, name=TEST-StreamDecoratorTest.testParallelHavingStream-seed#[D1C1AC8FE0928F20]-EventThread, state=WAITING, group=TGRP-StreamDecoratorTest]
        at java.base@11/jdk.internal.misc.Unsafe.park(Native Method)
        at java.base@11/java.util.concurrent.locks.LockSupport.park(LockSupport.java:194)
        at java.base@11/java.util.concurrent.locks.AbstractQueuedSynchronizer$ConditionObject.await(AbstractQueuedSynchronizer.java:2081)
        at java.base@11/java.util.concurrent.LinkedBlockingQueue.take(LinkedBlockingQueue.java:433)
        at app//org.apache.zookeeper.ClientCnxn$EventThread.run(ClientCnxn.java:502)
  11) Thread[id=422, name=Connection evictor, state=TIMED_WAITING, group=TGRP-StreamDecoratorTest]
        at java.base@11/java.lang.Thread.sleep(Native Method)
        at app//org.apache.http.impl.client.IdleConnectionEvictor$1.run(IdleConnectionEvictor.java:66)
        at java.base@11/java.lang.Thread.run(Thread.java:834)
  12) Thread[id=511, name=Connection evictor, state=TIMED_WAITING, group=TGRP-StreamDecoratorTest]
        at java.base@11/java.lang.Thread.sleep(Native Method)
        at app//org.apache.http.impl.client.IdleConnectionEvictor$1.run(IdleConnectionEvictor.java:66)
        at java.base@11/java.lang.Thread.run(Thread.java:834)
  13) Thread[id=508, name=Connection evictor, state=TIMED_WAITING, group=TGRP-StreamDecoratorTest]
        at java.base@11/java.lang.Thread.sleep(Native Method)
        at app//org.apache.http.impl.client.IdleConnectionEvictor$1.run(IdleConnectionEvictor.java:66)
        at java.base@11/java.lang.Thread.run(Thread.java:834)
  14) Thread[id=493, name=Connection evictor, state=TIMED_WAITING, group=TGRP-StreamDecoratorTest]
        at java.base@11/java.lang.Thread.sleep(Native Method)
        at app//org.apache.http.impl.client.IdleConnectionEvictor$1.run(IdleConnectionEvictor.java:66)
        at java.base@11/java.lang.Thread.run(Thread.java:834)
	at __randomizedtesting.SeedInfo.seed([D1C1AC8FE0928F20]:0)


FAILED:  junit.framework.TestSuite.org.apache.solr.client.solrj.io.stream.StreamDecoratorTest

Error Message:
There are still zombie threads that couldn't be terminated:    1) Thread[id=494, name=TEST-StreamDecoratorTest.testExecutorStream-seed#[D1C1AC8FE0928F20]-SendThread(127.0.0.1:44995), state=TIMED_WAITING, group=TGRP-StreamDecoratorTest]         at java.base@11/java.lang.Thread.sleep(Native Method)         at app//org.apache.zookeeper.ClientCnxn$SendThread.run(ClientCnxn.java:1054)    2) Thread[id=496, name=zkConnectionManagerCallback-231-thread-1, state=WAITING, group=TGRP-StreamDecoratorTest]         at java.base@11/jdk.internal.misc.Unsafe.park(Native Method)         at java.base@11/java.util.concurrent.locks.LockSupport.park(LockSupport.java:194)         at java.base@11/java.util.concurrent.locks.AbstractQueuedSynchronizer$ConditionObject.await(AbstractQueuedSynchronizer.java:2081)         at java.base@11/java.util.concurrent.LinkedBlockingQueue.take(LinkedBlockingQueue.java:433)         at java.base@11/java.util.concurrent.ThreadPoolExecutor.getTask(ThreadPoolExecutor.java:1054)         at java.base@11/java.util.concurrent.ThreadPoolExecutor.runWorker(ThreadPoolExecutor.java:1114)         at java.base@11/java.util.concurrent.ThreadPoolExecutor$Worker.run(ThreadPoolExecutor.java:628)         at java.base@11/java.lang.Thread.run(Thread.java:834)    3) Thread[id=425, name=zkConnectionManagerCallback-198-thread-1, state=WAITING, group=TGRP-StreamDecoratorTest]         at java.base@11/jdk.internal.misc.Unsafe.park(Native Method)         at java.base@11/java.util.concurrent.locks.LockSupport.park(LockSupport.java:194)         at java.base@11/java.util.concurrent.locks.AbstractQueuedSynchronizer$ConditionObject.await(AbstractQueuedSynchronizer.java:2081)         at java.base@11/java.util.concurrent.LinkedBlockingQueue.take(LinkedBlockingQueue.java:433)         at java.base@11/java.util.concurrent.ThreadPoolExecutor.getTask(ThreadPoolExecutor.java:1054)         at java.base@11/java.util.concurrent.ThreadPoolExecutor.runWorker(ThreadPoolExecutor.java:1114)         at java.base@11/java.util.concurrent.ThreadPoolExecutor$Worker.run(ThreadPoolExecutor.java:628)         at java.base@11/java.lang.Thread.run(Thread.java:834)    4) Thread[id=423, name=TEST-StreamDecoratorTest.testParallelHavingStream-seed#[D1C1AC8FE0928F20]-SendThread(127.0.0.1:44995), state=TIMED_WAITING, group=TGRP-StreamDecoratorTest]         at java.base@11/java.lang.Thread.sleep(Native Method)         at app//org.apache.zookeeper.client.StaticHostProvider.next(StaticHostProvider.java:105)         at app//org.apache.zookeeper.ClientCnxn$SendThread.startConnect(ClientCnxn.java:1000)         at app//org.apache.zookeeper.ClientCnxn$SendThread.run(ClientCnxn.java:1063)

Stack Trace:
com.carrotsearch.randomizedtesting.ThreadLeakError: There are still zombie threads that couldn't be terminated:
   1) Thread[id=494, name=TEST-StreamDecoratorTest.testExecutorStream-seed#[D1C1AC8FE0928F20]-SendThread(127.0.0.1:44995), state=TIMED_WAITING, group=TGRP-StreamDecoratorTest]
        at java.base@11/java.lang.Thread.sleep(Native Method)
        at app//org.apache.zookeeper.ClientCnxn$SendThread.run(ClientCnxn.java:1054)
   2) Thread[id=496, name=zkConnectionManagerCallback-231-thread-1, state=WAITING, group=TGRP-StreamDecoratorTest]
        at java.base@11/jdk.internal.misc.Unsafe.park(Native Method)
        at java.base@11/java.util.concurrent.locks.LockSupport.park(LockSupport.java:194)
        at java.base@11/java.util.concurrent.locks.AbstractQueuedSynchronizer$ConditionObject.await(AbstractQueuedSynchronizer.java:2081)
        at java.base@11/java.util.concurrent.LinkedBlockingQueue.take(LinkedBlockingQueue.java:433)
        at java.base@11/java.util.concurrent.ThreadPoolExecutor.getTask(ThreadPoolExecutor.java:1054)
        at java.base@11/java.util.concurrent.ThreadPoolExecutor.runWorker(ThreadPoolExecutor.java:1114)
        at java.base@11/java.util.concurrent.ThreadPoolExecutor$Worker.run(ThreadPoolExecutor.java:628)
        at java.base@11/java.lang.Thread.run(Thread.java:834)
   3) Thread[id=425, name=zkConnectionManagerCallback-198-thread-1, state=WAITING, group=TGRP-StreamDecoratorTest]
        at java.base@11/jdk.internal.misc.Unsafe.park(Native Method)
        at java.base@11/java.util.concurrent.locks.LockSupport.park(LockSupport.java:194)
        at java.base@11/java.util.concurrent.locks.AbstractQueuedSynchronizer$ConditionObject.await(AbstractQueuedSynchronizer.java:2081)
        at java.base@11/java.util.concurrent.LinkedBlockingQueue.take(LinkedBlockingQueue.java:433)
        at java.base@11/java.util.concurrent.ThreadPoolExecutor.getTask(ThreadPoolExecutor.java:1054)
        at java.base@11/java.util.concurrent.ThreadPoolExecutor.runWorker(ThreadPoolExecutor.java:1114)
        at java.base@11/java.util.concurrent.ThreadPoolExecutor$Worker.run(ThreadPoolExecutor.java:628)
        at java.base@11/java.lang.Thread.run(Thread.java:834)
   4) Thread[id=423, name=TEST-StreamDecoratorTest.testParallelHavingStream-seed#[D1C1AC8FE0928F20]-SendThread(127.0.0.1:44995), state=TIMED_WAITING, group=TGRP-StreamDecoratorTest]
        at java.base@11/java.lang.Thread.sleep(Native Method)
        at app//org.apache.zookeeper.client.StaticHostProvider.next(StaticHostProvider.java:105)
        at app//org.apache.zookeeper.ClientCnxn$SendThread.startConnect(ClientCnxn.java:1000)
        at app//org.apache.zookeeper.ClientCnxn$SendThread.run(ClientCnxn.java:1063)
	at __randomizedtesting.SeedInfo.seed([D1C1AC8FE0928F20]:0)


FAILED:  junit.framework.TestSuite.org.apache.solr.client.solrj.io.stream.StreamDecoratorTest

Error Message:
20 threads leaked from SUITE scope at org.apache.solr.client.solrj.io.stream.StreamDecoratorTest:     1) Thread[id=2057, name=TEST-StreamDecoratorTest.testParallelExecutorStream-seed#[D1C1AC8FE0928F20]-SendThread(127.0.0.1:35163), state=TIMED_WAITING, group=TGRP-StreamDecoratorTest]         at java.base@11/java.lang.Thread.sleep(Native Method)         at app//org.apache.zookeeper.client.StaticHostProvider.next(StaticHostProvider.java:105)         at app//org.apache.zookeeper.ClientCnxn$SendThread.startConnect(ClientCnxn.java:1000)         at app//org.apache.zookeeper.ClientCnxn$SendThread.run(ClientCnxn.java:1063)    2) Thread[id=2059, name=zkConnectionManagerCallback-1016-thread-1, state=WAITING, group=TGRP-StreamDecoratorTest]         at java.base@11/jdk.internal.misc.Unsafe.park(Native Method)         at java.base@11/java.util.concurrent.locks.LockSupport.park(LockSupport.java:194)         at java.base@11/java.util.concurrent.locks.AbstractQueuedSynchronizer$ConditionObject.await(AbstractQueuedSynchronizer.java:2081)         at java.base@11/java.util.concurrent.LinkedBlockingQueue.take(LinkedBlockingQueue.java:433)         at java.base@11/java.util.concurrent.ThreadPoolExecutor.getTask(ThreadPoolExecutor.java:1054)         at java.base@11/java.util.concurrent.ThreadPoolExecutor.runWorker(ThreadPoolExecutor.java:1114)         at java.base@11/java.util.concurrent.ThreadPoolExecutor$Worker.run(ThreadPoolExecutor.java:628)         at java.base@11/java.lang.Thread.run(Thread.java:834)    3) Thread[id=2058, name=TEST-StreamDecoratorTest.testParallelExecutorStream-seed#[D1C1AC8FE0928F20]-EventThread, state=WAITING, group=TGRP-StreamDecoratorTest]         at java.base@11/jdk.internal.misc.Unsafe.park(Native Method)         at java.base@11/java.util.concurrent.locks.LockSupport.park(LockSupport.java:194)         at java.base@11/java.util.concurrent.locks.AbstractQueuedSynchronizer$ConditionObject.await(AbstractQueuedSynchronizer.java:2081)         at java.base@11/java.util.concurrent.LinkedBlockingQueue.take(LinkedBlockingQueue.java:433)         at app//org.apache.zookeeper.ClientCnxn$EventThread.run(ClientCnxn.java:502)    4) Thread[id=431, name=zkConnectionManagerCallback-198-thread-1, state=WAITING, group=TGRP-StreamDecoratorTest]         at java.base@11/jdk.internal.misc.Unsafe.park(Native Method)         at java.base@11/java.util.concurrent.locks.LockSupport.park(LockSupport.java:194)         at java.base@11/java.util.concurrent.locks.AbstractQueuedSynchronizer$ConditionObject.await(AbstractQueuedSynchronizer.java:2081)         at java.base@11/java.util.concurrent.LinkedBlockingQueue.take(LinkedBlockingQueue.java:433)         at java.base@11/java.util.concurrent.ThreadPoolExecutor.getTask(ThreadPoolExecutor.java:1054)         at java.base@11/java.util.concurrent.ThreadPoolExecutor.runWorker(ThreadPoolExecutor.java:1114)         at java.base@11/java.util.concurrent.ThreadPoolExecutor$Worker.run(ThreadPoolExecutor.java:628)         at java.base@11/java.lang.Thread.run(Thread.java:834)    5) Thread[id=532, name=Connection evictor, state=TIMED_WAITING, group=TGRP-StreamDecoratorTest]         at java.base@11/java.lang.Thread.sleep(Native Method)         at app//org.apache.http.impl.client.IdleConnectionEvictor$1.run(IdleConnectionEvictor.java:66)         at java.base@11/java.lang.Thread.run(Thread.java:834)    6) Thread[id=435, name=Connection evictor, state=TIMED_WAITING, group=TGRP-StreamDecoratorTest]         at java.base@11/java.lang.Thread.sleep(Native Method)         at app//org.apache.http.impl.client.IdleConnectionEvictor$1.run(IdleConnectionEvictor.java:66)         at java.base@11/java.lang.Thread.run(Thread.java:834)    7) Thread[id=429, name=TEST-StreamDecoratorTest.testParallelHavingStream-seed#[D1C1AC8FE0928F20]-SendThread(127.0.0.1:35163), state=TIMED_WAITING, group=TGRP-StreamDecoratorTest]         at java.base@11/java.lang.Thread.sleep(Native Method)         at app//org.apache.zookeeper.client.StaticHostProvider.next(StaticHostProvider.java:105)         at app//org.apache.zookeeper.ClientCnxn$SendThread.startConnect(ClientCnxn.java:1000)         at app//org.apache.zookeeper.ClientCnxn$SendThread.run(ClientCnxn.java:1063)    8) Thread[id=517, name=zkConnectionManagerCallback-240-thread-1, state=WAITING, group=TGRP-StreamDecoratorTest]         at java.base@11/jdk.internal.misc.Unsafe.park(Native Method)         at java.base@11/java.util.concurrent.locks.LockSupport.park(LockSupport.java:194)         at java.base@11/java.util.concurrent.locks.AbstractQueuedSynchronizer$ConditionObject.await(AbstractQueuedSynchronizer.java:2081)         at java.base@11/java.util.concurrent.LinkedBlockingQueue.take(LinkedBlockingQueue.java:433)         at java.base@11/java.util.concurrent.ThreadPoolExecutor.getTask(ThreadPoolExecutor.java:1054)         at java.base@11/java.util.concurrent.ThreadPoolExecutor.runWorker(ThreadPoolExecutor.java:1114)         at java.base@11/java.util.concurrent.ThreadPoolExecutor$Worker.run(ThreadPoolExecutor.java:628)         at java.base@11/java.lang.Thread.run(Thread.java:834)    9) Thread[id=2062, name=Connection evictor, state=TIMED_WAITING, group=TGRP-StreamDecoratorTest]         at java.base@11/java.lang.Thread.sleep(Native Method)         at app//org.apache.http.impl.client.IdleConnectionEvictor$1.run(IdleConnectionEvictor.java:66)         at java.base@11/java.lang.Thread.run(Thread.java:834)   10) Thread[id=514, name=Connection evictor, state=TIMED_WAITING, group=TGRP-StreamDecoratorTest]         at java.base@11/java.lang.Thread.sleep(Native Method)         at app//org.apache.http.impl.client.IdleConnectionEvictor$1.run(IdleConnectionEvictor.java:66)         at java.base@11/java.lang.Thread.run(Thread.java:834)   11) Thread[id=430, name=TEST-StreamDecoratorTest.testParallelHavingStream-seed#[D1C1AC8FE0928F20]-EventThread, state=WAITING, group=TGRP-StreamDecoratorTest]         at java.base@11/jdk.internal.misc.Unsafe.park(Native Method)         at java.base@11/java.util.concurrent.locks.LockSupport.park(LockSupport.java:194)         at java.base@11/java.util.concurrent.locks.AbstractQueuedSynchronizer$ConditionObject.await(AbstractQueuedSynchronizer.java:2081)         at java.base@11/java.util.concurrent.LinkedBlockingQueue.take(LinkedBlockingQueue.java:433)         at app//org.apache.zookeeper.ClientCnxn$EventThread.run(ClientCnxn.java:502)   12) Thread[id=521, name=Connection evictor, state=TIMED_WAITING, group=TGRP-StreamDecoratorTest]         at java.base@11/java.lang.Thread.sleep(Native Method)         at app//org.apache.http.impl.client.IdleConnectionEvictor$1.run(IdleConnectionEvictor.java:66)         at java.base@11/java.lang.Thread.run(Thread.java:834)   13) Thread[id=2063, name=Connection evictor, state=TIMED_WAITING, group=TGRP-StreamDecoratorTest]         at java.base@11/java.lang.Thread.sleep(Native Method)         at app//org.apache.http.impl.client.IdleConnectionEvictor$1.run(IdleConnectionEvictor.java:66)         at java.base@11/java.lang.Thread.run(Thread.java:834)   14) Thread[id=2056, name=Connection evictor, state=TIMED_WAITING, group=TGRP-StreamDecoratorTest]         at java.base@11/java.lang.Thread.sleep(Native Method)         at app//org.apache.http.impl.client.IdleConnectionEvictor$1.run(IdleConnectionEvictor.java:66)         at java.base@11/java.lang.Thread.run(Thread.java:834)   15) Thread[id=434, name=Connection evictor, state=TIMED_WAITING, group=TGRP-StreamDecoratorTest]         at java.base@11/java.lang.Thread.sleep(Native Method)         at app//org.apache.http.impl.client.IdleConnectionEvictor$1.run(IdleConnectionEvictor.java:66)         at java.base@11/java.lang.Thread.run(Thread.java:834)   16) Thread[id=515, name=TEST-StreamDecoratorTest.testExecutorStream-seed#[D1C1AC8FE0928F20]-SendThread(127.0.0.1:35163), state=TIMED_WAITING, group=TGRP-StreamDecoratorTest]         at java.base@11/java.lang.Thread.sleep(Native Method)         at app//org.apache.zookeeper.ClientCnxn$SendThread.run(ClientCnxn.java:1054)   17) Thread[id=520, name=Connection evictor, state=TIMED_WAITING, group=TGRP-StreamDecoratorTest]         at java.base@11/java.lang.Thread.sleep(Native Method)         at app//org.apache.http.impl.client.IdleConnectionEvictor$1.run(IdleConnectionEvictor.java:66)         at java.base@11/java.lang.Thread.run(Thread.java:834)   18) Thread[id=529, name=Connection evictor, state=TIMED_WAITING, group=TGRP-StreamDecoratorTest]         at java.base@11/java.lang.Thread.sleep(Native Method)         at app//org.apache.http.impl.client.IdleConnectionEvictor$1.run(IdleConnectionEvictor.java:66)         at java.base@11/java.lang.Thread.run(Thread.java:834)   19) Thread[id=516, name=TEST-StreamDecoratorTest.testExecutorStream-seed#[D1C1AC8FE0928F20]-EventThread, state=WAITING, group=TGRP-StreamDecoratorTest]         at java.base@11/jdk.internal.misc.Unsafe.park(Native Method)         at java.base@11/java.util.concurrent.locks.LockSupport.park(LockSupport.java:194)         at java.base@11/java.util.concurrent.locks.AbstractQueuedSynchronizer$ConditionObject.await(AbstractQueuedSynchronizer.java:2081)         at java.base@11/java.util.concurrent.LinkedBlockingQueue.take(LinkedBlockingQueue.java:433)         at app//org.apache.zookeeper.ClientCnxn$EventThread.run(ClientCnxn.java:502)   20) Thread[id=428, name=Connection evictor, state=TIMED_WAITING, group=TGRP-StreamDecoratorTest]         at java.base@11/java.lang.Thread.sleep(Native Method)         at app//org.apache.http.impl.client.IdleConnectionEvictor$1.run(IdleConnectionEvictor.java:66)         at java.base@11/java.lang.Thread.run(Thread.java:834)

Stack Trace:
com.carrotsearch.randomizedtesting.ThreadLeakError: 20 threads leaked from SUITE scope at org.apache.solr.client.solrj.io.stream.StreamDecoratorTest: 
   1) Thread[id=2057, name=TEST-StreamDecoratorTest.testParallelExecutorStream-seed#[D1C1AC8FE0928F20]-SendThread(127.0.0.1:35163), state=TIMED_WAITING, group=TGRP-StreamDecoratorTest]
        at java.base@11/java.lang.Thread.sleep(Native Method)
        at app//org.apache.zookeeper.client.StaticHostProvider.next(StaticHostProvider.java:105)
        at app//org.apache.zookeeper.ClientCnxn$SendThread.startConnect(ClientCnxn.java:1000)
        at app//org.apache.zookeeper.ClientCnxn$SendThread.run(ClientCnxn.java:1063)
   2) Thread[id=2059, name=zkConnectionManagerCallback-1016-thread-1, state=WAITING, group=TGRP-StreamDecoratorTest]
        at java.base@11/jdk.internal.misc.Unsafe.park(Native Method)
        at java.base@11/java.util.concurrent.locks.LockSupport.park(LockSupport.java:194)
        at java.base@11/java.util.concurrent.locks.AbstractQueuedSynchronizer$ConditionObject.await(AbstractQueuedSynchronizer.java:2081)
        at java.base@11/java.util.concurrent.LinkedBlockingQueue.take(LinkedBlockingQueue.java:433)
        at java.base@11/java.util.concurrent.ThreadPoolExecutor.getTask(ThreadPoolExecutor.java:1054)
        at java.base@11/java.util.concurrent.ThreadPoolExecutor.runWorker(ThreadPoolExecutor.java:1114)
        at java.base@11/java.util.concurrent.ThreadPoolExecutor$Worker.run(ThreadPoolExecutor.java:628)
        at java.base@11/java.lang.Thread.run(Thread.java:834)
   3) Thread[id=2058, name=TEST-StreamDecoratorTest.testParallelExecutorStream-seed#[D1C1AC8FE0928F20]-EventThread, state=WAITING, group=TGRP-StreamDecoratorTest]
        at java.base@11/jdk.internal.misc.Unsafe.park(Native Method)
        at java.base@11/java.util.concurrent.locks.LockSupport.park(LockSupport.java:194)
        at java.base@11/java.util.concurrent.locks.AbstractQueuedSynchronizer$ConditionObject.await(AbstractQueuedSynchronizer.java:2081)
        at java.base@11/java.util.concurrent.LinkedBlockingQueue.take(LinkedBlockingQueue.java:433)
        at app//org.apache.zookeeper.ClientCnxn$EventThread.run(ClientCnxn.java:502)
   4) Thread[id=431, name=zkConnectionManagerCallback-198-thread-1, state=WAITING, group=TGRP-StreamDecoratorTest]
        at java.base@11/jdk.internal.misc.Unsafe.park(Native Method)
        at java.base@11/java.util.concurrent.locks.LockSupport.park(LockSupport.java:194)
        at java.base@11/java.util.concurrent.locks.AbstractQueuedSynchronizer$ConditionObject.await(AbstractQueuedSynchronizer.java:2081)
        at java.base@11/java.util.concurrent.LinkedBlockingQueue.take(LinkedBlockingQueue.java:433)
        at java.base@11/java.util.concurrent.ThreadPoolExecutor.getTask(ThreadPoolExecutor.java:1054)
        at java.base@11/java.util.concurrent.ThreadPoolExecutor.runWorker(ThreadPoolExecutor.java:1114)
        at java.base@11/java.util.concurrent.ThreadPoolExecutor$Worker.run(ThreadPoolExecutor.java:628)
        at java.base@11/java.lang.Thread.run(Thread.java:834)
   5) Thread[id=532, name=Connection evictor, state=TIMED_WAITING, group=TGRP-StreamDecoratorTest]
        at java.base@11/java.lang.Thread.sleep(Native Method)
        at app//org.apache.http.impl.client.IdleConnectionEvictor$1.run(IdleConnectionEvictor.java:66)
        at java.base@11/java.lang.Thread.run(Thread.java:834)
   6) Thread[id=435, name=Connection evictor, state=TIMED_WAITING, group=TGRP-StreamDecoratorTest]
        at java.base@11/java.lang.Thread.sleep(Native Method)
        at app//org.apache.http.impl.client.IdleConnectionEvictor$1.run(IdleConnectionEvictor.java:66)
        at java.base@11/java.lang.Thread.run(Thread.java:834)
   7) Thread[id=429, name=TEST-StreamDecoratorTest.testParallelHavingStream-seed#[D1C1AC8FE0928F20]-SendThread(127.0.0.1:35163), state=TIMED_WAITING, group=TGRP-StreamDecoratorTest]
        at java.base@11/java.lang.Thread.sleep(Native Method)
        at app//org.apache.zookeeper.client.StaticHostProvider.next(StaticHostProvider.java:105)
        at app//org.apache.zookeeper.ClientCnxn$SendThread.startConnect(ClientCnxn.java:1000)
        at app//org.apache.zookeeper.ClientCnxn$SendThread.run(ClientCnxn.java:1063)
   8) Thread[id=517, name=zkConnectionManagerCallback-240-thread-1, state=WAITING, group=TGRP-StreamDecoratorTest]
        at java.base@11/jdk.internal.misc.Unsafe.park(Native Method)
        at java.base@11/java.util.concurrent.locks.LockSupport.park(LockSupport.java:194)
        at java.base@11/java.util.concurrent.locks.AbstractQueuedSynchronizer$ConditionObject.await(AbstractQueuedSynchronizer.java:2081)
        at java.base@11/java.util.concurrent.LinkedBlockingQueue.take(LinkedBlockingQueue.java:433)
        at java.base@11/java.util.concurrent.ThreadPoolExecutor.getTask(ThreadPoolExecutor.java:1054)
        at java.base@11/java.util.concurrent.ThreadPoolExecutor.runWorker(ThreadPoolExecutor.java:1114)
        at java.base@11/java.util.concurrent.ThreadPoolExecutor$Worker.run(ThreadPoolExecutor.java:628)
        at java.base@11/java.lang.Thread.run(Thread.java:834)
   9) Thread[id=2062, name=Connection evictor, state=TIMED_WAITING, group=TGRP-StreamDecoratorTest]
        at java.base@11/java.lang.Thread.sleep(Native Method)
        at app//org.apache.http.impl.client.IdleConnectionEvictor$1.run(IdleConnectionEvictor.java:66)
        at java.base@11/java.lang.Thread.run(Thread.java:834)
  10) Thread[id=514, name=Connection evictor, state=TIMED_WAITING, group=TGRP-StreamDecoratorTest]
        at java.base@11/java.lang.Thread.sleep(Native Method)
        at app//org.apache.http.impl.client.IdleConnectionEvictor$1.run(IdleConnectionEvictor.java:66)
        at java.base@11/java.lang.Thread.run(Thread.java:834)
  11) Thread[id=430, name=TEST-StreamDecoratorTest.testParallelHavingStream-seed#[D1C1AC8FE0928F20]-EventThread, state=WAITING, group=TGRP-StreamDecoratorTest]
        at java.base@11/jdk.internal.misc.Unsafe.park(Native Method)
        at java.base@11/java.util.concurrent.locks.LockSupport.park(LockSupport.java:194)
        at java.base@11/java.util.concurrent.locks.AbstractQueuedSynchronizer$ConditionObject.await(AbstractQueuedSynchronizer.java:2081)
        at java.base@11/java.util.concurrent.LinkedBlockingQueue.take(LinkedBlockingQueue.java:433)
        at app//org.apache.zookeeper.ClientCnxn$EventThread.run(ClientCnxn.java:502)
  12) Thread[id=521, name=Connection evictor, state=TIMED_WAITING, group=TGRP-StreamDecoratorTest]
        at java.base@11/java.lang.Thread.sleep(Native Method)
        at app//org.apache.http.impl.client.IdleConnectionEvictor$1.run(IdleConnectionEvictor.java:66)
        at java.base@11/java.lang.Thread.run(Thread.java:834)
  13) Thread[id=2063, name=Connection evictor, state=TIMED_WAITING, group=TGRP-StreamDecoratorTest]
        at java.base@11/java.lang.Thread.sleep(Native Method)
        at app//org.apache.http.impl.client.IdleConnectionEvictor$1.run(IdleConnectionEvictor.java:66)
        at java.base@11/java.lang.Thread.run(Thread.java:834)
  14) Thread[id=2056, name=Connection evictor, state=TIMED_WAITING, group=TGRP-StreamDecoratorTest]
        at java.base@11/java.lang.Thread.sleep(Native Method)
        at app//org.apache.http.impl.client.IdleConnectionEvictor$1.run(IdleConnectionEvictor.java:66)
        at java.base@11/java.lang.Thread.run(Thread.java:834)
  15) Thread[id=434, name=Connection evictor, state=TIMED_WAITING, group=TGRP-StreamDecoratorTest]
        at java.base@11/java.lang.Thread.sleep(Native Method)
        at app//org.apache.http.impl.client.IdleConnectionEvictor$1.run(IdleConnectionEvictor.java:66)
        at java.base@11/java.lang.Thread.run(Thread.java:834)
  16) Thread[id=515, name=TEST-StreamDecoratorTest.testExecutorStream-seed#[D1C1AC8FE0928F20]-SendThread(127.0.0.1:35163), state=TIMED_WAITING, group=TGRP-StreamDecoratorTest]
        at java.base@11/java.lang.Thread.sleep(Native Method)
        at app//org.apache.zookeeper.ClientCnxn$SendThread.run(ClientCnxn.java:1054)
  17) Thread[id=520, name=Connection evictor, state=TIMED_WAITING, group=TGRP-StreamDecoratorTest]
        at java.base@11/java.lang.Thread.sleep(Native Method)
        at app//org.apache.http.impl.client.IdleConnectionEvictor$1.run(IdleConnectionEvictor.java:66)
        at java.base@11/java.lang.Thread.run(Thread.java:834)
  18) Thread[id=529, name=Connection evictor, state=TIMED_WAITING, group=TGRP-StreamDecoratorTest]
        at java.base@11/java.lang.Thread.sleep(Native Method)
        at app//org.apache.http.impl.client.IdleConnectionEvictor$1.run(IdleConnectionEvictor.java:66)
        at java.base@11/java.lang.Thread.run(Thread.java:834)
  19) Thread[id=516, name=TEST-StreamDecoratorTest.testExecutorStream-seed#[D1C1AC8FE0928F20]-EventThread, state=WAITING, group=TGRP-StreamDecoratorTest]
        at java.base@11/jdk.internal.misc.Unsafe.park(Native Method)
        at java.base@11/java.util.concurrent.locks.LockSupport.park(LockSupport.java:194)
        at java.base@11/java.util.concurrent.locks.AbstractQueuedSynchronizer$ConditionObject.await(AbstractQueuedSynchronizer.java:2081)
        at java.base@11/java.util.concurrent.LinkedBlockingQueue.take(LinkedBlockingQueue.java:433)
        at app//org.apache.zookeeper.ClientCnxn$EventThread.run(ClientCnxn.java:502)
  20) Thread[id=428, name=Connection evictor, state=TIMED_WAITING, group=TGRP-StreamDecoratorTest]
        at java.base@11/java.lang.Thread.sleep(Native Method)
        at app//org.apache.http.impl.client.IdleConnectionEvictor$1.run(IdleConnectionEvictor.java:66)
        at java.base@11/java.lang.Thread.run(Thread.java:834)
	at __randomizedtesting.SeedInfo.seed([D1C1AC8FE0928F20]:0)


FAILED:  junit.framework.TestSuite.org.apache.solr.client.solrj.io.stream.StreamDecoratorTest

Error Message:
There are still zombie threads that couldn't be terminated:    1) Thread[id=2057, name=TEST-StreamDecoratorTest.testParallelExecutorStream-seed#[D1C1AC8FE0928F20]-SendThread(127.0.0.1:35163), state=TIMED_WAITING, group=TGRP-StreamDecoratorTest]         at java.base@11/java.lang.Thread.sleep(Native Method)         at app//org.apache.zookeeper.client.StaticHostProvider.next(StaticHostProvider.java:105)         at app//org.apache.zookeeper.ClientCnxn$SendThread.startConnect(ClientCnxn.java:1000)         at app//org.apache.zookeeper.ClientCnxn$SendThread.run(ClientCnxn.java:1063)    2) Thread[id=429, name=TEST-StreamDecoratorTest.testParallelHavingStream-seed#[D1C1AC8FE0928F20]-SendThread(127.0.0.1:35163), state=TIMED_WAITING, group=TGRP-StreamDecoratorTest]         at java.base@11/java.lang.Thread.sleep(Native Method)         at app//org.apache.zookeeper.client.StaticHostProvider.next(StaticHostProvider.java:105)         at app//org.apache.zookeeper.ClientCnxn$SendThread.startConnect(ClientCnxn.java:1000)         at app//org.apache.zookeeper.ClientCnxn$SendThread.run(ClientCnxn.java:1063)    3) Thread[id=517, name=zkConnectionManagerCallback-240-thread-1, state=WAITING, group=TGRP-StreamDecoratorTest]         at java.base@11/jdk.internal.misc.Unsafe.park(Native Method)         at java.base@11/java.util.concurrent.locks.LockSupport.park(LockSupport.java:194)         at java.base@11/java.util.concurrent.locks.AbstractQueuedSynchronizer$ConditionObject.await(AbstractQueuedSynchronizer.java:2081)         at java.base@11/java.util.concurrent.LinkedBlockingQueue.take(LinkedBlockingQueue.java:433)         at java.base@11/java.util.concurrent.ThreadPoolExecutor.getTask(ThreadPoolExecutor.java:1054)         at java.base@11/java.util.concurrent.ThreadPoolExecutor.runWorker(ThreadPoolExecutor.java:1114)         at java.base@11/java.util.concurrent.ThreadPoolExecutor$Worker.run(ThreadPoolExecutor.java:628)         at java.base@11/java.lang.Thread.run(Thread.java:834)    4) Thread[id=2059, name=zkConnectionManagerCallback-1016-thread-1, state=WAITING, group=TGRP-StreamDecoratorTest]         at java.base@11/jdk.internal.misc.Unsafe.park(Native Method)         at java.base@11/java.util.concurrent.locks.LockSupport.park(LockSupport.java:194)         at java.base@11/java.util.concurrent.locks.AbstractQueuedSynchronizer$ConditionObject.await(AbstractQueuedSynchronizer.java:2081)         at java.base@11/java.util.concurrent.LinkedBlockingQueue.take(LinkedBlockingQueue.java:433)         at java.base@11/java.util.concurrent.ThreadPoolExecutor.getTask(ThreadPoolExecutor.java:1054)         at java.base@11/java.util.concurrent.ThreadPoolExecutor.runWorker(ThreadPoolExecutor.java:1114)         at java.base@11/java.util.concurrent.ThreadPoolExecutor$Worker.run(ThreadPoolExecutor.java:628)         at java.base@11/java.lang.Thread.run(Thread.java:834)    5) Thread[id=515, name=TEST-StreamDecoratorTest.testExecutorStream-seed#[D1C1AC8FE0928F20]-SendThread(127.0.0.1:35163), state=TIMED_WAITING, group=TGRP-StreamDecoratorTest]         at java.base@11/java.lang.Thread.sleep(Native Method)         at app//org.apache.zookeeper.ClientCnxn$SendThread.run(ClientCnxn.java:1054)    6) Thread[id=431, name=zkConnectionManagerCallback-198-thread-1, state=WAITING, group=TGRP-StreamDecoratorTest]         at java.base@11/jdk.internal.misc.Unsafe.park(Native Method)         at java.base@11/java.util.concurrent.locks.LockSupport.park(LockSupport.java:194)         at java.base@11/java.util.concurrent.locks.AbstractQueuedSynchronizer$ConditionObject.await(AbstractQueuedSynchronizer.java:2081)         at java.base@11/java.util.concurrent.LinkedBlockingQueue.take(LinkedBlockingQueue.java:433)         at java.base@11/java.util.concurrent.ThreadPoolExecutor.getTask(ThreadPoolExecutor.java:1054)         at java.base@11/java.util.concurrent.ThreadPoolExecutor.runWorker(ThreadPoolExecutor.java:1114)         at java.base@11/java.util.concurrent.ThreadPoolExecutor$Worker.run(ThreadPoolExecutor.java:628)         at java.base@11/java.lang.Thread.run(Thread.java:834)

Stack Trace:
com.carrotsearch.randomizedtesting.ThreadLeakError: There are still zombie threads that couldn't be terminated:
   1) Thread[id=2057, name=TEST-StreamDecoratorTest.testParallelExecutorStream-seed#[D1C1AC8FE0928F20]-SendThread(127.0.0.1:35163), state=TIMED_WAITING, group=TGRP-StreamDecoratorTest]
        at java.base@11/java.lang.Thread.sleep(Native Method)
        at app//org.apache.zookeeper.client.StaticHostProvider.next(StaticHostProvider.java:105)
        at app//org.apache.zookeeper.ClientCnxn$SendThread.startConnect(ClientCnxn.java:1000)
        at app//org.apache.zookeeper.ClientCnxn$SendThread.run(ClientCnxn.java:1063)
   2) Thread[id=429, name=TEST-StreamDecoratorTest.testParallelHavingStream-seed#[D1C1AC8FE0928F20]-SendThread(127.0.0.1:35163), state=TIMED_WAITING, group=TGRP-StreamDecoratorTest]
        at java.base@11/java.lang.Thread.sleep(Native Method)
        at app//org.apache.zookeeper.client.StaticHostProvider.next(StaticHostProvider.java:105)
        at app//org.apache.zookeeper.ClientCnxn$SendThread.startConnect(ClientCnxn.java:1000)
        at app//org.apache.zookeeper.ClientCnxn$SendThread.run(ClientCnxn.java:1063)
   3) Thread[id=517, name=zkConnectionManagerCallback-240-thread-1, state=WAITING, group=TGRP-StreamDecoratorTest]
        at java.base@11/jdk.internal.misc.Unsafe.park(Native Method)
        at java.base@11/java.util.concurrent.locks.LockSupport.park(LockSupport.java:194)
        at java.base@11/java.util.concurrent.locks.AbstractQueuedSynchronizer$ConditionObject.await(AbstractQueuedSynchronizer.java:2081)
        at java.base@11/java.util.concurrent.LinkedBlockingQueue.take(LinkedBlockingQueue.java:433)
        at java.base@11/java.util.concurrent.ThreadPoolExecutor.getTask(ThreadPoolExecutor.java:1054)
        at java.base@11/java.util.concurrent.ThreadPoolExecutor.runWorker(ThreadPoolExecutor.java:1114)
        at java.base@11/java.util.concurrent.ThreadPoolExecutor$Worker.run(ThreadPoolExecutor.java:628)
        at java.base@11/java.lang.Thread.run(Thread.java:834)
   4) Thread[id=2059, name=zkConnectionManagerCallback-1016-thread-1, state=WAITING, group=TGRP-StreamDecoratorTest]
        at java.base@11/jdk.internal.misc.Unsafe.park(Native Method)
        at java.base@11/java.util.concurrent.locks.LockSupport.park(LockSupport.java:194)
        at java.base@11/java.util.concurrent.locks.AbstractQueuedSynchronizer$ConditionObject.await(AbstractQueuedSynchronizer.java:2081)
        at java.base@11/java.util.concurrent.LinkedBlockingQueue.take(LinkedBlockingQueue.java:433)
        at java.base@11/java.util.concurrent.ThreadPoolExecutor.getTask(ThreadPoolExecutor.java:1054)
        at java.base@11/java.util.concurrent.ThreadPoolExecutor.runWorker(ThreadPoolExecutor.java:1114)
        at java.base@11/java.util.concurrent.ThreadPoolExecutor$Worker.run(ThreadPoolExecutor.java:628)
        at java.base@11/java.lang.Thread.run(Thread.java:834)
   5) Thread[id=515, name=TEST-StreamDecoratorTest.testExecutorStream-seed#[D1C1AC8FE0928F20]-SendThread(127.0.0.1:35163), state=TIMED_WAITING, group=TGRP-StreamDecoratorTest]
        at java.base@11/java.lang.Thread.sleep(Native Method)
        at app//org.apache.zookeeper.ClientCnxn$SendThread.run(ClientCnxn.java:1054)
   6) Thread[id=431, name=zkConnectionManagerCallback-198-thread-1, state=WAITING, group=TGRP-StreamDecoratorTest]
        at java.base@11/jdk.internal.misc.Unsafe.park(Native Method)
        at java.base@11/java.util.concurrent.locks.LockSupport.park(LockSupport.java:194)
        at java.base@11/java.util.concurrent.locks.AbstractQueuedSynchronizer$ConditionObject.await(AbstractQueuedSynchronizer.java:2081)
        at java.base@11/java.util.concurrent.LinkedBlockingQueue.take(LinkedBlockingQueue.java:433)
        at java.base@11/java.util.concurrent.ThreadPoolExecutor.getTask(ThreadPoolExecutor.java:1054)
        at java.base@11/java.util.concurrent.ThreadPoolExecutor.runWorker(ThreadPoolExecutor.java:1114)
        at java.base@11/java.util.concurrent.ThreadPoolExecutor$Worker.run(ThreadPoolExecutor.java:628)
        at java.base@11/java.lang.Thread.run(Thread.java:834)
	at __randomizedtesting.SeedInfo.seed([D1C1AC8FE0928F20]:0)


FAILED:  junit.framework.TestSuite.org.apache.solr.client.solrj.io.stream.StreamDecoratorTest

Error Message:
14 threads leaked from SUITE scope at org.apache.solr.client.solrj.io.stream.StreamDecoratorTest:     1) Thread[id=545, name=TEST-StreamDecoratorTest.testExecutorStream-seed#[D1C1AC8FE0928F20]-SendThread(127.0.0.1:35259), state=TIMED_WAITING, group=TGRP-StreamDecoratorTest]         at java.base@11/java.lang.Thread.sleep(Native Method)         at app//org.apache.zookeeper.client.StaticHostProvider.next(StaticHostProvider.java:105)         at app//org.apache.zookeeper.ClientCnxn$SendThread.startConnect(ClientCnxn.java:1000)         at app//org.apache.zookeeper.ClientCnxn$SendThread.run(ClientCnxn.java:1063)    2) Thread[id=547, name=zkConnectionManagerCallback-257-thread-1, state=WAITING, group=TGRP-StreamDecoratorTest]         at java.base@11/jdk.internal.misc.Unsafe.park(Native Method)         at java.base@11/java.util.concurrent.locks.LockSupport.park(LockSupport.java:194)         at java.base@11/java.util.concurrent.locks.AbstractQueuedSynchronizer$ConditionObject.await(AbstractQueuedSynchronizer.java:2081)         at java.base@11/java.util.concurrent.LinkedBlockingQueue.take(LinkedBlockingQueue.java:433)         at java.base@11/java.util.concurrent.ThreadPoolExecutor.getTask(ThreadPoolExecutor.java:1054)         at java.base@11/java.util.concurrent.ThreadPoolExecutor.runWorker(ThreadPoolExecutor.java:1114)         at java.base@11/java.util.concurrent.ThreadPoolExecutor$Worker.run(ThreadPoolExecutor.java:628)         at java.base@11/java.lang.Thread.run(Thread.java:834)    3) Thread[id=436, name=TEST-StreamDecoratorTest.testParallelHavingStream-seed#[D1C1AC8FE0928F20]-EventThread, state=WAITING, group=TGRP-StreamDecoratorTest]         at java.base@11/jdk.internal.misc.Unsafe.park(Native Method)         at java.base@11/java.util.concurrent.locks.LockSupport.park(LockSupport.java:194)         at java.base@11/java.util.concurrent.locks.AbstractQueuedSynchronizer$ConditionObject.await(AbstractQueuedSynchronizer.java:2081)         at java.base@11/java.util.concurrent.LinkedBlockingQueue.take(LinkedBlockingQueue.java:433)         at app//org.apache.zookeeper.ClientCnxn$EventThread.run(ClientCnxn.java:502)    4) Thread[id=550, name=Connection evictor, state=TIMED_WAITING, group=TGRP-StreamDecoratorTest]         at java.base@11/java.lang.Thread.sleep(Native Method)         at app//org.apache.http.impl.client.IdleConnectionEvictor$1.run(IdleConnectionEvictor.java:66)         at java.base@11/java.lang.Thread.run(Thread.java:834)    5) Thread[id=546, name=TEST-StreamDecoratorTest.testExecutorStream-seed#[D1C1AC8FE0928F20]-EventThread, state=WAITING, group=TGRP-StreamDecoratorTest]         at java.base@11/jdk.internal.misc.Unsafe.park(Native Method)         at java.base@11/java.util.concurrent.locks.LockSupport.park(LockSupport.java:194)         at java.base@11/java.util.concurrent.locks.AbstractQueuedSynchronizer$ConditionObject.await(AbstractQueuedSynchronizer.java:2081)         at java.base@11/java.util.concurrent.LinkedBlockingQueue.take(LinkedBlockingQueue.java:433)         at app//org.apache.zookeeper.ClientCnxn$EventThread.run(ClientCnxn.java:502)    6) Thread[id=435, name=TEST-StreamDecoratorTest.testParallelHavingStream-seed#[D1C1AC8FE0928F20]-SendThread(127.0.0.1:35259), state=TIMED_WAITING, group=TGRP-StreamDecoratorTest]         at java.base@11/java.lang.Thread.sleep(Native Method)         at app//org.apache.zookeeper.client.StaticHostProvider.next(StaticHostProvider.java:105)         at app//org.apache.zookeeper.ClientCnxn$SendThread.startConnect(ClientCnxn.java:1000)         at app//org.apache.zookeeper.ClientCnxn$SendThread.run(ClientCnxn.java:1063)    7) Thread[id=562, name=Connection evictor, state=TIMED_WAITING, group=TGRP-StreamDecoratorTest]         at java.base@11/java.lang.Thread.sleep(Native Method)         at app//org.apache.http.impl.client.IdleConnectionEvictor$1.run(IdleConnectionEvictor.java:66)         at java.base@11/java.lang.Thread.run(Thread.java:834)    8) Thread[id=434, name=Connection evictor, state=TIMED_WAITING, group=TGRP-StreamDecoratorTest]         at java.base@11/java.lang.Thread.sleep(Native Method)         at app//org.apache.http.impl.client.IdleConnectionEvictor$1.run(IdleConnectionEvictor.java:66)         at java.base@11/java.lang.Thread.run(Thread.java:834)    9) Thread[id=441, name=Connection evictor, state=TIMED_WAITING, group=TGRP-StreamDecoratorTest]         at java.base@11/java.lang.Thread.sleep(Native Method)         at app//org.apache.http.impl.client.IdleConnectionEvictor$1.run(IdleConnectionEvictor.java:66)         at java.base@11/java.lang.Thread.run(Thread.java:834)   10) Thread[id=551, name=Connection evictor, state=TIMED_WAITING, group=TGRP-StreamDecoratorTest]         at java.base@11/java.lang.Thread.sleep(Native Method)         at app//org.apache.http.impl.client.IdleConnectionEvictor$1.run(IdleConnectionEvictor.java:66)         at java.base@11/java.lang.Thread.run(Thread.java:834)   11) Thread[id=559, name=Connection evictor, state=TIMED_WAITING, group=TGRP-StreamDecoratorTest]         at java.base@11/java.lang.Thread.sleep(Native Method)         at app//org.apache.http.impl.client.IdleConnectionEvictor$1.run(IdleConnectionEvictor.java:66)         at java.base@11/java.lang.Thread.run(Thread.java:834)   12) Thread[id=440, name=Connection evictor, state=TIMED_WAITING, group=TGRP-StreamDecoratorTest]         at java.base@11/java.lang.Thread.sleep(Native Method)         at app//org.apache.http.impl.client.IdleConnectionEvictor$1.run(IdleConnectionEvictor.java:66)         at java.base@11/java.lang.Thread.run(Thread.java:834)   13) Thread[id=437, name=zkConnectionManagerCallback-204-thread-1, state=WAITING, group=TGRP-StreamDecoratorTest]         at java.base@11/jdk.internal.misc.Unsafe.park(Native Method)         at java.base@11/java.util.concurrent.locks.LockSupport.park(LockSupport.java:194)         at java.base@11/java.util.concurrent.locks.AbstractQueuedSynchronizer$ConditionObject.await(AbstractQueuedSynchronizer.java:2081)         at java.base@11/java.util.concurrent.LinkedBlockingQueue.take(LinkedBlockingQueue.java:433)         at java.base@11/java.util.concurrent.ThreadPoolExecutor.getTask(ThreadPoolExecutor.java:1054)         at java.base@11/java.util.concurrent.ThreadPoolExecutor.runWorker(ThreadPoolExecutor.java:1114)         at java.base@11/java.util.concurrent.ThreadPoolExecutor$Worker.run(ThreadPoolExecutor.java:628)         at java.base@11/java.lang.Thread.run(Thread.java:834)   14) Thread[id=544, name=Connection evictor, state=TIMED_WAITING, group=TGRP-StreamDecoratorTest]         at java.base@11/java.lang.Thread.sleep(Native Method)         at app//org.apache.http.impl.client.IdleConnectionEvictor$1.run(IdleConnectionEvictor.java:66)         at java.base@11/java.lang.Thread.run(Thread.java:834)

Stack Trace:
com.carrotsearch.randomizedtesting.ThreadLeakError: 14 threads leaked from SUITE scope at org.apache.solr.client.solrj.io.stream.StreamDecoratorTest: 
   1) Thread[id=545, name=TEST-StreamDecoratorTest.testExecutorStream-seed#[D1C1AC8FE0928F20]-SendThread(127.0.0.1:35259), state=TIMED_WAITING, group=TGRP-StreamDecoratorTest]
        at java.base@11/java.lang.Thread.sleep(Native Method)
        at app//org.apache.zookeeper.client.StaticHostProvider.next(StaticHostProvider.java:105)
        at app//org.apache.zookeeper.ClientCnxn$SendThread.startConnect(ClientCnxn.java:1000)
        at app//org.apache.zookeeper.ClientCnxn$SendThread.run(ClientCnxn.java:1063)
   2) Thread[id=547, name=zkConnectionManagerCallback-257-thread-1, state=WAITING, group=TGRP-StreamDecoratorTest]
        at java.base@11/jdk.internal.misc.Unsafe.park(Native Method)
        at java.base@11/java.util.concurrent.locks.LockSupport.park(LockSupport.java:194)
        at java.base@11/java.util.concurrent.locks.AbstractQueuedSynchronizer$ConditionObject.await(AbstractQueuedSynchronizer.java:2081)
        at java.base@11/java.util.concurrent.LinkedBlockingQueue.take(LinkedBlockingQueue.java:433)
        at java.base@11/java.util.concurrent.ThreadPoolExecutor.getTask(ThreadPoolExecutor.java:1054)
        at java.base@11/java.util.concurrent.ThreadPoolExecutor.runWorker(ThreadPoolExecutor.java:1114)
        at java.base@11/java.util.concurrent.ThreadPoolExecutor$Worker.run(ThreadPoolExecutor.java:628)
        at java.base@11/java.lang.Thread.run(Thread.java:834)
   3) Thread[id=436, name=TEST-StreamDecoratorTest.testParallelHavingStream-seed#[D1C1AC8FE0928F20]-EventThread, state=WAITING, group=TGRP-StreamDecoratorTest]
        at java.base@11/jdk.internal.misc.Unsafe.park(Native Method)
        at java.base@11/java.util.concurrent.locks.LockSupport.park(LockSupport.java:194)
        at java.base@11/java.util.concurrent.locks.AbstractQueuedSynchronizer$ConditionObject.await(AbstractQueuedSynchronizer.java:2081)
        at java.base@11/java.util.concurrent.LinkedBlockingQueue.take(LinkedBlockingQueue.java:433)
        at app//org.apache.zookeeper.ClientCnxn$EventThread.run(ClientCnxn.java:502)
   4) Thread[id=550, name=Connection evictor, state=TIMED_WAITING, group=TGRP-StreamDecoratorTest]
        at java.base@11/java.lang.Thread.sleep(Native Method)
        at app//org.apache.http.impl.client.IdleConnectionEvictor$1.run(IdleConnectionEvictor.java:66)
        at java.base@11/java.lang.Thread.run(Thread.java:834)
   5) Thread[id=546, name=TEST-StreamDecoratorTest.testExecutorStream-seed#[D1C1AC8FE0928F20]-EventThread, state=WAITING, group=TGRP-StreamDecoratorTest]
        at java.base@11/jdk.internal.misc.Unsafe.park(Native Method)
        at java.base@11/java.util.concurrent.locks.LockSupport.park(LockSupport.java:194)
        at java.base@11/java.util.concurrent.locks.AbstractQueuedSynchronizer$ConditionObject.await(AbstractQueuedSynchronizer.java:2081)
        at java.base@11/java.util.concurrent.LinkedBlockingQueue.take(LinkedBlockingQueue.java:433)
        at app//org.apache.zookeeper.ClientCnxn$EventThread.run(ClientCnxn.java:502)
   6) Thread[id=435, name=TEST-StreamDecoratorTest.testParallelHavingStream-seed#[D1C1AC8FE0928F20]-SendThread(127.0.0.1:35259), state=TIMED_WAITING, group=TGRP-StreamDecoratorTest]
        at java.base@11/java.lang.Thread.sleep(Native Method)
        at app//org.apache.zookeeper.client.StaticHostProvider.next(StaticHostProvider.java:105)
        at app//org.apache.zookeeper.ClientCnxn$SendThread.startConnect(ClientCnxn.java:1000)
        at app//org.apache.zookeeper.ClientCnxn$SendThread.run(ClientCnxn.java:1063)
   7) Thread[id=562, name=Connection evictor, state=TIMED_WAITING, group=TGRP-StreamDecoratorTest]
        at java.base@11/java.lang.Thread.sleep(Native Method)
        at app//org.apache.http.impl.client.IdleConnectionEvictor$1.run(IdleConnectionEvictor.java:66)
        at java.base@11/java.lang.Thread.run(Thread.java:834)
   8) Thread[id=434, name=Connection evictor, state=TIMED_WAITING, group=TGRP-StreamDecoratorTest]
        at java.base@11/java.lang.Thread.sleep(Native Method)
        at app//org.apache.http.impl.client.IdleConnectionEvictor$1.run(IdleConnectionEvictor.java:66)
        at java.base@11/java.lang.Thread.run(Thread.java:834)
   9) Thread[id=441, name=Connection evictor, state=TIMED_WAITING, group=TGRP-StreamDecoratorTest]
        at java.base@11/java.lang.Thread.sleep(Native Method)
        at app//org.apache.http.impl.client.IdleConnectionEvictor$1.run(IdleConnectionEvictor.java:66)
        at java.base@11/java.lang.Thread.run(Thread.java:834)
  10) Thread[id=551, name=Connection evictor, state=TIMED_WAITING, group=TGRP-StreamDecoratorTest]
        at java.base@11/java.lang.Thread.sleep(Native Method)
        at app//org.apache.http.impl.client.IdleConnectionEvictor$1.run(IdleConnectionEvictor.java:66)
        at java.base@11/java.lang.Thread.run(Thread.java:834)
  11) Thread[id=559, name=Connection evictor, state=TIMED_WAITING, group=TGRP-StreamDecoratorTest]
        at java.base@11/java.lang.Thread.sleep(Native Method)
        at app//org.apache.http.impl.client.IdleConnectionEvictor$1.run(IdleConnectionEvictor.java:66)
        at java.base@11/java.lang.Thread.run(Thread.java:834)
  12) Thread[id=440, name=Connection evictor, state=TIMED_WAITING, group=TGRP-StreamDecoratorTest]
        at java.base@11/java.lang.Thread.sleep(Native Method)
        at app//org.apache.http.impl.client.IdleConnectionEvictor$1.run(IdleConnectionEvictor.java:66)
        at java.base@11/java.lang.Thread.run(Thread.java:834)
  13) Thread[id=437, name=zkConnectionManagerCallback-204-thread-1, state=WAITING, group=TGRP-StreamDecoratorTest]
        at java.base@11/jdk.internal.misc.Unsafe.park(Native Method)
        at java.base@11/java.util.concurrent.locks.LockSupport.park(LockSupport.java:194)
        at java.base@11/java.util.concurrent.locks.AbstractQueuedSynchronizer$ConditionObject.await(AbstractQueuedSynchronizer.java:2081)
        at java.base@11/java.util.concurrent.LinkedBlockingQueue.take(LinkedBlockingQueue.java:433)
        at java.base@11/java.util.concurrent.ThreadPoolExecutor.getTask(ThreadPoolExecutor.java:1054)
        at java.base@11/java.util.concurrent.ThreadPoolExecutor.runWorker(ThreadPoolExecutor.java:1114)
        at java.base@11/java.util.concurrent.ThreadPoolExecutor$Worker.run(ThreadPoolExecutor.java:628)
        at java.base@11/java.lang.Thread.run(Thread.java:834)
  14) Thread[id=544, name=Connection evictor, state=TIMED_WAITING, group=TGRP-StreamDecoratorTest]
        at java.base@11/java.lang.Thread.sleep(Native Method)
        at app//org.apache.http.impl.client.IdleConnectionEvictor$1.run(IdleConnectionEvictor.java:66)
        at java.base@11/java.lang.Thread.run(Thread.java:834)
	at __randomizedtesting.SeedInfo.seed([D1C1AC8FE0928F20]:0)


FAILED:  junit.framework.TestSuite.org.apache.solr.client.solrj.io.stream.StreamDecoratorTest

Error Message:
There are still zombie threads that couldn't be terminated:    1) Thread[id=545, name=TEST-StreamDecoratorTest.testExecutorStream-seed#[D1C1AC8FE0928F20]-SendThread(127.0.0.1:35259), state=TIMED_WAITING, group=TGRP-StreamDecoratorTest]         at java.base@11/java.lang.Thread.sleep(Native Method)         at app//org.apache.zookeeper.client.StaticHostProvider.next(StaticHostProvider.java:105)         at app//org.apache.zookeeper.ClientCnxn$SendThread.startConnect(ClientCnxn.java:1000)         at app//org.apache.zookeeper.ClientCnxn$SendThread.run(ClientCnxn.java:1063)    2) Thread[id=547, name=zkConnectionManagerCallback-257-thread-1, state=WAITING, group=TGRP-StreamDecoratorTest]         at java.base@11/jdk.internal.misc.Unsafe.park(Native Method)         at java.base@11/java.util.concurrent.locks.LockSupport.park(LockSupport.java:194)         at java.base@11/java.util.concurrent.locks.AbstractQueuedSynchronizer$ConditionObject.await(AbstractQueuedSynchronizer.java:2081)         at java.base@11/java.util.concurrent.LinkedBlockingQueue.take(LinkedBlockingQueue.java:433)         at java.base@11/java.util.concurrent.ThreadPoolExecutor.getTask(ThreadPoolExecutor.java:1054)         at java.base@11/java.util.concurrent.ThreadPoolExecutor.runWorker(ThreadPoolExecutor.java:1114)         at java.base@11/java.util.concurrent.ThreadPoolExecutor$Worker.run(ThreadPoolExecutor.java:628)         at java.base@11/java.lang.Thread.run(Thread.java:834)    3) Thread[id=435, name=TEST-StreamDecoratorTest.testParallelHavingStream-seed#[D1C1AC8FE0928F20]-SendThread(127.0.0.1:35259), state=TIMED_WAITING, group=TGRP-StreamDecoratorTest]         at java.base@11/java.lang.Thread.sleep(Native Method)         at app//org.apache.zookeeper.client.StaticHostProvider.next(StaticHostProvider.java:105)         at app//org.apache.zookeeper.ClientCnxn$SendThread.startConnect(ClientCnxn.java:1000)         at app//org.apache.zookeeper.ClientCnxn$SendThread.run(ClientCnxn.java:1063)    4) Thread[id=437, name=zkConnectionManagerCallback-204-thread-1, state=WAITING, group=TGRP-StreamDecoratorTest]         at java.base@11/jdk.internal.misc.Unsafe.park(Native Method)         at java.base@11/java.util.concurrent.locks.LockSupport.park(LockSupport.java:194)         at java.base@11/java.util.concurrent.locks.AbstractQueuedSynchronizer$ConditionObject.await(AbstractQueuedSynchronizer.java:2081)         at java.base@11/java.util.concurrent.LinkedBlockingQueue.take(LinkedBlockingQueue.java:433)         at java.base@11/java.util.concurrent.ThreadPoolExecutor.getTask(ThreadPoolExecutor.java:1054)         at java.base@11/java.util.concurrent.ThreadPoolExecutor.runWorker(ThreadPoolExecutor.java:1114)         at java.base@11/java.util.concurrent.ThreadPoolExecutor$Worker.run(ThreadPoolExecutor.java:628)         at java.base@11/java.lang.Thread.run(Thread.java:834)

Stack Trace:
com.carrotsearch.randomizedtesting.ThreadLeakError: There are still zombie threads that couldn't be terminated:
   1) Thread[id=545, name=TEST-StreamDecoratorTest.testExecutorStream-seed#[D1C1AC8FE0928F20]-SendThread(127.0.0.1:35259), state=TIMED_WAITING, group=TGRP-StreamDecoratorTest]
        at java.base@11/java.lang.Thread.sleep(Native Method)
        at app//org.apache.zookeeper.client.StaticHostProvider.next(StaticHostProvider.java:105)
        at app//org.apache.zookeeper.ClientCnxn$SendThread.startConnect(ClientCnxn.java:1000)
        at app//org.apache.zookeeper.ClientCnxn$SendThread.run(ClientCnxn.java:1063)
   2) Thread[id=547, name=zkConnectionManagerCallback-257-thread-1, state=WAITING, group=TGRP-StreamDecoratorTest]
        at java.base@11/jdk.internal.misc.Unsafe.park(Native Method)
        at java.base@11/java.util.concurrent.locks.LockSupport.park(LockSupport.java:194)
        at java.base@11/java.util.concurrent.locks.AbstractQueuedSynchronizer$ConditionObject.await(AbstractQueuedSynchronizer.java:2081)
        at java.base@11/java.util.concurrent.LinkedBlockingQueue.take(LinkedBlockingQueue.java:433)
        at java.base@11/java.util.concurrent.ThreadPoolExecutor.getTask(ThreadPoolExecutor.java:1054)
        at java.base@11/java.util.concurrent.ThreadPoolExecutor.runWorker(ThreadPoolExecutor.java:1114)
        at java.base@11/java.util.concurrent.ThreadPoolExecutor$Worker.run(ThreadPoolExecutor.java:628)
        at java.base@11/java.lang.Thread.run(Thread.java:834)
   3) Thread[id=435, name=TEST-StreamDecoratorTest.testParallelHavingStream-seed#[D1C1AC8FE0928F20]-SendThread(127.0.0.1:35259), state=TIMED_WAITING, group=TGRP-StreamDecoratorTest]
        at java.base@11/java.lang.Thread.sleep(Native Method)
        at app//org.apache.zookeeper.client.StaticHostProvider.next(StaticHostProvider.java:105)
        at app//org.apache.zookeeper.ClientCnxn$SendThread.startConnect(ClientCnxn.java:1000)
        at app//org.apache.zookeeper.ClientCnxn$SendThread.run(ClientCnxn.java:1063)
   4) Thread[id=437, name=zkConnectionManagerCallback-204-thread-1, state=WAITING, group=TGRP-StreamDecoratorTest]
        at java.base@11/jdk.internal.misc.Unsafe.park(Native Method)
        at java.base@11/java.util.concurrent.locks.LockSupport.park(LockSupport.java:194)
        at java.base@11/java.util.concurrent.locks.AbstractQueuedSynchronizer$ConditionObject.await(AbstractQueuedSynchronizer.java:2081)
        at java.base@11/java.util.concurrent.LinkedBlockingQueue.take(LinkedBlockingQueue.java:433)
        at java.base@11/java.util.concurrent.ThreadPoolExecutor.getTask(ThreadPoolExecutor.java:1054)
        at java.base@11/java.util.concurrent.ThreadPoolExecutor.runWorker(ThreadPoolExecutor.java:1114)
        at java.base@11/java.util.concurrent.ThreadPoolExecutor$Worker.run(ThreadPoolExecutor.java:628)
        at java.base@11/java.lang.Thread.run(Thread.java:834)
	at __randomizedtesting.SeedInfo.seed([D1C1AC8FE0928F20]:0)


FAILED:  org.apache.solr.client.solrj.io.stream.StreamDecoratorTest.testParallelUniqueStream

Error Message:
java.util.concurrent.ExecutionException: java.io.IOException: --> https://127.0.0.1:44695/solr/collection1_shard2_replica_n2/:java.util.concurrent.ExecutionException: java.io.IOException: params q=*:*&fl=id,a_s,a_i,a_f&sort=a_f+asc,+a_i+asc&partitionKeys=a_f&distrib=false

Stack Trace:
java.io.IOException: java.util.concurrent.ExecutionException: java.io.IOException: --> https://127.0.0.1:44695/solr/collection1_shard2_replica_n2/:java.util.concurrent.ExecutionException: java.io.IOException: params q=*:*&fl=id,a_s,a_i,a_f&sort=a_f+asc,+a_i+asc&partitionKeys=a_f&distrib=false
	at __randomizedtesting.SeedInfo.seed([D1C1AC8FE0928F20:A11046E7227C3042]:0)
	at org.apache.solr.client.solrj.io.stream.CloudSolrStream.openStreams(CloudSolrStream.java:400)
	at org.apache.solr.client.solrj.io.stream.CloudSolrStream.open(CloudSolrStream.java:275)
	at org.apache.solr.client.solrj.io.stream.StreamDecoratorTest.getTuples(StreamDecoratorTest.java:3953)
	at org.apache.solr.client.solrj.io.stream.StreamDecoratorTest.testParallelUniqueStream(StreamDecoratorTest.java:1277)
	at java.base/jdk.internal.reflect.NativeMethodAccessorImpl.invoke0(Native Method)
	at java.base/jdk.internal.reflect.NativeMethodAccessorImpl.invoke(NativeMethodAccessorImpl.java:62)
	at java.base/jdk.internal.reflect.DelegatingMethodAccessorImpl.invoke(DelegatingMethodAccessorImpl.java:43)
	at java.base/java.lang.reflect.Method.invoke(Method.java:566)
	at com.carrotsearch.randomizedtesting.RandomizedRunner.invoke(RandomizedRunner.java:1742)
	at com.carrotsearch.randomizedtesting.RandomizedRunner$8.evaluate(RandomizedRunner.java:935)
	at com.carrotsearch.randomizedtesting.RandomizedRunner$9.evaluate(RandomizedRunner.java:971)
	at com.carrotsearch.randomizedtesting.RandomizedRunner$10.evaluate(RandomizedRunner.java:985)
	at com.carrotsearch.randomizedtesting.rules.SystemPropertiesRestoreRule$1.evaluate(SystemPropertiesRestoreRule.java:57)
	at org.apache.lucene.util.TestRuleSetupTeardownChained$1.evaluate(TestRuleSetupTeardownChained.java:49)
	at org.apache.lucene.util.AbstractBeforeAfterRule$1.evaluate(AbstractBeforeAfterRule.java:45)
	at org.apache.lucene.util.TestRuleThreadAndTestName$1.evaluate(TestRuleThreadAndTestName.java:48)
	at org.apache.lucene.util.TestRuleIgnoreAfterMaxFailures$1.evaluate(TestRuleIgnoreAfterMaxFailures.java:64)
	at org.apache.lucene.util.TestRuleMarkFailure$1.evaluate(TestRuleMarkFailure.java:47)
	at com.carrotsearch.randomizedtesting.rules.StatementAdapter.evaluate(StatementAdapter.java:36)
	at com.carrotsearch.randomizedtesting.ThreadLeakControl$StatementRunner.run(ThreadLeakControl.java:368)
	at com.carrotsearch.randomizedtesting.ThreadLeakControl.forkTimeoutingTask(ThreadLeakControl.java:817)
	at com.carrotsearch.randomizedtesting.ThreadLeakControl$3.evaluate(ThreadLeakControl.java:468)
	at com.carrotsearch.randomizedtesting.RandomizedRunner.runSingleTest(RandomizedRunner.java:944)
	at com.carrotsearch.randomizedtesting.RandomizedRunner$5.evaluate(RandomizedRunner.java:830)
	at com.carrotsearch.randomizedtesting.RandomizedRunner$6.evaluate(RandomizedRunner.java:880)
	at com.carrotsearch.randomizedtesting.RandomizedRunner$7.evaluate(RandomizedRunner.java:891)
	at com.carrotsearch.randomizedtesting.rules.StatementAdapter.evaluate(StatementAdapter.java:36)
	at com.carrotsearch.randomizedtesting.rules.SystemPropertiesRestoreRule$1.evaluate(SystemPropertiesRestoreRule.java:57)
	at org.apache.lucene.util.AbstractBeforeAfterRule$1.evaluate(AbstractBeforeAfterRule.java:45)
	at com.carrotsearch.randomizedtesting.rules.StatementAdapter.evaluate(StatementAdapter.java:36)
	at org.apache.lucene.util.TestRuleStoreClassName$1.evaluate(TestRuleStoreClassName.java:41)
	at com.carrotsearch.randomizedtesting.rules.NoShadowingOrOverridesOnMethodsRule$1.evaluate(NoShadowingOrOverridesOnMethodsRule.java:40)
	at com.carrotsearch.randomizedtesting.rules.NoShadowingOrOverridesOnMethodsRule$1.evaluate(NoShadowingOrOverridesOnMethodsRule.java:40)
	at com.carrotsearch.randomizedtesting.rules.StatementAdapter.evaluate(StatementAdapter.java:36)
	at com.carrotsearch.randomizedtesting.rules.StatementAdapter.evaluate(StatementAdapter.java:36)
	at org.apache.lucene.util.TestRuleAssertionsRequired$1.evaluate(TestRuleAssertionsRequired.java:53)
	at org.apache.lucene.util.TestRuleMarkFailure$1.evaluate(TestRuleMarkFailure.java:47)
	at org.apache.lucene.util.TestRuleIgnoreAfterMaxFailures$1.evaluate(TestRuleIgnoreAfterMaxFailures.java:64)
	at org.apache.lucene.util.TestRuleIgnoreTestSuites$1.evaluate(TestRuleIgnoreTestSuites.java:54)
	at com.carrotsearch.randomizedtesting.rules.StatementAdapter.evaluate(StatementAdapter.java:36)
	at com.carrotsearch.randomizedtesting.ThreadLeakControl$StatementRunner.run(ThreadLeakControl.java:368)
	at java.base/java.lang.Thread.run(Thread.java:834)
Caused by: java.util.concurrent.ExecutionException: java.io.IOException: --> https://127.0.0.1:44695/solr/collection1_shard2_replica_n2/:java.util.concurrent.ExecutionException: java.io.IOException: params q=*:*&fl=id,a_s,a_i,a_f&sort=a_f+asc,+a_i+asc&partitionKeys=a_f&distrib=false
	at java.base/java.util.concurrent.FutureTask.report(FutureTask.java:122)
	at java.base/java.util.concurrent.FutureTask.get(FutureTask.java:191)
	at org.apache.solr.client.solrj.io.stream.CloudSolrStream.openStreams(CloudSolrStream.java:394)
	... 41 more
Caused by: java.io.IOException: --> https://127.0.0.1:44695/solr/collection1_shard2_replica_n2/:java.util.concurrent.ExecutionException: java.io.IOException: params q=*:*&fl=id,a_s,a_i,a_f&sort=a_f+asc,+a_i+asc&partitionKeys=a_f&distrib=false
	at org.apache.solr.client.solrj.io.stream.SolrStream.read(SolrStream.java:215)
	at org.apache.solr.client.solrj.io.stream.CloudSolrStream$TupleWrapper.next(CloudSolrStream.java:484)
	at org.apache.solr.client.solrj.io.stream.CloudSolrStream$StreamOpener.call(CloudSolrStream.java:507)
	at org.apache.solr.client.solrj.io.stream.CloudSolrStream$StreamOpener.call(CloudSolrStream.java:494)
	at java.base/java.util.concurrent.FutureTask.run(FutureTask.java:264)
	at org.apache.solr.common.util.ExecutorUtil$MDCAwareThreadPoolExecutor.lambda$execute$0(ExecutorUtil.java:209)
	at java.base/java.util.concurrent.ThreadPoolExecutor.runWorker(ThreadPoolExecutor.java:1128)
	at java.base/java.util.concurrent.ThreadPoolExecutor$Worker.run(ThreadPoolExecutor.java:628)
	... 1 more


FAILED:  org.apache.solr.client.solrj.io.stream.StreamDecoratorTest.testParallelRollupStream

Error Message:
java.util.concurrent.ExecutionException: java.io.IOException: --> https://127.0.0.1:41909/solr/collection1_shard2_replica_n3/:java.util.concurrent.ExecutionException: java.io.

[...truncated too long message...]

60-thread-5) [    ] o.a.s.c.c.ZkStateReader Updated live nodes from ZooKeeper... (2) -> (1)
   [junit4]   2> 1064374 INFO  (zkCallback-146-thread-9) [    ] o.a.s.c.c.ZkStateReader Updated live nodes from ZooKeeper... (2) -> (1)
   [junit4]   2> 1064374 INFO  (zkCallback-139-thread-9) [    ] o.a.s.c.c.ZkStateReader Updated live nodes from ZooKeeper... (2) -> (1)
   [junit4]   2> 1064374 INFO  (zkCallback-153-thread-9) [    ] o.a.s.c.c.ZkStateReader Updated live nodes from ZooKeeper... (2) -> (1)
   [junit4]   2> 1064375 INFO  (jetty-closer-128-thread-2) [    ] o.e.j.s.h.ContextHandler Stopped o.e.j.s.ServletContextHandler@76a81f5f{/solr,null,UNAVAILABLE}
   [junit4]   2> 1064375 INFO  (jetty-closer-128-thread-2) [    ] o.e.j.s.session node0 Stopped scavenging
   [junit4]   2> 1064376 INFO  (jetty-closer-128-thread-1) [    ] o.a.s.m.SolrMetricManager Closing metric reporters for registry=solr.jetty, tag=null
   [junit4]   2> 1064376 INFO  (jetty-closer-128-thread-1) [    ] o.a.s.m.r.SolrJmxReporter Closing reporter [org.apache.solr.metrics.reporters.SolrJmxReporter@31b973bc: rootName = solr_46357, domain = solr.jetty, service url = null, agent id = null] for registry solr.jetty / com.codahale.metrics.MetricRegistry@4e45d356
   [junit4]   2> 1064377 INFO  (jetty-closer-128-thread-1) [    ] o.a.s.c.ZkController Remove node as live in ZooKeeper:/live_nodes/127.0.0.1:46357_solr
   [junit4]   2> 1064377 INFO  (jetty-closer-128-thread-1) [    ] o.a.s.m.SolrMetricManager Closing metric reporters for registry=solr.cluster, tag=null
   [junit4]   2> 1064377 INFO  (jetty-closer-128-thread-1) [    ] o.a.s.c.Overseer Overseer (id=72229297272324100-127.0.0.1:46357_solr-n_0000000000) closing
   [junit4]   2> 1064377 INFO  (zkCallback-146-thread-9) [    ] o.a.s.c.c.ZkStateReader Updated live nodes from ZooKeeper... (1) -> (0)
   [junit4]   2> 1064377 INFO  (OverseerStateUpdate-72229297272324100-127.0.0.1:46357_solr-n_0000000000) [n:127.0.0.1:46357_solr    ] o.a.s.c.Overseer Overseer Loop exiting : 127.0.0.1:46357_solr
   [junit4]   2> 1064377 WARN  (OverseerAutoScalingTriggerThread-72229297272324100-127.0.0.1:46357_solr-n_0000000000) [    ] o.a.s.c.a.OverseerTriggerThread OverseerTriggerThread woken up but we are closed, exiting.
   [junit4]   2> 1064377 INFO  (zkCallback-139-thread-9) [    ] o.a.s.c.c.ZkStateReader Updated live nodes from ZooKeeper... (1) -> (0)
   [junit4]   2> 1064380 DEBUG (jetty-closer-128-thread-1) [    ] o.a.s.c.a.ScheduledTriggers Shutting down scheduled thread pool executor now
   [junit4]   2> 1064383 DEBUG (jetty-closer-128-thread-1) [    ] o.a.s.c.a.ScheduledTriggers Shutting down action executor now
   [junit4]   2> 1064383 DEBUG (jetty-closer-128-thread-1) [    ] o.a.s.c.a.ScheduledTriggers Awaiting termination for action executor
   [junit4]   2> 1064383 DEBUG (jetty-closer-128-thread-1) [    ] o.a.s.c.a.ScheduledTriggers Awaiting termination for scheduled thread pool executor
   [junit4]   2> 1064383 DEBUG (jetty-closer-128-thread-1) [    ] o.a.s.c.a.ScheduledTriggers ScheduledTriggers closed completely
   [junit4]   2> 1064383 DEBUG (jetty-closer-128-thread-1) [    ] o.a.s.c.a.OverseerTriggerThread OverseerTriggerThread has been closed explicitly
   [junit4]   2> 1064388 INFO  (jetty-closer-128-thread-1) [    ] o.e.j.s.h.ContextHandler Stopped o.e.j.s.ServletContextHandler@56c6894a{/solr,null,UNAVAILABLE}
   [junit4]   2> 1064388 INFO  (jetty-closer-128-thread-1) [    ] o.e.j.s.session node0 Stopped scavenging
   [junit4]   2> 1064389 ERROR (SUITE-IndexSizeTriggerTest-seed#[AECB038BD7CD4B3D]-worker) [    ] o.a.z.s.ZooKeeperServer ZKShutdownHandler is not registered, so ZooKeeper server won't take any action on ERROR or SHUTDOWN server state changes
   [junit4]   2> 1064389 INFO  (SUITE-IndexSizeTriggerTest-seed#[AECB038BD7CD4B3D]-worker) [    ] o.a.s.c.ZkTestServer connecting to 127.0.0.1:40079 40079
   [junit4]   2> 1065265 INFO  (Thread-63) [    ] o.a.s.c.ZkTestServer connecting to 127.0.0.1:40079 40079
   [junit4]   2> 1065265 WARN  (Thread-63) [    ] o.a.s.c.ZkTestServer Watch limit violations: 
   [junit4]   2> Maximum concurrent create/delete watches above limit:
   [junit4]   2> 
   [junit4]   2> 	9	/solr/collections/testMergeIntegration_collection/terms/shard2
   [junit4]   2> 	9	/solr/aliases.json
   [junit4]   2> 	8	/solr/collections/testMixedBounds_collection/terms/shard2
   [junit4]   2> 	8	/solr/configs/conf
   [junit4]   2> 	8	/solr/collections/testTrigger_collection/terms/shard2
   [junit4]   2> 	8	/solr/collections/testSplitIntegration_collection/terms/shard2
   [junit4]   2> 	3	/solr/collections/testMixedBounds_collection/terms/shard1
   [junit4]   2> 	3	/solr/collections/testMergeIntegration_collection/terms/shard1
   [junit4]   2> 	3	/solr/collections/testTrigger_collection/terms/shard1
   [junit4]   2> 	3	/solr/collections/testSplitIntegration_collection/terms/shard1
   [junit4]   2> 	2	/solr/security.json
   [junit4]   2> 
   [junit4]   2> Maximum concurrent data watches above limit:
   [junit4]   2> 
   [junit4]   2> 	10	/solr/aliases.json
   [junit4]   2> 	9	/solr/clusterprops.json
   [junit4]   2> 	9	/solr/clusterstate.json
   [junit4]   2> 	4	/solr/collections/testTrigger_collection/state.json
   [junit4]   2> 	4	/solr/collections/testMixedBounds_collection/state.json
   [junit4]   2> 	4	/solr/collections/testMergeIntegration_collection/state.json
   [junit4]   2> 	3	/solr/collections/testSplitIntegration_collection/state.json
   [junit4]   2> 
   [junit4]   2> Maximum concurrent children watches above limit:
   [junit4]   2> 
   [junit4]   2> 	21	/solr/collections
   [junit4]   2> 	9	/solr/live_nodes
   [junit4]   2> 
   [junit4]   2> NOTE: leaving temporary files on disk at: /home/jenkins/workspace/Lucene-Solr-master-Linux/solr/build/solr-core/test/J2/temp/solr.cloud.autoscaling.IndexSizeTriggerTest_AECB038BD7CD4B3D-001
   [junit4]   2> NOTE: test params are: codec=Asserting(Lucene80): {}, docValues:{}, maxPointsInLeafNode=173, maxMBSortInHeap=7.480871801418186, sim=Asserting(org.apache.lucene.search.similarities.AssertingSimilarity@57a04dc9), locale=agq-CM, timezone=America/Cayman
   [junit4]   2> NOTE: Linux 4.15.0-32-generic amd64/Oracle Corporation 11 (64-bit)/cpus=8,threads=1,free=319152128,total=518979584
   [junit4]   2> NOTE: All tests run in this JVM: [MetricTriggerIntegrationTest, SchemaApiFailureTest, SchemaApiFailureTest, SchemaApiFailureTest, IndexSizeTriggerTest]
   [junit4] Completed [15/15 (14!)] on J2 in 550.94s, 4 tests, 4 failures <<< FAILURES!
   [junit4] 
   [junit4] 
   [junit4] Tests with failures [seed: AECB038BD7CD4B3D] (first 10 out of 18):
   [junit4]   - org.apache.solr.cloud.autoscaling.IndexSizeTriggerTest.testTrigger
   [junit4]   - org.apache.solr.cloud.autoscaling.MetricTriggerIntegrationTest.testMetricTrigger
   [junit4]   - org.apache.solr.cloud.autoscaling.MetricTriggerIntegrationTest.testMetricTrigger
   [junit4]   - org.apache.solr.cloud.autoscaling.MetricTriggerIntegrationTest.testMetricTrigger
   [junit4]   - org.apache.solr.schema.SchemaApiFailureTest (suite)
   [junit4]   - org.apache.solr.cloud.autoscaling.MetricTriggerIntegrationTest.testMetricTrigger
   [junit4]   - org.apache.solr.cloud.autoscaling.MetricTriggerIntegrationTest.testMetricTrigger
   [junit4]   - org.apache.solr.schema.SchemaApiFailureTest (suite)
   [junit4]   - org.apache.solr.schema.SchemaApiFailureTest (suite)
   [junit4]   - org.apache.solr.schema.SchemaApiFailureTest (suite)
   [junit4] 
   [junit4] 
   [junit4] JVM J0:     2.61 ..   726.68 =   724.07s
   [junit4] JVM J1:     2.61 ..   610.97 =   608.36s
   [junit4] JVM J2:     2.61 ..  1067.66 =  1065.05s
   [junit4] Execution time total: 17 minutes 47 seconds
   [junit4] Tests summary: 15 suites, 25 tests, 5 suite-level errors, 13 failures

BUILD FAILED
/home/jenkins/workspace/Lucene-Solr-master-Linux/lucene/common-build.xml:1567: The following error occurred while executing this line:
/home/jenkins/workspace/Lucene-Solr-master-Linux/lucene/common-build.xml:1092: There were test failures: 15 suites, 25 tests, 5 suite-level errors, 13 failures [seed: AECB038BD7CD4B3D]

Total time: 17 minutes 49 seconds

[repro] Setting last failure code to 256

[repro] Failures:
[repro]   3/5 failed: org.apache.solr.client.solrj.io.stream.StreamDecoratorTest
[repro]   4/5 failed: org.apache.solr.cloud.autoscaling.IndexSizeTriggerTest
[repro]   5/5 failed: org.apache.solr.cloud.autoscaling.MetricTriggerIntegrationTest
[repro]   5/5 failed: org.apache.solr.schema.SchemaApiFailureTest
[repro] Exiting with code 256
+ mv lucene/build lucene/build.repro
+ mv solr/build solr/build.repro
+ mv lucene/build.orig lucene/build
+ mv solr/build.orig solr/build
Archiving artifacts
Setting ANT_1_8_2_HOME=/var/lib/jenkins/tools/hudson.tasks.Ant_AntInstallation/ANT_1.8.2
[WARNINGS] Parsing warnings in console log with parser Java Compiler (javac)
Setting ANT_1_8_2_HOME=/var/lib/jenkins/tools/hudson.tasks.Ant_AntInstallation/ANT_1.8.2
Setting ANT_1_8_2_HOME=/var/lib/jenkins/tools/hudson.tasks.Ant_AntInstallation/ANT_1.8.2
<Git Blamer> Using GitBlamer to create author and commit information for all warnings.
<Git Blamer> GIT_COMMIT=39733cbf5ff9d8587d418007bd13087a434a1aa2, workspace=/var/lib/jenkins/workspace/Lucene-Solr-master-Linux
[WARNINGS] Computing warning deltas based on reference build #22861
Recording test results
Setting ANT_1_8_2_HOME=/var/lib/jenkins/tools/hudson.tasks.Ant_AntInstallation/ANT_1.8.2
Build step 'Publish JUnit test result report' changed build result to UNSTABLE
Email was triggered for: Unstable (Test Failures)
Sending email for trigger: Unstable (Test Failures)
Setting ANT_1_8_2_HOME=/var/lib/jenkins/tools/hudson.tasks.Ant_AntInstallation/ANT_1.8.2
Setting ANT_1_8_2_HOME=/var/lib/jenkins/tools/hudson.tasks.Ant_AntInstallation/ANT_1.8.2
Setting ANT_1_8_2_HOME=/var/lib/jenkins/tools/hudson.tasks.Ant_AntInstallation/ANT_1.8.2
Setting ANT_1_8_2_HOME=/var/lib/jenkins/tools/hudson.tasks.Ant_AntInstallation/ANT_1.8.2

Mime
View raw message