lucene-dev mailing list archives

Site index · List index
Message view « Date » · « Thread »
Top « Date » · « Thread »
From Policeman Jenkins Server <jenk...@thetaphi.de>
Subject [JENKINS] Lucene-Solr-master-Solaris (64bit/jdk1.8.0) - Build # 2070 - Still Unstable!
Date Sat, 22 Sep 2018 14:36:01 GMT
Build: https://jenkins.thetaphi.de/job/Lucene-Solr-master-Solaris/2070/
Java: 64bit/jdk1.8.0 -XX:-UseCompressedOops -XX:+UseG1GC

8 tests failed.
FAILED:  org.apache.lucene.search.TestSimpleExplanations.testBQ24

Error Message:
Test abandoned because suite timeout was reached.

Stack Trace:
java.lang.Exception: Test abandoned because suite timeout was reached.
	at __randomizedtesting.SeedInfo.seed([498EDC0E6CBAF35D]:0)


FAILED:  junit.framework.TestSuite.org.apache.lucene.search.TestSimpleExplanations

Error Message:
Suite timeout exceeded (>= 7200000 msec).

Stack Trace:
java.lang.Exception: Suite timeout exceeded (>= 7200000 msec).
	at __randomizedtesting.SeedInfo.seed([498EDC0E6CBAF35D]:0)


FAILED:  junit.framework.TestSuite.org.apache.solr.rest.TestManagedResourceStorage

Error Message:
SolrCore.getOpenCount()==2

Stack Trace:
java.lang.RuntimeException: SolrCore.getOpenCount()==2
	at __randomizedtesting.SeedInfo.seed([8368E5C57A9F8AC4]:0)
	at org.apache.solr.util.TestHarness.close(TestHarness.java:380)
	at org.apache.solr.SolrTestCaseJ4.deleteCore(SolrTestCaseJ4.java:802)
	at org.apache.solr.cloud.AbstractZkTestCase.azt_afterClass(AbstractZkTestCase.java:147)
	at sun.reflect.NativeMethodAccessorImpl.invoke0(Native Method)
	at sun.reflect.NativeMethodAccessorImpl.invoke(NativeMethodAccessorImpl.java:62)
	at sun.reflect.DelegatingMethodAccessorImpl.invoke(DelegatingMethodAccessorImpl.java:43)
	at java.lang.reflect.Method.invoke(Method.java:498)
	at com.carrotsearch.randomizedtesting.RandomizedRunner.invoke(RandomizedRunner.java:1742)
	at com.carrotsearch.randomizedtesting.RandomizedRunner$7.evaluate(RandomizedRunner.java:898)
	at com.carrotsearch.randomizedtesting.rules.StatementAdapter.evaluate(StatementAdapter.java:36)
	at com.carrotsearch.randomizedtesting.rules.SystemPropertiesRestoreRule$1.evaluate(SystemPropertiesRestoreRule.java:57)
	at org.apache.lucene.util.AbstractBeforeAfterRule$1.evaluate(AbstractBeforeAfterRule.java:45)
	at com.carrotsearch.randomizedtesting.rules.StatementAdapter.evaluate(StatementAdapter.java:36)
	at org.apache.lucene.util.TestRuleStoreClassName$1.evaluate(TestRuleStoreClassName.java:41)
	at com.carrotsearch.randomizedtesting.rules.NoShadowingOrOverridesOnMethodsRule$1.evaluate(NoShadowingOrOverridesOnMethodsRule.java:40)
	at com.carrotsearch.randomizedtesting.rules.NoShadowingOrOverridesOnMethodsRule$1.evaluate(NoShadowingOrOverridesOnMethodsRule.java:40)
	at com.carrotsearch.randomizedtesting.rules.StatementAdapter.evaluate(StatementAdapter.java:36)
	at com.carrotsearch.randomizedtesting.rules.StatementAdapter.evaluate(StatementAdapter.java:36)
	at com.carrotsearch.randomizedtesting.rules.StatementAdapter.evaluate(StatementAdapter.java:36)
	at org.apache.lucene.util.TestRuleAssertionsRequired$1.evaluate(TestRuleAssertionsRequired.java:53)
	at org.apache.lucene.util.TestRuleMarkFailure$1.evaluate(TestRuleMarkFailure.java:47)
	at org.apache.lucene.util.TestRuleIgnoreAfterMaxFailures$1.evaluate(TestRuleIgnoreAfterMaxFailures.java:64)
	at org.apache.lucene.util.TestRuleIgnoreTestSuites$1.evaluate(TestRuleIgnoreTestSuites.java:54)
	at com.carrotsearch.randomizedtesting.rules.StatementAdapter.evaluate(StatementAdapter.java:36)
	at com.carrotsearch.randomizedtesting.ThreadLeakControl$StatementRunner.run(ThreadLeakControl.java:368)
	at java.lang.Thread.run(Thread.java:748)


FAILED:  junit.framework.TestSuite.org.apache.solr.rest.TestManagedResourceStorage

Error Message:
4 threads leaked from SUITE scope at org.apache.solr.rest.TestManagedResourceStorage:     1) Thread[id=64, name=SessionTracker, state=TIMED_WAITING, group=TGRP-TestManagedResourceStorage]         at java.lang.Object.wait(Native Method)         at org.apache.zookeeper.server.SessionTrackerImpl.run(SessionTrackerImpl.java:147)    2) Thread[id=62, name=Thread-3, state=WAITING, group=TGRP-TestManagedResourceStorage]         at java.lang.Object.wait(Native Method)         at java.lang.Thread.join(Thread.java:1252)         at java.lang.Thread.join(Thread.java:1326)         at org.apache.zookeeper.server.NIOServerCnxnFactory.join(NIOServerCnxnFactory.java:313)         at org.apache.solr.cloud.ZkTestServer$ZKServerMain.runFromConfig(ZkTestServer.java:313)         at org.apache.solr.cloud.ZkTestServer$2.run(ZkTestServer.java:496)    3) Thread[id=63, name=NIOServerCxn.Factory:0.0.0.0/0.0.0.0:0, state=RUNNABLE, group=TGRP-TestManagedResourceStorage]         at sun.nio.ch.DevPollArrayWrapper.poll0(Native Method)         at sun.nio.ch.DevPollArrayWrapper.poll(DevPollArrayWrapper.java:223)         at sun.nio.ch.DevPollSelectorImpl.doSelect(DevPollSelectorImpl.java:98)         at sun.nio.ch.SelectorImpl.lockAndDoSelect(SelectorImpl.java:86)         at sun.nio.ch.SelectorImpl.select(SelectorImpl.java:97)         at org.apache.zookeeper.server.NIOServerCnxnFactory.run(NIOServerCnxnFactory.java:196)         at java.lang.Thread.run(Thread.java:748)    4) Thread[id=66, name=ProcessThread(sid:0 cport:64939):, state=WAITING, group=TGRP-TestManagedResourceStorage]         at sun.misc.Unsafe.park(Native Method)         at java.util.concurrent.locks.LockSupport.park(LockSupport.java:175)         at java.util.concurrent.locks.AbstractQueuedSynchronizer$ConditionObject.await(AbstractQueuedSynchronizer.java:2039)         at java.util.concurrent.LinkedBlockingQueue.take(LinkedBlockingQueue.java:442)         at org.apache.zookeeper.server.PrepRequestProcessor.run(PrepRequestProcessor.java:123)

Stack Trace:
com.carrotsearch.randomizedtesting.ThreadLeakError: 4 threads leaked from SUITE scope at org.apache.solr.rest.TestManagedResourceStorage: 
   1) Thread[id=64, name=SessionTracker, state=TIMED_WAITING, group=TGRP-TestManagedResourceStorage]
        at java.lang.Object.wait(Native Method)
        at org.apache.zookeeper.server.SessionTrackerImpl.run(SessionTrackerImpl.java:147)
   2) Thread[id=62, name=Thread-3, state=WAITING, group=TGRP-TestManagedResourceStorage]
        at java.lang.Object.wait(Native Method)
        at java.lang.Thread.join(Thread.java:1252)
        at java.lang.Thread.join(Thread.java:1326)
        at org.apache.zookeeper.server.NIOServerCnxnFactory.join(NIOServerCnxnFactory.java:313)
        at org.apache.solr.cloud.ZkTestServer$ZKServerMain.runFromConfig(ZkTestServer.java:313)
        at org.apache.solr.cloud.ZkTestServer$2.run(ZkTestServer.java:496)
   3) Thread[id=63, name=NIOServerCxn.Factory:0.0.0.0/0.0.0.0:0, state=RUNNABLE, group=TGRP-TestManagedResourceStorage]
        at sun.nio.ch.DevPollArrayWrapper.poll0(Native Method)
        at sun.nio.ch.DevPollArrayWrapper.poll(DevPollArrayWrapper.java:223)
        at sun.nio.ch.DevPollSelectorImpl.doSelect(DevPollSelectorImpl.java:98)
        at sun.nio.ch.SelectorImpl.lockAndDoSelect(SelectorImpl.java:86)
        at sun.nio.ch.SelectorImpl.select(SelectorImpl.java:97)
        at org.apache.zookeeper.server.NIOServerCnxnFactory.run(NIOServerCnxnFactory.java:196)
        at java.lang.Thread.run(Thread.java:748)
   4) Thread[id=66, name=ProcessThread(sid:0 cport:64939):, state=WAITING, group=TGRP-TestManagedResourceStorage]
        at sun.misc.Unsafe.park(Native Method)
        at java.util.concurrent.locks.LockSupport.park(LockSupport.java:175)
        at java.util.concurrent.locks.AbstractQueuedSynchronizer$ConditionObject.await(AbstractQueuedSynchronizer.java:2039)
        at java.util.concurrent.LinkedBlockingQueue.take(LinkedBlockingQueue.java:442)
        at org.apache.zookeeper.server.PrepRequestProcessor.run(PrepRequestProcessor.java:123)
	at __randomizedtesting.SeedInfo.seed([8368E5C57A9F8AC4]:0)


FAILED:  junit.framework.TestSuite.org.apache.solr.rest.TestManagedResourceStorage

Error Message:
There are still zombie threads that couldn't be terminated:    1) Thread[id=63, name=NIOServerCxn.Factory:0.0.0.0/0.0.0.0:0, state=RUNNABLE, group=TGRP-TestManagedResourceStorage]         at sun.nio.ch.DevPollArrayWrapper.interrupt(Native Method)         at sun.nio.ch.DevPollArrayWrapper.interrupt(DevPollArrayWrapper.java:300)         at sun.nio.ch.DevPollSelectorImpl.wakeup(DevPollSelectorImpl.java:207)         at java.nio.channels.spi.AbstractSelector$1.interrupt(AbstractSelector.java:213)         at java.nio.channels.spi.AbstractSelector.begin(AbstractSelector.java:219)         at sun.nio.ch.DevPollSelectorImpl.doSelect(DevPollSelectorImpl.java:97)         at sun.nio.ch.SelectorImpl.lockAndDoSelect(SelectorImpl.java:86)         at sun.nio.ch.SelectorImpl.select(SelectorImpl.java:97)         at org.apache.zookeeper.server.NIOServerCnxnFactory.run(NIOServerCnxnFactory.java:196)         at java.lang.Thread.run(Thread.java:748)

Stack Trace:
com.carrotsearch.randomizedtesting.ThreadLeakError: There are still zombie threads that couldn't be terminated:
   1) Thread[id=63, name=NIOServerCxn.Factory:0.0.0.0/0.0.0.0:0, state=RUNNABLE, group=TGRP-TestManagedResourceStorage]
        at sun.nio.ch.DevPollArrayWrapper.interrupt(Native Method)
        at sun.nio.ch.DevPollArrayWrapper.interrupt(DevPollArrayWrapper.java:300)
        at sun.nio.ch.DevPollSelectorImpl.wakeup(DevPollSelectorImpl.java:207)
        at java.nio.channels.spi.AbstractSelector$1.interrupt(AbstractSelector.java:213)
        at java.nio.channels.spi.AbstractSelector.begin(AbstractSelector.java:219)
        at sun.nio.ch.DevPollSelectorImpl.doSelect(DevPollSelectorImpl.java:97)
        at sun.nio.ch.SelectorImpl.lockAndDoSelect(SelectorImpl.java:86)
        at sun.nio.ch.SelectorImpl.select(SelectorImpl.java:97)
        at org.apache.zookeeper.server.NIOServerCnxnFactory.run(NIOServerCnxnFactory.java:196)
        at java.lang.Thread.run(Thread.java:748)
	at __randomizedtesting.SeedInfo.seed([8368E5C57A9F8AC4]:0)


FAILED:  junit.framework.TestSuite.org.apache.solr.rest.TestManagedResourceStorage

Error Message:
SolrCore.getOpenCount()==2

Stack Trace:
java.lang.RuntimeException: SolrCore.getOpenCount()==2
	at __randomizedtesting.SeedInfo.seed([8368E5C57A9F8AC4]:0)
	at org.apache.solr.util.TestHarness.close(TestHarness.java:380)
	at org.apache.solr.SolrTestCaseJ4.deleteCore(SolrTestCaseJ4.java:802)
	at org.apache.solr.cloud.AbstractZkTestCase.azt_afterClass(AbstractZkTestCase.java:147)
	at sun.reflect.NativeMethodAccessorImpl.invoke0(Native Method)
	at sun.reflect.NativeMethodAccessorImpl.invoke(NativeMethodAccessorImpl.java:62)
	at sun.reflect.DelegatingMethodAccessorImpl.invoke(DelegatingMethodAccessorImpl.java:43)
	at java.lang.reflect.Method.invoke(Method.java:498)
	at com.carrotsearch.randomizedtesting.RandomizedRunner.invoke(RandomizedRunner.java:1742)
	at com.carrotsearch.randomizedtesting.RandomizedRunner$7.evaluate(RandomizedRunner.java:898)
	at com.carrotsearch.randomizedtesting.rules.StatementAdapter.evaluate(StatementAdapter.java:36)
	at com.carrotsearch.randomizedtesting.rules.SystemPropertiesRestoreRule$1.evaluate(SystemPropertiesRestoreRule.java:57)
	at org.apache.lucene.util.AbstractBeforeAfterRule$1.evaluate(AbstractBeforeAfterRule.java:45)
	at com.carrotsearch.randomizedtesting.rules.StatementAdapter.evaluate(StatementAdapter.java:36)
	at org.apache.lucene.util.TestRuleStoreClassName$1.evaluate(TestRuleStoreClassName.java:41)
	at com.carrotsearch.randomizedtesting.rules.NoShadowingOrOverridesOnMethodsRule$1.evaluate(NoShadowingOrOverridesOnMethodsRule.java:40)
	at com.carrotsearch.randomizedtesting.rules.NoShadowingOrOverridesOnMethodsRule$1.evaluate(NoShadowingOrOverridesOnMethodsRule.java:40)
	at com.carrotsearch.randomizedtesting.rules.StatementAdapter.evaluate(StatementAdapter.java:36)
	at com.carrotsearch.randomizedtesting.rules.StatementAdapter.evaluate(StatementAdapter.java:36)
	at com.carrotsearch.randomizedtesting.rules.StatementAdapter.evaluate(StatementAdapter.java:36)
	at org.apache.lucene.util.TestRuleAssertionsRequired$1.evaluate(TestRuleAssertionsRequired.java:53)
	at org.apache.lucene.util.TestRuleMarkFailure$1.evaluate(TestRuleMarkFailure.java:47)
	at org.apache.lucene.util.TestRuleIgnoreAfterMaxFailures$1.evaluate(TestRuleIgnoreAfterMaxFailures.java:64)
	at org.apache.lucene.util.TestRuleIgnoreTestSuites$1.evaluate(TestRuleIgnoreTestSuites.java:54)
	at com.carrotsearch.randomizedtesting.rules.StatementAdapter.evaluate(StatementAdapter.java:36)
	at com.carrotsearch.randomizedtesting.ThreadLeakControl$StatementRunner.run(ThreadLeakControl.java:368)
	at java.lang.Thread.run(Thread.java:748)


FAILED:  junit.framework.TestSuite.org.apache.solr.rest.TestManagedResourceStorage

Error Message:
4 threads leaked from SUITE scope at org.apache.solr.rest.TestManagedResourceStorage:     1) Thread[id=4770, name=NIOServerCxn.Factory:0.0.0.0/0.0.0.0:0, state=RUNNABLE, group=TGRP-TestManagedResourceStorage]         at sun.nio.ch.DevPollArrayWrapper.poll0(Native Method)         at sun.nio.ch.DevPollArrayWrapper.poll(DevPollArrayWrapper.java:223)         at sun.nio.ch.DevPollSelectorImpl.doSelect(DevPollSelectorImpl.java:98)         at sun.nio.ch.SelectorImpl.lockAndDoSelect(SelectorImpl.java:86)         at sun.nio.ch.SelectorImpl.select(SelectorImpl.java:97)         at org.apache.zookeeper.server.NIOServerCnxnFactory.run(NIOServerCnxnFactory.java:196)         at java.lang.Thread.run(Thread.java:748)    2) Thread[id=4769, name=Thread-746, state=WAITING, group=TGRP-TestManagedResourceStorage]         at java.lang.Object.wait(Native Method)         at java.lang.Thread.join(Thread.java:1252)         at java.lang.Thread.join(Thread.java:1326)         at org.apache.zookeeper.server.NIOServerCnxnFactory.join(NIOServerCnxnFactory.java:313)         at org.apache.solr.cloud.ZkTestServer$ZKServerMain.runFromConfig(ZkTestServer.java:313)         at org.apache.solr.cloud.ZkTestServer$2.run(ZkTestServer.java:496)    3) Thread[id=4771, name=SessionTracker, state=TIMED_WAITING, group=TGRP-TestManagedResourceStorage]         at java.lang.Object.wait(Native Method)         at org.apache.zookeeper.server.SessionTrackerImpl.run(SessionTrackerImpl.java:147)    4) Thread[id=4773, name=ProcessThread(sid:0 cport:51027):, state=WAITING, group=TGRP-TestManagedResourceStorage]         at sun.misc.Unsafe.park(Native Method)         at java.util.concurrent.locks.LockSupport.park(LockSupport.java:175)         at java.util.concurrent.locks.AbstractQueuedSynchronizer$ConditionObject.await(AbstractQueuedSynchronizer.java:2039)         at java.util.concurrent.LinkedBlockingQueue.take(LinkedBlockingQueue.java:442)         at org.apache.zookeeper.server.PrepRequestProcessor.run(PrepRequestProcessor.java:123)

Stack Trace:
com.carrotsearch.randomizedtesting.ThreadLeakError: 4 threads leaked from SUITE scope at org.apache.solr.rest.TestManagedResourceStorage: 
   1) Thread[id=4770, name=NIOServerCxn.Factory:0.0.0.0/0.0.0.0:0, state=RUNNABLE, group=TGRP-TestManagedResourceStorage]
        at sun.nio.ch.DevPollArrayWrapper.poll0(Native Method)
        at sun.nio.ch.DevPollArrayWrapper.poll(DevPollArrayWrapper.java:223)
        at sun.nio.ch.DevPollSelectorImpl.doSelect(DevPollSelectorImpl.java:98)
        at sun.nio.ch.SelectorImpl.lockAndDoSelect(SelectorImpl.java:86)
        at sun.nio.ch.SelectorImpl.select(SelectorImpl.java:97)
        at org.apache.zookeeper.server.NIOServerCnxnFactory.run(NIOServerCnxnFactory.java:196)
        at java.lang.Thread.run(Thread.java:748)
   2) Thread[id=4769, name=Thread-746, state=WAITING, group=TGRP-TestManagedResourceStorage]
        at java.lang.Object.wait(Native Method)
        at java.lang.Thread.join(Thread.java:1252)
        at java.lang.Thread.join(Thread.java:1326)
        at org.apache.zookeeper.server.NIOServerCnxnFactory.join(NIOServerCnxnFactory.java:313)
        at org.apache.solr.cloud.ZkTestServer$ZKServerMain.runFromConfig(ZkTestServer.java:313)
        at org.apache.solr.cloud.ZkTestServer$2.run(ZkTestServer.java:496)
   3) Thread[id=4771, name=SessionTracker, state=TIMED_WAITING, group=TGRP-TestManagedResourceStorage]
        at java.lang.Object.wait(Native Method)
        at org.apache.zookeeper.server.SessionTrackerImpl.run(SessionTrackerImpl.java:147)
   4) Thread[id=4773, name=ProcessThread(sid:0 cport:51027):, state=WAITING, group=TGRP-TestManagedResourceStorage]
        at sun.misc.Unsafe.park(Native Method)
        at java.util.concurrent.locks.LockSupport.park(LockSupport.java:175)
        at java.util.concurrent.locks.AbstractQueuedSynchronizer$ConditionObject.await(AbstractQueuedSynchronizer.java:2039)
        at java.util.concurrent.LinkedBlockingQueue.take(LinkedBlockingQueue.java:442)
        at org.apache.zookeeper.server.PrepRequestProcessor.run(PrepRequestProcessor.java:123)
	at __randomizedtesting.SeedInfo.seed([8368E5C57A9F8AC4]:0)


FAILED:  junit.framework.TestSuite.org.apache.solr.rest.TestManagedResourceStorage

Error Message:
There are still zombie threads that couldn't be terminated:    1) Thread[id=4770, name=NIOServerCxn.Factory:0.0.0.0/0.0.0.0:0, state=RUNNABLE, group=TGRP-TestManagedResourceStorage]         at sun.nio.ch.DevPollArrayWrapper.interrupt(Native Method)         at sun.nio.ch.DevPollArrayWrapper.interrupt(DevPollArrayWrapper.java:300)         at sun.nio.ch.DevPollSelectorImpl.wakeup(DevPollSelectorImpl.java:207)         at java.nio.channels.spi.AbstractSelector$1.interrupt(AbstractSelector.java:213)         at java.nio.channels.spi.AbstractSelector.begin(AbstractSelector.java:219)         at sun.nio.ch.DevPollSelectorImpl.doSelect(DevPollSelectorImpl.java:97)         at sun.nio.ch.SelectorImpl.lockAndDoSelect(SelectorImpl.java:86)         at sun.nio.ch.SelectorImpl.select(SelectorImpl.java:97)         at org.apache.zookeeper.server.NIOServerCnxnFactory.run(NIOServerCnxnFactory.java:196)         at java.lang.Thread.run(Thread.java:748)

Stack Trace:
com.carrotsearch.randomizedtesting.ThreadLeakError: There are still zombie threads that couldn't be terminated:
   1) Thread[id=4770, name=NIOServerCxn.Factory:0.0.0.0/0.0.0.0:0, state=RUNNABLE, group=TGRP-TestManagedResourceStorage]
        at sun.nio.ch.DevPollArrayWrapper.interrupt(Native Method)
        at sun.nio.ch.DevPollArrayWrapper.interrupt(DevPollArrayWrapper.java:300)
        at sun.nio.ch.DevPollSelectorImpl.wakeup(DevPollSelectorImpl.java:207)
        at java.nio.channels.spi.AbstractSelector$1.interrupt(AbstractSelector.java:213)
        at java.nio.channels.spi.AbstractSelector.begin(AbstractSelector.java:219)
        at sun.nio.ch.DevPollSelectorImpl.doSelect(DevPollSelectorImpl.java:97)
        at sun.nio.ch.SelectorImpl.lockAndDoSelect(SelectorImpl.java:86)
        at sun.nio.ch.SelectorImpl.select(SelectorImpl.java:97)
        at org.apache.zookeeper.server.NIOServerCnxnFactory.run(NIOServerCnxnFactory.java:196)
        at java.lang.Thread.run(Thread.java:748)
	at __randomizedtesting.SeedInfo.seed([8368E5C57A9F8AC4]:0)




Build Log:
[...truncated 2254 lines...]
   [junit4] Suite: org.apache.lucene.search.TestSimpleExplanations
   [junit4]   2> ??? 22, 2018 5:18:21 PM com.carrotsearch.randomizedtesting.ThreadLeakControl$2 evaluate
   [junit4]   2> WARNING: Suite execution timed out: org.apache.lucene.search.TestSimpleExplanations
   [junit4]   2>    1) Thread[id=1, name=main, state=WAITING, group=main]
   [junit4]   2>         at java.lang.Object.wait(Native Method)
   [junit4]   2>         at java.lang.Thread.join(Thread.java:1252)
   [junit4]   2>         at java.lang.Thread.join(Thread.java:1326)
   [junit4]   2>         at com.carrotsearch.randomizedtesting.RandomizedRunner.runSuite(RandomizedRunner.java:637)
   [junit4]   2>         at com.carrotsearch.randomizedtesting.RandomizedRunner.run(RandomizedRunner.java:494)
   [junit4]   2>         at com.carrotsearch.ant.tasks.junit4.slave.SlaveMain.execute(SlaveMain.java:269)
   [junit4]   2>         at com.carrotsearch.ant.tasks.junit4.slave.SlaveMain.main(SlaveMain.java:394)
   [junit4]   2>         at com.carrotsearch.ant.tasks.junit4.slave.SlaveMainSafe.main(SlaveMainSafe.java:13)
   [junit4]   2>    2) Thread[id=96, name=SUITE-TestSimpleExplanations-seed#[498EDC0E6CBAF35D], state=RUNNABLE, group=TGRP-TestSimpleExplanations]
   [junit4]   2>         at java.lang.Thread.getStackTrace(Thread.java:1559)
   [junit4]   2>         at com.carrotsearch.randomizedtesting.ThreadLeakControl$4.run(ThreadLeakControl.java:696)
   [junit4]   2>         at com.carrotsearch.randomizedtesting.ThreadLeakControl$4.run(ThreadLeakControl.java:693)
   [junit4]   2>         at java.security.AccessController.doPrivileged(Native Method)
   [junit4]   2>         at com.carrotsearch.randomizedtesting.ThreadLeakControl.getStackTrace(ThreadLeakControl.java:693)
   [junit4]   2>         at com.carrotsearch.randomizedtesting.ThreadLeakControl.getThreadsWithTraces(ThreadLeakControl.java:709)
   [junit4]   2>         at com.carrotsearch.randomizedtesting.ThreadLeakControl.formatThreadStacksFull(ThreadLeakControl.java:689)
   [junit4]   2>         at com.carrotsearch.randomizedtesting.ThreadLeakControl.access$1000(ThreadLeakControl.java:65)
   [junit4]   2>         at com.carrotsearch.randomizedtesting.ThreadLeakControl$2.evaluate(ThreadLeakControl.java:415)
   [junit4]   2>         at com.carrotsearch.randomizedtesting.RandomizedRunner.runSuite(RandomizedRunner.java:706)
   [junit4]   2>         at com.carrotsearch.randomizedtesting.RandomizedRunner.access$200(RandomizedRunner.java:140)
   [junit4]   2>         at com.carrotsearch.randomizedtesting.RandomizedRunner$2.run(RandomizedRunner.java:627)
   [junit4]   2>    3) Thread[id=97, name=TEST-TestSimpleExplanations.testBQ24-seed#[498EDC0E6CBAF35D], state=RUNNABLE, group=TGRP-TestSimpleExplanations]
   [junit4]   2>         at java.lang.Throwable.getStackTraceElement(Native Method)
   [junit4]   2>         at java.lang.Throwable.getOurStackTrace(Throwable.java:827)
   [junit4]   2>         at java.lang.Throwable.getStackTrace(Throwable.java:816)
   [junit4]   2>         at java.lang.Thread.getStackTrace(Thread.java:1559)
   [junit4]   2>         at com.carrotsearch.randomizedtesting.ThreadLeakControl$4.run(ThreadLeakControl.java:696)
   [junit4]   2>         at com.carrotsearch.randomizedtesting.ThreadLeakControl$4.run(ThreadLeakControl.java:693)
   [junit4]   2>         at java.security.AccessController.doPrivileged(Native Method)
   [junit4]   2>         at com.carrotsearch.randomizedtesting.ThreadLeakControl.getStackTrace(ThreadLeakControl.java:693)
   [junit4]   2>         at com.carrotsearch.randomizedtesting.ThreadLeakControl.access$200(ThreadLeakControl.java:65)
   [junit4]   2>         at com.carrotsearch.randomizedtesting.ThreadLeakControl$KnownSystemThread.reject(ThreadLeakControl.java:318)
   [junit4]   2>         at com.carrotsearch.randomizedtesting.ThreadLeakControl$1.reject(ThreadLeakControl.java:269)
   [junit4]   2>         at com.carrotsearch.randomizedtesting.ThreadLeakControl$1.reject(ThreadLeakControl.java:269)
   [junit4]   2>         at com.carrotsearch.randomizedtesting.ThreadLeakControl.getThreads(ThreadLeakControl.java:736)
   [junit4]   2>         at com.carrotsearch.randomizedtesting.ThreadLeakControl.access$1600(ThreadLeakControl.java:65)
   [junit4]   2>         at com.carrotsearch.randomizedtesting.ThreadLeakControl$3.evaluate(ThreadLeakControl.java:467)
   [junit4]   2>         at com.carrotsearch.randomizedtesting.RandomizedRunner.runSingleTest(RandomizedRunner.java:944)
   [junit4]   2>         at com.carrotsearch.randomizedtesting.RandomizedRunner$5.evaluate(RandomizedRunner.java:830)
   [junit4]   2>         at com.carrotsearch.randomizedtesting.RandomizedRunner$6.evaluate(RandomizedRunner.java:880)
   [junit4]   2>         at com.carrotsearch.randomizedtesting.RandomizedRunner$7.evaluate(RandomizedRunner.java:891)
   [junit4]   2>         at org.apache.lucene.util.AbstractBeforeAfterRule$1.evaluate(AbstractBeforeAfterRule.java:45)
   [junit4]   2>         at com.carrotsearch.randomizedtesting.rules.StatementAdapter.evaluate(StatementAdapter.java:36)
   [junit4]   2>         at org.apache.lucene.util.TestRuleStoreClassName$1.evaluate(TestRuleStoreClassName.java:41)
   [junit4]   2>         at com.carrotsearch.randomizedtesting.rules.NoShadowingOrOverridesOnMethodsRule$1.evaluate(NoShadowingOrOverridesOnMethodsRule.java:40)
   [junit4]   2>         at com.carrotsearch.randomizedtesting.rules.NoShadowingOrOverridesOnMethodsRule$1.evaluate(NoShadowingOrOverridesOnMethodsRule.java:40)
   [junit4]   2>         at com.carrotsearch.randomizedtesting.rules.StatementAdapter.evaluate(StatementAdapter.java:36)
   [junit4]   2>         at com.carrotsearch.randomizedtesting.rules.StatementAdapter.evaluate(StatementAdapter.java:36)
   [junit4]   2>         at com.carrotsearch.randomizedtesting.rules.StatementAdapter.evaluate(StatementAdapter.java:36)
   [junit4]   2>         at org.apache.lucene.util.TestRuleAssertionsRequired$1.evaluate(TestRuleAssertionsRequired.java:53)
   [junit4]   2>         at org.apache.lucene.util.TestRuleMarkFailure$1.evaluate(TestRuleMarkFailure.java:47)
   [junit4]   2>         at org.apache.lucene.util.TestRuleIgnoreAfterMaxFailures$1.evaluate(TestRuleIgnoreAfterMaxFailures.java:64)
   [junit4]   2>         at org.apache.lucene.util.TestRuleIgnoreTestSuites$1.evaluate(TestRuleIgnoreTestSuites.java:54)
   [junit4]   2>         at com.carrotsearch.randomizedtesting.rules.StatementAdapter.evaluate(StatementAdapter.java:36)
   [junit4]   2>         at com.carrotsearch.randomizedtesting.ThreadLeakControl$StatementRunner.run(ThreadLeakControl.java:368)
   [junit4]   2>         at java.lang.Thread.run(Thread.java:748)
   [junit4]   2>    4) Thread[id=9, name=JUnit4-serializer-daemon, state=TIMED_WAITING, group=main]
   [junit4]   2>         at java.lang.Thread.sleep(Native Method)
   [junit4]   2>         at com.carrotsearch.ant.tasks.junit4.events.Serializer$1.run(Serializer.java:50)
   [junit4]   2> NOTE: reproduce with: ant test  -Dtestcase=TestSimpleExplanations -Dtests.method=testBQ24 -Dtests.seed=498EDC0E6CBAF35D -Dtests.slow=true -Dtests.locale=sr-ME -Dtests.timezone=Asia/Baku -Dtests.asserts=true -Dtests.file.encoding=ISO-8859-1
   [junit4] ERROR   38072s J1 | TestSimpleExplanations.testBQ24 <<<
   [junit4]    > Throwable #1: java.lang.Exception: Test abandoned because suite timeout was reached.
   [junit4]    > 	at __randomizedtesting.SeedInfo.seed([498EDC0E6CBAF35D]:0)
   [junit4]   2> ??? 22, 2018 5:18:21 PM com.carrotsearch.randomizedtesting.ThreadLeakControl checkThreadLeaks
   [junit4]   2> WARNING: Will linger awaiting termination of 1 leaked thread(s).
   [junit4]   2> NOTE: test params are: codec=Lucene80, sim=Asserting(org.apache.lucene.search.similarities.AssertingSimilarity@20dddf7f), locale=sr-ME, timezone=Asia/Baku
   [junit4]   2> NOTE: SunOS 5.11 amd64/Oracle Corporation 1.8.0_172 (64-bit)/cpus=3,threads=1,free=251429376,total=529530880
   [junit4]   2> NOTE: All tests run in this JVM: [TestDeterminism, TestLatLonPoint, FuzzyTermOnShortTermsTest, TestOmitNorms, TestSpanNotQuery, TestSortRescorer, TestBagOfPositions, TestLucene50TermVectorsFormat, TestIndependenceSaturated, TestIsCurrent, TestBinaryDocument, TestCharArraySet, TestIndexWriterOnVMError, TestUTF32ToUTF8, TestParallelTermEnum, TestSimpleExplanations]
   [junit4]   2> NOTE: reproduce with: ant test  -Dtestcase=TestSimpleExplanations -Dtests.seed=498EDC0E6CBAF35D -Dtests.slow=true -Dtests.locale=sr-ME -Dtests.timezone=Asia/Baku -Dtests.asserts=true -Dtests.file.encoding=ISO-8859-1
   [junit4] ERROR   0.00s J1 | TestSimpleExplanations (suite) <<<
   [junit4]    > Throwable #1: java.lang.Exception: Suite timeout exceeded (>= 7200000 msec).
   [junit4]    > 	at __randomizedtesting.SeedInfo.seed([498EDC0E6CBAF35D]:0)
   [junit4] Completed [398/510 (1!)] on J1 in 38074.05s, 59 tests, 2 errors <<< FAILURES!

[...truncated 11118 lines...]
   [junit4] Suite: org.apache.solr.rest.TestManagedResourceStorage
   [junit4]   2> Creating dataDir: /export/home/jenkins/workspace/Lucene-Solr-master-Solaris/solr/build/solr-core/test/J1/temp/solr.rest.TestManagedResourceStorage_8368E5C57A9F8AC4-001/init-core-data-001
   [junit4]   2> 609527 WARN  (SUITE-TestManagedResourceStorage-seed#[8368E5C57A9F8AC4]-worker) [    ] o.a.s.SolrTestCaseJ4 startTrackingSearchers: numOpens=34 numCloses=34
   [junit4]   2> 609527 INFO  (SUITE-TestManagedResourceStorage-seed#[8368E5C57A9F8AC4]-worker) [    ] o.a.s.SolrTestCaseJ4 Using PointFields (NUMERIC_POINTS_SYSPROP=true) w/NUMERIC_DOCVALUES_SYSPROP=false
   [junit4]   2> 609528 INFO  (SUITE-TestManagedResourceStorage-seed#[8368E5C57A9F8AC4]-worker) [    ] o.a.s.SolrTestCaseJ4 Randomized ssl (false) and clientAuth (false) via: @org.apache.solr.util.RandomizeSSL(reason=, value=NaN, ssl=NaN, clientAuth=NaN)
   [junit4]   2> 609528 INFO  (SUITE-TestManagedResourceStorage-seed#[8368E5C57A9F8AC4]-worker) [    ] o.a.s.SolrTestCaseJ4 SecureRandom sanity checks: test.solr.allowed.securerandom=null & java.security.egd=file:/dev/./urandom
   [junit4]   2> 609528 INFO  (SUITE-TestManagedResourceStorage-seed#[8368E5C57A9F8AC4]-worker) [    ] o.a.s.c.ZkTestServer STARTING ZK TEST SERVER
   [junit4]   2> 609529 INFO  (Thread-746) [    ] o.a.s.c.ZkTestServer client port:0.0.0.0/0.0.0.0:0
   [junit4]   2> 609529 INFO  (Thread-746) [    ] o.a.s.c.ZkTestServer Starting server
   [junit4]   2> 609530 ERROR (Thread-746) [    ] o.a.z.s.ZooKeeperServer ZKShutdownHandler is not registered, so ZooKeeper server won't take any action on ERROR or SHUTDOWN server state changes
   [junit4]   2> 609629 INFO  (SUITE-TestManagedResourceStorage-seed#[8368E5C57A9F8AC4]-worker) [    ] o.a.s.c.ZkTestServer start zk server on port:51027
   [junit4]   2> 609631 INFO  (zkConnectionManagerCallback-1267-thread-1) [    ] o.a.s.c.c.ConnectionManager zkClient has connected
   [junit4]   2> 609636 INFO  (zkConnectionManagerCallback-1269-thread-1) [    ] o.a.s.c.c.ConnectionManager zkClient has connected
   [junit4]   2> 609645 INFO  (SUITE-TestManagedResourceStorage-seed#[8368E5C57A9F8AC4]-worker) [    ] o.a.s.c.AbstractZkTestCase put /export/home/jenkins/workspace/Lucene-Solr-master-Solaris/solr/core/src/test-files/solr/collection1/conf/solrconfig.xml to /configs/conf1/solrconfig.xml
   [junit4]   2> 609648 INFO  (SUITE-TestManagedResourceStorage-seed#[8368E5C57A9F8AC4]-worker) [    ] o.a.s.c.AbstractZkTestCase put /export/home/jenkins/workspace/Lucene-Solr-master-Solaris/solr/core/src/test-files/solr/collection1/conf/schema.xml to /configs/conf1/schema.xml
   [junit4]   2> 609650 INFO  (SUITE-TestManagedResourceStorage-seed#[8368E5C57A9F8AC4]-worker) [    ] o.a.s.c.AbstractZkTestCase put /export/home/jenkins/workspace/Lucene-Solr-master-Solaris/solr/core/src/test-files/solr/collection1/conf/solrconfig.snippet.randomindexconfig.xml to /configs/conf1/solrconfig.snippet.randomindexconfig.xml
   [junit4]   2> 609652 INFO  (SUITE-TestManagedResourceStorage-seed#[8368E5C57A9F8AC4]-worker) [    ] o.a.s.c.AbstractZkTestCase put /export/home/jenkins/workspace/Lucene-Solr-master-Solaris/solr/core/src/test-files/solr/collection1/conf/stopwords.txt to /configs/conf1/stopwords.txt
   [junit4]   2> 609654 INFO  (SUITE-TestManagedResourceStorage-seed#[8368E5C57A9F8AC4]-worker) [    ] o.a.s.c.AbstractZkTestCase put /export/home/jenkins/workspace/Lucene-Solr-master-Solaris/solr/core/src/test-files/solr/collection1/conf/protwords.txt to /configs/conf1/protwords.txt
   [junit4]   2> 609655 INFO  (SUITE-TestManagedResourceStorage-seed#[8368E5C57A9F8AC4]-worker) [    ] o.a.s.c.AbstractZkTestCase put /export/home/jenkins/workspace/Lucene-Solr-master-Solaris/solr/core/src/test-files/solr/collection1/conf/currency.xml to /configs/conf1/currency.xml
   [junit4]   2> 609657 INFO  (SUITE-TestManagedResourceStorage-seed#[8368E5C57A9F8AC4]-worker) [    ] o.a.s.c.AbstractZkTestCase put /export/home/jenkins/workspace/Lucene-Solr-master-Solaris/solr/core/src/test-files/solr/collection1/conf/enumsConfig.xml to /configs/conf1/enumsConfig.xml
   [junit4]   2> 609659 INFO  (SUITE-TestManagedResourceStorage-seed#[8368E5C57A9F8AC4]-worker) [    ] o.a.s.c.AbstractZkTestCase put /export/home/jenkins/workspace/Lucene-Solr-master-Solaris/solr/core/src/test-files/solr/collection1/conf/open-exchange-rates.json to /configs/conf1/open-exchange-rates.json
   [junit4]   2> 609660 INFO  (SUITE-TestManagedResourceStorage-seed#[8368E5C57A9F8AC4]-worker) [    ] o.a.s.c.AbstractZkTestCase put /export/home/jenkins/workspace/Lucene-Solr-master-Solaris/solr/core/src/test-files/solr/collection1/conf/mapping-ISOLatin1Accent.txt to /configs/conf1/mapping-ISOLatin1Accent.txt
   [junit4]   2> 609662 INFO  (SUITE-TestManagedResourceStorage-seed#[8368E5C57A9F8AC4]-worker) [    ] o.a.s.c.AbstractZkTestCase put /export/home/jenkins/workspace/Lucene-Solr-master-Solaris/solr/core/src/test-files/solr/collection1/conf/old_synonyms.txt to /configs/conf1/old_synonyms.txt
   [junit4]   2> 609664 INFO  (SUITE-TestManagedResourceStorage-seed#[8368E5C57A9F8AC4]-worker) [    ] o.a.s.c.AbstractZkTestCase put /export/home/jenkins/workspace/Lucene-Solr-master-Solaris/solr/core/src/test-files/solr/collection1/conf/synonyms.txt to /configs/conf1/synonyms.txt
   [junit4]   2> 609666 INFO  (SUITE-TestManagedResourceStorage-seed#[8368E5C57A9F8AC4]-worker) [    ] o.a.s.SolrTestCaseJ4 ####initCore
   [junit4]   2> 609666 INFO  (SUITE-TestManagedResourceStorage-seed#[8368E5C57A9F8AC4]-worker) [    ] o.a.s.c.SolrResourceLoader [null] Added 2 libs to classloader, from paths: [/export/home/jenkins/workspace/Lucene-Solr-master-Solaris/solr/core/src/test-files/solr/collection1/lib, /export/home/jenkins/workspace/Lucene-Solr-master-Solaris/solr/core/src/test-files/solr/collection1/lib/classes]
   [junit4]   2> 609692 INFO  (SUITE-TestManagedResourceStorage-seed#[8368E5C57A9F8AC4]-worker) [    ] o.a.s.c.SolrConfig Using Lucene MatchVersion: 8.0.0
   [junit4]   2> 609765 INFO  (SUITE-TestManagedResourceStorage-seed#[8368E5C57A9F8AC4]-worker) [    ] o.a.s.s.IndexSchema [null] Schema name=test
   [junit4]   2> 609828 INFO  (SUITE-TestManagedResourceStorage-seed#[8368E5C57A9F8AC4]-worker) [    ] o.a.s.s.IndexSchema Loaded schema test/1.0 with uniqueid field id
   [junit4]   2> 610617 INFO  (SUITE-TestManagedResourceStorage-seed#[8368E5C57A9F8AC4]-worker) [    ] o.a.s.c.ZkContainer Zookeeper client=127.0.0.1:51027/solr
   [junit4]   2> 610619 INFO  (zkConnectionManagerCallback-1273-thread-1) [    ] o.a.s.c.c.ConnectionManager zkClient has connected
   [junit4]   2> 610623 INFO  (zkConnectionManagerCallback-1275-thread-1) [    ] o.a.s.c.c.ConnectionManager zkClient has connected
   [junit4]   2> 610759 INFO  (SUITE-TestManagedResourceStorage-seed#[8368E5C57A9F8AC4]-worker) [n:127.0.0.1:8983_    ] o.a.s.c.OverseerElectionContext I am going to be the leader 127.0.0.1:8983_
   [junit4]   2> 610760 INFO  (SUITE-TestManagedResourceStorage-seed#[8368E5C57A9F8AC4]-worker) [n:127.0.0.1:8983_    ] o.a.s.c.Overseer Overseer (id=72062684889153539-127.0.0.1:8983_-n_0000000000) starting
   [junit4]   2> 610771 INFO  (zkConnectionManagerCallback-1282-thread-1) [    ] o.a.s.c.c.ConnectionManager zkClient has connected
   [junit4]   2> 610774 INFO  (SUITE-TestManagedResourceStorage-seed#[8368E5C57A9F8AC4]-worker) [n:127.0.0.1:8983_    ] o.a.s.c.s.i.ZkClientClusterStateProvider Cluster at 127.0.0.1:51027/solr ready
   [junit4]   2> 610775 INFO  (SUITE-TestManagedResourceStorage-seed#[8368E5C57A9F8AC4]-worker) [n:127.0.0.1:8983_    ] o.a.s.c.ZkController Register node as live in ZooKeeper:/live_nodes/127.0.0.1:8983_
   [junit4]   2> 610776 INFO  (OverseerStateUpdate-72062684889153539-127.0.0.1:8983_-n_0000000000) [n:127.0.0.1:8983_    ] o.a.s.c.Overseer Starting to work on the main queue : 127.0.0.1:8983_
   [junit4]   2> 610779 INFO  (zkCallback-1281-thread-1) [    ] o.a.s.c.c.ZkStateReader Updated live nodes from ZooKeeper... (0) -> (1)
   [junit4]   2> 610780 INFO  (OverseerStateUpdate-72062684889153539-127.0.0.1:8983_-n_0000000000) [n:127.0.0.1:8983_    ] o.a.s.c.c.ZkStateReader Updated live nodes from ZooKeeper... (0) -> (1)
   [junit4]   2> 610797 INFO  (SUITE-TestManagedResourceStorage-seed#[8368E5C57A9F8AC4]-worker) [n:127.0.0.1:8983_    ] o.a.s.h.a.MetricsHistoryHandler No .system collection, keeping metrics history in memory.
   [junit4]   2> 610809 INFO  (SUITE-TestManagedResourceStorage-seed#[8368E5C57A9F8AC4]-worker) [n:127.0.0.1:8983_    ] o.a.s.m.r.SolrJmxReporter JMX monitoring for 'solr.node' (registry 'solr.node') enabled at server: com.sun.jmx.mbeanserver.JmxMBeanServer@22fad812
   [junit4]   2> 610813 INFO  (SUITE-TestManagedResourceStorage-seed#[8368E5C57A9F8AC4]-worker) [n:127.0.0.1:8983_    ] o.a.s.m.r.SolrJmxReporter JMX monitoring for 'solr.jvm' (registry 'solr.jvm') enabled at server: com.sun.jmx.mbeanserver.JmxMBeanServer@22fad812
   [junit4]   2> 610813 INFO  (SUITE-TestManagedResourceStorage-seed#[8368E5C57A9F8AC4]-worker) [n:127.0.0.1:8983_    ] o.a.s.m.r.SolrJmxReporter JMX monitoring for 'solr.jetty' (registry 'solr.jetty') enabled at server: com.sun.jmx.mbeanserver.JmxMBeanServer@22fad812
   [junit4]   2> 610815 INFO  (coreLoadExecutor-2303-thread-1-processing-n:127.0.0.1:8983_) [n:127.0.0.1:8983_    ] o.a.s.c.TransientSolrCoreCacheDefault Allocating transient cache for 2147483647 transient cores
   [junit4]   2> 611820 INFO  (coreLoadExecutor-2303-thread-1-processing-n:127.0.0.1:8983_) [n:127.0.0.1:8983_ c:collection1 s:shard1  x:collection1] o.a.s.c.SolrResourceLoader [null] Added 2 libs to classloader, from paths: [/export/home/jenkins/workspace/Lucene-Solr-master-Solaris/solr/core/src/test-files/solr/collection1/lib, /export/home/jenkins/workspace/Lucene-Solr-master-Solaris/solr/core/src/test-files/solr/collection1/lib/classes]
   [junit4]   2> 611847 INFO  (coreLoadExecutor-2303-thread-1-processing-n:127.0.0.1:8983_) [n:127.0.0.1:8983_ c:collection1 s:shard1  x:collection1] o.a.s.c.SolrConfig Using Lucene MatchVersion: 8.0.0
   [junit4]   2> 611863 INFO  (coreLoadExecutor-2303-thread-1-processing-n:127.0.0.1:8983_) [n:127.0.0.1:8983_ c:collection1 s:shard1  x:collection1] o.a.s.s.IndexSchema [collection1] Schema name=test
   [junit4]   2> 611938 INFO  (coreLoadExecutor-2303-thread-1-processing-n:127.0.0.1:8983_) [n:127.0.0.1:8983_ c:collection1 s:shard1  x:collection1] o.a.s.s.IndexSchema Loaded schema test/1.0 with uniqueid field id
   [junit4]   2> 611963 INFO  (coreLoadExecutor-2303-thread-1-processing-n:127.0.0.1:8983_) [n:127.0.0.1:8983_ c:collection1 s:shard1  x:collection1] o.a.s.c.CoreContainer Creating SolrCore 'collection1' using configuration from collection collection1, trusted=true
   [junit4]   2> 611964 INFO  (coreLoadExecutor-2303-thread-1-processing-n:127.0.0.1:8983_) [n:127.0.0.1:8983_ c:collection1 s:shard1  x:collection1] o.a.s.m.r.SolrJmxReporter JMX monitoring for 'solr.core.collection1.shard1.127.0.0.1:8983__collection1' (registry 'solr.core.collection1.shard1.127.0.0.1:8983__collection1') enabled at server: com.sun.jmx.mbeanserver.JmxMBeanServer@22fad812
   [junit4]   2> 611964 INFO  (coreLoadExecutor-2303-thread-1-processing-n:127.0.0.1:8983_) [n:127.0.0.1:8983_ c:collection1 s:shard1  x:collection1] o.a.s.c.SolrCore [[collection1] ] Opening new SolrCore at [/export/home/jenkins/workspace/Lucene-Solr-master-Solaris/solr/core/src/test-files/solr/collection1], dataDir=[/export/home/jenkins/workspace/Lucene-Solr-master-Solaris/solr/build/solr-core/test/J1/temp/solr.rest.TestManagedResourceStorage_8368E5C57A9F8AC4-001/init-core-data-001/]
   [junit4]   2> 611965 INFO  (coreLoadExecutor-2303-thread-1-processing-n:127.0.0.1:8983_) [n:127.0.0.1:8983_ c:collection1 s:shard1  x:collection1] o.a.s.u.RandomMergePolicy RandomMergePolicy wrapping class org.apache.lucene.index.TieredMergePolicy: [TieredMergePolicy: maxMergeAtOnce=47, maxMergeAtOnceExplicit=14, maxMergedSegmentMB=84.150390625, floorSegmentMB=0.8056640625, forceMergeDeletesPctAllowed=16.24685163571734, segmentsPerTier=45.0, maxCFSSegmentSizeMB=8.796093022207999E12, noCFSRatio=1.0, deletesPctAllowed=21.048607543231785
   [junit4]   2> 612012 INFO  (coreLoadExecutor-2303-thread-1-processing-n:127.0.0.1:8983_) [n:127.0.0.1:8983_ c:collection1 s:shard1  x:collection1] o.a.s.u.UpdateHandler Using UpdateLog implementation: org.apache.solr.update.UpdateLog
   [junit4]   2> 612012 INFO  (coreLoadExecutor-2303-thread-1-processing-n:127.0.0.1:8983_) [n:127.0.0.1:8983_ c:collection1 s:shard1  x:collection1] o.a.s.u.UpdateLog Initializing UpdateLog: dataDir= defaultSyncLevel=FLUSH numRecordsToKeep=100 maxNumLogsToKeep=10 numVersionBuckets=65536
   [junit4]   2> 612013 INFO  (coreLoadExecutor-2303-thread-1-processing-n:127.0.0.1:8983_) [n:127.0.0.1:8983_ c:collection1 s:shard1  x:collection1] o.a.s.u.CommitTracker Hard AutoCommit: disabled
   [junit4]   2> 612013 INFO  (coreLoadExecutor-2303-thread-1-processing-n:127.0.0.1:8983_) [n:127.0.0.1:8983_ c:collection1 s:shard1  x:collection1] o.a.s.u.CommitTracker Soft AutoCommit: disabled
   [junit4]   2> 612014 INFO  (coreLoadExecutor-2303-thread-1-processing-n:127.0.0.1:8983_) [n:127.0.0.1:8983_ c:collection1 s:shard1  x:collection1] o.a.s.u.RandomMergePolicy RandomMergePolicy wrapping class org.apache.lucene.index.TieredMergePolicy: [TieredMergePolicy: maxMergeAtOnce=38, maxMergeAtOnceExplicit=16, maxMergedSegmentMB=67.6083984375, floorSegmentMB=0.3798828125, forceMergeDeletesPctAllowed=28.884016600508062, segmentsPerTier=18.0, maxCFSSegmentSizeMB=8.796093022207999E12, noCFSRatio=0.7064318101936592, deletesPctAllowed=46.64270498677786
   [junit4]   2> 612014 INFO  (coreLoadExecutor-2303-thread-1-processing-n:127.0.0.1:8983_) [n:127.0.0.1:8983_ c:collection1 s:shard1  x:collection1] o.a.s.s.SolrIndexSearcher Opening [Searcher@282dc016[collection1] main]
   [junit4]   2> 612016 INFO  (coreLoadExecutor-2303-thread-1-processing-n:127.0.0.1:8983_) [n:127.0.0.1:8983_ c:collection1 s:shard1  x:collection1] o.a.s.h.c.SpellCheckComponent Initializing spell checkers
   [junit4]   2> 612072 INFO  (coreLoadExecutor-2303-thread-1-processing-n:127.0.0.1:8983_) [n:127.0.0.1:8983_ c:collection1 s:shard1  x:collection1] o.a.s.s.DirectSolrSpellChecker init: {name=direct,classname=DirectSolrSpellChecker,field=lowerfilt,minQueryLength=3}
   [junit4]   2> 612134 INFO  (coreLoadExecutor-2303-thread-1-processing-n:127.0.0.1:8983_) [n:127.0.0.1:8983_ c:collection1 s:shard1  x:collection1] o.a.s.h.ReplicationHandler Commits will be reserved for 10000ms.
   [junit4]   2> 612134 INFO  (coreLoadExecutor-2303-thread-1-processing-n:127.0.0.1:8983_) [n:127.0.0.1:8983_ c:collection1 s:shard1  x:collection1] o.a.s.u.UpdateLog Could not find max version in index or recent updates, using new clock 1612315372887736320
   [junit4]   2> 612134 INFO  (searcherExecutor-2304-thread-1-processing-n:127.0.0.1:8983_ x:collection1 c:collection1 s:shard1) [n:127.0.0.1:8983_ c:collection1 s:shard1  x:collection1] o.a.s.h.c.SpellCheckComponent Loading spell index for spellchecker: default
   [junit4]   2> 612134 INFO  (searcherExecutor-2304-thread-1-processing-n:127.0.0.1:8983_ x:collection1 c:collection1 s:shard1) [n:127.0.0.1:8983_ c:collection1 s:shard1  x:collection1] o.a.s.h.c.SpellCheckComponent Loading spell index for spellchecker: direct
   [junit4]   2> 612135 INFO  (searcherExecutor-2304-thread-1-processing-n:127.0.0.1:8983_ x:collection1 c:collection1 s:shard1) [n:127.0.0.1:8983_ c:collection1 s:shard1  x:collection1] o.a.s.h.c.SpellCheckComponent Loading spell index for spellchecker: wordbreak
   [junit4]   2> 612135 INFO  (searcherExecutor-2304-thread-1-processing-n:127.0.0.1:8983_ x:collection1 c:collection1 s:shard1) [n:127.0.0.1:8983_ c:collection1 s:shard1  x:collection1] o.a.s.h.c.SpellCheckComponent Loading spell index for spellchecker: multipleFields
   [junit4]   2> 612135 INFO  (searcherExecutor-2304-thread-1-processing-n:127.0.0.1:8983_ x:collection1 c:collection1 s:shard1) [n:127.0.0.1:8983_ c:collection1 s:shard1  x:collection1] o.a.s.h.c.SpellCheckComponent Loading spell index for spellchecker: jarowinkler
   [junit4]   2> 612135 INFO  (searcherExecutor-2304-thread-1-processing-n:127.0.0.1:8983_ x:collection1 c:collection1 s:shard1) [n:127.0.0.1:8983_ c:collection1 s:shard1  x:collection1] o.a.s.h.c.SpellCheckComponent Loading spell index for spellchecker: external
   [junit4]   2> 612135 INFO  (searcherExecutor-2304-thread-1-processing-n:127.0.0.1:8983_ x:collection1 c:collection1 s:shard1) [n:127.0.0.1:8983_ c:collection1 s:shard1  x:collection1] o.a.s.h.c.SpellCheckComponent Loading spell index for spellchecker: freq
   [junit4]   2> 612136 INFO  (searcherExecutor-2304-thread-1-processing-n:127.0.0.1:8983_ x:collection1 c:collection1 s:shard1) [n:127.0.0.1:8983_ c:collection1 s:shard1  x:collection1] o.a.s.h.c.SpellCheckComponent Loading spell index for spellchecker: fqcn
   [junit4]   2> 612136 INFO  (searcherExecutor-2304-thread-1-processing-n:127.0.0.1:8983_ x:collection1 c:collection1 s:shard1) [n:127.0.0.1:8983_ c:collection1 s:shard1  x:collection1] o.a.s.h.c.SpellCheckComponent Loading spell index for spellchecker: perDict
   [junit4]   2> 612137 INFO  (searcherExecutor-2304-thread-1-processing-n:127.0.0.1:8983_ x:collection1 c:collection1 s:shard1) [n:127.0.0.1:8983_ c:collection1 s:shard1  x:collection1] o.a.s.c.SolrCore [collection1] Registered new searcher Searcher@282dc016[collection1] main{ExitableDirectoryReader(UninvertingDirectoryReader())}
   [junit4]   2> 612139 INFO  (SUITE-TestManagedResourceStorage-seed#[8368E5C57A9F8AC4]-worker) [n:127.0.0.1:8983_    ] o.a.s.SolrTestCaseJ4 ####initCore end
   [junit4]   2> 612149 INFO  (coreZkRegister-2291-thread-1-processing-n:127.0.0.1:8983_ x:collection1 c:collection1 s:shard1) [n:127.0.0.1:8983_ c:collection1 s:shard1 r:127.0.0.1:8983__collection1 x:collection1] o.a.s.c.ZkShardTerms Successful update of terms at /collections/collection1/terms/shard1 to Terms{values={127.0.0.1:8983__collection1=0}, version=0}
   [junit4]   2> 612151 INFO  (TEST-TestManagedResourceStorage.testFileBasedJsonStorage-seed#[8368E5C57A9F8AC4]) [n:127.0.0.1:8983_    ] o.a.s.SolrTestCaseJ4 ###Starting testFileBasedJsonStorage
   [junit4]   2> 612152 INFO  (TEST-TestManagedResourceStorage.testFileBasedJsonStorage-seed#[8368E5C57A9F8AC4]) [n:127.0.0.1:8983_    ] o.a.s.r.ManagedResourceStorage File-based storage initialized to use dir: /export/home/jenkins/workspace/Lucene-Solr-master-Solaris/solr/build/solr-core/test/J1/temp/solr.rest.TestManagedResourceStorage_8368E5C57A9F8AC4-001/json-storage-001/managed
   [junit4]   2> 612152 INFO  (TEST-TestManagedResourceStorage.testFileBasedJsonStorage-seed#[8368E5C57A9F8AC4]) [n:127.0.0.1:8983_    ] o.a.s.r.ManagedResourceStorage Saved JSON object to path _test_foo.json using file:dir=/export/home/jenkins/workspace/Lucene-Solr-master-Solaris/solr/build/solr-core/test/J1/temp/solr.rest.TestManagedResourceStorage_8368E5C57A9F8AC4-001/json-storage-001/managed
   [junit4]   2> 612153 INFO  (TEST-TestManagedResourceStorage.testFileBasedJsonStorage-seed#[8368E5C57A9F8AC4]) [n:127.0.0.1:8983_    ] o.a.s.r.ManagedResourceStorage Loaded LinkedHashMap at path _test_foo.json using file:dir=/export/home/jenkins/workspace/Lucene-Solr-master-Solaris/solr/build/solr-core/test/J1/temp/solr.rest.TestManagedResourceStorage_8368E5C57A9F8AC4-001/json-storage-001/managed
   [junit4]   2> 612153 INFO  (TEST-TestManagedResourceStorage.testFileBasedJsonStorage-seed#[8368E5C57A9F8AC4]) [n:127.0.0.1:8983_    ] o.a.s.r.ManagedResourceStorage Saved JSON object to path _test_foo.json using file:dir=/export/home/jenkins/workspace/Lucene-Solr-master-Solaris/solr/build/solr-core/test/J1/temp/solr.rest.TestManagedResourceStorage_8368E5C57A9F8AC4-001/json-storage-001/managed
   [junit4]   2> 612153 INFO  (TEST-TestManagedResourceStorage.testFileBasedJsonStorage-seed#[8368E5C57A9F8AC4]) [n:127.0.0.1:8983_    ] o.a.s.r.ManagedResourceStorage Loaded LinkedHashMap at path _test_foo.json using file:dir=/export/home/jenkins/workspace/Lucene-Solr-master-Solaris/solr/build/solr-core/test/J1/temp/solr.rest.TestManagedResourceStorage_8368E5C57A9F8AC4-001/json-storage-001/managed
   [junit4]   2> 612153 INFO  (TEST-TestManagedResourceStorage.testFileBasedJsonStorage-seed#[8368E5C57A9F8AC4]) [n:127.0.0.1:8983_    ] o.a.s.SolrTestCaseJ4 ###Ending testFileBasedJsonStorage
   [junit4]   2> 612163 INFO  (TEST-TestManagedResourceStorage.testZkBasedJsonStorage-seed#[8368E5C57A9F8AC4]) [n:127.0.0.1:8983_    ] o.a.s.SolrTestCaseJ4 ###Starting testZkBasedJsonStorage
   [junit4]   2> 612166 INFO  (TEST-TestManagedResourceStorage.testZkBasedJsonStorage-seed#[8368E5C57A9F8AC4]) [n:127.0.0.1:8983_    ] o.a.s.r.ManagedResourceStorage Configured ZooKeeperStorageIO with znodeBase: /test
   [junit4]   2> 612166 INFO  (coreZkRegister-2291-thread-1-processing-n:127.0.0.1:8983_ x:collection1 c:collection1 s:shard1) [n:127.0.0.1:8983_ c:collection1 s:shard1 r:127.0.0.1:8983__collection1 x:collection1] o.a.s.c.ShardLeaderElectionContext Enough replicas found to continue.
   [junit4]   2> 612166 INFO  (coreZkRegister-2291-thread-1-processing-n:127.0.0.1:8983_ x:collection1 c:collection1 s:shard1) [n:127.0.0.1:8983_ c:collection1 s:shard1 r:127.0.0.1:8983__collection1 x:collection1] o.a.s.c.ShardLeaderElectionContext I may be the new leader - try and sync
   [junit4]   2> 612166 INFO  (coreZkRegister-2291-thread-1-processing-n:127.0.0.1:8983_ x:collection1 c:collection1 s:shard1) [n:127.0.0.1:8983_ c:collection1 s:shard1 r:127.0.0.1:8983__collection1 x:collection1] o.a.s.c.ShardLeaderElectionContext Found all replicas participating in election, clear LIR
   [junit4]   2> 612168 INFO  (TEST-TestManagedResourceStorage.testZkBasedJsonStorage-seed#[8368E5C57A9F8AC4]) [n:127.0.0.1:8983_    ] o.a.s.r.ManagedResourceStorage Wrote 136 bytes to new znode /test/_test_foo.json
   [junit4]   2> 612168 INFO  (TEST-TestManagedResourceStorage.testZkBasedJsonStorage-seed#[8368E5C57A9F8AC4]) [n:127.0.0.1:8983_    ] o.a.s.r.ManagedResourceStorage Saved JSON object to path _test_foo.json using ZooKeeperStorageIO:path=/test
   [junit4]   2> 612169 INFO  (TEST-TestManagedResourceStorage.testZkBasedJsonStorage-seed#[8368E5C57A9F8AC4]) [n:127.0.0.1:8983_    ] o.a.s.r.ManagedResourceStorage Loaded LinkedHashMap at path _test_foo.json using ZooKeeperStorageIO:path=/test
   [junit4]   2> 612170 INFO  (TEST-TestManagedResourceStorage.testZkBasedJsonStorage-seed#[8368E5C57A9F8AC4]) [n:127.0.0.1:8983_    ] o.a.s.r.ManagedResourceStorage Wrote 175 bytes to existing znode /test/_test_foo.json
   [junit4]   2> 612170 INFO  (TEST-TestManagedResourceStorage.testZkBasedJsonStorage-seed#[8368E5C57A9F8AC4]) [n:127.0.0.1:8983_    ] o.a.s.r.ManagedResourceStorage Saved JSON object to path _test_foo.json using ZooKeeperStorageIO:path=/test
   [junit4]   2> 612171 INFO  (TEST-TestManagedResourceStorage.testZkBasedJsonStorage-seed#[8368E5C57A9F8AC4]) [n:127.0.0.1:8983_    ] o.a.s.r.ManagedResourceStorage Loaded LinkedHashMap at path _test_foo.json using ZooKeeperStorageIO:path=/test
   [junit4]   2> 612171 INFO  (TEST-TestManagedResourceStorage.testZkBasedJsonStorage-seed#[8368E5C57A9F8AC4]) [n:127.0.0.1:8983_    ] o.a.s.SolrTestCaseJ4 ###Ending testZkBasedJsonStorage
   [junit4]   2> 612171 INFO  (SUITE-TestManagedResourceStorage-seed#[8368E5C57A9F8AC4]-worker) [n:127.0.0.1:8983_    ] o.a.s.SolrTestCaseJ4 ###deleteCore
   [junit4]   2> 612172 INFO  (coreZkRegister-2291-thread-1-processing-n:127.0.0.1:8983_ x:collection1 c:collection1 s:shard1) [n:127.0.0.1:8983_ c:collection1 s:shard1 r:127.0.0.1:8983__collection1 x:collection1] o.a.s.c.ShardLeaderElectionContext I am the new leader: http://127.0.0.1:8983/collection1/ shard1
   [junit4]   2> 612172 INFO  (SUITE-TestManagedResourceStorage-seed#[8368E5C57A9F8AC4]-worker) [n:127.0.0.1:8983_    ] o.a.s.SolrTestCaseJ4 ###deleteCore
   [junit4]   2> 612172 INFO  (SUITE-TestManagedResourceStorage-seed#[8368E5C57A9F8AC4]-worker) [n:127.0.0.1:8983_    ] o.a.s.c.CoreContainer Shutting down CoreContainer instance=1622410962
   [junit4]   2> 612173 INFO  (SUITE-TestManagedResourceStorage-seed#[8368E5C57A9F8AC4]-worker) [n:127.0.0.1:8983_    ] o.a.s.m.SolrMetricManager Closing metric reporters for registry=solr.node, tag=null
   [junit4]   2> 612173 INFO  (SUITE-TestManagedResourceStorage-seed#[8368E5C57A9F8AC4]-worker) [n:127.0.0.1:8983_    ] o.a.s.m.r.SolrJmxReporter Closing reporter [org.apache.solr.metrics.reporters.SolrJmxReporter@549c0e47: rootName = null, domain = solr.node, service url = null, agent id = null] for registry solr.node / com.codahale.metrics.MetricRegistry@4969948a
   [junit4]   2> 612176 INFO  (SUITE-TestManagedResourceStorage-seed#[8368E5C57A9F8AC4]-worker) [n:127.0.0.1:8983_    ] o.a.s.m.SolrMetricManager Closing metric reporters for registry=solr.jvm, tag=null
   [junit4]   2> 612176 INFO  (SUITE-TestManagedResourceStorage-seed#[8368E5C57A9F8AC4]-worker) [n:127.0.0.1:8983_    ] o.a.s.m.r.SolrJmxReporter Closing reporter [org.apache.solr.metrics.reporters.SolrJmxReporter@43aadd88: rootName = null, domain = solr.jvm, service url = null, agent id = null] for registry solr.jvm / com.codahale.metrics.MetricRegistry@849df3
   [junit4]   2> 612177 INFO  (SUITE-TestManagedResourceStorage-seed#[8368E5C57A9F8AC4]-worker) [n:127.0.0.1:8983_    ] o.a.s.m.SolrMetricManager Closing metric reporters for registry=solr.jetty, tag=null
   [junit4]   2> 612177 INFO  (SUITE-TestManagedResourceStorage-seed#[8368E5C57A9F8AC4]-worker) [n:127.0.0.1:8983_    ] o.a.s.m.r.SolrJmxReporter Closing reporter [org.apache.solr.metrics.reporters.SolrJmxReporter@36879693: rootName = null, domain = solr.jetty, service url = null, agent id = null] for registry solr.jetty / com.codahale.metrics.MetricRegistry@46e23ed
   [junit4]   2> 612180 INFO  (SUITE-TestManagedResourceStorage-seed#[8368E5C57A9F8AC4]-worker) [n:127.0.0.1:8983_    ] o.a.s.c.ZkController Remove node as live in ZooKeeper:/live_nodes/127.0.0.1:8983_
   [junit4]   2> 612180 INFO  (SUITE-TestManagedResourceStorage-seed#[8368E5C57A9F8AC4]-worker) [n:127.0.0.1:8983_    ] o.a.s.m.SolrMetricManager Closing metric reporters for registry=solr.cluster, tag=null
   [junit4]   2> 612182 INFO  (coreCloseExecutor-2309-thread-1-processing-n:127.0.0.1:8983_) [n:127.0.0.1:8983_ c:collection1 s:shard1 r:127.0.0.1:8983__collection1 x:collection1] o.a.s.c.SolrCore [collection1]  CLOSING SolrCore org.apache.solr.core.SolrCore@4dd9f5d0
   [junit4]   2> 612182 INFO  (zkCallback-1274-thread-1) [    ] o.a.s.c.c.ZkStateReader Updated live nodes from ZooKeeper... (1) -> (0)
   [junit4]   2> 612182 INFO  (coreCloseExecutor-2309-thread-1-processing-n:127.0.0.1:8983_) [n:127.0.0.1:8983_ c:collection1 s:shard1 r:127.0.0.1:8983__collection1 x:collection1] o.a.s.m.SolrMetricManager Closing metric reporters for registry=solr.core.collection1.shard1.127.0.0.1:8983__collection1, tag=4dd9f5d0
   [junit4]   2> 612182 INFO  (zkCallback-1281-thread-1) [    ] o.a.s.c.c.ZkStateReader Updated live nodes from ZooKeeper... (1) -> (0)
   [junit4]   2> 612182 INFO  (coreCloseExecutor-2309-thread-1-processing-n:127.0.0.1:8983_) [n:127.0.0.1:8983_ c:collection1 s:shard1 r:127.0.0.1:8983__collection1 x:collection1] o.a.s.m.r.SolrJmxReporter Closing reporter [org.apache.solr.metrics.reporters.SolrJmxReporter@5cbd0373: rootName = null, domain = solr.core.collection1.shard1.127.0.0.1:8983__collection1, service url = null, agent id = null] for registry solr.core.collection1.shard1.127.0.0.1:8983__collection1 / com.codahale.metrics.MetricRegistry@720b1196
   [junit4]   2> 612189 INFO  (coreCloseExecutor-2309-thread-1-processing-n:127.0.0.1:8983_) [n:127.0.0.1:8983_ c:collection1 s:shard1 r:127.0.0.1:8983__collection1 x:collection1] o.a.s.m.SolrMetricManager Closing metric reporters for registry=solr.collection.collection1.shard1.leader, tag=4dd9f5d0
   [junit4]   2> 612191 INFO  (SUITE-TestManagedResourceStorage-seed#[8368E5C57A9F8AC4]-worker) [n:127.0.0.1:8983_    ] o.a.s.c.Overseer Overseer (id=72062684889153539-127.0.0.1:8983_-n_0000000000) closing
   [junit4]   2> 612192 INFO  (OverseerStateUpdate-72062684889153539-127.0.0.1:8983_-n_0000000000) [n:127.0.0.1:8983_    ] o.a.s.c.Overseer Overseer Loop exiting : 127.0.0.1:8983_
   [junit4]   2> 612192 WARN  (OverseerAutoScalingTriggerThread-72062684889153539-127.0.0.1:8983_-n_0000000000) [    ] o.a.s.c.a.OverseerTriggerThread OverseerTriggerThread woken up but we are closed, exiting.
   [junit4]   2> 612223 ERROR (coreZkRegister-2291-thread-1-processing-n:127.0.0.1:8983_ x:collection1 c:collection1 s:shard1) [n:127.0.0.1:8983_ c:collection1 s:shard1 r:127.0.0.1:8983__collection1 x:collection1] o.a.s.c.ZkController Error getting leader from zk
   [junit4]   2> org.apache.solr.common.SolrException: No registered leader was found after waiting for 1560000ms , collection: collection1 slice: shard1 saw state=DocCollection(collection1//clusterstate.json/1)={
   [junit4]   2>   "shards":{"shard1":{
   [junit4]   2>       "parent":null,
   [junit4]   2>       "range":null,
   [junit4]   2>       "state":"active",
   [junit4]   2>       "replicas":{"127.0.0.1:8983__collection1":{
   [junit4]   2>           "core":"collection1",
   [junit4]   2>           "base_url":"http://127.0.0.1:8983",
   [junit4]   2>           "node_name":"127.0.0.1:8983_",
   [junit4]   2>           "state":"down",
   [junit4]   2>           "type":"NRT"}}}},
   [junit4]   2>   "router":{"name":"implicit"}} with live_nodes=[]
   [junit4]   2> 	at org.apache.solr.common.cloud.ZkStateReader.getLeaderRetry(ZkStateReader.java:861) ~[java/:?]
   [junit4]   2> 	at org.apache.solr.common.cloud.ZkStateReader.getLeaderUrl(ZkStateReader.java:826) ~[java/:?]
   [junit4]   2> 	at org.apache.solr.cloud.ZkController.getLeader(ZkController.java:1269) ~[java/:?]
   [junit4]   2> 	at org.apache.solr.cloud.ZkController.register(ZkController.java:1149) ~[java/:?]
   [junit4]   2> 	at org.apache.solr.cloud.ZkController.register(ZkController.java:1080) ~[java/:?]
   [junit4]   2> 	at org.apache.solr.core.ZkContainer.lambda$registerInZk$0(ZkContainer.java:187) ~[java/:?]
   [junit4]   2> 	at org.apache.solr.common.util.ExecutorUtil$MDCAwareThreadPoolExecutor.lambda$execute$0(ExecutorUtil.java:209) ~[java/:?]
   [junit4]   2> 	at java.util.concurrent.ThreadPoolExecutor.runWorker(ThreadPoolExecutor.java:1149) [?:1.8.0_172]
   [junit4]   2> 	at java.util.concurrent.ThreadPoolExecutor$Worker.run(ThreadPoolExecutor.java:624) [?:1.8.0_172]
   [junit4]   2> 	at java.lang.Thread.run(Thread.java:748) [?:1.8.0_172]
   [junit4]   2> 612224 ERROR (coreZkRegister-2291-thread-1-processing-n:127.0.0.1:8983_ x:collection1 c:collection1 s:shard1) [n:127.0.0.1:8983_ c:collection1 s:shard1 r:127.0.0.1:8983__collection1 x:collection1] o.a.s.c.ZkContainer :org.apache.solr.common.SolrException: Error getting leader from zk for shard shard1
   [junit4]   2> 	at org.apache.solr.cloud.ZkController.getLeader(ZkController.java:1298)
   [junit4]   2> 	at org.apache.solr.cloud.ZkController.register(ZkController.java:1149)
   [junit4]   2> 	at org.apache.solr.cloud.ZkController.register(ZkController.java:1080)
   [junit4]   2> 	at org.apache.solr.core.ZkContainer.lambda$registerInZk$0(ZkContainer.java:187)
   [junit4]   2> 	at org.apache.solr.common.util.ExecutorUtil$MDCAwareThreadPoolExecutor.lambda$execute$0(ExecutorUtil.java:209)
   [junit4]   2> 	at java.util.concurrent.ThreadPoolExecutor.runWorker(ThreadPoolExecutor.java:1149)
   [junit4]   2> 	at java.util.concurrent.ThreadPoolExecutor$Worker.run(ThreadPoolExecutor.java:624)
   [junit4]   2> 	at java.lang.Thread.run(Thread.java:748)
   [junit4]   2> Caused by: org.apache.solr.common.SolrException: No registered leader was found after waiting for 1560000ms , collection: collection1 slice: shard1 saw state=DocCollection(collection1//clusterstate.json/1)={
   [junit4]   2>   "shards":{"shard1":{
   [junit4]   2>       "parent":null,
   [junit4]   2>       "range":null,
   [junit4]   2>       "state":"active",
   [junit4]   2>       "replicas":{"127.0.0.1:8983__collection1":{
   [junit4]   2>           "core":"collection1",
   [junit4]   2>           "base_url":"http://127.0.0.1:8983",
   [junit4]   2>           "node_name":"127.0.0.1:8983_",
   [junit4]   2>           "state":"down",
   [junit4]   2>           "type":"NRT"}}}},
   [junit4]   2>   "router":{"name":"implicit"}} with live_nodes=[]
   [junit4]   2> 	at org.apache.solr.common.cloud.ZkStateReader.getLeaderRetry(ZkStateReader.java:861)
   [junit4]   2> 	at org.apache.solr.common.cloud.ZkStateReader.getLeaderUrl(ZkStateReader.java:826)
   [junit4]   2> 	at org.apache.solr.cloud.ZkController.getLeader(ZkController.java:1269)
   [junit4]   2> 	... 7 more
   [junit4]   2> 
   [junit4]   2> 612225 INFO  (SUITE-TestManagedResourceStorage-seed#[8368E5C57A9F8AC4]-worker) [n:127.0.0.1:8983_    ] o.a.s.SolrTestCaseJ4 ------------------------------------------------------- Done waiting for tracked resources to be released
   [junit4]   2> Sep 22, 2018 1:42:41 PM com.carrotsearch.randomizedtesting.ThreadLeakControl checkThreadLeaks
   [junit4]   2> WARNING: Will linger awaiting termination of 6 leaked thread(s).
   [junit4]   2> Sep 22, 2018 1:44:01 PM com.carrotsearch.randomizedtesting.ThreadLeakControl checkThreadLeaks
   [junit4]   2> SEVERE: 4 threads leaked from SUITE scope at org.apache.solr.rest.TestManagedResourceStorage: 
   [junit4]   2>    1) Thread[id=4770, name=NIOServerCxn.Factory:0.0.0.0/0.0.0.0:0, state=RUNNABLE, group=TGRP-TestManagedResourceStorage]
   [junit4]   2>         at sun.nio.ch.DevPollArrayWrapper.poll0(Native Method)
   [junit4]   2>         at sun.nio.ch.DevPollArrayWrapper.poll(DevPollArrayWrapper.java:223)
   [junit4]   2>         at sun.nio.ch.DevPollSelectorImpl.doSelect(DevPollSelectorImpl.java:98)
   [junit4]   2>         at sun.nio.ch.SelectorImpl.lockAndDoSelect(SelectorImpl.java:86)
   [junit4]   2>         at sun.nio.ch.SelectorImpl.select(SelectorImpl.java:97)
   [junit4]   2>         at org.apache.zookeeper.server.NIOServerCnxnFactory.run(NIOServerCnxnFactory.java:196)
   [junit4]   2>         at java.lang.Thread.run(Thread.java:748)
   [junit4]   2>    2) Thread[id=4769, name=Thread-746, state=WAITING, group=TGRP-TestManagedResourceStorage]
   [junit4]   2>         at java.lang.Object.wait(Native Method)
   [junit4]   2>         at java.lang.Thread.join(Thread.java:1252)
   [junit4]   2>         at java.lang.Thread.join(Thread.java:1326)
   [junit4]   2>         at org.apache.zookeeper.server.NIOServerCnxnFactory.join(NIOServerCnxnFactory.java:313)
   [junit4]   2>         at org.apache.solr.cloud.ZkTestServer$ZKServerMain.runFromConfig(ZkTestServer.java:313)
   [junit4]   2>         at org.apache.solr.cloud.ZkTestServer$2.run(ZkTestServer.java:496)
   [junit4]   2>    3) Thread[id=4771, name=SessionTracker, state=TIMED_WAITING, group=TGRP-TestManagedResourceStorage]
   [junit4]   2>         at java.lang.Object.wait(Native Method)
   [junit4]   2>         at org.apache.zookeeper.server.SessionTrackerImpl.run(SessionTrackerImpl.java:147)
   [junit4]   2>    4) Thread[id=4773, name=ProcessThread(sid:0 cport:51027):, state=WAITING, group=TGRP-TestManagedResourceStorage]
   [junit4]   2>         at sun.misc.Unsafe.park(Native Method)
   [junit4]   2>         at java.util.concurrent.locks.LockSupport.park(LockSupport.java:175)
   [junit4]   2>         at java.util.concurrent.locks.AbstractQueuedSynchronizer$ConditionObject.await(AbstractQueuedSynchronizer.java:2039)
   [junit4]   2>         at java.util.concurrent.LinkedBlockingQueue.take(LinkedBlockingQueue.java:442)
   [junit4]   2>         at org.apache.zookeeper.server.PrepRequestProcessor.run(PrepRequestProcessor.java:123)
   [junit4]   2> Sep 22, 2018 1:44:01 PM com.carrotsearch.randomizedtesting.ThreadLeakControl tryToInterruptAll
   [junit4]   2> INFO: Starting to interrupt leaked threads:
   [junit4]   2>    1) Thread[id=4770, name=NIOServerCxn.Factory:0.0.0.0/0.0.0.0:0, state=RUNNABLE, group=TGRP-TestManagedResourceStorage]
   [junit4]   2>    2) Thread[id=4769, name=Thread-746, state=WAITING, group=TGRP-TestManagedResourceStorage]
   [junit4]   2>    3) Thread[id=4771, name=SessionTracker, state=TIMED_WAITING, group=TGRP-TestManagedResourceStorage]
   [junit4]   2>    4) Thread[id=4773, name=ProcessThread(sid:0 cport:51027):, state=WAITING, group=TGRP-TestManagedResourceStorage]
   [junit4]   2> 692375 ERROR (SessionTracker) [    ] o.a.z.s.ZooKeeperCriticalThread Severe unrecoverable error, from thread : SessionTracker
   [junit4]   2> java.lang.InterruptedException: null
   [junit4]   2> 	at java.lang.Object.wait(Native Method) ~[?:1.8.0_172]
   [junit4]   2> 	at org.apache.zookeeper.server.SessionTrackerImpl.run(SessionTrackerImpl.java:147) [zookeeper-3.4.11.jar:3.4.11-37e277162d567b55a07d1755f0b31c32e93c01a0]
   [junit4]   2> 692375 ERROR (ProcessThread(sid:0 cport:51027):) [    ] o.a.z.s.ZooKeeperCriticalThread Severe unrecoverable error, from thread : ProcessThread(sid:0 cport:51027):
   [junit4]   2> java.lang.InterruptedException: null
   [junit4]   2> 	at java.util.concurrent.locks.AbstractQueuedSynchronizer$ConditionObject.reportInterruptAfterWait(AbstractQueuedSynchronizer.java:2014) ~[?:1.8.0_172]
   [junit4]   2> 	at java.util.concurrent.locks.AbstractQueuedSynchronizer$ConditionObject.await(AbstractQueuedSynchronizer.java:2048) ~[?:1.8.0_172]
   [junit4]   2> 	at java.util.concurrent.LinkedBlockingQueue.take(LinkedBlockingQueue.java:442) ~[?:1.8.0_172]
   [junit4]   2> 	at org.apache.zookeeper.server.PrepRequestProcessor.run(PrepRequestProcessor.java:123) [zookeeper-3.4.11.jar:3.4.11-37e277162d567b55a07d1755f0b31c32e93c01a0]
   [junit4]   2> 692375 ERROR (ProcessThread(sid:0 cport:51027):) [    ] o.a.z.s.ZooKeeperServer ZKShutdownHandler is not registered, so ZooKeeper server won't take any action on ERROR or SHUTDOWN server state changes
   [junit4]   2> 692375 ERROR (SessionTracker) [    ] o.a.z.s.ZooKeeperServer ZKShutdownHandler is not registered, so ZooKeeper server won't take any action on ERROR or SHUTDOWN server state changes
   [junit4]   2> 692375 WARN  (Thread-746) [    ] o.a.s.c.ZkTestServer Server interrupted
   [junit4]   2> java.lang.InterruptedException: null
   [junit4]   2> 	at java.lang.Object.wait(Native Method) ~[?:1.8.0_172]
   [junit4]   2> 	at java.lang.Thread.join(Thread.java:1252) ~[?:1.8.0_172]
   [junit4]   2> 	at java.lang.Thread.join(Thread.java:1326) ~[?:1.8.0_172]
   [junit4]   2> 	at org.apache.zookeeper.server.NIOServerCnxnFactory.join(NIOServerCnxnFactory.java:313) ~[zookeeper-3.4.11.jar:3.4.11-37e277162d567b55a07d1755f0b31c32e93c01a0]
   [junit4]   2> 	at org.apache.solr.cloud.ZkTestServer$ZKServerMain.runFromConfig(ZkTestServer.java:313) [java/:?]
   [junit4]   2> 	at org.apache.solr.cloud.ZkTestServer$2.run(ZkTestServer.java:496) [java/:?]
   [junit4]   2> Sep 22, 2018 1:44:04 PM com.carrotsearch.randomizedtesting.ThreadLeakControl tryToInterruptAll
   [junit4]   2> SEVERE: There are still zombie threads that couldn't be terminated:
   [junit4]   2>    1) Thread[id=4770, name=NIOServerCxn.Factory:0.0.0.0/0.0.0.0:0, state=RUNNABLE, group=TGRP-TestManagedResourceStorage]
   [junit4]   2>         at sun.nio.ch.DevPollArrayWrapper.interrupt(Native Method)
   [junit4]   2>         at sun.nio.ch.DevPollArrayWrapper.interrupt(DevPollArrayWrapper.java:300)
   [junit4]   2>         at sun.nio.ch.DevPollSelectorImpl.wakeup(DevPollSelectorImpl.java:207)
   [junit4]   2>         at java.nio.channels.spi.AbstractSelector$1.interrupt(AbstractSelector.java:213)
   [junit4]   2>         at java.nio.channels.spi.AbstractSelector.begin(AbstractSelector.java:219)
   [junit4]   2>         at sun.nio.ch.DevPollSelectorImpl.doSelect(DevPollSelectorImpl.java:97)
   [junit4]   2>         at sun.nio.ch.SelectorImpl.lockAndDoSelect(SelectorImpl.java:86)
   [junit4]   2>         at sun.nio.ch.SelectorImpl.select(SelectorImpl.java:97)
   [junit4]   2>         at org.apache.zookeeper.server.NIOServerCnxnFactory.run(NIOServerCnxnFactory.java:196)
   [junit4]   2>         at java.lang.Thread.run(Thread.java:748)
   [junit4]   2> NOTE: test params are: codec=Asserting(Lucene80), sim=Asserting(org.apache.lucene.search.similarities.AssertingSimilarity@4876d8eb), locale=es-HN, timezone=Etc/GMT+0
   [junit4]   2> NOTE: SunOS 5.11 amd64/Oracle Corporation 1.8.0_172 (64-bit)/cpus=3,threads=3,free=118910704,total=536870912
   [junit4]   2> NOTE: All tests run in this JVM: [TestBlendedInfixSuggestions, ReplicationFactorTest, TestManagedStopFilterFactory, TestPerFieldSimilarity, ReplaceNodeNoTargetTest, SortByFunctionTest, EnumFieldTest, TestTolerantUpdateProcessorCloud, SpellCheckCollatorTest, AtomicUpdateProcessorFactoryTest, ShufflingReplicaListTransformerTest, TestFieldCollectionResource, TestApiFramework, TaggerTest, IndexSizeTriggerTest, OrderedExecutorTest, TestInPlaceUpdatesDistrib, NodeAddedTriggerTest, SolrMetricReporterTest, TestCloudJSONFacetSKG, TestManagedSchemaThreadSafety, TestSubQueryTransformer, TestSimDistribStateManager, OpenExchangeRatesOrgProviderTest, TestDocSet, TestUseDocValuesAsStored, TestCursorMarkWithoutUniqueKey, MultiThreadedOCPTest, TestRandomFlRTGCloud, TestFastOutputStream, TestPullReplica, BasicDistributedZk2Test, TestIndexSearcher, TestSystemIdResolver, GraphQueryTest, BJQParserTest, TestUninvertingReader, TestAddFieldRealTimeGet, PeerSyncWithIndexFingerprintCachingTest, TestDFISimilarityFactory, BufferStoreTest, TestDirectoryFactory, CleanupOldIndexTest, TestReversedWildcardFilterFactory, TestConfigSetProperties, LukeRequestHandlerTest, TestLegacyNumericRangeQueryBuilder, BadIndexSchemaTest, FileUtilsTest, DeleteShardTest, DateRangeFieldTest, TestPHPSerializedResponseWriter, UninvertDocValuesMergePolicyTest, TestReloadAndDeleteDocs, ClusterStateTest, TestSurroundQueryParser, XmlInterpolationTest, SimpleCollectionCreateDeleteTest, DistributedIntervalFacetingTest, BasicZkTest, TestSafeXMLParsing, TestAnalyzeInfixSuggestions, ChangedSchemaMergeTest, TestDelegationWithHadoopAuth, SortSpecParsingTest, CustomHighlightComponentTest, TestManagedResourceStorage]
   [junit4]   2> NOTE: reproduce with: ant test  -Dtestcase=TestManagedResourceStorage -Dtests.seed=8368E5C57A9F8AC4 -Dtests.slow=true -Dtests.locale=es-HN -Dtests.timezone=Etc/GMT+0 -Dtests.asserts=true -Dtests.file.encoding=UTF-8
   [junit4] ERROR   0.00s J1 | TestManagedResourceStorage (suite) <<<
   [junit4]    > Throwable #1: java.lang.RuntimeException: SolrCore.getOpenCount()==2
   [junit4]    > 	at __randomizedtesting.SeedInfo.seed([8368E5C57A9F8AC4]:0)
   [junit4]    > 	at org.apache.solr.util.TestHarness.close(TestHarness.java:380)
   [junit4]    > 	at org.apache.solr.SolrTestCaseJ4.deleteCore(SolrTestCaseJ4.java:802)
   [junit4]    > 	at org.apache.solr.cloud.AbstractZkTestCase.azt_afterClass(AbstractZkTestCase.java:147)
   [junit4]    > 	at java.lang.Thread.run(Thread.java:748)Throwable #2: com.carrotsearch.randomizedtesting.ThreadLeakError: 4 threads leaked from SUITE scope at org.apache.solr.rest.TestManagedResourceStorage: 
   [junit4]    >    1) Thread[id=4770, name=NIOServerCxn.Factory:0.0.0.0/0.0.0.0:0, state=RUNNABLE, group=TGRP-TestManagedResourceStorage]
   [junit4]    >         at sun.nio.ch.DevPollArrayWrapper.poll0(Native Method)
   [junit4]    >         at sun.nio.ch.DevPollArrayWrapper.poll(DevPollArrayWrapper.java:223)
   [junit4]    >         at sun.nio.ch.DevPollSelectorImpl.doSelect(DevPollSelectorImpl.java:98)
   [junit4]    >         at sun.nio.ch.SelectorImpl.lockAndDoSelect(SelectorImpl.java:86)
   [junit4]    >         at sun.nio.ch.SelectorImpl.select(SelectorImpl.java:97)
   [junit4]    >         at org.apache.zookeeper.server.NIOServerCnxnFactory.run(NIOServerCnxnFactory.java:196)
   [junit4]    >         at java.lang.Thread.run(Thread.java:748)
   [junit4]    >    2) Thread[id=4769, name=Thread-746, state=WAITING, group=TGRP-TestManagedResourceStorage]
   [junit4]    >         at java.lang.Object.wait(Native Method)
   [junit4]    >         at java.lang.Thread.join(Thread.java:1252)
   [junit4]    >         at java.lang.Thread.join(Thread.java:1326)
   [junit4]    >         at org.apache.zookeeper.server.NIOServerCnxnFactory.join(NIOServerCnxnFactory.java:313)
   [junit4]    >         at org.apache.solr.cloud.ZkTestServer$ZKServerMain.runFromConfig(ZkTestServer.java:313)
   [junit4]    >         at org.apache.solr.cloud.ZkTestServer$2.run(ZkTestServer.java:496)
   [junit4]    >    3) Thread[id=4771, name=SessionTracker, state=TIMED_WAITING, group=TGRP-TestManagedResourceStorage]
   [junit4]    >         at java.lang.Object.wait(Native Method)
   [junit4]    >         at org.apache.zookeeper.server.SessionTrackerImpl.run(SessionTrackerImpl.java:147)
   [junit4]    >    4) Thread[id=4773, name=ProcessThread(sid:0 cport:51027):, state=WAITING, group=TGRP-TestManagedResourceStorage]
   [junit4]    >         at sun.misc.Unsafe.park(Native Method)
   [junit4]    >         at java.util.concurrent.locks.LockSupport.park(LockSupport.java:175)
   [junit4]    >         at java.util.concurrent.locks.AbstractQueuedSynchronizer$ConditionObject.await(AbstractQueuedSynchronizer.java:2039)
   [junit4]    >         at java.util.concurrent.LinkedBlockingQueue.take(LinkedBlockingQueue.java:442)
   [junit4]    >         at org.apache.zookeeper.server.PrepRequestProcessor.run(PrepRequestProcessor.java:123)
   [junit4]    > 	at __randomizedtesting.SeedInfo.seed([8368E5C57A9F8AC4]:0)Throwable #3: com.carrotsearch.randomizedtesting.ThreadLeakError: There are still zombie threads that couldn't be terminated:
   [junit4]    >    1) Thread[id=4770, name=NIOServerCxn.Factory:0.0.0.0/0.0.0.0:0, state=RUNNABLE, group=TGRP-TestManagedResourceStorage]
   [junit4]    >         at sun.nio.ch.DevPollArrayWrapper.interrupt(Native Method)
   [junit4]    >         at sun.nio.ch.DevPollArrayWrapper.interrupt(DevPollArrayWrapper.java:300)
   [junit4]    >         at sun.nio.ch.DevPollSelectorImpl.wakeup(DevPollSelectorImpl.java:207)
   [junit4]    >         at java.nio.channels.spi.AbstractSelector$1.interrupt(AbstractSelector.java:213)
   [junit4]    >         at java.nio.channels.spi.AbstractSelector.begin(AbstractSelector.java:219)
   [junit4]    >         at sun.nio.ch.DevPollSelectorImpl.doSelect(DevPollSelectorImpl.java:97)
   [junit4]    >         at sun.nio.ch.SelectorImpl.lockAndDoSelect(SelectorImpl.java:86)
   [junit4]    >         at sun.nio.ch.SelectorImpl.select(SelectorImpl.java:97)
   [junit4]    >         at org.apache.zookeeper.server.NIOServerCnxnFactory.run(NIOServerCnxnFactory.java:196)
   [junit4]    >         at java.lang.Thread.run(Thread.java:748)
   [junit4]    > 	at __randomizedtesting.SeedInfo.seed([8368E5C57A9F8AC4]:0)
   [junit4] Completed [128/834 (1!)] on J1 in 85.86s, 2 tests, 3 errors <<< FAILURES!

[...truncated 51066 lines...]
[asciidoctor:convert] asciidoctor: ERROR: about-this-guide.adoc: line 1: invalid part, must have at least one section (e.g., chapter, appendix, etc.)
[asciidoctor:convert] asciidoctor: ERROR: solr-glossary.adoc: line 1: invalid part, must have at least one section (e.g., chapter, appendix, etc.)
     [java] Processed 2430 links (1982 relative) to 3172 anchors in 246 files
     [echo] Validated Links & Anchors via: /export/home/jenkins/workspace/Lucene-Solr-master-Solaris/solr/build/solr-ref-guide/bare-bones-html/

-documentation-lint:
    [jtidy] Checking for broken html (such as invalid tags)...
   [delete] Deleting directory /export/home/jenkins/workspace/Lucene-Solr-master-Solaris/lucene/build/jtidy_tmp
     [echo] Checking for broken links...
     [exec] 
     [exec] Crawl/parse...
     [exec] 
     [exec] Verify...
     [echo] Checking for malformed docs...

jar-checksums:

resolve:

ivy-availability-check:
[loadresource] Do not set property disallowed.ivy.jars.list as its length is 0.

-ivy-fail-disallowed-ivy-version:

ivy-fail:

ivy-configure:
[ivy:configure] :: loading settings :: file = /export/home/jenkins/workspace/Lucene-Solr-master-Solaris/lucene/top-level-ivy-settings.xml

resolve:

ivy-availability-check:
[loadresource] Do not set property disallowed.ivy.jars.list as its length is 0.

-ivy-fail-disallowed-ivy-version:

ivy-fail:

ivy-configure:
[ivy:configure] :: loading settings :: file = /export/home/jenkins/workspace/Lucene-Solr-master-Solaris/lucene/top-level-ivy-settings.xml

resolve:

resolve:

ivy-availability-check:
[loadresource] Do not set property disallowed.ivy.jars.list as its length is 0.

-ivy-fail-disallowed-ivy-version:

ivy-fail:

ivy-configure:
[ivy:configure] :: loading settings :: file = /export/home/jenkins/workspace/Lucene-Solr-master-Solaris/lucene/top-level-ivy-settings.xml

resolve:

ivy-availability-check:
[loadresource] Do not set property disallowed.ivy.jars.list as its length is 0.

-ivy-fail-disallowed-ivy-version:

ivy-fail:

ivy-configure:
[ivy:configure] :: loading settings :: file = /export/home/jenkins/workspace/Lucene-Solr-master-Solaris/lucene/top-level-ivy-settings.xml

resolve:

ivy-availability-check:
[loadresource] Do not set property disallowed.ivy.jars.list as its length is 0.

-ivy-fail-disallowed-ivy-version:

ivy-fail:

ivy-configure:
[ivy:configure] :: loading settings :: file = /export/home/jenkins/workspace/Lucene-Solr-master-Solaris/lucene/top-level-ivy-settings.xml

resolve:

ivy-availability-check:
[loadresource] Do not set property disallowed.ivy.jars.list as its length is 0.

-ivy-fail-disallowed-ivy-version:

ivy-fail:

ivy-configure:
[ivy:configure] :: loading settings :: file = /export/home/jenkins/workspace/Lucene-Solr-master-Solaris/lucene/top-level-ivy-settings.xml

resolve:

ivy-availability-check:
[loadresource] Do not set property disallowed.ivy.jars.list as its length is 0.

-ivy-fail-disallowed-ivy-version:

ivy-fail:

ivy-configure:
[ivy:configure] :: loading settings :: file = /export/home/jenkins/workspace/Lucene-Solr-master-Solaris/lucene/top-level-ivy-settings.xml

resolve:

ivy-availability-check:
[loadresource] Do not set property disallowed.ivy.jars.list as its length is 0.

-ivy-fail-disallowed-ivy-version:

ivy-fail:

ivy-configure:
[ivy:configure] :: loading settings :: file = /export/home/jenkins/workspace/Lucene-Solr-master-Solaris/lucene/top-level-ivy-settings.xml

resolve:

ivy-availability-check:
[loadresource] Do not set property disallowed.ivy.jars.list as its length is 0.

-ivy-fail-disallowed-ivy-version:

ivy-fail:

ivy-configure:
[ivy:configure] :: loading settings :: file = /export/home/jenkins/workspace/Lucene-Solr-master-Solaris/lucene/top-level-ivy-settings.xml

resolve:

ivy-availability-check:
[loadresource] Do not set property disallowed.ivy.jars.list as its length is 0.

-ivy-fail-disallowed-ivy-version:

ivy-fail:

ivy-configure:
[ivy:configure] :: loading settings :: file = /export/home/jenkins/workspace/Lucene-Solr-master-Solaris/lucene/top-level-ivy-settings.xml

resolve:

ivy-availability-check:
[loadresource] Do not set property disallowed.ivy.jars.list as its length is 0.

-ivy-fail-disallowed-ivy-version:

ivy-fail:

ivy-configure:
[ivy:configure] :: loading settings :: file = /export/home/jenkins/workspace/Lucene-Solr-master-Solaris/lucene/top-level-ivy-settings.xml

resolve:

ivy-availability-check:
[loadresource] Do not set property disallowed.ivy.jars.list as its length is 0.

-ivy-fail-disallowed-ivy-version:

ivy-fail:

ivy-configure:
[ivy:configure] :: loading settings :: file = /export/home/jenkins/workspace/Lucene-Solr-master-Solaris/lucene/top-level-ivy-settings.xml

resolve:

ivy-availability-check:
[loadresource] Do not set property disallowed.ivy.jars.list as its length is 0.

-ivy-fail-disallowed-ivy-version:

ivy-fail:

ivy-configure:
[ivy:configure] :: loading settings :: file = /export/home/jenkins/workspace/Lucene-Solr-master-Solaris/lucene/top-level-ivy-settings.xml

resolve:

ivy-availability-check:
[loadresource] Do not set property disallowed.ivy.jars.list as its length is 0.

-ivy-fail-disallowed-ivy-version:

ivy-fail:

ivy-configure:
[ivy:configure] :: loading settings :: file = /export/home/jenkins/workspace/Lucene-Solr-master-Solaris/lucene/top-level-ivy-settings.xml

resolve:

ivy-availability-check:
[loadresource] Do not set property disallowed.ivy.jars.list as its length is 0.

-ivy-fail-disallowed-ivy-version:

ivy-fail:

ivy-configure:
[ivy:configure] :: loading settings :: file = /export/home/jenkins/workspace/Lucene-Solr-master-Solaris/lucene/top-level-ivy-settings.xml

resolve:

ivy-availability-check:
[loadresource] Do not set property disallowed.ivy.jars.list as its length is 0.

-ivy-fail-disallowed-ivy-version:

ivy-fail:

ivy-configure:
[ivy:configure] :: loading settings :: file = /export/home/jenkins/workspace/Lucene-Solr-master-Solaris/lucene/top-level-ivy-settings.xml

resolve:

ivy-availability-check:
[loadresource] Do not set property disallowed.ivy.jars.list as its length is 0.

-ivy-fail-disallowed-ivy-version:

ivy-fail:

ivy-configure:
[ivy:configure] :: loading settings :: file = /export/home/jenkins/workspace/Lucene-Solr-master-Solaris/lucene/top-level-ivy-settings.xml

resolve:

ivy-availability-check:
[loadresource] Do not set property disallowed.ivy.jars.list as its length is 0.

-ivy-fail-disallowed-ivy-version:

ivy-fail:

ivy-configure:
[ivy:configure] :: loading settings :: file = /export/home/jenkins/workspace/Lucene-Solr-master-Solaris/lucene/top-level-ivy-settings.xml

resolve:

ivy-availability-check:
[loadresource] Do not set property disallowed.ivy.jars.list as its length is 0.

-ivy-fail-disallowed-ivy-version:

ivy-fail:

ivy-configure:
[ivy:configure] :: loading settings :: file = /export/home/jenkins/workspace/Lucene-Solr-master-Solaris/lucene/top-level-ivy-settings.xml

resolve:

ivy-availability-check:
[loadresource] Do not set property disallowed.ivy.jars.list as its length is 0.

-ivy-fail-disallowed-ivy-version:

ivy-fail:

ivy-configure:
[ivy:configure] :: loading settings :: file = /export/home/jenkins/workspace/Lucene-Solr-master-Solaris/lucene/top-level-ivy-settings.xml

resolve:

ivy-availability-check:
[loadresource] Do not set property disallowed.ivy.jars.list as its length is 0.

-ivy-fail-disallowed-ivy-version:

ivy-fail:

ivy-configure:
[ivy:configure] :: loading settings :: file = /export/home/jenkins/workspace/Lucene-Solr-master-Solaris/lucene/top-level-ivy-settings.xml

resolve:

ivy-availability-check:
[loadresource] Do not set property disallowed.ivy.jars.list as its length is 0.

-ivy-fail-disallowed-ivy-version:

ivy-fail:

ivy-configure:
[ivy:configure] :: loading settings :: file = /export/home/jenkins/workspace/Lucene-Solr-master-Solaris/lucene/top-level-ivy-settings.xml

resolve:

ivy-availability-check:
[loadresource] Do not set property disallowed.ivy.jars.list as its length is 0.

-ivy-fail-disallowed-ivy-version:

ivy-fail:

ivy-configure:
[ivy:configure] :: loading settings :: file = /export/home/jenkins/workspace/Lucene-Solr-master-Solaris/lucene/top-level-ivy-settings.xml

resolve:

ivy-availability-check:
[loadresource] Do not set property disallowed.ivy.jars.list as its length is 0.

-ivy-fail-disallowed-ivy-version:

ivy-fail:

ivy-configure:
[ivy:configure] :: loading settings :: file = /export/home/jenkins/workspace/Lucene-Solr-master-Solaris/lucene/top-level-ivy-settings.xml

resolve:

ivy-availability-check:
[loadresource] Do not set property disallowed.ivy.jars.list as its length is 0.

-ivy-fail-disallowed-ivy-version:

ivy-fail:

ivy-configure:
[ivy:configure] :: loading settings :: file = /export/home/jenkins/workspace/Lucene-Solr-master-Solaris/lucene/top-level-ivy-settings.xml

resolve:

ivy-availability-check:
[loadresource] Do not set property disallowed.ivy.jars.list as its length is 0.

-ivy-fail-disallowed-ivy-version:

ivy-fail:

ivy-configure:
[ivy:configure] :: loading settings :: file = /export/home/jenkins/workspace/Lucene-Solr-master-Solaris/lucene/top-level-ivy-settings.xml

common.resolve:

resolve:

ivy-availability-check:
[loadresource] Do not set property disallowed.ivy.jars.list as its length is 0.

-ivy-fail-disallowed-ivy-version:

ivy-fail:

ivy-configure:
[ivy:configure] :: loading settings :: file = /export/home/jenkins/workspace/Lucene-Solr-master-Solaris/lucene/top-level-ivy-settings.xml

resolve:

ivy-availability-check:
[loadresource] Do not set property disallowed.ivy.jars.list as its length is 0.

-ivy-fail-disallowed-ivy-version:

ivy-fail:

ivy-configure:
[ivy:configure] :: loading settings :: file = /export/home/jenkins/workspace/Lucene-Solr-master-Solaris/lucene/top-level-ivy-settings.xml

resolve:

ivy-availability-check:
[loadresource] Do not set property disallowed.ivy.jars.list as its length is 0.

-ivy-fail-disallowed-ivy-version:

ivy-fail:

ivy-configure:
[ivy:configure] :: loading settings :: file = /export/home/jenkins/workspace/Lucene-Solr-master-Solaris/lucene/top-level-ivy-settings.xml

resolve:

ivy-availability-check:
[loadresource] Do not set property disallowed.ivy.jars.list as its length is 0.

-ivy-fail-disallowed-ivy-version:

ivy-fail:

ivy-configure:
[ivy:configure] :: loading settings :: file = /export/home/jenkins/workspace/Lucene-Solr-master-Solaris/lucene/top-level-ivy-settings.xml

resolve:

ivy-availability-check:
[loadresource] Do not set property disallowed.ivy.jars.list as its length is 0.

-ivy-fail-disallowed-ivy-version:

ivy-fail:

ivy-configure:
[ivy:configure] :: loading settings :: file = /export/home/jenkins/workspace/Lucene-Solr-master-Solaris/lucene/top-level-ivy-settings.xml

resolve:

jar-checksums:
    [mkdir] Created dir: /export/home/jenkins/workspace/Lucene-Solr-master-Solaris/lucene/null1758967658
     [copy] Copying 35 files to /export/home/jenkins/workspace/Lucene-Solr-master-Solaris/lucene/null1758967658
   [delete] Deleting directory /export/home/jenkins/workspace/Lucene-Solr-master-Solaris/lucene/null1758967658

resolve-example:

ivy-availability-check:
[loadresource] Do not set property disallowed.ivy.jars.list as its length is 0.

-ivy-fail-disallowed-ivy-version:

ivy-fail:

ivy-configure:
[ivy:configure] :: loading settings :: file = /export/home/jenkins/workspace/Lucene-Solr-master-Solaris/lucene/top-level-ivy-settings.xml

resolve:

resolve-server:

ivy-availability-check:
[loadresource] Do not set property disallowed.ivy.jars.list as its length is 0.

-ivy-fail-disallowed-ivy-version:

ivy-fail:

ivy-fail:

ivy-configure:
[ivy:configure] :: loading settings :: file = /export/home/jenkins/workspace/Lucene-Solr-master-Solaris/lucene/top-level-ivy-settings.xml

resolve:

resolve:

ivy-availability-check:
[loadresource] Do not set property disallowed.ivy.jars.list as its length is 0.

-ivy-fail-disallowed-ivy-version:

ivy-fail:

ivy-fail:

ivy-configure:
[ivy:configure] :: loading settings :: file = /export/home/jenkins/workspace/Lucene-Solr-master-Solaris/lucene/top-level-ivy-settings.xml

resolve:

ivy-availability-check:
[loadresource] Do not set property disallowed.ivy.jars.list as its length is 0.

-ivy-fail-disallowed-ivy-version:

ivy-fail:

ivy-fail:

ivy-configure:
[ivy:configure] :: loading settings :: file = /export/home/jenkins/workspace/Lucene-Solr-master-Solaris/lucene/top-level-ivy-settings.xml

resolve:

ivy-availability-check:
[loadresource] Do not set property disallowed.ivy.jars.list as its length is 0.

-ivy-fail-disallowed-ivy-version:

ivy-fail:

ivy-configure:
[ivy:configure] :: loading settings :: file = /export/home/jenkins/workspace/Lucene-Solr-master-Solaris/lucene/top-level-ivy-settings.xml

resolve:

ivy-availability-check:
[loadresource] Do not set property disallowed.ivy.jars.list as its length is 0.

-ivy-fail-disallowed-ivy-version:

ivy-fail:

ivy-fail:

ivy-configure:
[ivy:configure] :: loading settings :: file = /export/home/jenkins/workspace/Lucene-Solr-master-Solaris/lucene/top-level-ivy-settings.xml

resolve:

ivy-availability-check:
[loadresource] Do not set property disallowed.ivy.jars.list as its length is 0.

-ivy-fail-disallowed-ivy-version:

ivy-fail:

ivy-configure:
[ivy:configure] :: loading settings :: file = /export/home/jenkins/workspace/Lucene-Solr-master-Solaris/lucene/top-level-ivy-settings.xml

resolve:

ivy-availability-check:
[loadresource] Do not set property disallowed.ivy.jars.list as its length is 0.

-ivy-fail-disallowed-ivy-version:

ivy-fail:

ivy-fail:

ivy-configure:
[ivy:configure] :: loading settings :: file = /export/home/jenkins/workspace/Lucene-Solr-master-Solaris/lucene/top-level-ivy-settings.xml

resolve:

ivy-availability-check:
[loadresource] Do not set property disallowed.ivy.jars.list as its length is 0.

-ivy-fail-disallowed-ivy-version:

ivy-fail:

ivy-fail:

ivy-configure:
[ivy:configure] :: loading settings :: file = /export/home/jenkins/workspace/Lucene-Solr-master-Solaris/lucene/top-level-ivy-settings.xml

resolve:

ivy-availability-check:
[loadresource] Do not set property disallowed.ivy.jars.list as its length is 0.

-ivy-fail-disallowed-ivy-version:

ivy-fail:

ivy-fail:

ivy-configure:
[ivy:configure] :: loading settings :: file = /export/home/jenkins/workspace/Lucene-Solr-master-Solaris/lucene/top-level-ivy-settings.xml

resolve:

ivy-availability-check:
[loadresource] Do not set property disallowed.ivy.jars.list as its length is 0.

-ivy-fail-disallowed-ivy-version:

ivy-fail:

ivy-fail:

ivy-configure:
[ivy:configure] :: loading settings :: file = /export/home/jenkins/workspace/Lucene-Solr-master-Solaris/lucene/top-level-ivy-settings.xml

resolve:

ivy-availability-check:
[loadresource] Do not set property disallowed.ivy.jars.list as its length is 0.

-ivy-fail-disallowed-ivy-version:

ivy-fail:

ivy-fail:

ivy-configure:
[ivy:configure] :: loading settings :: file = /export/home/jenkins/workspace/Lucene-Solr-master-Solaris/lucene/top-level-ivy-settings.xml

resolve:

ivy-availability-check:
[loadresource] Do not set property disallowed.ivy.jars.list as its length is 0.

-ivy-fail-disallowed-ivy-version:

ivy-fail:

ivy-fail:

ivy-configure:
[ivy:configure] :: loading settings :: file = /export/home/jenkins/workspace/Lucene-Solr-master-Solaris/lucene/top-level-ivy-settings.xml

resolve:

ivy-avai

[...truncated too long message...]

K      0.02s J1 | TestSimpleExplanations.testBQ14
   [junit4] OK      0.01s J1 | TestSimpleExplanations.testMultiFieldBQ1
   [junit4] OK      0.01s J1 | TestSimpleExplanations.testBQ1
   [junit4] OK      0.01s J1 | TestSimpleExplanations.testCSQ1
   [junit4] OK      0.01s J1 | TestSimpleExplanations.testBQ11
   [junit4] OK      0.03s J1 | TestSimpleExplanations.testDMQ2
   [junit4] OK      0.03s J1 | TestSimpleExplanations.testMultiFieldBQofPQ2
   [junit4] OK      0.02s J1 | TestSimpleExplanations.testBQ10
   [junit4] OK      0.01s J1 | TestSimpleExplanations.testT2
   [junit4] OK      0.04s J1 | TestSimpleExplanations.testDMQ9
   [junit4] OK      0.02s J1 | TestSimpleExplanations.testMultiFieldBQ9
   [junit4] OK      0.01s J1 | TestSimpleExplanations.testDMQ5
   [junit4] OK      0.01s J1 | TestSimpleExplanations.testBQ25
   [junit4] OK      0.03s J1 | TestSimpleExplanations.testMultiFieldBQ2
   [junit4] OK      0.02s J1 | TestSimpleExplanations.testDMQ8
   [junit4] OK      0.03s J1 | TestSimpleExplanations.testMPQ5
   [junit4] OK      0.02s J1 | TestSimpleExplanations.testBQ19
   [junit4] OK      0.03s J1 | TestSimpleExplanations.testP5
   [junit4] OK      0.04s J1 | TestSimpleExplanations.testP2
   [junit4] OK      0.05s J1 | TestSimpleExplanations.testBQ8
   [junit4] OK      0.01s J1 | TestSimpleExplanations.testMultiFieldBQ3
   [junit4] OK      0.01s J1 | TestSimpleExplanations.testDMQ3
   [junit4] OK      0.00s J1 | TestSimpleExplanations.testMA2
   [junit4] OK      0.01s J1 | TestSimpleExplanations.testBQ21
   [junit4] OK      0.01s J1 | TestSimpleExplanations.testBQ24
   [junit4] OK      0.03s J1 | TestSimpleExplanations.testBQ9
   [junit4] OK      0.04s J1 | TestSimpleExplanations.testDMQ7
   [junit4] OK      0.08s J1 | TestSimpleExplanations.testBQ3
   [junit4] OK      0.01s J1 | TestSimpleExplanations.testMPQ4
   [junit4] OK      0.02s J1 | TestSimpleExplanations.testMPQ3
   [junit4] OK      0.00s J1 | TestSimpleExplanations.testMA1
   [junit4] OK      0.02s J1 | TestSimpleExplanations.testBQ7
   [junit4] OK      0.01s J1 | TestSimpleExplanations.testBQ2
   [junit4] OK      0.03s J1 | TestSimpleExplanations.testMultiFieldBQofPQ6
   [junit4] OK      0.02s J1 | TestSimpleExplanations.testMultiFieldBQ8
   [junit4] OK      0.01s J1 | TestSimpleExplanations.testBQ4
   [junit4] Completed [4/5] on J1 in 1.20s, 70 tests
   [junit4] 
   [junit4] Suite: org.apache.lucene.search.TestSimpleExplanations
   [junit4] OK      0.03s J0 | TestSimpleExplanations.testBQ16
   [junit4] OK      0.09s J0 | TestSimpleExplanations.testMultiFieldBQofPQ5
   [junit4] OK      0.02s J0 | TestSimpleExplanations.testMPQ2
   [junit4] OK      0.02s J0 | TestSimpleExplanations.testCSQ2
   [junit4] OK      0.02s J0 | TestSimpleExplanations.testDMQ1
   [junit4] OK      0.01s J0 | TestSimpleExplanations.testBQ15
   [junit4] OK      0.02s J0 | TestSimpleExplanations.testMultiFieldBQofPQ3
   [junit4] OK      0.01s J0 | TestSimpleExplanations.testP1
   [junit4] OK      0.02s J0 | TestSimpleExplanations.testDMQ4
   [junit4] OK      0.01s J0 | TestSimpleExplanations.testP4
   [junit4] OK      0.03s J0 | TestSimpleExplanations.testDMQ6
   [junit4] OK      0.01s J0 | TestSimpleExplanations.testMPQ1
   [junit4] OK      0.01s J0 | TestSimpleExplanations.testP6
   [junit4] OK      0.02s J0 | TestSimpleExplanations.testMPQ6
   [junit4] OK      0.03s J0 | TestSimpleExplanations.testMultiFieldBQofPQ1
   [junit4] OK      0.01s J0 | TestSimpleExplanations.testCSQ3
   [junit4] OK      0.01s J0 | TestSimpleExplanations.testBQ23
   [junit4] OK      0.02s J0 | TestSimpleExplanations.testSynonymQuery
   [junit4] OK      0.04s J0 | TestSimpleExplanations.testMultiFieldBQofPQ4
   [junit4] OK      0.03s J0 | TestSimpleExplanations.testMultiFieldBQ4
   [junit4] OK      0.02s J0 | TestSimpleExplanations.testMultiFieldBQ10
   [junit4] OK      0.02s J0 | TestSimpleExplanations.testBQ17
   [junit4] OK      0.01s J0 | TestSimpleExplanations.testT1
   [junit4] OK      0.01s J0 | TestSimpleExplanations.testBQ5
   [junit4] OK      0.02s J0 | TestSimpleExplanations.testMultiFieldBQ5
   [junit4] OK      0.11s J0 | TestSimpleExplanations.testMultiFieldBQofPQ7
   [junit4] OK      0.02s J0 | TestSimpleExplanations.testMultiFieldBQ7
   [junit4] OK      0.01s J0 | TestSimpleExplanations.testP3
   [junit4] OK      0.02s J0 | TestSimpleExplanations.testMultiFieldBQ6
   [junit4] OK      0.01s J0 | TestSimpleExplanations.testP7
   [junit4] OK      0.01s J0 | TestSimpleExplanations.testBQ26
   [junit4] OK      0.00s J0 | TestSimpleExplanations.testEquality
   [junit4] OK      0.01s J0 | TestSimpleExplanations.testBQ6
   [junit4] OK      0.12s J0 | TestSimpleExplanations.testBQ20
   [junit4] OK      0.01s J0 | TestSimpleExplanations.testBQ14
   [junit4] OK      0.02s J0 | TestSimpleExplanations.testMultiFieldBQ1
   [junit4] OK      0.01s J0 | TestSimpleExplanations.testBQ1
   [junit4] OK      0.02s J0 | TestSimpleExplanations.testCSQ1
   [junit4] OK      0.01s J0 | TestSimpleExplanations.testBQ11
   [junit4] OK      0.05s J0 | TestSimpleExplanations.testDMQ2
   [junit4] OK      0.02s J0 | TestSimpleExplanations.testMultiFieldBQofPQ2
   [junit4] OK      0.03s J0 | TestSimpleExplanations.testBQ10
   [junit4] OK      0.01s J0 | TestSimpleExplanations.testT2
   [junit4] OK      0.10s J0 | TestSimpleExplanations.testDMQ9
   [junit4] OK      0.03s J0 | TestSimpleExplanations.testMultiFieldBQ9
   [junit4] OK      0.02s J0 | TestSimpleExplanations.testDMQ5
   [junit4] OK      0.03s J0 | TestSimpleExplanations.testBQ25
   [junit4] OK      0.02s J0 | TestSimpleExplanations.testMultiFieldBQ2
   [junit4] OK      0.01s J0 | TestSimpleExplanations.testDMQ8
   [junit4] OK      0.01s J0 | TestSimpleExplanations.testMPQ5
   [junit4] OK      0.22s J0 | TestSimpleExplanations.testBQ19
   [junit4] OK      0.02s J0 | TestSimpleExplanations.testP5
   [junit4] OK      0.02s J0 | TestSimpleExplanations.testP2
   [junit4] OK      0.15s J0 | TestSimpleExplanations.testBQ8
   [junit4] OK      0.04s J0 | TestSimpleExplanations.testMultiFieldBQ3
   [junit4] OK      0.04s J0 | TestSimpleExplanations.testDMQ3
   [junit4] OK      0.01s J0 | TestSimpleExplanations.testMA2
   [junit4] OK      0.01s J0 | TestSimpleExplanations.testBQ21
   [junit4] OK      0.06s J0 | TestSimpleExplanations.testBQ24
   [junit4] OK      0.05s J0 | TestSimpleExplanations.testBQ9
   [junit4] OK      0.02s J0 | TestSimpleExplanations.testDMQ7
   [junit4] OK      0.03s J0 | TestSimpleExplanations.testBQ3
   [junit4] OK      0.02s J0 | TestSimpleExplanations.testMPQ4
   [junit4] OK      0.02s J0 | TestSimpleExplanations.testMPQ3
   [junit4] OK      0.02s J0 | TestSimpleExplanations.testMA1
   [junit4] OK      0.08s J0 | TestSimpleExplanations.testBQ7
   [junit4] OK      0.02s J0 | TestSimpleExplanations.testBQ2
   [junit4] OK      0.04s J0 | TestSimpleExplanations.testMultiFieldBQofPQ6
   [junit4] OK      0.03s J0 | TestSimpleExplanations.testMultiFieldBQ8
   [junit4] OK      0.02s J0 | TestSimpleExplanations.testBQ4
   [junit4] Completed [5/5] on J0 in 2.41s, 70 tests
   [junit4] 
   [junit4] JVM J0:     0.82 ..    10.47 =     9.65s
   [junit4] JVM J1:     1.04 ..    10.23 =     9.18s
   [junit4] Execution time total: 10 seconds
   [junit4] Tests summary: 5 suites, 350 tests
   [junit4] Could not remove temporary path: /export/home/jenkins/workspace/Lucene-Solr-master-Solaris/lucene/build/core/test/J0 (java.nio.file.DirectoryNotEmptyException: Remaining files: [/export/home/jenkins/workspace/Lucene-Solr-master-Solaris/lucene/build/core/test/J0/temp])
   [junit4] Could not remove temporary path: /export/home/jenkins/workspace/Lucene-Solr-master-Solaris/lucene/build/core/test/J1 (java.nio.file.DirectoryNotEmptyException: Remaining files: [/export/home/jenkins/workspace/Lucene-Solr-master-Solaris/lucene/build/core/test/J1/temp])
     [echo] 5 slowest tests:
[junit4:tophints] 6348.47s | org.apache.lucene.search.TestSimpleExplanations
[junit4:tophints]  58.52s | org.apache.lucene.codecs.lucene70.TestLucene70DocValuesFormat
[junit4:tophints]  25.91s | org.apache.lucene.index.TestIndexingSequenceNumbers
[junit4:tophints]  15.34s | org.apache.lucene.search.similarities.TestBasicModelIne
[junit4:tophints]  14.26s | org.apache.lucene.util.bkd.TestBKD

-check-totals:

test-nocompile:

BUILD SUCCESSFUL
Total time: 14 seconds
[repro] Failures:
[repro]   0/5 failed: org.apache.lucene.search.TestSimpleExplanations
[repro]   1/5 failed: org.apache.solr.rest.TestManagedResourceStorage
[repro] Exiting with code 256
+ mv lucene/build lucene/build.repro
+ mv solr/build solr/build.repro
+ mv lucene/build.orig lucene/build
+ mv solr/build.orig solr/build
Archiving artifacts
Setting ANT_1_8_2_HOME=/export/home/jenkins/tools/hudson.tasks.Ant_AntInstallation/ANT_1.8.2
[WARNINGS] Parsing warnings in console log with parser Java Compiler (javac)
Setting ANT_1_8_2_HOME=/export/home/jenkins/tools/hudson.tasks.Ant_AntInstallation/ANT_1.8.2
Setting ANT_1_8_2_HOME=/export/home/jenkins/tools/hudson.tasks.Ant_AntInstallation/ANT_1.8.2
<Git Blamer> Using GitBlamer to create author and commit information for all warnings.
<Git Blamer> GIT_COMMIT=60569fbe4e8e9f9f9d57da9bf2570f847a26965c, workspace=/export/home/jenkins/workspace/Lucene-Solr-master-Solaris
[WARNINGS] Computing warning deltas based on reference build #2069
Recording test results
Setting ANT_1_8_2_HOME=/export/home/jenkins/tools/hudson.tasks.Ant_AntInstallation/ANT_1.8.2
Build step 'Publish JUnit test result report' changed build result to UNSTABLE
Email was triggered for: Unstable (Test Failures)
Sending email for trigger: Unstable (Test Failures)
Setting ANT_1_8_2_HOME=/export/home/jenkins/tools/hudson.tasks.Ant_AntInstallation/ANT_1.8.2
Setting ANT_1_8_2_HOME=/export/home/jenkins/tools/hudson.tasks.Ant_AntInstallation/ANT_1.8.2
Setting ANT_1_8_2_HOME=/export/home/jenkins/tools/hudson.tasks.Ant_AntInstallation/ANT_1.8.2
Setting ANT_1_8_2_HOME=/export/home/jenkins/tools/hudson.tasks.Ant_AntInstallation/ANT_1.8.2

Mime
View raw message