lucene-dev mailing list archives

Site index · List index
Message view « Date » · « Thread »
Top « Date » · « Thread »
From Policeman Jenkins Server <jenk...@thetaphi.de>
Subject [JENKINS-EA] Lucene-Solr-7.x-Windows (64bit/jdk-11-ea+28) - Build # 799 - Unstable!
Date Sun, 23 Sep 2018 10:17:46 GMT
Build: https://jenkins.thetaphi.de/job/Lucene-Solr-7.x-Windows/799/
Java: 64bit/jdk-11-ea+28 -XX:-UseCompressedOops -XX:+UseG1GC

10 tests failed.
FAILED:  org.apache.solr.ltr.store.rest.TestModelManagerPersistence.testWrapperModelPersistence

Error Message:
Software caused connection abort: recv failed

Stack Trace:
javax.net.ssl.SSLProtocolException: Software caused connection abort: recv failed
	at __randomizedtesting.SeedInfo.seed([31CEBAF2DEE12C1D:44A4C92C611D5558]:0)
	at java.base/sun.security.ssl.Alert.createSSLException(Alert.java:126)
	at java.base/sun.security.ssl.TransportContext.fatal(TransportContext.java:321)
	at java.base/sun.security.ssl.TransportContext.fatal(TransportContext.java:264)
	at java.base/sun.security.ssl.TransportContext.fatal(TransportContext.java:259)
	at java.base/sun.security.ssl.SSLSocketImpl.handleException(SSLSocketImpl.java:1314)
	at java.base/sun.security.ssl.SSLSocketImpl$AppInputStream.read(SSLSocketImpl.java:839)
	at org.apache.http.impl.io.SessionInputBufferImpl.streamRead(SessionInputBufferImpl.java:137)
	at org.apache.http.impl.io.SessionInputBufferImpl.fillBuffer(SessionInputBufferImpl.java:153)
	at org.apache.http.impl.io.SessionInputBufferImpl.readLine(SessionInputBufferImpl.java:282)
	at org.apache.http.impl.conn.DefaultHttpResponseParser.parseHead(DefaultHttpResponseParser.java:138)
	at org.apache.http.impl.conn.DefaultHttpResponseParser.parseHead(DefaultHttpResponseParser.java:56)
	at org.apache.http.impl.io.AbstractMessageParser.parse(AbstractMessageParser.java:259)
	at org.apache.http.impl.DefaultBHttpClientConnection.receiveResponseHeader(DefaultBHttpClientConnection.java:163)
	at org.apache.http.impl.conn.CPoolProxy.receiveResponseHeader(CPoolProxy.java:165)
	at org.apache.http.protocol.HttpRequestExecutor.doReceiveResponse(HttpRequestExecutor.java:273)
	at org.apache.http.protocol.HttpRequestExecutor.execute(HttpRequestExecutor.java:125)
	at org.apache.http.impl.execchain.MainClientExec.execute(MainClientExec.java:272)
	at org.apache.http.impl.execchain.ProtocolExec.execute(ProtocolExec.java:185)
	at org.apache.http.impl.execchain.RetryExec.execute(RetryExec.java:89)
	at org.apache.http.impl.execchain.RedirectExec.execute(RedirectExec.java:111)
	at org.apache.http.impl.client.InternalHttpClient.doExecute(InternalHttpClient.java:185)
	at org.apache.http.impl.client.CloseableHttpClient.execute(CloseableHttpClient.java:83)
	at org.apache.solr.util.RestTestHarness.getResponse(RestTestHarness.java:215)
	at org.apache.solr.util.RestTestHarness.query(RestTestHarness.java:107)
	at org.apache.solr.util.RestTestBase.assertJQ(RestTestBase.java:226)
	at org.apache.solr.util.RestTestBase.assertJQ(RestTestBase.java:192)
	at org.apache.solr.ltr.store.rest.TestModelManagerPersistence.doWrapperModelPersistenceChecks(TestModelManagerPersistence.java:202)
	at org.apache.solr.ltr.store.rest.TestModelManagerPersistence.testWrapperModelPersistence(TestModelManagerPersistence.java:255)
	at java.base/jdk.internal.reflect.NativeMethodAccessorImpl.invoke0(Native Method)
	at java.base/jdk.internal.reflect.NativeMethodAccessorImpl.invoke(NativeMethodAccessorImpl.java:62)
	at java.base/jdk.internal.reflect.DelegatingMethodAccessorImpl.invoke(DelegatingMethodAccessorImpl.java:43)
	at java.base/java.lang.reflect.Method.invoke(Method.java:566)
	at com.carrotsearch.randomizedtesting.RandomizedRunner.invoke(RandomizedRunner.java:1742)
	at com.carrotsearch.randomizedtesting.RandomizedRunner$8.evaluate(RandomizedRunner.java:935)
	at com.carrotsearch.randomizedtesting.RandomizedRunner$9.evaluate(RandomizedRunner.java:971)
	at com.carrotsearch.randomizedtesting.RandomizedRunner$10.evaluate(RandomizedRunner.java:985)
	at com.carrotsearch.randomizedtesting.rules.SystemPropertiesRestoreRule$1.evaluate(SystemPropertiesRestoreRule.java:57)
	at org.apache.lucene.util.TestRuleSetupTeardownChained$1.evaluate(TestRuleSetupTeardownChained.java:49)
	at org.apache.lucene.util.AbstractBeforeAfterRule$1.evaluate(AbstractBeforeAfterRule.java:45)
	at org.apache.lucene.util.TestRuleThreadAndTestName$1.evaluate(TestRuleThreadAndTestName.java:48)
	at org.apache.lucene.util.TestRuleIgnoreAfterMaxFailures$1.evaluate(TestRuleIgnoreAfterMaxFailures.java:64)
	at org.apache.lucene.util.TestRuleMarkFailure$1.evaluate(TestRuleMarkFailure.java:47)
	at com.carrotsearch.randomizedtesting.rules.StatementAdapter.evaluate(StatementAdapter.java:36)
	at com.carrotsearch.randomizedtesting.ThreadLeakControl$StatementRunner.run(ThreadLeakControl.java:368)
	at com.carrotsearch.randomizedtesting.ThreadLeakControl.forkTimeoutingTask(ThreadLeakControl.java:817)
	at com.carrotsearch.randomizedtesting.ThreadLeakControl$3.evaluate(ThreadLeakControl.java:468)
	at com.carrotsearch.randomizedtesting.RandomizedRunner.runSingleTest(RandomizedRunner.java:944)
	at com.carrotsearch.randomizedtesting.RandomizedRunner$5.evaluate(RandomizedRunner.java:830)
	at com.carrotsearch.randomizedtesting.RandomizedRunner$6.evaluate(RandomizedRunner.java:880)
	at com.carrotsearch.randomizedtesting.RandomizedRunner$7.evaluate(RandomizedRunner.java:891)
	at com.carrotsearch.randomizedtesting.rules.StatementAdapter.evaluate(StatementAdapter.java:36)
	at com.carrotsearch.randomizedtesting.rules.SystemPropertiesRestoreRule$1.evaluate(SystemPropertiesRestoreRule.java:57)
	at org.apache.lucene.util.AbstractBeforeAfterRule$1.evaluate(AbstractBeforeAfterRule.java:45)
	at com.carrotsearch.randomizedtesting.rules.StatementAdapter.evaluate(StatementAdapter.java:36)
	at org.apache.lucene.util.TestRuleStoreClassName$1.evaluate(TestRuleStoreClassName.java:41)
	at com.carrotsearch.randomizedtesting.rules.NoShadowingOrOverridesOnMethodsRule$1.evaluate(NoShadowingOrOverridesOnMethodsRule.java:40)
	at com.carrotsearch.randomizedtesting.rules.NoShadowingOrOverridesOnMethodsRule$1.evaluate(NoShadowingOrOverridesOnMethodsRule.java:40)
	at com.carrotsearch.randomizedtesting.rules.StatementAdapter.evaluate(StatementAdapter.java:36)
	at com.carrotsearch.randomizedtesting.rules.StatementAdapter.evaluate(StatementAdapter.java:36)
	at org.apache.lucene.util.TestRuleAssertionsRequired$1.evaluate(TestRuleAssertionsRequired.java:53)
	at org.apache.lucene.util.TestRuleMarkFailure$1.evaluate(TestRuleMarkFailure.java:47)
	at org.apache.lucene.util.TestRuleIgnoreAfterMaxFailures$1.evaluate(TestRuleIgnoreAfterMaxFailures.java:64)
	at org.apache.lucene.util.TestRuleIgnoreTestSuites$1.evaluate(TestRuleIgnoreTestSuites.java:54)
	at com.carrotsearch.randomizedtesting.rules.StatementAdapter.evaluate(StatementAdapter.java:36)
	at com.carrotsearch.randomizedtesting.ThreadLeakControl$StatementRunner.run(ThreadLeakControl.java:368)
	at java.base/java.lang.Thread.run(Thread.java:834)
Caused by: java.net.SocketException: Software caused connection abort: recv failed
	at java.base/java.net.SocketInputStream.socketRead0(Native Method)
	at java.base/java.net.SocketInputStream.socketRead(SocketInputStream.java:115)
	at java.base/java.net.SocketInputStream.read(SocketInputStream.java:168)
	at java.base/java.net.SocketInputStream.read(SocketInputStream.java:140)
	at java.base/sun.security.ssl.SSLSocketInputRecord.read(SSLSocketInputRecord.java:448)
	at java.base/sun.security.ssl.SSLSocketInputRecord.bytesInCompletePacket(SSLSocketInputRecord.java:68)
	at java.base/sun.security.ssl.SSLSocketImpl.readApplicationRecord(SSLSocketImpl.java:1104)
	at java.base/sun.security.ssl.SSLSocketImpl$AppInputStream.read(SSLSocketImpl.java:823)
	... 60 more


FAILED:  org.apache.solr.ltr.store.rest.TestModelManagerPersistence.testInnerCustomClassesPersistence

Error Message:
mismatch: 'model42'!='linear' @ models/[0]/name

Stack Trace:
java.lang.RuntimeException: mismatch: 'model42'!='linear' @ models/[0]/name
	at __randomizedtesting.SeedInfo.seed([31CEBAF2DEE12C1D:18CB91C7180D0A71]:0)
	at org.apache.solr.util.RestTestBase.assertJQ(RestTestBase.java:248)
	at org.apache.solr.util.RestTestBase.assertJQ(RestTestBase.java:192)
	at org.apache.solr.ltr.store.rest.TestModelManagerPersistence.testInnerCustomClassesPersistence(TestModelManagerPersistence.java:310)
	at java.base/jdk.internal.reflect.NativeMethodAccessorImpl.invoke0(Native Method)
	at java.base/jdk.internal.reflect.NativeMethodAccessorImpl.invoke(NativeMethodAccessorImpl.java:62)
	at java.base/jdk.internal.reflect.DelegatingMethodAccessorImpl.invoke(DelegatingMethodAccessorImpl.java:43)
	at java.base/java.lang.reflect.Method.invoke(Method.java:566)
	at com.carrotsearch.randomizedtesting.RandomizedRunner.invoke(RandomizedRunner.java:1742)
	at com.carrotsearch.randomizedtesting.RandomizedRunner$8.evaluate(RandomizedRunner.java:935)
	at com.carrotsearch.randomizedtesting.RandomizedRunner$9.evaluate(RandomizedRunner.java:971)
	at com.carrotsearch.randomizedtesting.RandomizedRunner$10.evaluate(RandomizedRunner.java:985)
	at com.carrotsearch.randomizedtesting.rules.SystemPropertiesRestoreRule$1.evaluate(SystemPropertiesRestoreRule.java:57)
	at org.apache.lucene.util.TestRuleSetupTeardownChained$1.evaluate(TestRuleSetupTeardownChained.java:49)
	at org.apache.lucene.util.AbstractBeforeAfterRule$1.evaluate(AbstractBeforeAfterRule.java:45)
	at org.apache.lucene.util.TestRuleThreadAndTestName$1.evaluate(TestRuleThreadAndTestName.java:48)
	at org.apache.lucene.util.TestRuleIgnoreAfterMaxFailures$1.evaluate(TestRuleIgnoreAfterMaxFailures.java:64)
	at org.apache.lucene.util.TestRuleMarkFailure$1.evaluate(TestRuleMarkFailure.java:47)
	at com.carrotsearch.randomizedtesting.rules.StatementAdapter.evaluate(StatementAdapter.java:36)
	at com.carrotsearch.randomizedtesting.ThreadLeakControl$StatementRunner.run(ThreadLeakControl.java:368)
	at com.carrotsearch.randomizedtesting.ThreadLeakControl.forkTimeoutingTask(ThreadLeakControl.java:817)
	at com.carrotsearch.randomizedtesting.ThreadLeakControl$3.evaluate(ThreadLeakControl.java:468)
	at com.carrotsearch.randomizedtesting.RandomizedRunner.runSingleTest(RandomizedRunner.java:944)
	at com.carrotsearch.randomizedtesting.RandomizedRunner$5.evaluate(RandomizedRunner.java:830)
	at com.carrotsearch.randomizedtesting.RandomizedRunner$6.evaluate(RandomizedRunner.java:880)
	at com.carrotsearch.randomizedtesting.RandomizedRunner$7.evaluate(RandomizedRunner.java:891)
	at com.carrotsearch.randomizedtesting.rules.StatementAdapter.evaluate(StatementAdapter.java:36)
	at com.carrotsearch.randomizedtesting.rules.SystemPropertiesRestoreRule$1.evaluate(SystemPropertiesRestoreRule.java:57)
	at org.apache.lucene.util.AbstractBeforeAfterRule$1.evaluate(AbstractBeforeAfterRule.java:45)
	at com.carrotsearch.randomizedtesting.rules.StatementAdapter.evaluate(StatementAdapter.java:36)
	at org.apache.lucene.util.TestRuleStoreClassName$1.evaluate(TestRuleStoreClassName.java:41)
	at com.carrotsearch.randomizedtesting.rules.NoShadowingOrOverridesOnMethodsRule$1.evaluate(NoShadowingOrOverridesOnMethodsRule.java:40)
	at com.carrotsearch.randomizedtesting.rules.NoShadowingOrOverridesOnMethodsRule$1.evaluate(NoShadowingOrOverridesOnMethodsRule.java:40)
	at com.carrotsearch.randomizedtesting.rules.StatementAdapter.evaluate(StatementAdapter.java:36)
	at com.carrotsearch.randomizedtesting.rules.StatementAdapter.evaluate(StatementAdapter.java:36)
	at org.apache.lucene.util.TestRuleAssertionsRequired$1.evaluate(TestRuleAssertionsRequired.java:53)
	at org.apache.lucene.util.TestRuleMarkFailure$1.evaluate(TestRuleMarkFailure.java:47)
	at org.apache.lucene.util.TestRuleIgnoreAfterMaxFailures$1.evaluate(TestRuleIgnoreAfterMaxFailures.java:64)
	at org.apache.lucene.util.TestRuleIgnoreTestSuites$1.evaluate(TestRuleIgnoreTestSuites.java:54)
	at com.carrotsearch.randomizedtesting.rules.StatementAdapter.evaluate(StatementAdapter.java:36)
	at com.carrotsearch.randomizedtesting.ThreadLeakControl$StatementRunner.run(ThreadLeakControl.java:368)
	at java.base/java.lang.Thread.run(Thread.java:834)


FAILED:  org.apache.solr.ltr.store.rest.TestModelManagerPersistence.testFeaturePersistence

Error Message:


Stack Trace:
java.lang.AssertionError
	at __randomizedtesting.SeedInfo.seed([31CEBAF2DEE12C1D:B8A2789533D278B9]:0)
	at org.junit.Assert.fail(Assert.java:92)
	at org.junit.Assert.assertTrue(Assert.java:43)
	at org.junit.Assert.assertTrue(Assert.java:54)
	at org.apache.solr.ltr.store.rest.TestModelManagerPersistence.testFeaturePersistence(TestModelManagerPersistence.java:96)
	at java.base/jdk.internal.reflect.NativeMethodAccessorImpl.invoke0(Native Method)
	at java.base/jdk.internal.reflect.NativeMethodAccessorImpl.invoke(NativeMethodAccessorImpl.java:62)
	at java.base/jdk.internal.reflect.DelegatingMethodAccessorImpl.invoke(DelegatingMethodAccessorImpl.java:43)
	at java.base/java.lang.reflect.Method.invoke(Method.java:566)
	at com.carrotsearch.randomizedtesting.RandomizedRunner.invoke(RandomizedRunner.java:1742)
	at com.carrotsearch.randomizedtesting.RandomizedRunner$8.evaluate(RandomizedRunner.java:935)
	at com.carrotsearch.randomizedtesting.RandomizedRunner$9.evaluate(RandomizedRunner.java:971)
	at com.carrotsearch.randomizedtesting.RandomizedRunner$10.evaluate(RandomizedRunner.java:985)
	at com.carrotsearch.randomizedtesting.rules.SystemPropertiesRestoreRule$1.evaluate(SystemPropertiesRestoreRule.java:57)
	at org.apache.lucene.util.TestRuleSetupTeardownChained$1.evaluate(TestRuleSetupTeardownChained.java:49)
	at org.apache.lucene.util.AbstractBeforeAfterRule$1.evaluate(AbstractBeforeAfterRule.java:45)
	at org.apache.lucene.util.TestRuleThreadAndTestName$1.evaluate(TestRuleThreadAndTestName.java:48)
	at org.apache.lucene.util.TestRuleIgnoreAfterMaxFailures$1.evaluate(TestRuleIgnoreAfterMaxFailures.java:64)
	at org.apache.lucene.util.TestRuleMarkFailure$1.evaluate(TestRuleMarkFailure.java:47)
	at com.carrotsearch.randomizedtesting.rules.StatementAdapter.evaluate(StatementAdapter.java:36)
	at com.carrotsearch.randomizedtesting.ThreadLeakControl$StatementRunner.run(ThreadLeakControl.java:368)
	at com.carrotsearch.randomizedtesting.ThreadLeakControl.forkTimeoutingTask(ThreadLeakControl.java:817)
	at com.carrotsearch.randomizedtesting.ThreadLeakControl$3.evaluate(ThreadLeakControl.java:468)
	at com.carrotsearch.randomizedtesting.RandomizedRunner.runSingleTest(RandomizedRunner.java:944)
	at com.carrotsearch.randomizedtesting.RandomizedRunner$5.evaluate(RandomizedRunner.java:830)
	at com.carrotsearch.randomizedtesting.RandomizedRunner$6.evaluate(RandomizedRunner.java:880)
	at com.carrotsearch.randomizedtesting.RandomizedRunner$7.evaluate(RandomizedRunner.java:891)
	at com.carrotsearch.randomizedtesting.rules.StatementAdapter.evaluate(StatementAdapter.java:36)
	at com.carrotsearch.randomizedtesting.rules.SystemPropertiesRestoreRule$1.evaluate(SystemPropertiesRestoreRule.java:57)
	at org.apache.lucene.util.AbstractBeforeAfterRule$1.evaluate(AbstractBeforeAfterRule.java:45)
	at com.carrotsearch.randomizedtesting.rules.StatementAdapter.evaluate(StatementAdapter.java:36)
	at org.apache.lucene.util.TestRuleStoreClassName$1.evaluate(TestRuleStoreClassName.java:41)
	at com.carrotsearch.randomizedtesting.rules.NoShadowingOrOverridesOnMethodsRule$1.evaluate(NoShadowingOrOverridesOnMethodsRule.java:40)
	at com.carrotsearch.randomizedtesting.rules.NoShadowingOrOverridesOnMethodsRule$1.evaluate(NoShadowingOrOverridesOnMethodsRule.java:40)
	at com.carrotsearch.randomizedtesting.rules.StatementAdapter.evaluate(StatementAdapter.java:36)
	at com.carrotsearch.randomizedtesting.rules.StatementAdapter.evaluate(StatementAdapter.java:36)
	at org.apache.lucene.util.TestRuleAssertionsRequired$1.evaluate(TestRuleAssertionsRequired.java:53)
	at org.apache.lucene.util.TestRuleMarkFailure$1.evaluate(TestRuleMarkFailure.java:47)
	at org.apache.lucene.util.TestRuleIgnoreAfterMaxFailures$1.evaluate(TestRuleIgnoreAfterMaxFailures.java:64)
	at org.apache.lucene.util.TestRuleIgnoreTestSuites$1.evaluate(TestRuleIgnoreTestSuites.java:54)
	at com.carrotsearch.randomizedtesting.rules.StatementAdapter.evaluate(StatementAdapter.java:36)
	at com.carrotsearch.randomizedtesting.ThreadLeakControl$StatementRunner.run(ThreadLeakControl.java:368)
	at java.base/java.lang.Thread.run(Thread.java:834)


FAILED:  org.apache.solr.ltr.store.rest.TestModelManagerPersistence.testFilePersistence

Error Message:
List size mismatch @ models

Stack Trace:
java.lang.RuntimeException: List size mismatch @ models
	at __randomizedtesting.SeedInfo.seed([31CEBAF2DEE12C1D:136FDE8F7B8D4A58]:0)
	at org.apache.solr.util.RestTestBase.assertJQ(RestTestBase.java:248)
	at org.apache.solr.util.RestTestBase.assertJQ(RestTestBase.java:192)
	at org.apache.solr.ltr.store.rest.TestModelManagerPersistence.testFilePersistence(TestModelManagerPersistence.java:138)
	at java.base/jdk.internal.reflect.NativeMethodAccessorImpl.invoke0(Native Method)
	at java.base/jdk.internal.reflect.NativeMethodAccessorImpl.invoke(NativeMethodAccessorImpl.java:62)
	at java.base/jdk.internal.reflect.DelegatingMethodAccessorImpl.invoke(DelegatingMethodAccessorImpl.java:43)
	at java.base/java.lang.reflect.Method.invoke(Method.java:566)
	at com.carrotsearch.randomizedtesting.RandomizedRunner.invoke(RandomizedRunner.java:1742)
	at com.carrotsearch.randomizedtesting.RandomizedRunner$8.evaluate(RandomizedRunner.java:935)
	at com.carrotsearch.randomizedtesting.RandomizedRunner$9.evaluate(RandomizedRunner.java:971)
	at com.carrotsearch.randomizedtesting.RandomizedRunner$10.evaluate(RandomizedRunner.java:985)
	at com.carrotsearch.randomizedtesting.rules.SystemPropertiesRestoreRule$1.evaluate(SystemPropertiesRestoreRule.java:57)
	at org.apache.lucene.util.TestRuleSetupTeardownChained$1.evaluate(TestRuleSetupTeardownChained.java:49)
	at org.apache.lucene.util.AbstractBeforeAfterRule$1.evaluate(AbstractBeforeAfterRule.java:45)
	at org.apache.lucene.util.TestRuleThreadAndTestName$1.evaluate(TestRuleThreadAndTestName.java:48)
	at org.apache.lucene.util.TestRuleIgnoreAfterMaxFailures$1.evaluate(TestRuleIgnoreAfterMaxFailures.java:64)
	at org.apache.lucene.util.TestRuleMarkFailure$1.evaluate(TestRuleMarkFailure.java:47)
	at com.carrotsearch.randomizedtesting.rules.StatementAdapter.evaluate(StatementAdapter.java:36)
	at com.carrotsearch.randomizedtesting.ThreadLeakControl$StatementRunner.run(ThreadLeakControl.java:368)
	at com.carrotsearch.randomizedtesting.ThreadLeakControl.forkTimeoutingTask(ThreadLeakControl.java:817)
	at com.carrotsearch.randomizedtesting.ThreadLeakControl$3.evaluate(ThreadLeakControl.java:468)
	at com.carrotsearch.randomizedtesting.RandomizedRunner.runSingleTest(RandomizedRunner.java:944)
	at com.carrotsearch.randomizedtesting.RandomizedRunner$5.evaluate(RandomizedRunner.java:830)
	at com.carrotsearch.randomizedtesting.RandomizedRunner$6.evaluate(RandomizedRunner.java:880)
	at com.carrotsearch.randomizedtesting.RandomizedRunner$7.evaluate(RandomizedRunner.java:891)
	at com.carrotsearch.randomizedtesting.rules.StatementAdapter.evaluate(StatementAdapter.java:36)
	at com.carrotsearch.randomizedtesting.rules.SystemPropertiesRestoreRule$1.evaluate(SystemPropertiesRestoreRule.java:57)
	at org.apache.lucene.util.AbstractBeforeAfterRule$1.evaluate(AbstractBeforeAfterRule.java:45)
	at com.carrotsearch.randomizedtesting.rules.StatementAdapter.evaluate(StatementAdapter.java:36)
	at org.apache.lucene.util.TestRuleStoreClassName$1.evaluate(TestRuleStoreClassName.java:41)
	at com.carrotsearch.randomizedtesting.rules.NoShadowingOrOverridesOnMethodsRule$1.evaluate(NoShadowingOrOverridesOnMethodsRule.java:40)
	at com.carrotsearch.randomizedtesting.rules.NoShadowingOrOverridesOnMethodsRule$1.evaluate(NoShadowingOrOverridesOnMethodsRule.java:40)
	at com.carrotsearch.randomizedtesting.rules.StatementAdapter.evaluate(StatementAdapter.java:36)
	at com.carrotsearch.randomizedtesting.rules.StatementAdapter.evaluate(StatementAdapter.java:36)
	at org.apache.lucene.util.TestRuleAssertionsRequired$1.evaluate(TestRuleAssertionsRequired.java:53)
	at org.apache.lucene.util.TestRuleMarkFailure$1.evaluate(TestRuleMarkFailure.java:47)
	at org.apache.lucene.util.TestRuleIgnoreAfterMaxFailures$1.evaluate(TestRuleIgnoreAfterMaxFailures.java:64)
	at org.apache.lucene.util.TestRuleIgnoreTestSuites$1.evaluate(TestRuleIgnoreTestSuites.java:54)
	at com.carrotsearch.randomizedtesting.rules.StatementAdapter.evaluate(StatementAdapter.java:36)
	at com.carrotsearch.randomizedtesting.ThreadLeakControl$StatementRunner.run(ThreadLeakControl.java:368)
	at java.base/java.lang.Thread.run(Thread.java:834)


FAILED:  org.apache.solr.ltr.store.rest.TestModelManagerPersistence.testWrapperModelPersistence

Error Message:
Software caused connection abort: recv failed

Stack Trace:
javax.net.ssl.SSLProtocolException: Software caused connection abort: recv failed
	at __randomizedtesting.SeedInfo.seed([31CEBAF2DEE12C1D:44A4C92C611D5558]:0)
	at java.base/sun.security.ssl.Alert.createSSLException(Alert.java:126)
	at java.base/sun.security.ssl.TransportContext.fatal(TransportContext.java:321)
	at java.base/sun.security.ssl.TransportContext.fatal(TransportContext.java:264)
	at java.base/sun.security.ssl.TransportContext.fatal(TransportContext.java:259)
	at java.base/sun.security.ssl.SSLSocketImpl.handleException(SSLSocketImpl.java:1314)
	at java.base/sun.security.ssl.SSLSocketImpl$AppInputStream.read(SSLSocketImpl.java:839)
	at org.apache.http.impl.io.SessionInputBufferImpl.streamRead(SessionInputBufferImpl.java:137)
	at org.apache.http.impl.io.SessionInputBufferImpl.fillBuffer(SessionInputBufferImpl.java:153)
	at org.apache.http.impl.io.SessionInputBufferImpl.readLine(SessionInputBufferImpl.java:282)
	at org.apache.http.impl.conn.DefaultHttpResponseParser.parseHead(DefaultHttpResponseParser.java:138)
	at org.apache.http.impl.conn.DefaultHttpResponseParser.parseHead(DefaultHttpResponseParser.java:56)
	at org.apache.http.impl.io.AbstractMessageParser.parse(AbstractMessageParser.java:259)
	at org.apache.http.impl.DefaultBHttpClientConnection.receiveResponseHeader(DefaultBHttpClientConnection.java:163)
	at org.apache.http.impl.conn.CPoolProxy.receiveResponseHeader(CPoolProxy.java:165)
	at org.apache.http.protocol.HttpRequestExecutor.doReceiveResponse(HttpRequestExecutor.java:273)
	at org.apache.http.protocol.HttpRequestExecutor.execute(HttpRequestExecutor.java:125)
	at org.apache.http.impl.execchain.MainClientExec.execute(MainClientExec.java:272)
	at org.apache.http.impl.execchain.ProtocolExec.execute(ProtocolExec.java:185)
	at org.apache.http.impl.execchain.RetryExec.execute(RetryExec.java:89)
	at org.apache.http.impl.execchain.RedirectExec.execute(RedirectExec.java:111)
	at org.apache.http.impl.client.InternalHttpClient.doExecute(InternalHttpClient.java:185)
	at org.apache.http.impl.client.CloseableHttpClient.execute(CloseableHttpClient.java:83)
	at org.apache.solr.util.RestTestHarness.getResponse(RestTestHarness.java:215)
	at org.apache.solr.util.RestTestHarness.query(RestTestHarness.java:107)
	at org.apache.solr.util.RestTestBase.assertJQ(RestTestBase.java:226)
	at org.apache.solr.util.RestTestBase.assertJQ(RestTestBase.java:192)
	at org.apache.solr.ltr.store.rest.TestModelManagerPersistence.doWrapperModelPersistenceChecks(TestModelManagerPersistence.java:202)
	at org.apache.solr.ltr.store.rest.TestModelManagerPersistence.testWrapperModelPersistence(TestModelManagerPersistence.java:255)
	at java.base/jdk.internal.reflect.NativeMethodAccessorImpl.invoke0(Native Method)
	at java.base/jdk.internal.reflect.NativeMethodAccessorImpl.invoke(NativeMethodAccessorImpl.java:62)
	at java.base/jdk.internal.reflect.DelegatingMethodAccessorImpl.invoke(DelegatingMethodAccessorImpl.java:43)
	at java.base/java.lang.reflect.Method.invoke(Method.java:566)
	at com.carrotsearch.randomizedtesting.RandomizedRunner.invoke(RandomizedRunner.java:1742)
	at com.carrotsearch.randomizedtesting.RandomizedRunner$8.evaluate(RandomizedRunner.java:935)
	at com.carrotsearch.randomizedtesting.RandomizedRunner$9.evaluate(RandomizedRunner.java:971)
	at com.carrotsearch.randomizedtesting.RandomizedRunner$10.evaluate(RandomizedRunner.java:985)
	at com.carrotsearch.randomizedtesting.rules.SystemPropertiesRestoreRule$1.evaluate(SystemPropertiesRestoreRule.java:57)
	at org.apache.lucene.util.TestRuleSetupTeardownChained$1.evaluate(TestRuleSetupTeardownChained.java:49)
	at org.apache.lucene.util.AbstractBeforeAfterRule$1.evaluate(AbstractBeforeAfterRule.java:45)
	at org.apache.lucene.util.TestRuleThreadAndTestName$1.evaluate(TestRuleThreadAndTestName.java:48)
	at org.apache.lucene.util.TestRuleIgnoreAfterMaxFailures$1.evaluate(TestRuleIgnoreAfterMaxFailures.java:64)
	at org.apache.lucene.util.TestRuleMarkFailure$1.evaluate(TestRuleMarkFailure.java:47)
	at com.carrotsearch.randomizedtesting.rules.StatementAdapter.evaluate(StatementAdapter.java:36)
	at com.carrotsearch.randomizedtesting.ThreadLeakControl$StatementRunner.run(ThreadLeakControl.java:368)
	at com.carrotsearch.randomizedtesting.ThreadLeakControl.forkTimeoutingTask(ThreadLeakControl.java:817)
	at com.carrotsearch.randomizedtesting.ThreadLeakControl$3.evaluate(ThreadLeakControl.java:468)
	at com.carrotsearch.randomizedtesting.RandomizedRunner.runSingleTest(RandomizedRunner.java:944)
	at com.carrotsearch.randomizedtesting.RandomizedRunner$5.evaluate(RandomizedRunner.java:830)
	at com.carrotsearch.randomizedtesting.RandomizedRunner$6.evaluate(RandomizedRunner.java:880)
	at com.carrotsearch.randomizedtesting.RandomizedRunner$7.evaluate(RandomizedRunner.java:891)
	at com.carrotsearch.randomizedtesting.rules.StatementAdapter.evaluate(StatementAdapter.java:36)
	at com.carrotsearch.randomizedtesting.rules.SystemPropertiesRestoreRule$1.evaluate(SystemPropertiesRestoreRule.java:57)
	at org.apache.lucene.util.AbstractBeforeAfterRule$1.evaluate(AbstractBeforeAfterRule.java:45)
	at com.carrotsearch.randomizedtesting.rules.StatementAdapter.evaluate(StatementAdapter.java:36)
	at org.apache.lucene.util.TestRuleStoreClassName$1.evaluate(TestRuleStoreClassName.java:41)
	at com.carrotsearch.randomizedtesting.rules.NoShadowingOrOverridesOnMethodsRule$1.evaluate(NoShadowingOrOverridesOnMethodsRule.java:40)
	at com.carrotsearch.randomizedtesting.rules.NoShadowingOrOverridesOnMethodsRule$1.evaluate(NoShadowingOrOverridesOnMethodsRule.java:40)
	at com.carrotsearch.randomizedtesting.rules.StatementAdapter.evaluate(StatementAdapter.java:36)
	at com.carrotsearch.randomizedtesting.rules.StatementAdapter.evaluate(StatementAdapter.java:36)
	at org.apache.lucene.util.TestRuleAssertionsRequired$1.evaluate(TestRuleAssertionsRequired.java:53)
	at org.apache.lucene.util.TestRuleMarkFailure$1.evaluate(TestRuleMarkFailure.java:47)
	at org.apache.lucene.util.TestRuleIgnoreAfterMaxFailures$1.evaluate(TestRuleIgnoreAfterMaxFailures.java:64)
	at org.apache.lucene.util.TestRuleIgnoreTestSuites$1.evaluate(TestRuleIgnoreTestSuites.java:54)
	at com.carrotsearch.randomizedtesting.rules.StatementAdapter.evaluate(StatementAdapter.java:36)
	at com.carrotsearch.randomizedtesting.ThreadLeakControl$StatementRunner.run(ThreadLeakControl.java:368)
	at java.base/java.lang.Thread.run(Thread.java:834)
Caused by: java.net.SocketException: Software caused connection abort: recv failed
	at java.base/java.net.SocketInputStream.socketRead0(Native Method)
	at java.base/java.net.SocketInputStream.socketRead(SocketInputStream.java:115)
	at java.base/java.net.SocketInputStream.read(SocketInputStream.java:168)
	at java.base/java.net.SocketInputStream.read(SocketInputStream.java:140)
	at java.base/sun.security.ssl.SSLSocketInputRecord.read(SSLSocketInputRecord.java:448)
	at java.base/sun.security.ssl.SSLSocketInputRecord.bytesInCompletePacket(SSLSocketInputRecord.java:68)
	at java.base/sun.security.ssl.SSLSocketImpl.readApplicationRecord(SSLSocketImpl.java:1104)
	at java.base/sun.security.ssl.SSLSocketImpl$AppInputStream.read(SSLSocketImpl.java:823)
	... 60 more


FAILED:  org.apache.solr.ltr.store.rest.TestModelManagerPersistence.testWrapperModelPersistence

Error Message:
Software caused connection abort: recv failed

Stack Trace:
javax.net.ssl.SSLProtocolException: Software caused connection abort: recv failed
	at __randomizedtesting.SeedInfo.seed([31CEBAF2DEE12C1D:44A4C92C611D5558]:0)
	at java.base/sun.security.ssl.Alert.createSSLException(Alert.java:126)
	at java.base/sun.security.ssl.TransportContext.fatal(TransportContext.java:321)
	at java.base/sun.security.ssl.TransportContext.fatal(TransportContext.java:264)
	at java.base/sun.security.ssl.TransportContext.fatal(TransportContext.java:259)
	at java.base/sun.security.ssl.SSLSocketImpl.handleException(SSLSocketImpl.java:1314)
	at java.base/sun.security.ssl.SSLSocketImpl$AppInputStream.read(SSLSocketImpl.java:839)
	at org.apache.http.impl.io.SessionInputBufferImpl.streamRead(SessionInputBufferImpl.java:137)
	at org.apache.http.impl.io.SessionInputBufferImpl.fillBuffer(SessionInputBufferImpl.java:153)
	at org.apache.http.impl.io.SessionInputBufferImpl.readLine(SessionInputBufferImpl.java:282)
	at org.apache.http.impl.conn.DefaultHttpResponseParser.parseHead(DefaultHttpResponseParser.java:138)
	at org.apache.http.impl.conn.DefaultHttpResponseParser.parseHead(DefaultHttpResponseParser.java:56)
	at org.apache.http.impl.io.AbstractMessageParser.parse(AbstractMessageParser.java:259)
	at org.apache.http.impl.DefaultBHttpClientConnection.receiveResponseHeader(DefaultBHttpClientConnection.java:163)
	at org.apache.http.impl.conn.CPoolProxy.receiveResponseHeader(CPoolProxy.java:165)
	at org.apache.http.protocol.HttpRequestExecutor.doReceiveResponse(HttpRequestExecutor.java:273)
	at org.apache.http.protocol.HttpRequestExecutor.execute(HttpRequestExecutor.java:125)
	at org.apache.http.impl.execchain.MainClientExec.execute(MainClientExec.java:272)
	at org.apache.http.impl.execchain.ProtocolExec.execute(ProtocolExec.java:185)
	at org.apache.http.impl.execchain.RetryExec.execute(RetryExec.java:89)
	at org.apache.http.impl.execchain.RedirectExec.execute(RedirectExec.java:111)
	at org.apache.http.impl.client.InternalHttpClient.doExecute(InternalHttpClient.java:185)
	at org.apache.http.impl.client.CloseableHttpClient.execute(CloseableHttpClient.java:83)
	at org.apache.solr.util.RestTestHarness.getResponse(RestTestHarness.java:215)
	at org.apache.solr.util.RestTestHarness.query(RestTestHarness.java:107)
	at org.apache.solr.util.RestTestBase.assertJQ(RestTestBase.java:226)
	at org.apache.solr.util.RestTestBase.assertJQ(RestTestBase.java:192)
	at org.apache.solr.ltr.store.rest.TestModelManagerPersistence.doWrapperModelPersistenceChecks(TestModelManagerPersistence.java:202)
	at org.apache.solr.ltr.store.rest.TestModelManagerPersistence.testWrapperModelPersistence(TestModelManagerPersistence.java:255)
	at java.base/jdk.internal.reflect.NativeMethodAccessorImpl.invoke0(Native Method)
	at java.base/jdk.internal.reflect.NativeMethodAccessorImpl.invoke(NativeMethodAccessorImpl.java:62)
	at java.base/jdk.internal.reflect.DelegatingMethodAccessorImpl.invoke(DelegatingMethodAccessorImpl.java:43)
	at java.base/java.lang.reflect.Method.invoke(Method.java:566)
	at com.carrotsearch.randomizedtesting.RandomizedRunner.invoke(RandomizedRunner.java:1742)
	at com.carrotsearch.randomizedtesting.RandomizedRunner$8.evaluate(RandomizedRunner.java:935)
	at com.carrotsearch.randomizedtesting.RandomizedRunner$9.evaluate(RandomizedRunner.java:971)
	at com.carrotsearch.randomizedtesting.RandomizedRunner$10.evaluate(RandomizedRunner.java:985)
	at com.carrotsearch.randomizedtesting.rules.SystemPropertiesRestoreRule$1.evaluate(SystemPropertiesRestoreRule.java:57)
	at org.apache.lucene.util.TestRuleSetupTeardownChained$1.evaluate(TestRuleSetupTeardownChained.java:49)
	at org.apache.lucene.util.AbstractBeforeAfterRule$1.evaluate(AbstractBeforeAfterRule.java:45)
	at org.apache.lucene.util.TestRuleThreadAndTestName$1.evaluate(TestRuleThreadAndTestName.java:48)
	at org.apache.lucene.util.TestRuleIgnoreAfterMaxFailures$1.evaluate(TestRuleIgnoreAfterMaxFailures.java:64)
	at org.apache.lucene.util.TestRuleMarkFailure$1.evaluate(TestRuleMarkFailure.java:47)
	at com.carrotsearch.randomizedtesting.rules.StatementAdapter.evaluate(StatementAdapter.java:36)
	at com.carrotsearch.randomizedtesting.ThreadLeakControl$StatementRunner.run(ThreadLeakControl.java:368)
	at com.carrotsearch.randomizedtesting.ThreadLeakControl.forkTimeoutingTask(ThreadLeakControl.java:817)
	at com.carrotsearch.randomizedtesting.ThreadLeakControl$3.evaluate(ThreadLeakControl.java:468)
	at com.carrotsearch.randomizedtesting.RandomizedRunner.runSingleTest(RandomizedRunner.java:944)
	at com.carrotsearch.randomizedtesting.RandomizedRunner$5.evaluate(RandomizedRunner.java:830)
	at com.carrotsearch.randomizedtesting.RandomizedRunner$6.evaluate(RandomizedRunner.java:880)
	at com.carrotsearch.randomizedtesting.RandomizedRunner$7.evaluate(RandomizedRunner.java:891)
	at com.carrotsearch.randomizedtesting.rules.StatementAdapter.evaluate(StatementAdapter.java:36)
	at com.carrotsearch.randomizedtesting.rules.SystemPropertiesRestoreRule$1.evaluate(SystemPropertiesRestoreRule.java:57)
	at org.apache.lucene.util.AbstractBeforeAfterRule$1.evaluate(AbstractBeforeAfterRule.java:45)
	at com.carrotsearch.randomizedtesting.rules.StatementAdapter.evaluate(StatementAdapter.java:36)
	at org.apache.lucene.util.TestRuleStoreClassName$1.evaluate(TestRuleStoreClassName.java:41)
	at com.carrotsearch.randomizedtesting.rules.NoShadowingOrOverridesOnMethodsRule$1.evaluate(NoShadowingOrOverridesOnMethodsRule.java:40)
	at com.carrotsearch.randomizedtesting.rules.NoShadowingOrOverridesOnMethodsRule$1.evaluate(NoShadowingOrOverridesOnMethodsRule.java:40)
	at com.carrotsearch.randomizedtesting.rules.StatementAdapter.evaluate(StatementAdapter.java:36)
	at com.carrotsearch.randomizedtesting.rules.StatementAdapter.evaluate(StatementAdapter.java:36)
	at org.apache.lucene.util.TestRuleAssertionsRequired$1.evaluate(TestRuleAssertionsRequired.java:53)
	at org.apache.lucene.util.TestRuleMarkFailure$1.evaluate(TestRuleMarkFailure.java:47)
	at org.apache.lucene.util.TestRuleIgnoreAfterMaxFailures$1.evaluate(TestRuleIgnoreAfterMaxFailures.java:64)
	at org.apache.lucene.util.TestRuleIgnoreTestSuites$1.evaluate(TestRuleIgnoreTestSuites.java:54)
	at com.carrotsearch.randomizedtesting.rules.StatementAdapter.evaluate(StatementAdapter.java:36)
	at com.carrotsearch.randomizedtesting.ThreadLeakControl$StatementRunner.run(ThreadLeakControl.java:368)
	at java.base/java.lang.Thread.run(Thread.java:834)
Caused by: java.net.SocketException: Software caused connection abort: recv failed
	at java.base/java.net.SocketInputStream.socketRead0(Native Method)
	at java.base/java.net.SocketInputStream.socketRead(SocketInputStream.java:115)
	at java.base/java.net.SocketInputStream.read(SocketInputStream.java:168)
	at java.base/java.net.SocketInputStream.read(SocketInputStream.java:140)
	at java.base/sun.security.ssl.SSLSocketInputRecord.read(SSLSocketInputRecord.java:448)
	at java.base/sun.security.ssl.SSLSocketInputRecord.bytesInCompletePacket(SSLSocketInputRecord.java:68)
	at java.base/sun.security.ssl.SSLSocketImpl.readApplicationRecord(SSLSocketImpl.java:1104)
	at java.base/sun.security.ssl.SSLSocketImpl$AppInputStream.read(SSLSocketImpl.java:823)
	... 60 more


FAILED:  org.apache.solr.ltr.store.rest.TestModelManagerPersistence.testWrapperModelPersistence

Error Message:
Software caused connection abort: recv failed

Stack Trace:
javax.net.ssl.SSLProtocolException: Software caused connection abort: recv failed
	at __randomizedtesting.SeedInfo.seed([31CEBAF2DEE12C1D:44A4C92C611D5558]:0)
	at java.base/sun.security.ssl.Alert.createSSLException(Alert.java:126)
	at java.base/sun.security.ssl.TransportContext.fatal(TransportContext.java:321)
	at java.base/sun.security.ssl.TransportContext.fatal(TransportContext.java:264)
	at java.base/sun.security.ssl.TransportContext.fatal(TransportContext.java:259)
	at java.base/sun.security.ssl.SSLSocketImpl.handleException(SSLSocketImpl.java:1314)
	at java.base/sun.security.ssl.SSLSocketImpl$AppInputStream.read(SSLSocketImpl.java:839)
	at org.apache.http.impl.io.SessionInputBufferImpl.streamRead(SessionInputBufferImpl.java:137)
	at org.apache.http.impl.io.SessionInputBufferImpl.fillBuffer(SessionInputBufferImpl.java:153)
	at org.apache.http.impl.io.SessionInputBufferImpl.readLine(SessionInputBufferImpl.java:282)
	at org.apache.http.impl.conn.DefaultHttpResponseParser.parseHead(DefaultHttpResponseParser.java:138)
	at org.apache.http.impl.conn.DefaultHttpResponseParser.parseHead(DefaultHttpResponseParser.java:56)
	at org.apache.http.impl.io.AbstractMessageParser.parse(AbstractMessageParser.java:259)
	at org.apache.http.impl.DefaultBHttpClientConnection.receiveResponseHeader(DefaultBHttpClientConnection.java:163)
	at org.apache.http.impl.conn.CPoolProxy.receiveResponseHeader(CPoolProxy.java:165)
	at org.apache.http.protocol.HttpRequestExecutor.doReceiveResponse(HttpRequestExecutor.java:273)
	at org.apache.http.protocol.HttpRequestExecutor.execute(HttpRequestExecutor.java:125)
	at org.apache.http.impl.execchain.MainClientExec.execute(MainClientExec.java:272)
	at org.apache.http.impl.execchain.ProtocolExec.execute(ProtocolExec.java:185)
	at org.apache.http.impl.execchain.RetryExec.execute(RetryExec.java:89)
	at org.apache.http.impl.execchain.RedirectExec.execute(RedirectExec.java:111)
	at org.apache.http.impl.client.InternalHttpClient.doExecute(InternalHttpClient.java:185)
	at org.apache.http.impl.client.CloseableHttpClient.execute(CloseableHttpClient.java:83)
	at org.apache.solr.util.RestTestHarness.getResponse(RestTestHarness.java:215)
	at org.apache.solr.util.RestTestHarness.query(RestTestHarness.java:107)
	at org.apache.solr.util.RestTestBase.assertJQ(RestTestBase.java:226)
	at org.apache.solr.util.RestTestBase.assertJQ(RestTestBase.java:192)
	at org.apache.solr.ltr.store.rest.TestModelManagerPersistence.doWrapperModelPersistenceChecks(TestModelManagerPersistence.java:202)
	at org.apache.solr.ltr.store.rest.TestModelManagerPersistence.testWrapperModelPersistence(TestModelManagerPersistence.java:255)
	at java.base/jdk.internal.reflect.NativeMethodAccessorImpl.invoke0(Native Method)
	at java.base/jdk.internal.reflect.NativeMethodAccessorImpl.invoke(NativeMethodAccessorImpl.java:62)
	at java.base/jdk.internal.reflect.DelegatingMethodAccessorImpl.invoke(DelegatingMethodAccessorImpl.java:43)
	at java.base/java.lang.reflect.Method.invoke(Method.java:566)
	at com.carrotsearch.randomizedtesting.RandomizedRunner.invoke(RandomizedRunner.java:1742)
	at com.carrotsearch.randomizedtesting.RandomizedRunner$8.evaluate(RandomizedRunner.java:935)
	at com.carrotsearch.randomizedtesting.RandomizedRunner$9.evaluate(RandomizedRunner.java:971)
	at com.carrotsearch.randomizedtesting.RandomizedRunner$10.evaluate(RandomizedRunner.java:985)
	at com.carrotsearch.randomizedtesting.rules.SystemPropertiesRestoreRule$1.evaluate(SystemPropertiesRestoreRule.java:57)
	at org.apache.lucene.util.TestRuleSetupTeardownChained$1.evaluate(TestRuleSetupTeardownChained.java:49)
	at org.apache.lucene.util.AbstractBeforeAfterRule$1.evaluate(AbstractBeforeAfterRule.java:45)
	at org.apache.lucene.util.TestRuleThreadAndTestName$1.evaluate(TestRuleThreadAndTestName.java:48)
	at org.apache.lucene.util.TestRuleIgnoreAfterMaxFailures$1.evaluate(TestRuleIgnoreAfterMaxFailures.java:64)
	at org.apache.lucene.util.TestRuleMarkFailure$1.evaluate(TestRuleMarkFailure.java:47)
	at com.carrotsearch.randomizedtesting.rules.StatementAdapter.evaluate(StatementAdapter.java:36)
	at com.carrotsearch.randomizedtesting.ThreadLeakControl$StatementRunner.run(ThreadLeakControl.java:368)
	at com.carrotsearch.randomizedtesting.ThreadLeakControl.forkTimeoutingTask(ThreadLeakControl.java:817)
	at com.carrotsearch.randomizedtesting.ThreadLeakControl$3.evaluate(ThreadLeakControl.java:468)
	at com.carrotsearch.randomizedtesting.RandomizedRunner.runSingleTest(RandomizedRunner.java:944)
	at com.carrotsearch.randomizedtesting.RandomizedRunner$5.evaluate(RandomizedRunner.java:830)
	at com.carrotsearch.randomizedtesting.RandomizedRunner$6.evaluate(RandomizedRunner.java:880)
	at com.carrotsearch.randomizedtesting.RandomizedRunner$7.evaluate(RandomizedRunner.java:891)
	at com.carrotsearch.randomizedtesting.rules.StatementAdapter.evaluate(StatementAdapter.java:36)
	at com.carrotsearch.randomizedtesting.rules.SystemPropertiesRestoreRule$1.evaluate(SystemPropertiesRestoreRule.java:57)
	at org.apache.lucene.util.AbstractBeforeAfterRule$1.evaluate(AbstractBeforeAfterRule.java:45)
	at com.carrotsearch.randomizedtesting.rules.StatementAdapter.evaluate(StatementAdapter.java:36)
	at org.apache.lucene.util.TestRuleStoreClassName$1.evaluate(TestRuleStoreClassName.java:41)
	at com.carrotsearch.randomizedtesting.rules.NoShadowingOrOverridesOnMethodsRule$1.evaluate(NoShadowingOrOverridesOnMethodsRule.java:40)
	at com.carrotsearch.randomizedtesting.rules.NoShadowingOrOverridesOnMethodsRule$1.evaluate(NoShadowingOrOverridesOnMethodsRule.java:40)
	at com.carrotsearch.randomizedtesting.rules.StatementAdapter.evaluate(StatementAdapter.java:36)
	at com.carrotsearch.randomizedtesting.rules.StatementAdapter.evaluate(StatementAdapter.java:36)
	at org.apache.lucene.util.TestRuleAssertionsRequired$1.evaluate(TestRuleAssertionsRequired.java:53)
	at org.apache.lucene.util.TestRuleMarkFailure$1.evaluate(TestRuleMarkFailure.java:47)
	at org.apache.lucene.util.TestRuleIgnoreAfterMaxFailures$1.evaluate(TestRuleIgnoreAfterMaxFailures.java:64)
	at org.apache.lucene.util.TestRuleIgnoreTestSuites$1.evaluate(TestRuleIgnoreTestSuites.java:54)
	at com.carrotsearch.randomizedtesting.rules.StatementAdapter.evaluate(StatementAdapter.java:36)
	at com.carrotsearch.randomizedtesting.ThreadLeakControl$StatementRunner.run(ThreadLeakControl.java:368)
	at java.base/java.lang.Thread.run(Thread.java:834)
Caused by: java.net.SocketException: Software caused connection abort: recv failed
	at java.base/java.net.SocketInputStream.socketRead0(Native Method)
	at java.base/java.net.SocketInputStream.socketRead(SocketInputStream.java:115)
	at java.base/java.net.SocketInputStream.read(SocketInputStream.java:168)
	at java.base/java.net.SocketInputStream.read(SocketInputStream.java:140)
	at java.base/sun.security.ssl.SSLSocketInputRecord.read(SSLSocketInputRecord.java:448)
	at java.base/sun.security.ssl.SSLSocketInputRecord.bytesInCompletePacket(SSLSocketInputRecord.java:68)
	at java.base/sun.security.ssl.SSLSocketImpl.readApplicationRecord(SSLSocketImpl.java:1104)
	at java.base/sun.security.ssl.SSLSocketImpl$AppInputStream.read(SSLSocketImpl.java:823)
	... 60 more


FAILED:  org.apache.solr.ltr.store.rest.TestModelManagerPersistence.testInnerCustomClassesPersistence

Error Message:
mismatch: 'model42'!='linear' @ models/[0]/name

Stack Trace:
java.lang.RuntimeException: mismatch: 'model42'!='linear' @ models/[0]/name
	at __randomizedtesting.SeedInfo.seed([31CEBAF2DEE12C1D:18CB91C7180D0A71]:0)
	at org.apache.solr.util.RestTestBase.assertJQ(RestTestBase.java:248)
	at org.apache.solr.util.RestTestBase.assertJQ(RestTestBase.java:192)
	at org.apache.solr.ltr.store.rest.TestModelManagerPersistence.testInnerCustomClassesPersistence(TestModelManagerPersistence.java:310)
	at java.base/jdk.internal.reflect.NativeMethodAccessorImpl.invoke0(Native Method)
	at java.base/jdk.internal.reflect.NativeMethodAccessorImpl.invoke(NativeMethodAccessorImpl.java:62)
	at java.base/jdk.internal.reflect.DelegatingMethodAccessorImpl.invoke(DelegatingMethodAccessorImpl.java:43)
	at java.base/java.lang.reflect.Method.invoke(Method.java:566)
	at com.carrotsearch.randomizedtesting.RandomizedRunner.invoke(RandomizedRunner.java:1742)
	at com.carrotsearch.randomizedtesting.RandomizedRunner$8.evaluate(RandomizedRunner.java:935)
	at com.carrotsearch.randomizedtesting.RandomizedRunner$9.evaluate(RandomizedRunner.java:971)
	at com.carrotsearch.randomizedtesting.RandomizedRunner$10.evaluate(RandomizedRunner.java:985)
	at com.carrotsearch.randomizedtesting.rules.SystemPropertiesRestoreRule$1.evaluate(SystemPropertiesRestoreRule.java:57)
	at org.apache.lucene.util.TestRuleSetupTeardownChained$1.evaluate(TestRuleSetupTeardownChained.java:49)
	at org.apache.lucene.util.AbstractBeforeAfterRule$1.evaluate(AbstractBeforeAfterRule.java:45)
	at org.apache.lucene.util.TestRuleThreadAndTestName$1.evaluate(TestRuleThreadAndTestName.java:48)
	at org.apache.lucene.util.TestRuleIgnoreAfterMaxFailures$1.evaluate(TestRuleIgnoreAfterMaxFailures.java:64)
	at org.apache.lucene.util.TestRuleMarkFailure$1.evaluate(TestRuleMarkFailure.java:47)
	at com.carrotsearch.randomizedtesting.rules.StatementAdapter.evaluate(StatementAdapter.java:36)
	at com.carrotsearch.randomizedtesting.ThreadLeakControl$StatementRunner.run(ThreadLeakControl.java:368)
	at com.carrotsearch.randomizedtesting.ThreadLeakControl.forkTimeoutingTask(ThreadLeakControl.java:817)
	at com.carrotsearch.randomizedtesting.ThreadLeakControl$3.evaluate(ThreadLeakControl.java:468)
	at com.carrotsearch.randomizedtesting.RandomizedRunner.runSingleTest(RandomizedRunner.java:944)
	at com.carrotsearch.randomizedtesting.RandomizedRunner$5.evaluate(RandomizedRunner.java:830)
	at com.carrotsearch.randomizedtesting.RandomizedRunner$6.evaluate(RandomizedRunner.java:880)
	at com.carrotsearch.randomizedtesting.RandomizedRunner$7.evaluate(RandomizedRunner.java:891)
	at com.carrotsearch.randomizedtesting.rules.StatementAdapter.evaluate(StatementAdapter.java:36)
	at com.carrotsearch.randomizedtesting.rules.SystemPropertiesRestoreRule$1.evaluate(SystemPropertiesRestoreRule.java:57)
	at org.apache.lucene.util.AbstractBeforeAfterRule$1.evaluate(AbstractBeforeAfterRule.java:45)
	at com.carrotsearch.randomizedtesting.rules.StatementAdapter.evaluate(StatementAdapter.java:36)
	at org.apache.lucene.util.TestRuleStoreClassName$1.evaluate(TestRuleStoreClassName.java:41)
	at com.carrotsearch.randomizedtesting.rules.NoShadowingOrOverridesOnMethodsRule$1.evaluate(NoShadowingOrOverridesOnMethodsRule.java:40)
	at com.carrotsearch.randomizedtesting.rules.NoShadowingOrOverridesOnMethodsRule$1.evaluate(NoShadowingOrOverridesOnMethodsRule.java:40)
	at com.carrotsearch.randomizedtesting.rules.StatementAdapter.evaluate(StatementAdapter.java:36)
	at com.carrotsearch.randomizedtesting.rules.StatementAdapter.evaluate(StatementAdapter.java:36)
	at org.apache.lucene.util.TestRuleAssertionsRequired$1.evaluate(TestRuleAssertionsRequired.java:53)
	at org.apache.lucene.util.TestRuleMarkFailure$1.evaluate(TestRuleMarkFailure.java:47)
	at org.apache.lucene.util.TestRuleIgnoreAfterMaxFailures$1.evaluate(TestRuleIgnoreAfterMaxFailures.java:64)
	at org.apache.lucene.util.TestRuleIgnoreTestSuites$1.evaluate(TestRuleIgnoreTestSuites.java:54)
	at com.carrotsearch.randomizedtesting.rules.StatementAdapter.evaluate(StatementAdapter.java:36)
	at com.carrotsearch.randomizedtesting.ThreadLeakControl$StatementRunner.run(ThreadLeakControl.java:368)
	at java.base/java.lang.Thread.run(Thread.java:834)


FAILED:  org.apache.solr.ltr.store.rest.TestModelManagerPersistence.testFeaturePersistence

Error Message:


Stack Trace:
java.lang.AssertionError
	at __randomizedtesting.SeedInfo.seed([31CEBAF2DEE12C1D:B8A2789533D278B9]:0)
	at org.junit.Assert.fail(Assert.java:92)
	at org.junit.Assert.assertTrue(Assert.java:43)
	at org.junit.Assert.assertTrue(Assert.java:54)
	at org.apache.solr.ltr.store.rest.TestModelManagerPersistence.testFeaturePersistence(TestModelManagerPersistence.java:96)
	at java.base/jdk.internal.reflect.NativeMethodAccessorImpl.invoke0(Native Method)
	at java.base/jdk.internal.reflect.NativeMethodAccessorImpl.invoke(NativeMethodAccessorImpl.java:62)
	at java.base/jdk.internal.reflect.DelegatingMethodAccessorImpl.invoke(DelegatingMethodAccessorImpl.java:43)
	at java.base/java.lang.reflect.Method.invoke(Method.java:566)
	at com.carrotsearch.randomizedtesting.RandomizedRunner.invoke(RandomizedRunner.java:1742)
	at com.carrotsearch.randomizedtesting.RandomizedRunner$8.evaluate(RandomizedRunner.java:935)
	at com.carrotsearch.randomizedtesting.RandomizedRunner$9.evaluate(RandomizedRunner.java:971)
	at com.carrotsearch.randomizedtesting.RandomizedRunner$10.evaluate(RandomizedRunner.java:985)
	at com.carrotsearch.randomizedtesting.rules.SystemPropertiesRestoreRule$1.evaluate(SystemPropertiesRestoreRule.java:57)
	at org.apache.lucene.util.TestRuleSetupTeardownChained$1.evaluate(TestRuleSetupTeardownChained.java:49)
	at org.apache.lucene.util.AbstractBeforeAfterRule$1.evaluate(AbstractBeforeAfterRule.java:45)
	at org.apache.lucene.util.TestRuleThreadAndTestName$1.evaluate(TestRuleThreadAndTestName.java:48)
	at org.apache.lucene.util.TestRuleIgnoreAfterMaxFailures$1.evaluate(TestRuleIgnoreAfterMaxFailures.java:64)
	at org.apache.lucene.util.TestRuleMarkFailure$1.evaluate(TestRuleMarkFailure.java:47)
	at com.carrotsearch.randomizedtesting.rules.StatementAdapter.evaluate(StatementAdapter.java:36)
	at com.carrotsearch.randomizedtesting.ThreadLeakControl$StatementRunner.run(ThreadLeakControl.java:368)
	at com.carrotsearch.randomizedtesting.ThreadLeakControl.forkTimeoutingTask(ThreadLeakControl.java:817)
	at com.carrotsearch.randomizedtesting.ThreadLeakControl$3.evaluate(ThreadLeakControl.java:468)
	at com.carrotsearch.randomizedtesting.RandomizedRunner.runSingleTest(RandomizedRunner.java:944)
	at com.carrotsearch.randomizedtesting.RandomizedRunner$5.evaluate(RandomizedRunner.java:830)
	at com.carrotsearch.randomizedtesting.RandomizedRunner$6.evaluate(RandomizedRunner.java:880)
	at com.carrotsearch.randomizedtesting.RandomizedRunner$7.evaluate(RandomizedRunner.java:891)
	at com.carrotsearch.randomizedtesting.rules.StatementAdapter.evaluate(StatementAdapter.java:36)
	at com.carrotsearch.randomizedtesting.rules.SystemPropertiesRestoreRule$1.evaluate(SystemPropertiesRestoreRule.java:57)
	at org.apache.lucene.util.AbstractBeforeAfterRule$1.evaluate(AbstractBeforeAfterRule.java:45)
	at com.carrotsearch.randomizedtesting.rules.StatementAdapter.evaluate(StatementAdapter.java:36)
	at org.apache.lucene.util.TestRuleStoreClassName$1.evaluate(TestRuleStoreClassName.java:41)
	at com.carrotsearch.randomizedtesting.rules.NoShadowingOrOverridesOnMethodsRule$1.evaluate(NoShadowingOrOverridesOnMethodsRule.java:40)
	at com.carrotsearch.randomizedtesting.rules.NoShadowingOrOverridesOnMethodsRule$1.evaluate(NoShadowingOrOverridesOnMethodsRule.java:40)
	at com.carrotsearch.randomizedtesting.rules.StatementAdapter.evaluate(StatementAdapter.java:36)
	at com.carrotsearch.randomizedtesting.rules.StatementAdapter.evaluate(StatementAdapter.java:36)
	at org.apache.lucene.util.TestRuleAssertionsRequired$1.evaluate(TestRuleAssertionsRequired.java:53)
	at org.apache.lucene.util.TestRuleMarkFailure$1.evaluate(TestRuleMarkFailure.java:47)
	at org.apache.lucene.util.TestRuleIgnoreAfterMaxFailures$1.evaluate(TestRuleIgnoreAfterMaxFailures.java:64)
	at org.apache.lucene.util.TestRuleIgnoreTestSuites$1.evaluate(TestRuleIgnoreTestSuites.java:54)
	at com.carrotsearch.randomizedtesting.rules.StatementAdapter.evaluate(StatementAdapter.java:36)
	at com.carrotsearch.randomizedtesting.ThreadLeakControl$StatementRunner.run(ThreadLeakControl.java:368)
	at java.base/java.lang.Thread.run(Thread.java:834)


FAILED:  org.apache.solr.ltr.store.rest.TestModelManagerPersistence.testFilePersistence

Error Message:
List size mismatch @ models

Stack Trace:
java.lang.RuntimeException: List size mismatch @ models
	at __randomizedtesting.SeedInfo.seed([31CEBAF2DEE12C1D:136FDE8F7B8D4A58]:0)
	at org.apache.solr.util.RestTestBase.assertJQ(RestTestBase.java:248)
	at org.apache.solr.util.RestTestBase.assertJQ(RestTestBase.java:192)
	at org.apache.solr.ltr.store.rest.TestModelManagerPersistence.testFilePersistence(TestModelManagerPersistence.java:138)
	at java.base/jdk.internal.reflect.NativeMethodAccessorImpl.invoke0(Native Method)
	at java.base/jdk.internal.reflect.NativeMethodAccessorImpl.invoke(NativeMethodAccessorImpl.java:62)
	at java.base/jdk.internal.reflect.DelegatingMethodAccessorImpl.invoke(DelegatingMethodAccessorImpl.java:43)
	at java.base/java.lang.reflect.Method.invoke(Method.java:566)
	at com.carrotsearch.randomizedtesting.RandomizedRunner.invoke(RandomizedRunner.java:1742)
	at com.carrotsearch.randomizedtesting.RandomizedRunner$8.evaluate(RandomizedRunner.java:935)
	at com.carrotsearch.randomizedtesting.RandomizedRunner$9.evaluate(RandomizedRunner.java:971)
	at com.carrotsearch.randomizedtesting.RandomizedRunner$10.evaluate(RandomizedRunner.java:985)
	at com.carrotsearch.randomizedtesting.rules.SystemPropertiesRestoreRule$1.evaluate(SystemPropertiesRestoreRule.java:57)
	at org.apache.lucene.util.TestRuleSetupTeardownChained$1.evaluate(TestRuleSetupTeardownChained.java:49)
	at org.apache.lucene.util.AbstractBeforeAfterRule$1.evaluate(AbstractBeforeAfterRule.java:45)
	at org.apache.lucene.util.TestRuleThreadAndTestName$1.evaluate(TestRuleThreadAndTestName.java:48)
	at org.apache.lucene.util.TestRuleIgnoreAfterMaxFailures$1.evaluate(TestRuleIgnoreAfterMaxFailures.java:64)
	at org.apache.lucene.util.TestRuleMarkFailure$1.evaluate(TestRuleMarkFailure.java:47)
	at com.carrotsearch.randomizedtesting.rules.StatementAdapter.evaluate(StatementAdapter.java:36)
	at com.carrotsearch.randomizedtesting.ThreadLeakControl$StatementRunner.run(ThreadLeakControl.java:368)
	at com.carrotsearch.randomizedtesting.ThreadLeakControl.forkTimeoutingTask(ThreadLeakControl.java:817)
	at com.carrotsearch.randomizedtesting.ThreadLeakControl$3.evaluate(ThreadLeakControl.java:468)
	at com.carrotsearch.randomizedtesting.RandomizedRunner.runSingleTest(RandomizedRunner.java:944)
	at com.carrotsearch.randomizedtesting.RandomizedRunner$5.evaluate(RandomizedRunner.java:830)
	at com.carrotsearch.randomizedtesting.RandomizedRunner$6.evaluate(RandomizedRunner.java:880)
	at com.carrotsearch.randomizedtesting.RandomizedRunner$7.evaluate(RandomizedRunner.java:891)
	at com.carrotsearch.randomizedtesting.rules.StatementAdapter.evaluate(StatementAdapter.java:36)
	at com.carrotsearch.randomizedtesting.rules.SystemPropertiesRestoreRule$1.evaluate(SystemPropertiesRestoreRule.java:57)
	at org.apache.lucene.util.AbstractBeforeAfterRule$1.evaluate(AbstractBeforeAfterRule.java:45)
	at com.carrotsearch.randomizedtesting.rules.StatementAdapter.evaluate(StatementAdapter.java:36)
	at org.apache.lucene.util.TestRuleStoreClassName$1.evaluate(TestRuleStoreClassName.java:41)
	at com.carrotsearch.randomizedtesting.rules.NoShadowingOrOverridesOnMethodsRule$1.evaluate(NoShadowingOrOverridesOnMethodsRule.java:40)
	at com.carrotsearch.randomizedtesting.rules.NoShadowingOrOverridesOnMethodsRule$1.evaluate(NoShadowingOrOverridesOnMethodsRule.java:40)
	at com.carrotsearch.randomizedtesting.rules.StatementAdapter.evaluate(StatementAdapter.java:36)
	at com.carrotsearch.randomizedtesting.rules.StatementAdapter.evaluate(StatementAdapter.java:36)
	at org.apache.lucene.util.TestRuleAssertionsRequired$1.evaluate(TestRuleAssertionsRequired.java:53)
	at org.apache.lucene.util.TestRuleMarkFailure$1.evaluate(TestRuleMarkFailure.java:47)
	at org.apache.lucene.util.TestRuleIgnoreAfterMaxFailures$1.evaluate(TestRuleIgnoreAfterMaxFailures.java:64)
	at org.apache.lucene.util.TestRuleIgnoreTestSuites$1.evaluate(TestRuleIgnoreTestSuites.java:54)
	at com.carrotsearch.randomizedtesting.rules.StatementAdapter.evaluate(StatementAdapter.java:36)
	at com.carrotsearch.randomizedtesting.ThreadLeakControl$StatementRunner.run(ThreadLeakControl.java:368)
	at java.base/java.lang.Thread.run(Thread.java:834)




Build Log:
[...truncated 23249 lines...]
   [junit4] Suite: org.apache.solr.ltr.store.rest.TestModelManagerPersistence
   [junit4]   2> Creating dataDir: C:\Users\jenkins\workspace\Lucene-Solr-7.x-Windows\solr\build\contrib\solr-ltr\test\J1\temp\solr.ltr.store.rest.TestModelManagerPersistence_31CEBAF2DEE12C1D-001\init-core-data-001
   [junit4]   1> 10:09:44.061 [SUITE-TestModelManagerPersistence-seed#[31CEBAF2DEE12C1D]-worker] ERROR org.apache.solr.util.StartupLoggingUtils - Missing Java Option solr.log.dir. Logging may be missing or incomplete.
   [junit4]   2> Sep 23, 2018 1:09:44 MOG org.restlet.Application start
   [junit4]   2> INFO: Starting org.apache.solr.rest.SolrSchemaRestApi application
   [junit4]   2> Sep 23, 2018 1:09:44 MOG org.restlet.engine.log.LogFilter afterHandle
   [junit4]   2> INFO: 2018-09-23	13:09:44	127.0.0.1	-	127.0.0.1	53562	GET	/solr/schema/model-store	wt=json&indent=on	200	-	0	11	https://127.0.0.1:53562	Apache-HttpClient/4.5.3 (Java/11)	-
   [junit4]   2> Sep 23, 2018 1:09:44 MOG org.restlet.engine.log.LogFilter afterHandle
   [junit4]   2> INFO: 2018-09-23	13:09:44	127.0.0.1	-	127.0.0.1	53562	GET	/solr/schema/feature-store/testWrapper	wt=json&indent=on	200	-	0	2	https://127.0.0.1:53562	Apache-HttpClient/4.5.3 (Java/11)	-
   [junit4]   2> Sep 23, 2018 1:09:44 MOG org.restlet.engine.log.LogFilter afterHandle
   [junit4]   2> INFO: 2018-09-23	13:09:44	127.0.0.1	-	127.0.0.1	53562	PUT	/solr/schema/feature-store	wt=json&indent=on	200	-	137	14	https://127.0.0.1:53562	Apache-HttpClient/4.5.3 (Java/11)	-
   [junit4]   2> Sep 23, 2018 1:09:44 MOG org.restlet.engine.log.LogFilter afterHandle
   [junit4]   2> INFO: 2018-09-23	13:09:44	127.0.0.1	-	127.0.0.1	53562	PUT	/solr/schema/feature-store	wt=json&indent=on	200	-	116	5	https://127.0.0.1:53562	Apache-HttpClient/4.5.3 (Java/11)	-
   [junit4]   2> Sep 23, 2018 1:09:44 MOG org.restlet.engine.log.LogFilter afterHandle
   [junit4]   2> INFO: 2018-09-23	13:09:44	127.0.0.1	-	127.0.0.1	53562	PUT	/solr/schema/model-store	wt=json&indent=on	200	-	171	16	https://127.0.0.1:53562	Apache-HttpClient/4.5.3 (Java/11)	-
   [junit4]   2> Sep 23, 2018 1:09:44 MOG org.restlet.engine.log.LogFilter afterHandle
   [junit4]   2> INFO: 2018-09-23	13:09:44	127.0.0.1	-	127.0.0.1	53562	GET	/solr/schema/model-store	wt=json&indent=on	200	-	0	0	https://127.0.0.1:53562	Apache-HttpClient/4.5.3 (Java/11)	-
   [junit4]   2> Sep 23, 2018 1:09:45 MOG org.restlet.engine.log.LogFilter afterHandle
   [junit4]   2> INFO: 2018-09-23	13:09:45	127.0.0.1	-	127.0.0.1	53562	GET	/solr/schema/model-store	wt=json&indent=on	200	-	0	2	https://127.0.0.1:53562	Apache-HttpClient/4.5.3 (Java/11)	-
   [junit4]   1> 10:09:45.165 [TEST-TestModelManagerPersistence.testWrapperModelPersistence-seed#[31CEBAF2DEE12C1D]] ERROR org.apache.solr.util.StartupLoggingUtils - Missing Java Option solr.log.dir. Logging may be missing or incomplete.
   [junit4]   1> 10:09:45.569 [TEST-TestModelManagerPersistence.testWrapperModelPersistence-seed#[31CEBAF2DEE12C1D]] ERROR org.apache.solr.util.RestTestBase - REQUEST FAILED: /schema/model-store?wt=json&indent=on
   [junit4]   2> NOTE: reproduce with: ant test  -Dtestcase=TestModelManagerPersistence -Dtests.method=testWrapperModelPersistence -Dtests.seed=31CEBAF2DEE12C1D -Dtests.slow=true -Dtests.locale=guz -Dtests.timezone=Asia/Jerusalem -Dtests.asserts=true -Dtests.file.encoding=Cp1252
   [junit4] ERROR   0.85s J1 | TestModelManagerPersistence.testWrapperModelPersistence <<<
   [junit4]    > Throwable #1: javax.net.ssl.SSLProtocolException: Software caused connection abort: recv failed
   [junit4]    > 	at __randomizedtesting.SeedInfo.seed([31CEBAF2DEE12C1D:44A4C92C611D5558]:0)
   [junit4]    > 	at java.base/sun.security.ssl.Alert.createSSLException(Alert.java:126)
   [junit4]    > 	at java.base/sun.security.ssl.TransportContext.fatal(TransportContext.java:321)
   [junit4]    > 	at java.base/sun.security.ssl.TransportContext.fatal(TransportContext.java:264)
   [junit4]    > 	at java.base/sun.security.ssl.TransportContext.fatal(TransportContext.java:259)
   [junit4]    > 	at java.base/sun.security.ssl.SSLSocketImpl.handleException(SSLSocketImpl.java:1314)
   [junit4]    > 	at java.base/sun.security.ssl.SSLSocketImpl$AppInputStream.read(SSLSocketImpl.java:839)
   [junit4]    > 	at org.apache.http.impl.io.SessionInputBufferImpl.streamRead(SessionInputBufferImpl.java:137)
   [junit4]    > 	at org.apache.http.impl.io.SessionInputBufferImpl.fillBuffer(SessionInputBufferImpl.java:153)
   [junit4]    > 	at org.apache.http.impl.io.SessionInputBufferImpl.readLine(SessionInputBufferImpl.java:282)
   [junit4]    > 	at org.apache.http.impl.conn.DefaultHttpResponseParser.parseHead(DefaultHttpResponseParser.java:138)
   [junit4]    > 	at org.apache.http.impl.conn.DefaultHttpResponseParser.parseHead(DefaultHttpResponseParser.java:56)
   [junit4]    > 	at org.apache.http.impl.io.AbstractMessageParser.parse(AbstractMessageParser.java:259)
   [junit4]    > 	at org.apache.http.impl.DefaultBHttpClientConnection.receiveResponseHeader(DefaultBHttpClientConnection.java:163)
   [junit4]    > 	at org.apache.http.impl.conn.CPoolProxy.receiveResponseHeader(CPoolProxy.java:165)
   [junit4]    > 	at org.apache.http.protocol.HttpRequestExecutor.doReceiveResponse(HttpRequestExecutor.java:273)
   [junit4]    > 	at org.apache.http.protocol.HttpRequestExecutor.execute(HttpRequestExecutor.java:125)
   [junit4]    > 	at org.apache.http.impl.execchain.MainClientExec.execute(MainClientExec.java:272)
   [junit4]    > 	at org.apache.http.impl.execchain.ProtocolExec.execute(ProtocolExec.java:185)
   [junit4]    > 	at org.apache.http.impl.execchain.RetryExec.execute(RetryExec.java:89)
   [junit4]    > 	at org.apache.http.impl.execchain.RedirectExec.execute(RedirectExec.java:111)
   [junit4]    > 	at org.apache.http.impl.client.InternalHttpClient.doExecute(InternalHttpClient.java:185)
   [junit4]    > 	at org.apache.http.impl.client.CloseableHttpClient.execute(CloseableHttpClient.java:83)
   [junit4]    > 	at org.apache.solr.util.RestTestHarness.getResponse(RestTestHarness.java:215)
   [junit4]    > 	at org.apache.solr.util.RestTestHarness.query(RestTestHarness.java:107)
   [junit4]    > 	at org.apache.solr.util.RestTestBase.assertJQ(RestTestBase.java:226)
   [junit4]    > 	at org.apache.solr.util.RestTestBase.assertJQ(RestTestBase.java:192)
   [junit4]    > 	at org.apache.solr.ltr.store.rest.TestModelManagerPersistence.doWrapperModelPersistenceChecks(TestModelManagerPersistence.java:202)
   [junit4]    > 	at org.apache.solr.ltr.store.rest.TestModelManagerPersistence.testWrapperModelPersistence(TestModelManagerPersistence.java:255)
   [junit4]    > 	at java.base/jdk.internal.reflect.NativeMethodAccessorImpl.invoke0(Native Method)
   [junit4]    > 	at java.base/jdk.internal.reflect.NativeMethodAccessorImpl.invoke(NativeMethodAccessorImpl.java:62)
   [junit4]    > 	at java.base/jdk.internal.reflect.DelegatingMethodAccessorImpl.invoke(DelegatingMethodAccessorImpl.java:43)
   [junit4]    > 	at java.base/java.lang.reflect.Method.invoke(Method.java:566)
   [junit4]    > 	at java.base/java.lang.Thread.run(Thread.java:834)
   [junit4]    > Caused by: java.net.SocketException: Software caused connection abort: recv failed
   [junit4]    > 	at java.base/java.net.SocketInputStream.socketRead0(Native Method)
   [junit4]    > 	at java.base/java.net.SocketInputStream.socketRead(SocketInputStream.java:115)
   [junit4]    > 	at java.base/java.net.SocketInputStream.read(SocketInputStream.java:168)
   [junit4]    > 	at java.base/java.net.SocketInputStream.read(SocketInputStream.java:140)
   [junit4]    > 	at java.base/sun.security.ssl.SSLSocketInputRecord.read(SSLSocketInputRecord.java:448)
   [junit4]    > 	at java.base/sun.security.ssl.SSLSocketInputRecord.bytesInCompletePacket(SSLSocketInputRecord.java:68)
   [junit4]    > 	at java.base/sun.security.ssl.SSLSocketImpl.readApplicationRecord(SSLSocketImpl.java:1104)
   [junit4]    > 	at java.base/sun.security.ssl.SSLSocketImpl$AppInputStream.read(SSLSocketImpl.java:823)
   [junit4]    > 	... 60 more
   [junit4]   2> Sep 23, 2018 1:09:45 MOG org.restlet.Application start
   [junit4]   2> INFO: Starting org.apache.solr.rest.SolrSchemaRestApi application
   [junit4]   2> Sep 23, 2018 1:09:45 MOG org.restlet.engine.log.LogFilter afterHandle
   [junit4]   2> INFO: 2018-09-23	13:09:45	127.0.0.1	-	127.0.0.1	53562	PUT	/solr/schema/feature-store	wt=json&indent=on	200	-	116	7	https://127.0.0.1:53562	Apache-HttpClient/4.5.3 (Java/11)	-
   [junit4]   2> Sep 23, 2018 1:09:45 MOG org.restlet.engine.log.LogFilter afterHandle
   [junit4]   2> INFO: 2018-09-23	13:09:45	127.0.0.1	-	127.0.0.1	53562	GET	/solr/schema/feature-store/test42	wt=json&indent=on	200	-	0	0	https://127.0.0.1:53562	Apache-HttpClient/4.5.3 (Java/11)	-
   [junit4]   2> Sep 23, 2018 1:09:45 MOG org.restlet.engine.log.LogFilter afterHandle
   [junit4]   2> INFO: 2018-09-23	13:09:45	127.0.0.1	-	127.0.0.1	53562	PUT	/solr/schema/model-store	wt=json&indent=on	200	-	206	6	https://127.0.0.1:53562	Apache-HttpClient/4.5.3 (Java/11)	-
   [junit4]   2> Sep 23, 2018 1:09:45 MOG org.restlet.engine.log.LogFilter afterHandle
   [junit4]   2> INFO: 2018-09-23	13:09:45	127.0.0.1	-	127.0.0.1	53562	GET	/solr/schema/model-store	wt=json&indent=on	200	-	0	2	https://127.0.0.1:53562	Apache-HttpClient/4.5.3 (Java/11)	-
   [junit4]   1> 10:09:45.706 [TEST-TestModelManagerPersistence.testInnerCustomClassesPersistence-seed#[31CEBAF2DEE12C1D]] ERROR org.apache.solr.util.RestTestBase - query failed JSON validation. error=mismatch: 'model42'!='linear' @ models/[0]/name
   [junit4]   1>  expected =/models/[0]/name=='model42'
   [junit4]   1>  response = {
   [junit4]   1>   "responseHeader":{
   [junit4]   1>     "status":0,
   [junit4]   1>     "QTime":1},
   [junit4]   1>   "models":[{
   [junit4]   1>       "name":"linear",
   [junit4]   1>       "class":"org.apache.solr.ltr.model.DefaultWrapperModel",
   [junit4]   1>       "store":"testWrapper",
   [junit4]   1>       "features":[],
   [junit4]   1>       "params":{"resource":"baseModelForPersistence.json"}},
   [junit4]   1>     {
   [junit4]   1>       "name":"model42",
   [junit4]   1>       "class":"org.apache.solr.ltr.store.rest.TestModelManagerPersistence$DummyCustomModel",
   [junit4]   1>       "store":"test42",
   [junit4]   1>       "features":[{
   [junit4]   1>           "name":"feature42",
   [junit4]   1>           "norm":{"class":"org.apache.solr.ltr.norm.IdentityNormalizer"}}],
   [junit4]   1>       "params":{"weights":{"feature42":1.0}}}]}
   [junit4]   1> 
   [junit4]   1>  request = /schema/model-store?wt=json&indent=on
   [junit4]   1> 
   [junit4]   2> NOTE: reproduce with: ant test  -Dtestcase=TestModelManagerPersistence -Dtests.method=testInnerCustomClassesPersistence -Dtests.seed=31CEBAF2DEE12C1D -Dtests.slow=true -Dtests.locale=guz -Dtests.timezone=Asia/Jerusalem -Dtests.asserts=true -Dtests.file.encoding=Cp1252
   [junit4] ERROR   0.14s J1 | TestModelManagerPersistence.testInnerCustomClassesPersistence <<<
   [junit4]    > Throwable #1: java.lang.RuntimeException: mismatch: 'model42'!='linear' @ models/[0]/name
   [junit4]    > 	at __randomizedtesting.SeedInfo.seed([31CEBAF2DEE12C1D:18CB91C7180D0A71]:0)
   [junit4]    > 	at org.apache.solr.util.RestTestBase.assertJQ(RestTestBase.java:248)
   [junit4]    > 	at org.apache.solr.util.RestTestBase.assertJQ(RestTestBase.java:192)
   [junit4]    > 	at org.apache.solr.ltr.store.rest.TestModelManagerPersistence.testInnerCustomClassesPersistence(TestModelManagerPersistence.java:310)
   [junit4]    > 	at java.base/jdk.internal.reflect.NativeMethodAccessorImpl.invoke0(Native Method)
   [junit4]    > 	at java.base/jdk.internal.reflect.NativeMethodAccessorImpl.invoke(NativeMethodAccessorImpl.java:62)
   [junit4]    > 	at java.base/jdk.internal.reflect.DelegatingMethodAccessorImpl.invoke(DelegatingMethodAccessorImpl.java:43)
   [junit4]    > 	at java.base/java.lang.reflect.Method.invoke(Method.java:566)
   [junit4]    > 	at java.base/java.lang.Thread.run(Thread.java:834)
   [junit4]   2> Sep 23, 2018 1:09:45 MOG org.restlet.engine.log.LogFilter afterHandle
   [junit4]   2> INFO: 2018-09-23	13:09:45	127.0.0.1	-	127.0.0.1	53562	PUT	/solr/schema/feature-store	wt=json&indent=on	200	-	111	3	https://127.0.0.1:53562	Apache-HttpClient/4.5.3 (Java/11)	-
   [junit4]   2> Sep 23, 2018 1:09:45 MOG org.restlet.engine.log.LogFilter afterHandle
   [junit4]   2> INFO: 2018-09-23	13:09:45	127.0.0.1	-	127.0.0.1	53562	GET	/solr/schema/feature-store/test	wt=json&indent=on	200	-	0	1	https://127.0.0.1:53562	Apache-HttpClient/4.5.3 (Java/11)	-
   [junit4]   2> Sep 23, 2018 1:09:46 MOG org.restlet.engine.log.LogFilter afterHandle
   [junit4]   2> INFO: 2018-09-23	13:09:46	127.0.0.1	-	127.0.0.1	53562	GET	/solr/schema/feature-store/test	wt=json&indent=on	200	-	0	1	https://127.0.0.1:53562	Apache-HttpClient/4.5.3 (Java/11)	-
   [junit4]   2> Sep 23, 2018 1:09:46 MOG org.restlet.engine.log.LogFilter afterHandle
   [junit4]   2> INFO: 2018-09-23	13:09:46	127.0.0.1	-	127.0.0.1	53562	PUT	/solr/schema/feature-store	wt=json&indent=on	200	-	113	2	https://127.0.0.1:53562	Apache-HttpClient/4.5.3 (Java/11)	-
   [junit4]   2> Sep 23, 2018 1:09:46 MOG org.restlet.engine.log.LogFilter afterHandle
   [junit4]   2> INFO: 2018-09-23	13:09:46	127.0.0.1	-	127.0.0.1	53562	PUT	/solr/schema/feature-store	wt=json&indent=on	200	-	112	1	https://127.0.0.1:53562	Apache-HttpClient/4.5.3 (Java/11)	-
   [junit4]   2> Sep 23, 2018 1:09:46 MOG org.restlet.engine.log.LogFilter afterHandle
   [junit4]   2> INFO: 2018-09-23	13:09:46	127.0.0.1	-	127.0.0.1	53562	PUT	/solr/schema/feature-store	wt=json&indent=on	200	-	113	1	https://127.0.0.1:53562	Apache-HttpClient/4.5.3 (Java/11)	-
   [junit4]   2> Sep 23, 2018 1:09:46 MOG org.restlet.engine.log.LogFilter afterHandle
   [junit4]   2> INFO: 2018-09-23	13:09:46	127.0.0.1	-	127.0.0.1	53562	GET	/solr/schema/feature-store/test	wt=json&indent=on	200	-	0	0	https://127.0.0.1:53562	Apache-HttpClient/4.5.3 (Java/11)	-
   [junit4]   2> Sep 23, 2018 1:09:46 MOG org.restlet.engine.log.LogFilter afterHandle
   [junit4]   2> INFO: 2018-09-23	13:09:46	127.0.0.1	-	127.0.0.1	53562	GET	/solr/schema/feature-store/test	wt=json&indent=on	200	-	0	0	https://127.0.0.1:53562	Apache-HttpClient/4.5.3 (Java/11)	-
   [junit4]   2> Sep 23, 2018 1:09:46 MOG org.restlet.engine.log.LogFilter afterHandle
   [junit4]   2> INFO: 2018-09-23	13:09:46	127.0.0.1	-	127.0.0.1	53562	GET	/solr/schema/feature-store/test1	wt=json&indent=on	200	-	0	0	https://127.0.0.1:53562	Apache-HttpClient/4.5.3 (Java/11)	-
   [junit4]   2> Sep 23, 2018 1:09:46 MOG org.restlet.engine.log.LogFilter afterHandle
   [junit4]   2> INFO: 2018-09-23	13:09:46	127.0.0.1	-	127.0.0.1	53562	GET	/solr/schema/feature-store/test2	wt=json&indent=on	200	-	0	1	https://127.0.0.1:53562	Apache-HttpClient/4.5.3 (Java/11)	-
   [junit4]   2> Sep 23, 2018 1:09:46 MOG org.restlet.engine.log.LogFilter afterHandle
   [junit4]   2> INFO: 2018-09-23	13:09:46	127.0.0.1	-	127.0.0.1	53562	GET	/solr/schema/feature-store/test	wt=json&indent=on	200	-	0	2	https://127.0.0.1:53562	Apache-HttpClient/4.5.3 (Java/11)	-
   [junit4]   2> Sep 23, 2018 1:09:46 MOG org.restlet.engine.log.LogFilter afterHandle
   [junit4]   2> INFO: 2018-09-23	13:09:46	127.0.0.1	-	127.0.0.1	53562	GET	/solr/schema/feature-store/test	wt=json&indent=on	200	-	0	1	https://127.0.0.1:53562	Apache-HttpClient/4.5.3 (Java/11)	-
   [junit4]   2> Sep 23, 2018 1:09:46 MOG org.restlet.engine.log.LogFilter afterHandle
   [junit4]   2> INFO: 2018-09-23	13:09:46	127.0.0.1	-	127.0.0.1	53562	GET	/solr/schema/feature-store/test1	wt=json&indent=on	200	-	0	0	https://127.0.0.1:53562	Apache-HttpClient/4.5.3 (Java/11)	-
   [junit4]   2> Sep 23, 2018 1:09:46 MOG org.restlet.engine.log.LogFilter afterHandle
   [junit4]   2> INFO: 2018-09-23	13:09:46	127.0.0.1	-	127.0.0.1	53562	GET	/solr/schema/feature-store/test2	wt=json&indent=on	200	-	0	0	https://127.0.0.1:53562	Apache-HttpClient/4.5.3 (Java/11)	-
   [junit4]   2> Sep 23, 2018 1:09:46 MOG org.restlet.engine.log.LogFilter afterHandle
   [junit4]   2> INFO: 2018-09-23	13:09:46	127.0.0.1	-	127.0.0.1	53562	PUT	/solr/schema/model-store	wt=json&indent=on	200	-	165	2	https://127.0.0.1:53562	Apache-HttpClient/4.5.3 (Java/11)	-
   [junit4]   2> Sep 23, 2018 1:09:46 MOG org.restlet.engine.log.LogFilter afterHandle
   [junit4]   2> INFO: 2018-09-23	13:09:46	127.0.0.1	-	127.0.0.1	53562	PUT	/solr/schema/model-store	wt=json&indent=on	200	-	169	2	https://127.0.0.1:53562	Apache-HttpClient/4.5.3 (Java/11)	-
   [junit4]   2> NOTE: reproduce with: ant test  -Dtestcase=TestModelManagerPersistence -Dtests.method=testFeaturePersistence -Dtests.seed=31CEBAF2DEE12C1D -Dtests.slow=true -Dtests.locale=guz -Dtests.timezone=Asia/Jerusalem -Dtests.asserts=true -Dtests.file.encoding=Cp1252
   [junit4] FAILURE 0.64s J1 | TestModelManagerPersistence.testFeaturePersistence <<<
   [junit4]    > Throwable #1: java.lang.AssertionError
   [junit4]    > 	at __randomizedtesting.SeedInfo.seed([31CEBAF2DEE12C1D:B8A2789533D278B9]:0)
   [junit4]    > 	at org.apache.solr.ltr.store.rest.TestModelManagerPersistence.testFeaturePersistence(TestModelManagerPersistence.java:96)
   [junit4]    > 	at java.base/jdk.internal.reflect.NativeMethodAccessorImpl.invoke0(Native Method)
   [junit4]    > 	at java.base/jdk.internal.reflect.NativeMethodAccessorImpl.invoke(NativeMethodAccessorImpl.java:62)
   [junit4]    > 	at java.base/jdk.internal.reflect.DelegatingMethodAccessorImpl.invoke(DelegatingMethodAccessorImpl.java:43)
   [junit4]    > 	at java.base/java.lang.reflect.Method.invoke(Method.java:566)
   [junit4]    > 	at java.base/java.lang.Thread.run(Thread.java:834)
   [junit4]   2> Sep 23, 2018 1:09:46 MOG org.restlet.engine.log.LogFilter afterHandle
   [junit4]   2> INFO: 2018-09-23	13:09:46	127.0.0.1	-	127.0.0.1	53562	GET	/solr/schema/model-store	wt=json&indent=on	200	-	0	1	https://127.0.0.1:53562	Apache-HttpClient/4.5.3 (Java/11)	-
   [junit4]   1> 10:09:46.357 [TEST-TestModelManagerPersistence.testFilePersistence-seed#[31CEBAF2DEE12C1D]] ERROR org.apache.solr.util.RestTestBase - query failed JSON validation. error=List size mismatch @ models
   [junit4]   1>  expected =/models/==[]
   [junit4]   1>  response = {
   [junit4]   1>   "responseHeader":{
   [junit4]   1>     "status":0,
   [junit4]   1>     "QTime":0},
   [junit4]   1>   "models":[{
   [junit4]   1>       "name":"test-model2",
   [junit4]   1>       "class":"org.apache.solr.ltr.model.LinearModel",
   [junit4]   1>       "store":"test1",
   [junit4]   1>       "features":[{
   [junit4]   1>           "name":"feature1",
   [junit4]   1>           "norm":{"class":"org.apache.solr.ltr.norm.IdentityNormalizer"}}],
   [junit4]   1>       "params":{"weights":{"feature1":1.0}}},
   [junit4]   1>     {
   [junit4]   1>       "name":"test-model",
   [junit4]   1>       "class":"org.apache.solr.ltr.model.LinearModel",
   [junit4]   1>       "store":"test",
   [junit4]   1>       "features":[{
   [junit4]   1>           "name":"feature",
   [junit4]   1>           "norm":{"class":"org.apache.solr.ltr.norm.IdentityNormalizer"}}],
   [junit4]   1>       "params":{"weights":{"feature":1.0}}},
   [junit4]   1>     {
   [junit4]   1>       "name":"linear",
   [junit4]   1>       "class":"org.apache.solr.ltr.model.DefaultWrapperModel",
   [junit4]   1>       "store":"testWrapper",
   [junit4]   1>       "features":[],
   [junit4]   1>       "params":{"resource":"baseModelForPersistence.json"}},
   [junit4]   1>     {
   [junit4]   1>       "name":"model42",
   [junit4]   1>       "class":"org.apache.solr.ltr.store.rest.TestModelManagerPersistence$DummyCustomModel",
   [junit4]   1>       "store":"test42",
   [junit4]   1>       "features":[{
   [junit4]   1>           "name":"feature42",
   [junit4]   1>           "norm":{"class":"org.apache.solr.ltr.norm.IdentityNormalizer"}}],
   [junit4]   1>       "params":{"weights":{"feature42":1.0}}}]}
   [junit4]   1> 
   [junit4]   1>  request = /schema/model-store?wt=json&indent=on
   [junit4]   1> 
   [junit4]   2> NOTE: reproduce with: ant test  -Dtestcase=TestModelManagerPersistence -Dtests.method=testFilePersistence -Dtests.seed=31CEBAF2DEE12C1D -Dtests.slow=true -Dtests.locale=guz -Dtests.timezone=Asia/Jerusalem -Dtests.asserts=true -Dtests.file.encoding=Cp1252
   [junit4] ERROR   0.01s J1 | TestModelManagerPersistence.testFilePersistence <<<
   [junit4]    > Throwable #1: java.lang.RuntimeException: List size mismatch @ models
   [junit4]    > 	at __randomizedtesting.SeedInfo.seed([31CEBAF2DEE12C1D:136FDE8F7B8D4A58]:0)
   [junit4]    > 	at org.apache.solr.util.RestTestBase.assertJQ(RestTestBase.java:248)
   [junit4]    > 	at org.apache.solr.util.RestTestBase.assertJQ(RestTestBase.java:192)
   [junit4]    > 	at org.apache.solr.ltr.store.rest.TestModelManagerPersistence.testFilePersistence(TestModelManagerPersistence.java:138)
   [junit4]    > 	at java.base/jdk.internal.reflect.NativeMethodAccessorImpl.invoke0(Native Method)
   [junit4]    > 	at java.base/jdk.internal.reflect.NativeMethodAccessorImpl.invoke(NativeMethodAccessorImpl.java:62)
   [junit4]    > 	at java.base/jdk.internal.reflect.DelegatingMethodAccessorImpl.invoke(DelegatingMethodAccessorImpl.java:43)
   [junit4]    > 	at java.base/java.lang.reflect.Method.invoke(Method.java:566)
   [junit4]    > 	at java.base/java.lang.Thread.run(Thread.java:834)
   [junit4]   2> NOTE: leaving temporary files on disk at: C:\Users\jenkins\workspace\Lucene-Solr-7.x-Windows\solr\build\contrib\solr-ltr\test\J1\temp\solr.ltr.store.rest.TestModelManagerPersistence_31CEBAF2DEE12C1D-001
   [junit4]   2> NOTE: test params are: codec=Asserting(Lucene70): {_version_=PostingsFormat(name=LuceneVarGapDocFreqInterval), popularity=PostingsFormat(name=Memory), description=PostingsFormat(name=MockRandom), id=PostingsFormat(name=Memory), text=PostingsFormat(name=LuceneVarGapFixedInterval), title=PostingsFormat(name=MockRandom)}, docValues:{_version_=DocValuesFormat(name=Direct), popularity=DocValuesFormat(name=Lucene70)}, maxPointsInLeafNode=1588, maxMBSortInHeap=7.709938979807042, sim=RandomSimilarity(queryNorm=true): {}, locale=guz, timezone=Asia/Jerusalem
   [junit4]   2> NOTE: Windows 10 10.0 amd64/Oracle Corporation 11 (64-bit)/cpus=3,threads=1,free=130143016,total=335544320
   [junit4]   2> NOTE: All tests run in this JVM: [TestSelectiveWeightCreation, TestWrapperModel, TestMultipleAdditiveTreesModel, TestLTRWithFacet, TestExternalFeatures, TestLTRQParserExplain, TestOriginalScoreFeature, TestFilterSolrFeature, TestRankingFeature, TestLTRReRankingPipeline, TestLTRWithSort, TestParallelWeightCreation, TestUserTermScorereQDF, TestValueFeature, TestNeuralNetworkModel, TestModelManagerPersistence]
   [junit4] Completed [37/37 (1!)] on J1 in 3.19s, 4 tests, 1 failure, 3 errors <<< FAILURES!

[...truncated 34509 lines...]
[repro] Jenkins log URL: https://jenkins.thetaphi.de/job/Lucene-Solr-7.x-Windows/799/consoleText

[repro] Revision: a9723cd25298459db6d659a42d1f7b6c6c507139

[repro] Ant options: "-Dargs=-XX:-UseCompressedOops -XX:+UseG1GC"

[repro] ant clean

[...truncated 6 lines...]
[repro] Test suites by module:
[repro]    solr\contrib\ltr
[repro]       TestModelManagerPersistence
[repro] ant compile-test

[...truncated 2719 lines...]
[repro] ant test-nocompile -Dtests.dups=5 -Dtests.maxfailures=5 -Dtests.class="*.TestModelManagerPersistence" -Dtests.showOutput=onerror "-Dargs=-XX:-UseCompressedOops -XX:+UseG1GC" -Dtests.seed=31CEBAF2DEE12C1D -Dtests.slow=true -Dtests.locale=guz -Dtests.timezone=Asia/Jerusalem -Dtests.asserts=true -Dtests.file.encoding=Cp1252

[...truncated 32 lines...]
   [junit4] Suite: org.apache.solr.ltr.store.rest.TestModelManagerPersistence
   [junit4]   2> ERROR StatusLogger No Log4j 2 configuration file found. Using default configuration (logging only errors to the console), or user programmatically provided configurations. Set system property 'log4j2.debug' to show Log4j 2 internal initialization logging. See https://logging.apache.org/log4j/2.x/manual/configuration.html for instructions on how to configure Log4j 2
   [junit4]   2> Creating dataDir: C:\Users\jenkins\workspace\Lucene-Solr-7.x-Windows\solr\build\contrib\solr-ltr\test\J0\temp\solr.ltr.store.rest.TestModelManagerPersistence_31CEBAF2DEE12C1D-001\init-core-data-001
   [junit4]   1> 10:16:21.288 [SUITE-TestModelManagerPersistence-seed#[31CEBAF2DEE12C1D]-worker] ERROR org.apache.solr.util.StartupLoggingUtils - Missing Java Option solr.log.dir. Logging may be missing or incomplete.
   [junit4]   2> Sep 23, 2018 1:16:23 MOG org.restlet.Application start
   [junit4]   2> INFO: Starting org.apache.solr.rest.SolrSchemaRestApi application
   [junit4]   2> Sep 23, 2018 1:16:23 MOG org.restlet.engine.log.LogFilter afterHandle
   [junit4]   2> INFO: 2018-09-23	13:16:23	127.0.0.1	-	127.0.0.1	53789	GET	/solr/schema/model-store	wt=json&indent=on	200	-	0	82	https://127.0.0.1:53789	Apache-HttpClient/4.5.3 (Java/11)	-
   [junit4]   2> Sep 23, 2018 1:16:23 MOG org.restlet.engine.log.LogFilter afterHandle
   [junit4]   2> INFO: 2018-09-23	13:16:23	127.0.0.1	-	127.0.0.1	53789	GET	/solr/schema/feature-store/testWrapper	wt=json&indent=on	200	-	0	2	https://127.0.0.1:53789	Apache-HttpClient/4.5.3 (Java/11)	-
   [junit4]   2> Sep 23, 2018 1:16:23 MOG org.restlet.engine.log.LogFilter afterHandle
   [junit4]   2> INFO: 2018-09-23	13:16:23	127.0.0.1	-	127.0.0.1	53789	PUT	/solr/schema/feature-store	wt=json&indent=on	200	-	137	11	https://127.0.0.1:53789	Apache-HttpClient/4.5.3 (Java/11)	-
   [junit4]   2> Sep 23, 2018 1:16:23 MOG org.restlet.engine.log.LogFilter afterHandle
   [junit4]   2> INFO: 2018-09-23	13:16:23	127.0.0.1	-	127.0.0.1	53789	PUT	/solr/schema/feature-store	wt=json&indent=on	200	-	116	7	https://127.0.0.1:53789	Apache-HttpClient/4.5.3 (Java/11)	-
   [junit4]   2> Sep 23, 2018 1:16:23 MOG org.restlet.engine.log.LogFilter afterHandle
   [junit4]   2> INFO: 2018-09-23	13:16:23	127.0.0.1	-	127.0.0.1	53789	PUT	/solr/schema/model-store	wt=json&indent=on	200	-	171	20	https://127.0.0.1:53789	Apache-HttpClient/4.5.3 (Java/11)	-
   [junit4]   2> Sep 23, 2018 1:16:23 MOG org.restlet.engine.log.LogFilter afterHandle
   [junit4]   2> INFO: 2018-09-23	13:16:23	127.0.0.1	-	127.0.0.1	53789	GET	/solr/schema/model-store	wt=json&indent=on	200	-	0	1	https://127.0.0.1:53789	Apache-HttpClient/4.5.3 (Java/11)	-
   [junit4]   2> Sep 23, 2018 1:16:24 MOG org.restlet.engine.log.LogFilter afterHandle
   [junit4]   2> INFO: 2018-09-23	13:16:24	127.0.0.1	-	127.0.0.1	53789	GET	/solr/schema/model-store	wt=json&indent=on	200	-	0	4	https://127.0.0.1:53789	Apache-HttpClient/4.5.3 (Java/11)	-
   [junit4]   1> 10:16:24.399 [TEST-TestModelManagerPersistence.testWrapperModelPersistence-seed#[31CEBAF2DEE12C1D]] ERROR org.apache.solr.util.StartupLoggingUtils - Missing Java Option solr.log.dir. Logging may be missing or incomplete.
   [junit4]   1> 10:16:25.063 [TEST-TestModelManagerPersistence.testWrapperModelPersistence-seed#[31CEBAF2DEE12C1D]] ERROR org.apache.solr.util.RestTestBase - REQUEST FAILED: /schema/model-store?wt=json&indent=on
   [junit4]   2> NOTE: reproduce with: ant test  -Dtestcase=TestModelManagerPersistence -Dtests.method=testWrapperModelPersistence -Dtests.seed=31CEBAF2DEE12C1D -Dtests.slow=true -Dtests.badapples=true -Dtests.locale=guz -Dtests.timezone=Asia/Jerusalem -Dtests.asserts=true -Dtests.file.encoding=Cp1252
   [junit4] ERROR   1.51s J0 | TestModelManagerPersistence.testWrapperModelPersistence <<<
   [junit4]    > Throwable #1: javax.net.ssl.SSLProtocolException: Software caused connection abort: recv failed
   [junit4]    > 	at __randomizedtesting.SeedInfo.seed([31CEBAF2DEE12C1D:44A4C92C611D5558]:0)
   [junit4]    > 	at java.base/sun.security.ssl.Alert.createSSLException(Alert.java:126)
   [junit4]    > 	at java.base/sun.security.ssl.TransportContext.fatal(TransportContext.java:321)
   [junit4]    > 	at java.base/sun.security.ssl.TransportContext.fatal(TransportContext.java:264)
   [junit4]    > 	at java.base/sun.security.ssl.TransportContext.fatal(TransportContext.java:259)
   [junit4]    > 	at java.base/sun.security.ssl.SSLSocketImpl.handleException(SSLSocketImpl.java:1314)
   [junit4]    > 	at java.base/sun.security.ssl.SSLSocketImpl$AppInputStream.read(SSLSocketImpl.java:839)
   [junit4]    > 	at org.apache.http.impl.io.SessionInputBufferImpl.streamRead(SessionInputBufferImpl.java:137)
   [junit4]    > 	at org.apache.http.impl.io.SessionInputBufferImpl.fillBuffer(SessionInputBufferImpl.java:153)
   [junit4]    > 	at org.apache.http.impl.io.SessionInputBufferImpl.readLine(SessionInputBufferImpl.java:282)
   [junit4]    > 	at org.apache.http.impl.conn.DefaultHttpResponseParser.parseHead(DefaultHttpResponseParser.java:138)
   [junit4]    > 	at org.apache.http.impl.conn.DefaultHttpResponseParser.parseHead(DefaultHttpResponseParser.java:56)
   [junit4]    > 	at org.apache.http.impl.io.AbstractMessageParser.parse(AbstractMessageParser.java:259)
   [junit4]    > 	at org.apache.http.impl.DefaultBHttpClientConnection.receiveResponseHeader(DefaultBHttpClientConnection.java:163)
   [junit4]    > 	at org.apache.http.impl.conn.CPoolProxy.receiveResponseHeader(CPoolProxy.java:165)
   [junit4]    > 	at org.apache.http.protocol.HttpRequestExecutor.doReceiveResponse(HttpRequestExecutor.java:273)
   [junit4]    > 	at org.apache.http.protocol.HttpRequestExecutor.execute(HttpRequestExecutor.java:125)
   [junit4]    > 	at org.apache.http.impl.execchain.MainClientExec.execute(MainClientExec.java:272)
   [junit4]    > 	at org.apache.http.impl.execchain.ProtocolExec.execute(ProtocolExec.java:185)
   [junit4]    > 	at org.apache.http.impl.execchain.RetryExec.execute(RetryExec.java:89)
   [junit4]    > 	at org.apache.http.impl.execchain.RedirectExec.execute(RedirectExec.java:111)
   [junit4]    > 	at org.apache.http.impl.client.InternalHttpClient.doExecute(InternalHttpClient.java:185)
   [junit4]    > 	at org.apache.http.impl.client.CloseableHttpClient.execute(CloseableHttpClient.java:83)
   [junit4]    > 	at org.apache.solr.util.RestTestHarness.getResponse(RestTestHarness.java:215)
   [junit4]    > 	at org.apache.solr.util.RestTestHarness.query(RestTestHarness.java:107)
   [junit4]    > 	at org.apache.solr.util.RestTestBase.assertJQ(RestTestBase.java:226)
   [junit4]    > 	at org.apache.solr.util.RestTestBase.assertJQ(RestTestBase.java:192)
   [junit4]    > 	at org.apache.solr.ltr.store.rest.TestModelManagerPersistence.doWrapperModelPersistenceChecks(TestModelManagerPersistence.java:202)
   [junit4]    > 	at org.apache.solr.ltr.store.rest.TestModelManagerPersistence.testWrapperModelPersistence(TestModelManagerPersistence.java:255)
   [junit4]    > 	at java.base/jdk.internal.reflect.NativeMethodAccessorImpl.invoke0(Native Method)
   [junit4]    > 	at java.base/jdk.internal.reflect.NativeMethodAccessorImpl.invoke(NativeMethodAccessorImpl.java:62)
   [junit4]    > 	at java.base/jdk.internal.reflect.DelegatingMethodAccessorImpl.invoke(DelegatingMethodAccessorImpl.java:43)
   [junit4]    > 	at java.base/java.lang.reflect.Method.invoke(Method.java:566)
   [junit4]    > 	at java.base/java.lang.Thread.run(Thread.java:834)
   [junit4]    > Caused by: java.net.SocketException: Software caused connection abort: recv failed
   [junit4]    > 	at java.base/java.net.SocketInputStream.socketRead0(Native Method)
   [junit4]    > 	at java.base/java.net.SocketInputStream.socketRead(SocketInputStream.java:115)
   [junit4]    > 	at java.base/java.net.SocketInputStream.read(SocketInputStream.java:168)
   [junit4]    > 	at java.base/java.net.SocketInputStream.read(SocketInputStream.java:140)
   [junit4]    > 	at java.base/sun.security.ssl.SSLSocketInputRecord.read(SSLSocketInputRecord.java:448)
   [junit4]    > 	at java.base/sun.security.ssl.SSLSocketInputRecord.bytesInCompletePacket(SSLSocketInputRecord.java:68)
   [junit4]    > 	at java.base/sun.security.ssl.SSLSocketImpl.readApplicationRecord(SSLSocketImpl.java:1104)
   [junit4]    > 	at java.base/sun.security.ssl.SSLSocketImpl$AppInputStream.read(SSLSocketImpl.java:823)
   [junit4]    > 	... 60 more
   [junit4]   2> Sep 23, 2018 1:16:25 MOG org.restlet.Application start
   [junit4]   2> INFO: Starting org.apache.solr.rest.SolrSchemaRestApi application
   [junit4]   2> Sep 23, 2018 1:16:25 MOG org.restlet.engine.log.LogFilter afterHandle
   [junit4]   2> INFO: 2018-09-23	13:16:25	127.0.0.1	-	127.0.0.1	53789	PUT	/solr/schema/feature-store	wt=json&indent=on	200	-	116	4	https://127.0.0.1:53789	Apache-HttpClient/4.5.3 (Java/11)	-
   [junit4]   2> Sep 23, 2018 1:16:25 MOG org.restlet.engine.log.LogFilter afterHandle
   [junit4]   2> INFO: 2018-09-23	13:16:25	127.0.0.1	-	127.0.0.1	53789	GET	/solr/schema/feature-store/test42	wt=json&indent=on	200	-	0	1	https://127.0.0.1:53789	Apache-HttpClient/4.5.3 (Java/11)	-
   [junit4]   2> Sep 23, 2018 1:16:25 MOG org.restlet.engine.log.LogFilter afterHandle
   [junit4]   2> INFO: 2018-09-23	13:16:25	127.0.0.1	-	127.0.0.1	53789	PUT	/solr/schema/model-store	wt=json&indent=on	200	-	206	6	https://127.0.0.1:53789	Apache-HttpClient/4.5.3 (Java/11)	-
   [junit4]   2> Sep 23, 2018 1:16:25 MOG org.restlet.engine.log.LogFilter afterHandle
   [junit4]   2> INFO: 2018-09-23	13:16:25	127.0.0.1	-	127.0.0.1	53789	GET	/solr/schema/model-store	wt=json&indent=on	200	-	0	0	https://127.0.0.1:53789	Apache-HttpClient/4.5.3 (Java/11)	-
   [junit4]   1> 10:16:25.154 [TEST-TestModelManagerPersistence.testInnerCustomClassesPersistence-seed#[31CEBAF2DEE12C1D]] ERROR org.apache.solr.util.RestTestBase - query failed JSON validation. error=mismatch: 'model42'!='linear' @ models/[0]/name
   [junit4]   1>  expected =/models/[0]/name=='model42'
   [junit4]   1>  response = {
   [junit4]   1>   "responseHeader":{
   [junit4]   1>     "status":0,
   [junit4]   1>     "QTime":1},
   [junit4]   1>   "models":[{
   [junit4]   1>       "name":"linear",
   [junit4]   1>       "class":"org.apache.solr.ltr.model.DefaultWrapperModel",
   [junit4]   1>       "store":"testWrapper",
   [junit4]   1>       "features":[],
   [junit4]   1>       "params":{"resource":"baseModelForPersistence.json"}},
   [junit4]   1>     {
   [junit4]   1>       "name":"model42",
   [junit4]   1>       "class":"org.apache.solr.ltr.store.rest.TestModelManagerPersistence$DummyCustomModel",
   [junit4]   1>       "store":"test42",
   [junit4]   1>       "features":[{
   [junit4]   1>       

[...truncated too long message...]

3807	GET	/solr/schema/model-store	wt=json&indent=on	200	-	0	1	https://127.0.0.1:53807	Apache-HttpClient/4.5.3 (Java/11)	-
   [junit4]   2> Sep 23, 2018 1:16:30 MOG org.restlet.engine.log.LogFilter afterHandle
   [junit4]   2> INFO: 2018-09-23	13:16:30	127.0.0.1	-	127.0.0.1	53807	GET	/solr/schema/model-store	wt=json&indent=on	200	-	0	0	https://127.0.0.1:53807	Apache-HttpClient/4.5.3 (Java/11)	-
   [junit4]   1> 10:16:30.665 [TEST-TestModelManagerPersistence.testWrapperModelPersistence-seed#[31CEBAF2DEE12C1D]] ERROR org.apache.solr.util.StartupLoggingUtils - Missing Java Option solr.log.dir. Logging may be missing or incomplete.
   [junit4]   1> 10:16:31.573 [TEST-TestModelManagerPersistence.testWrapperModelPersistence-seed#[31CEBAF2DEE12C1D]] ERROR org.apache.solr.util.RestTestBase - REQUEST FAILED: /schema/model-store?wt=json&indent=on
   [junit4]   2> NOTE: reproduce with: ant test  -Dtestcase=TestModelManagerPersistence -Dtests.method=testWrapperModelPersistence -Dtests.seed=31CEBAF2DEE12C1D -Dtests.slow=true -Dtests.badapples=true -Dtests.locale=guz -Dtests.timezone=Asia/Jerusalem -Dtests.asserts=true -Dtests.file.encoding=Cp1252
   [junit4] ERROR   1.92s J1 | TestModelManagerPersistence.testWrapperModelPersistence <<<
   [junit4]    > Throwable #1: javax.net.ssl.SSLProtocolException: Software caused connection abort: recv failed
   [junit4]    > 	at __randomizedtesting.SeedInfo.seed([31CEBAF2DEE12C1D:44A4C92C611D5558]:0)
   [junit4]    > 	at java.base/sun.security.ssl.Alert.createSSLException(Alert.java:126)
   [junit4]    > 	at java.base/sun.security.ssl.TransportContext.fatal(TransportContext.java:321)
   [junit4]    > 	at java.base/sun.security.ssl.TransportContext.fatal(TransportContext.java:264)
   [junit4]    > 	at java.base/sun.security.ssl.TransportContext.fatal(TransportContext.java:259)
   [junit4]    > 	at java.base/sun.security.ssl.SSLSocketImpl.handleException(SSLSocketImpl.java:1314)
   [junit4]    > 	at java.base/sun.security.ssl.SSLSocketImpl$AppInputStream.read(SSLSocketImpl.java:839)
   [junit4]    > 	at org.apache.http.impl.io.SessionInputBufferImpl.streamRead(SessionInputBufferImpl.java:137)
   [junit4]    > 	at org.apache.http.impl.io.SessionInputBufferImpl.fillBuffer(SessionInputBufferImpl.java:153)
   [junit4]    > 	at org.apache.http.impl.io.SessionInputBufferImpl.readLine(SessionInputBufferImpl.java:282)
   [junit4]    > 	at org.apache.http.impl.conn.DefaultHttpResponseParser.parseHead(DefaultHttpResponseParser.java:138)
   [junit4]    > 	at org.apache.http.impl.conn.DefaultHttpResponseParser.parseHead(DefaultHttpResponseParser.java:56)
   [junit4]    > 	at org.apache.http.impl.io.AbstractMessageParser.parse(AbstractMessageParser.java:259)
   [junit4]    > 	at org.apache.http.impl.DefaultBHttpClientConnection.receiveResponseHeader(DefaultBHttpClientConnection.java:163)
   [junit4]    > 	at org.apache.http.impl.conn.CPoolProxy.receiveResponseHeader(CPoolProxy.java:165)
   [junit4]    > 	at org.apache.http.protocol.HttpRequestExecutor.doReceiveResponse(HttpRequestExecutor.java:273)
   [junit4]    > 	at org.apache.http.protocol.HttpRequestExecutor.execute(HttpRequestExecutor.java:125)
   [junit4]    > 	at org.apache.http.impl.execchain.MainClientExec.execute(MainClientExec.java:272)
   [junit4]    > 	at org.apache.http.impl.execchain.ProtocolExec.execute(ProtocolExec.java:185)
   [junit4]    > 	at org.apache.http.impl.execchain.RetryExec.execute(RetryExec.java:89)
   [junit4]    > 	at org.apache.http.impl.execchain.RedirectExec.execute(RedirectExec.java:111)
   [junit4]    > 	at org.apache.http.impl.client.InternalHttpClient.doExecute(InternalHttpClient.java:185)
   [junit4]    > 	at org.apache.http.impl.client.CloseableHttpClient.execute(CloseableHttpClient.java:83)
   [junit4]    > 	at org.apache.solr.util.RestTestHarness.getResponse(RestTestHarness.java:215)
   [junit4]    > 	at org.apache.solr.util.RestTestHarness.query(RestTestHarness.java:107)
   [junit4]    > 	at org.apache.solr.util.RestTestBase.assertJQ(RestTestBase.java:226)
   [junit4]    > 	at org.apache.solr.util.RestTestBase.assertJQ(RestTestBase.java:192)
   [junit4]    > 	at org.apache.solr.ltr.store.rest.TestModelManagerPersistence.doWrapperModelPersistenceChecks(TestModelManagerPersistence.java:202)
   [junit4]    > 	at org.apache.solr.ltr.store.rest.TestModelManagerPersistence.testWrapperModelPersistence(TestModelManagerPersistence.java:255)
   [junit4]    > 	at java.base/jdk.internal.reflect.NativeMethodAccessorImpl.invoke0(Native Method)
   [junit4]    > 	at java.base/jdk.internal.reflect.NativeMethodAccessorImpl.invoke(NativeMethodAccessorImpl.java:62)
   [junit4]    > 	at java.base/jdk.internal.reflect.DelegatingMethodAccessorImpl.invoke(DelegatingMethodAccessorImpl.java:43)
   [junit4]    > 	at java.base/java.lang.reflect.Method.invoke(Method.java:566)
   [junit4]    > 	at java.base/java.lang.Thread.run(Thread.java:834)
   [junit4]    > Caused by: java.net.SocketException: Software caused connection abort: recv failed
   [junit4]    > 	at java.base/java.net.SocketInputStream.socketRead0(Native Method)
   [junit4]    > 	at java.base/java.net.SocketInputStream.socketRead(SocketInputStream.java:115)
   [junit4]    > 	at java.base/java.net.SocketInputStream.read(SocketInputStream.java:168)
   [junit4]    > 	at java.base/java.net.SocketInputStream.read(SocketInputStream.java:140)
   [junit4]    > 	at java.base/sun.security.ssl.SSLSocketInputRecord.read(SSLSocketInputRecord.java:448)
   [junit4]    > 	at java.base/sun.security.ssl.SSLSocketInputRecord.bytesInCompletePacket(SSLSocketInputRecord.java:68)
   [junit4]    > 	at java.base/sun.security.ssl.SSLSocketImpl.readApplicationRecord(SSLSocketImpl.java:1104)
   [junit4]    > 	at java.base/sun.security.ssl.SSLSocketImpl$AppInputStream.read(SSLSocketImpl.java:823)
   [junit4]    > 	... 60 more
   [junit4] IGNOR/A 0.02s J1 | TestModelManagerPersistence.testInnerCustomClassesPersistence
   [junit4]    > Assumption #1: Ignored, failures limit reached (5 >= 5).
   [junit4] IGNOR/A 0.04s J1 | TestModelManagerPersistence.testFeaturePersistence
   [junit4]    > Assumption #1: Ignored, failures limit reached (5 >= 5).
   [junit4] IGNOR/A 0.00s J1 | TestModelManagerPersistence.testFilePersistence
   [junit4]    > Assumption #1: Ignored, failures limit reached (5 >= 5).
   [junit4]   2> NOTE: leaving temporary files on disk at: C:\Users\jenkins\workspace\Lucene-Solr-7.x-Windows\solr\build\contrib\solr-ltr\test\J1\temp\solr.ltr.store.rest.TestModelManagerPersistence_31CEBAF2DEE12C1D-002
   [junit4]   2> NOTE: test params are: codec=Asserting(Lucene70): {_version_=PostingsFormat(name=LuceneVarGapDocFreqInterval), popularity=PostingsFormat(name=Memory), description=PostingsFormat(name=MockRandom), id=PostingsFormat(name=Memory), text=PostingsFormat(name=LuceneVarGapFixedInterval), title=PostingsFormat(name=MockRandom)}, docValues:{_version_=DocValuesFormat(name=Direct), popularity=DocValuesFormat(name=Lucene70)}, maxPointsInLeafNode=1588, maxMBSortInHeap=7.709938979807042, sim=RandomSimilarity(queryNorm=true): {}, locale=guz, timezone=Asia/Jerusalem
   [junit4]   2> NOTE: Windows 10 10.0 amd64/Oracle Corporation 11 (64-bit)/cpus=3,threads=1,free=32882920,total=100663296
   [junit4]   2> NOTE: All tests run in this JVM: [TestModelManagerPersistence, TestModelManagerPersistence]
   [junit4] Completed [5/5 (4!)] on J1 in 3.98s, 4 tests, 1 error, 3 skipped <<< FAILURES!

[...truncated 19 lines...]
BUILD FAILED
C:\Users\jenkins\workspace\Lucene-Solr-7.x-Windows\lucene\common-build.xml:1567: The following error occurred while executing this line:
C:\Users\jenkins\workspace\Lucene-Solr-7.x-Windows\lucene\common-build.xml:1092: There were test failures: 5 suites, 20 tests, 8 errors, 2 failures, 10 ignored (6 assumptions) [seed: 31CEBAF2DEE12C1D]

Total time: 27 seconds

[repro] Setting last failure code to 1

[repro] Failures:
[repro]   4/5 failed: org.apache.solr.ltr.store.rest.TestModelManagerPersistence
[repro] Exiting with code 1

C:\Users\jenkins\workspace\Lucene-Solr-7.x-Windows>IF EXIST lucene\build move /y lucene\build lucene\build.repro 
        1 dir(s) moved.

C:\Users\jenkins\workspace\Lucene-Solr-7.x-Windows>IF EXIST solr\build move /y solr\build solr\build.repro 
        1 dir(s) moved.

C:\Users\jenkins\workspace\Lucene-Solr-7.x-Windows>IF EXIST lucene\build.orig move /y lucene\build.orig lucene\build 
        1 dir(s) moved.

C:\Users\jenkins\workspace\Lucene-Solr-7.x-Windows>IF EXIST solr\build.orig move /y solr\build.orig solr\build 
        1 dir(s) moved.

C:\Users\jenkins\workspace\Lucene-Solr-7.x-Windows>exit 0 
Archiving artifacts
Setting ANT_1_8_2_HOME=C:\Users\jenkins\tools\hudson.tasks.Ant_AntInstallation\ANT_1.8.2
[WARNINGS] Parsing warnings in console log with parser Java Compiler (javac)
Setting ANT_1_8_2_HOME=C:\Users\jenkins\tools\hudson.tasks.Ant_AntInstallation\ANT_1.8.2
Setting ANT_1_8_2_HOME=C:\Users\jenkins\tools\hudson.tasks.Ant_AntInstallation\ANT_1.8.2
<Git Blamer> Using GitBlamer to create author and commit information for all warnings.
<Git Blamer> GIT_COMMIT=a9723cd25298459db6d659a42d1f7b6c6c507139, workspace=C:\Users\jenkins\workspace\Lucene-Solr-7.x-Windows
[WARNINGS] Computing warning deltas based on reference build #798
Recording test results
Setting ANT_1_8_2_HOME=C:\Users\jenkins\tools\hudson.tasks.Ant_AntInstallation\ANT_1.8.2
Build step 'Publish JUnit test result report' changed build result to UNSTABLE
Email was triggered for: Unstable (Test Failures)
Sending email for trigger: Unstable (Test Failures)
Setting ANT_1_8_2_HOME=C:\Users\jenkins\tools\hudson.tasks.Ant_AntInstallation\ANT_1.8.2
Setting ANT_1_8_2_HOME=C:\Users\jenkins\tools\hudson.tasks.Ant_AntInstallation\ANT_1.8.2
Setting ANT_1_8_2_HOME=C:\Users\jenkins\tools\hudson.tasks.Ant_AntInstallation\ANT_1.8.2
Setting ANT_1_8_2_HOME=C:\Users\jenkins\tools\hudson.tasks.Ant_AntInstallation\ANT_1.8.2

Mime
View raw message