lucene-dev mailing list archives

Site index · List index
Message view « Date » · « Thread »
Top « Date » · « Thread »
From Apache Jenkins Server <jenk...@builds.apache.org>
Subject [JENKINS] Lucene-Solr-NightlyTests-7.x - Build # 309 - Still Unstable
Date Tue, 04 Sep 2018 03:55:24 GMT
Build: https://builds.apache.org/job/Lucene-Solr-NightlyTests-7.x/309/

2 tests failed.
FAILED:  junit.framework.TestSuite.org.apache.solr.cloud.BasicDistributedZkTest

Error Message:
ObjectTracker found 2 object(s) that were not released!!! [RawDirectoryWrapper, RawDirectoryWrapper] org.apache.solr.common.util.ObjectReleaseTracker$ObjectTrackerException: org.apache.lucene.store.RawDirectoryWrapper  at org.apache.solr.common.util.ObjectReleaseTracker.track(ObjectReleaseTracker.java:42)  at org.apache.solr.core.CachingDirectoryFactory.get(CachingDirectoryFactory.java:348)  at org.apache.solr.handler.IndexFetcher.fetchLatestIndex(IndexFetcher.java:504)  at org.apache.solr.handler.IndexFetcher.fetchLatestIndex(IndexFetcher.java:347)  at org.apache.solr.handler.ReplicationHandler.doFetch(ReplicationHandler.java:421)  at org.apache.solr.handler.ReplicationHandler.lambda$setupPolling$13(ReplicationHandler.java:1156)  at java.util.concurrent.Executors$RunnableAdapter.call(Executors.java:511)  at java.util.concurrent.FutureTask.runAndReset(FutureTask.java:308)  at java.util.concurrent.ScheduledThreadPoolExecutor$ScheduledFutureTask.access$301(ScheduledThreadPoolExecutor.java:180)  at java.util.concurrent.ScheduledThreadPoolExecutor$ScheduledFutureTask.run(ScheduledThreadPoolExecutor.java:294)  at java.util.concurrent.ThreadPoolExecutor.runWorker(ThreadPoolExecutor.java:1149)  at java.util.concurrent.ThreadPoolExecutor$Worker.run(ThreadPoolExecutor.java:624)  at java.lang.Thread.run(Thread.java:748)  org.apache.solr.common.util.ObjectReleaseTracker$ObjectTrackerException: org.apache.lucene.store.RawDirectoryWrapper  at org.apache.solr.common.util.ObjectReleaseTracker.track(ObjectReleaseTracker.java:42)  at org.apache.solr.core.CachingDirectoryFactory.get(CachingDirectoryFactory.java:348)  at org.apache.solr.handler.IndexFetcher.fetchLatestIndex(IndexFetcher.java:504)  at org.apache.solr.handler.IndexFetcher.fetchLatestIndex(IndexFetcher.java:347)  at org.apache.solr.handler.ReplicationHandler.doFetch(ReplicationHandler.java:421)  at org.apache.solr.handler.ReplicationHandler.lambda$setupPolling$13(ReplicationHandler.java:1156)  at java.util.concurrent.Executors$RunnableAdapter.call(Executors.java:511)  at java.util.concurrent.FutureTask.runAndReset(FutureTask.java:308)  at java.util.concurrent.ScheduledThreadPoolExecutor$ScheduledFutureTask.access$301(ScheduledThreadPoolExecutor.java:180)  at java.util.concurrent.ScheduledThreadPoolExecutor$ScheduledFutureTask.run(ScheduledThreadPoolExecutor.java:294)  at java.util.concurrent.ThreadPoolExecutor.runWorker(ThreadPoolExecutor.java:1149)  at java.util.concurrent.ThreadPoolExecutor$Worker.run(ThreadPoolExecutor.java:624)  at java.lang.Thread.run(Thread.java:748)  

Stack Trace:
java.lang.AssertionError: ObjectTracker found 2 object(s) that were not released!!! [RawDirectoryWrapper, RawDirectoryWrapper]
org.apache.solr.common.util.ObjectReleaseTracker$ObjectTrackerException: org.apache.lucene.store.RawDirectoryWrapper
	at org.apache.solr.common.util.ObjectReleaseTracker.track(ObjectReleaseTracker.java:42)
	at org.apache.solr.core.CachingDirectoryFactory.get(CachingDirectoryFactory.java:348)
	at org.apache.solr.handler.IndexFetcher.fetchLatestIndex(IndexFetcher.java:504)
	at org.apache.solr.handler.IndexFetcher.fetchLatestIndex(IndexFetcher.java:347)
	at org.apache.solr.handler.ReplicationHandler.doFetch(ReplicationHandler.java:421)
	at org.apache.solr.handler.ReplicationHandler.lambda$setupPolling$13(ReplicationHandler.java:1156)
	at java.util.concurrent.Executors$RunnableAdapter.call(Executors.java:511)
	at java.util.concurrent.FutureTask.runAndReset(FutureTask.java:308)
	at java.util.concurrent.ScheduledThreadPoolExecutor$ScheduledFutureTask.access$301(ScheduledThreadPoolExecutor.java:180)
	at java.util.concurrent.ScheduledThreadPoolExecutor$ScheduledFutureTask.run(ScheduledThreadPoolExecutor.java:294)
	at java.util.concurrent.ThreadPoolExecutor.runWorker(ThreadPoolExecutor.java:1149)
	at java.util.concurrent.ThreadPoolExecutor$Worker.run(ThreadPoolExecutor.java:624)
	at java.lang.Thread.run(Thread.java:748)

org.apache.solr.common.util.ObjectReleaseTracker$ObjectTrackerException: org.apache.lucene.store.RawDirectoryWrapper
	at org.apache.solr.common.util.ObjectReleaseTracker.track(ObjectReleaseTracker.java:42)
	at org.apache.solr.core.CachingDirectoryFactory.get(CachingDirectoryFactory.java:348)
	at org.apache.solr.handler.IndexFetcher.fetchLatestIndex(IndexFetcher.java:504)
	at org.apache.solr.handler.IndexFetcher.fetchLatestIndex(IndexFetcher.java:347)
	at org.apache.solr.handler.ReplicationHandler.doFetch(ReplicationHandler.java:421)
	at org.apache.solr.handler.ReplicationHandler.lambda$setupPolling$13(ReplicationHandler.java:1156)
	at java.util.concurrent.Executors$RunnableAdapter.call(Executors.java:511)
	at java.util.concurrent.FutureTask.runAndReset(FutureTask.java:308)
	at java.util.concurrent.ScheduledThreadPoolExecutor$ScheduledFutureTask.access$301(ScheduledThreadPoolExecutor.java:180)
	at java.util.concurrent.ScheduledThreadPoolExecutor$ScheduledFutureTask.run(ScheduledThreadPoolExecutor.java:294)
	at java.util.concurrent.ThreadPoolExecutor.runWorker(ThreadPoolExecutor.java:1149)
	at java.util.concurrent.ThreadPoolExecutor$Worker.run(ThreadPoolExecutor.java:624)
	at java.lang.Thread.run(Thread.java:748)


	at __randomizedtesting.SeedInfo.seed([6DBC95514E2684D]:0)
	at org.junit.Assert.fail(Assert.java:93)
	at org.junit.Assert.assertTrue(Assert.java:43)
	at org.junit.Assert.assertNull(Assert.java:551)
	at org.apache.solr.SolrTestCaseJ4.teardownTestCases(SolrTestCaseJ4.java:304)
	at sun.reflect.GeneratedMethodAccessor56.invoke(Unknown Source)
	at sun.reflect.DelegatingMethodAccessorImpl.invoke(DelegatingMethodAccessorImpl.java:43)
	at java.lang.reflect.Method.invoke(Method.java:498)
	at com.carrotsearch.randomizedtesting.RandomizedRunner.invoke(RandomizedRunner.java:1737)
	at com.carrotsearch.randomizedtesting.RandomizedRunner$7.evaluate(RandomizedRunner.java:897)
	at com.carrotsearch.randomizedtesting.rules.StatementAdapter.evaluate(StatementAdapter.java:36)
	at com.carrotsearch.randomizedtesting.rules.SystemPropertiesRestoreRule$1.evaluate(SystemPropertiesRestoreRule.java:57)
	at org.apache.lucene.util.AbstractBeforeAfterRule$1.evaluate(AbstractBeforeAfterRule.java:45)
	at com.carrotsearch.randomizedtesting.rules.StatementAdapter.evaluate(StatementAdapter.java:36)
	at org.apache.lucene.util.TestRuleStoreClassName$1.evaluate(TestRuleStoreClassName.java:41)
	at com.carrotsearch.randomizedtesting.rules.NoShadowingOrOverridesOnMethodsRule$1.evaluate(NoShadowingOrOverridesOnMethodsRule.java:40)
	at com.carrotsearch.randomizedtesting.rules.NoShadowingOrOverridesOnMethodsRule$1.evaluate(NoShadowingOrOverridesOnMethodsRule.java:40)
	at com.carrotsearch.randomizedtesting.rules.StatementAdapter.evaluate(StatementAdapter.java:36)
	at com.carrotsearch.randomizedtesting.rules.StatementAdapter.evaluate(StatementAdapter.java:36)
	at com.carrotsearch.randomizedtesting.rules.StatementAdapter.evaluate(StatementAdapter.java:36)
	at org.apache.lucene.util.TestRuleAssertionsRequired$1.evaluate(TestRuleAssertionsRequired.java:53)
	at org.apache.lucene.util.TestRuleMarkFailure$1.evaluate(TestRuleMarkFailure.java:47)
	at org.apache.lucene.util.TestRuleIgnoreAfterMaxFailures$1.evaluate(TestRuleIgnoreAfterMaxFailures.java:64)
	at org.apache.lucene.util.TestRuleIgnoreTestSuites$1.evaluate(TestRuleIgnoreTestSuites.java:54)
	at com.carrotsearch.randomizedtesting.rules.StatementAdapter.evaluate(StatementAdapter.java:36)
	at com.carrotsearch.randomizedtesting.ThreadLeakControl$StatementRunner.run(ThreadLeakControl.java:368)
	at java.lang.Thread.run(Thread.java:748)


FAILED:  org.apache.solr.logging.TestLogWatcher.testLog4jWatcher

Error Message:
expected:<-1> but was:<1536030778982>

Stack Trace:
java.lang.AssertionError: expected:<-1> but was:<1536030778982>
	at __randomizedtesting.SeedInfo.seed([6DBC95514E2684D:FB409915EDEAD743]:0)
	at org.junit.Assert.fail(Assert.java:93)
	at org.junit.Assert.failNotEquals(Assert.java:647)
	at org.junit.Assert.assertEquals(Assert.java:128)
	at org.junit.Assert.assertEquals(Assert.java:472)
	at org.junit.Assert.assertEquals(Assert.java:456)
	at org.apache.solr.logging.TestLogWatcher.testLog4jWatcher(TestLogWatcher.java:49)
	at sun.reflect.NativeMethodAccessorImpl.invoke0(Native Method)
	at sun.reflect.NativeMethodAccessorImpl.invoke(NativeMethodAccessorImpl.java:62)
	at sun.reflect.DelegatingMethodAccessorImpl.invoke(DelegatingMethodAccessorImpl.java:43)
	at java.lang.reflect.Method.invoke(Method.java:498)
	at com.carrotsearch.randomizedtesting.RandomizedRunner.invoke(RandomizedRunner.java:1737)
	at com.carrotsearch.randomizedtesting.RandomizedRunner$8.evaluate(RandomizedRunner.java:934)
	at com.carrotsearch.randomizedtesting.RandomizedRunner$9.evaluate(RandomizedRunner.java:970)
	at com.carrotsearch.randomizedtesting.RandomizedRunner$10.evaluate(RandomizedRunner.java:984)
	at com.carrotsearch.randomizedtesting.rules.SystemPropertiesRestoreRule$1.evaluate(SystemPropertiesRestoreRule.java:57)
	at org.apache.lucene.util.TestRuleSetupTeardownChained$1.evaluate(TestRuleSetupTeardownChained.java:49)
	at org.apache.lucene.util.AbstractBeforeAfterRule$1.evaluate(AbstractBeforeAfterRule.java:45)
	at org.apache.lucene.util.TestRuleThreadAndTestName$1.evaluate(TestRuleThreadAndTestName.java:48)
	at org.apache.lucene.util.TestRuleIgnoreAfterMaxFailures$1.evaluate(TestRuleIgnoreAfterMaxFailures.java:64)
	at org.apache.lucene.util.TestRuleMarkFailure$1.evaluate(TestRuleMarkFailure.java:47)
	at com.carrotsearch.randomizedtesting.rules.StatementAdapter.evaluate(StatementAdapter.java:36)
	at com.carrotsearch.randomizedtesting.ThreadLeakControl$StatementRunner.run(ThreadLeakControl.java:368)
	at com.carrotsearch.randomizedtesting.ThreadLeakControl.forkTimeoutingTask(ThreadLeakControl.java:817)
	at com.carrotsearch.randomizedtesting.ThreadLeakControl$3.evaluate(ThreadLeakControl.java:468)
	at com.carrotsearch.randomizedtesting.RandomizedRunner.runSingleTest(RandomizedRunner.java:943)
	at com.carrotsearch.randomizedtesting.RandomizedRunner$5.evaluate(RandomizedRunner.java:829)
	at com.carrotsearch.randomizedtesting.RandomizedRunner$6.evaluate(RandomizedRunner.java:879)
	at com.carrotsearch.randomizedtesting.RandomizedRunner$7.evaluate(RandomizedRunner.java:890)
	at com.carrotsearch.randomizedtesting.rules.StatementAdapter.evaluate(StatementAdapter.java:36)
	at com.carrotsearch.randomizedtesting.rules.SystemPropertiesRestoreRule$1.evaluate(SystemPropertiesRestoreRule.java:57)
	at org.apache.lucene.util.AbstractBeforeAfterRule$1.evaluate(AbstractBeforeAfterRule.java:45)
	at com.carrotsearch.randomizedtesting.rules.StatementAdapter.evaluate(StatementAdapter.java:36)
	at org.apache.lucene.util.TestRuleStoreClassName$1.evaluate(TestRuleStoreClassName.java:41)
	at com.carrotsearch.randomizedtesting.rules.NoShadowingOrOverridesOnMethodsRule$1.evaluate(NoShadowingOrOverridesOnMethodsRule.java:40)
	at com.carrotsearch.randomizedtesting.rules.NoShadowingOrOverridesOnMethodsRule$1.evaluate(NoShadowingOrOverridesOnMethodsRule.java:40)
	at com.carrotsearch.randomizedtesting.rules.StatementAdapter.evaluate(StatementAdapter.java:36)
	at com.carrotsearch.randomizedtesting.rules.StatementAdapter.evaluate(StatementAdapter.java:36)
	at com.carrotsearch.randomizedtesting.rules.StatementAdapter.evaluate(StatementAdapter.java:36)
	at org.apache.lucene.util.TestRuleAssertionsRequired$1.evaluate(TestRuleAssertionsRequired.java:53)
	at org.apache.lucene.util.TestRuleMarkFailure$1.evaluate(TestRuleMarkFailure.java:47)
	at org.apache.lucene.util.TestRuleIgnoreAfterMaxFailures$1.evaluate(TestRuleIgnoreAfterMaxFailures.java:64)
	at org.apache.lucene.util.TestRuleIgnoreTestSuites$1.evaluate(TestRuleIgnoreTestSuites.java:54)
	at com.carrotsearch.randomizedtesting.rules.StatementAdapter.evaluate(StatementAdapter.java:36)
	at com.carrotsearch.randomizedtesting.ThreadLeakControl$StatementRunner.run(ThreadLeakControl.java:368)
	at java.lang.Thread.run(Thread.java:748)




Build Log:
[...truncated 14700 lines...]
   [junit4] Suite: org.apache.solr.cloud.BasicDistributedZkTest
   [junit4]   2> Creating dataDir: /x1/jenkins/jenkins-slave/workspace/Lucene-Solr-NightlyTests-7.x/checkout/solr/build/solr-core/test/J1/temp/solr.cloud.BasicDistributedZkTest_6DBC95514E2684D-001/init-core-data-001
   [junit4]   2> 1738412 WARN  (SUITE-BasicDistributedZkTest-seed#[6DBC95514E2684D]-worker) [    ] o.a.s.SolrTestCaseJ4 startTrackingSearchers: numOpens=1 numCloses=1
   [junit4]   2> 1738413 INFO  (SUITE-BasicDistributedZkTest-seed#[6DBC95514E2684D]-worker) [    ] o.a.s.SolrTestCaseJ4 Using PointFields (NUMERIC_POINTS_SYSPROP=true) w/NUMERIC_DOCVALUES_SYSPROP=true
   [junit4]   2> 1738415 INFO  (SUITE-BasicDistributedZkTest-seed#[6DBC95514E2684D]-worker) [    ] o.a.s.SolrTestCaseJ4 Randomized ssl (false) and clientAuth (false) via: @org.apache.solr.SolrTestCaseJ4$SuppressSSL(bugUrl=https://issues.apache.org/jira/browse/SOLR-5776)
   [junit4]   2> 1738415 INFO  (SUITE-BasicDistributedZkTest-seed#[6DBC95514E2684D]-worker) [    ] o.a.s.SolrTestCaseJ4 SecureRandom sanity checks: test.solr.allowed.securerandom=null & java.security.egd=file:/dev/./urandom
   [junit4]   2> 1738416 INFO  (SUITE-BasicDistributedZkTest-seed#[6DBC95514E2684D]-worker) [    ] o.a.s.BaseDistributedSearchTestCase Setting hostContext system property: /
   [junit4]   2> 1738419 INFO  (TEST-BasicDistributedZkTest.test-seed#[6DBC95514E2684D]) [    ] o.a.s.c.ZkTestServer STARTING ZK TEST SERVER
   [junit4]   2> 1738419 INFO  (Thread-3235) [    ] o.a.s.c.ZkTestServer client port:0.0.0.0/0.0.0.0:0
   [junit4]   2> 1738419 INFO  (Thread-3235) [    ] o.a.s.c.ZkTestServer Starting server
   [junit4]   2> 1738421 ERROR (Thread-3235) [    ] o.a.z.s.ZooKeeperServer ZKShutdownHandler is not registered, so ZooKeeper server won't take any action on ERROR or SHUTDOWN server state changes
   [junit4]   2> 1738519 INFO  (TEST-BasicDistributedZkTest.test-seed#[6DBC95514E2684D]) [    ] o.a.s.c.ZkTestServer start zk server on port:33405
   [junit4]   2> 1738522 INFO  (zkConnectionManagerCallback-3536-thread-1) [    ] o.a.s.c.c.ConnectionManager zkClient has connected
   [junit4]   2> 1738524 INFO  (zkConnectionManagerCallback-3538-thread-1) [    ] o.a.s.c.c.ConnectionManager zkClient has connected
   [junit4]   2> 1738528 INFO  (TEST-BasicDistributedZkTest.test-seed#[6DBC95514E2684D]) [    ] o.a.s.c.AbstractZkTestCase put /x1/jenkins/jenkins-slave/workspace/Lucene-Solr-NightlyTests-7.x/checkout/solr/core/src/test-files/solr/collection1/conf/solrconfig-tlog.xml to /configs/conf1/solrconfig.xml
   [junit4]   2> 1738530 INFO  (TEST-BasicDistributedZkTest.test-seed#[6DBC95514E2684D]) [    ] o.a.s.c.AbstractZkTestCase put /x1/jenkins/jenkins-slave/workspace/Lucene-Solr-NightlyTests-7.x/checkout/solr/core/src/test-files/solr/collection1/conf/schema.xml to /configs/conf1/schema.xml
   [junit4]   2> 1738531 INFO  (TEST-BasicDistributedZkTest.test-seed#[6DBC95514E2684D]) [    ] o.a.s.c.AbstractZkTestCase put /x1/jenkins/jenkins-slave/workspace/Lucene-Solr-NightlyTests-7.x/checkout/solr/core/src/test-files/solr/collection1/conf/solrconfig.snippet.randomindexconfig.xml to /configs/conf1/solrconfig.snippet.randomindexconfig.xml
   [junit4]   2> 1738532 INFO  (TEST-BasicDistributedZkTest.test-seed#[6DBC95514E2684D]) [    ] o.a.s.c.AbstractZkTestCase put /x1/jenkins/jenkins-slave/workspace/Lucene-Solr-NightlyTests-7.x/checkout/solr/core/src/test-files/solr/collection1/conf/stopwords.txt to /configs/conf1/stopwords.txt
   [junit4]   2> 1738533 INFO  (TEST-BasicDistributedZkTest.test-seed#[6DBC95514E2684D]) [    ] o.a.s.c.AbstractZkTestCase put /x1/jenkins/jenkins-slave/workspace/Lucene-Solr-NightlyTests-7.x/checkout/solr/core/src/test-files/solr/collection1/conf/protwords.txt to /configs/conf1/protwords.txt
   [junit4]   2> 1738533 INFO  (TEST-BasicDistributedZkTest.test-seed#[6DBC95514E2684D]) [    ] o.a.s.c.AbstractZkTestCase put /x1/jenkins/jenkins-slave/workspace/Lucene-Solr-NightlyTests-7.x/checkout/solr/core/src/test-files/solr/collection1/conf/currency.xml to /configs/conf1/currency.xml
   [junit4]   2> 1738534 INFO  (TEST-BasicDistributedZkTest.test-seed#[6DBC95514E2684D]) [    ] o.a.s.c.AbstractZkTestCase put /x1/jenkins/jenkins-slave/workspace/Lucene-Solr-NightlyTests-7.x/checkout/solr/core/src/test-files/solr/collection1/conf/enumsConfig.xml to /configs/conf1/enumsConfig.xml
   [junit4]   2> 1738535 INFO  (TEST-BasicDistributedZkTest.test-seed#[6DBC95514E2684D]) [    ] o.a.s.c.AbstractZkTestCase put /x1/jenkins/jenkins-slave/workspace/Lucene-Solr-NightlyTests-7.x/checkout/solr/core/src/test-files/solr/collection1/conf/open-exchange-rates.json to /configs/conf1/open-exchange-rates.json
   [junit4]   2> 1738536 INFO  (TEST-BasicDistributedZkTest.test-seed#[6DBC95514E2684D]) [    ] o.a.s.c.AbstractZkTestCase put /x1/jenkins/jenkins-slave/workspace/Lucene-Solr-NightlyTests-7.x/checkout/solr/core/src/test-files/solr/collection1/conf/mapping-ISOLatin1Accent.txt to /configs/conf1/mapping-ISOLatin1Accent.txt
   [junit4]   2> 1738537 INFO  (TEST-BasicDistributedZkTest.test-seed#[6DBC95514E2684D]) [    ] o.a.s.c.AbstractZkTestCase put /x1/jenkins/jenkins-slave/workspace/Lucene-Solr-NightlyTests-7.x/checkout/solr/core/src/test-files/solr/collection1/conf/old_synonyms.txt to /configs/conf1/old_synonyms.txt
   [junit4]   2> 1738538 INFO  (TEST-BasicDistributedZkTest.test-seed#[6DBC95514E2684D]) [    ] o.a.s.c.AbstractZkTestCase put /x1/jenkins/jenkins-slave/workspace/Lucene-Solr-NightlyTests-7.x/checkout/solr/core/src/test-files/solr/collection1/conf/synonyms.txt to /configs/conf1/synonyms.txt
   [junit4]   2> 1738539 INFO  (TEST-BasicDistributedZkTest.test-seed#[6DBC95514E2684D]) [    ] o.a.s.c.AbstractFullDistribZkTestBase Will use TLOG replicas unless explicitly asked otherwise
   [junit4]   2> 1738646 INFO  (TEST-BasicDistributedZkTest.test-seed#[6DBC95514E2684D]) [    ] o.e.j.s.Server jetty-9.4.11.v20180605; built: 2018-06-05T18:24:03.829Z; git: d5fc0523cfa96bfebfbda19606cad384d772f04c; jvm 1.8.0_172-b11
   [junit4]   2> 1738649 INFO  (TEST-BasicDistributedZkTest.test-seed#[6DBC95514E2684D]) [    ] o.e.j.s.session DefaultSessionIdManager workerName=node0
   [junit4]   2> 1738649 INFO  (TEST-BasicDistributedZkTest.test-seed#[6DBC95514E2684D]) [    ] o.e.j.s.session No SessionScavenger set, using defaults
   [junit4]   2> 1738649 INFO  (TEST-BasicDistributedZkTest.test-seed#[6DBC95514E2684D]) [    ] o.e.j.s.session node0 Scavenging every 660000ms
   [junit4]   2> 1738649 INFO  (TEST-BasicDistributedZkTest.test-seed#[6DBC95514E2684D]) [    ] o.e.j.s.h.ContextHandler Started o.e.j.s.ServletContextHandler@2e345431{/,null,AVAILABLE}
   [junit4]   2> 1738654 INFO  (TEST-BasicDistributedZkTest.test-seed#[6DBC95514E2684D]) [    ] o.e.j.s.AbstractConnector Started ServerConnector@24c09e7c{HTTP/1.1,[http/1.1]}{127.0.0.1:46672}
   [junit4]   2> 1738654 INFO  (TEST-BasicDistributedZkTest.test-seed#[6DBC95514E2684D]) [    ] o.e.j.s.Server Started @1738704ms
   [junit4]   2> 1738654 INFO  (TEST-BasicDistributedZkTest.test-seed#[6DBC95514E2684D]) [    ] o.a.s.c.s.e.JettySolrRunner Jetty properties: {solr.data.dir=/x1/jenkins/jenkins-slave/workspace/Lucene-Solr-NightlyTests-7.x/checkout/solr/build/solr-core/test/J1/temp/solr.cloud.BasicDistributedZkTest_6DBC95514E2684D-001/tempDir-001/control/data, hostContext=/, hostPort=46672, coreRootDirectory=/x1/jenkins/jenkins-slave/workspace/Lucene-Solr-NightlyTests-7.x/checkout/solr/build/solr-core/test/J1/../../../../../../../../../../../x1/jenkins/jenkins-slave/workspace/Lucene-Solr-NightlyTests-7.x/checkout/solr/build/solr-core/test/J1/temp/solr.cloud.BasicDistributedZkTest_6DBC95514E2684D-001/control-001/cores}
   [junit4]   2> 1738654 ERROR (TEST-BasicDistributedZkTest.test-seed#[6DBC95514E2684D]) [    ] o.a.s.u.StartupLoggingUtils Missing Java Option solr.log.dir. Logging may be missing or incomplete.
   [junit4]   2> 1738654 INFO  (TEST-BasicDistributedZkTest.test-seed#[6DBC95514E2684D]) [    ] o.a.s.s.SolrDispatchFilter Using logger factory org.apache.logging.slf4j.Log4jLoggerFactory
   [junit4]   2> 1738654 INFO  (TEST-BasicDistributedZkTest.test-seed#[6DBC95514E2684D]) [    ] o.a.s.s.SolrDispatchFilter  ___      _       Welcome to Apache Solr™ version 7.5.0
   [junit4]   2> 1738654 INFO  (TEST-BasicDistributedZkTest.test-seed#[6DBC95514E2684D]) [    ] o.a.s.s.SolrDispatchFilter / __| ___| |_ _   Starting in cloud mode on port null
   [junit4]   2> 1738654 INFO  (TEST-BasicDistributedZkTest.test-seed#[6DBC95514E2684D]) [    ] o.a.s.s.SolrDispatchFilter \__ \/ _ \ | '_|  Install dir: null
   [junit4]   2> 1738654 INFO  (TEST-BasicDistributedZkTest.test-seed#[6DBC95514E2684D]) [    ] o.a.s.s.SolrDispatchFilter |___/\___/_|_|    Start time: 2018-09-04T02:32:23.385Z
   [junit4]   2> 1738656 INFO  (zkConnectionManagerCallback-3540-thread-1) [    ] o.a.s.c.c.ConnectionManager zkClient has connected
   [junit4]   2> 1738657 INFO  (TEST-BasicDistributedZkTest.test-seed#[6DBC95514E2684D]) [    ] o.a.s.s.SolrDispatchFilter Loading solr.xml from SolrHome (not found in ZooKeeper)
   [junit4]   2> 1738657 INFO  (TEST-BasicDistributedZkTest.test-seed#[6DBC95514E2684D]) [    ] o.a.s.c.SolrXmlConfig Loading container configuration from /x1/jenkins/jenkins-slave/workspace/Lucene-Solr-NightlyTests-7.x/checkout/solr/build/solr-core/test/J1/temp/solr.cloud.BasicDistributedZkTest_6DBC95514E2684D-001/control-001/solr.xml
   [junit4]   2> 1738660 INFO  (TEST-BasicDistributedZkTest.test-seed#[6DBC95514E2684D]) [    ] o.a.s.c.SolrXmlConfig Configuration parameter autoReplicaFailoverWorkLoopDelay is ignored
   [junit4]   2> 1738660 INFO  (TEST-BasicDistributedZkTest.test-seed#[6DBC95514E2684D]) [    ] o.a.s.c.SolrXmlConfig Configuration parameter autoReplicaFailoverBadNodeExpiration is ignored
   [junit4]   2> 1738662 INFO  (TEST-BasicDistributedZkTest.test-seed#[6DBC95514E2684D]) [    ] o.a.s.c.SolrXmlConfig MBean server found: com.sun.jmx.mbeanserver.JmxMBeanServer@4de642f7, but no JMX reporters were configured - adding default JMX reporter.
   [junit4]   2> 1738729 INFO  (TEST-BasicDistributedZkTest.test-seed#[6DBC95514E2684D]) [    ] o.a.s.c.ZkContainer Zookeeper client=127.0.0.1:33405/solr
   [junit4]   2> 1738731 INFO  (zkConnectionManagerCallback-3544-thread-1) [    ] o.a.s.c.c.ConnectionManager zkClient has connected
   [junit4]   2> 1738732 INFO  (zkConnectionManagerCallback-3546-thread-1) [    ] o.a.s.c.c.ConnectionManager zkClient has connected
   [junit4]   2> 1738794 INFO  (TEST-BasicDistributedZkTest.test-seed#[6DBC95514E2684D]) [n:127.0.0.1:46672_    ] o.a.s.c.OverseerElectionContext I am going to be the leader 127.0.0.1:46672_
   [junit4]   2> 1738794 INFO  (TEST-BasicDistributedZkTest.test-seed#[6DBC95514E2684D]) [n:127.0.0.1:46672_    ] o.a.s.c.Overseer Overseer (id=72274983583678468-127.0.0.1:46672_-n_0000000000) starting
   [junit4]   2> 1738801 INFO  (zkConnectionManagerCallback-3553-thread-1) [    ] o.a.s.c.c.ConnectionManager zkClient has connected
   [junit4]   2> 1738802 INFO  (TEST-BasicDistributedZkTest.test-seed#[6DBC95514E2684D]) [n:127.0.0.1:46672_    ] o.a.s.c.s.i.ZkClientClusterStateProvider Cluster at 127.0.0.1:33405/solr ready
   [junit4]   2> 1738803 INFO  (OverseerStateUpdate-72274983583678468-127.0.0.1:46672_-n_0000000000) [n:127.0.0.1:46672_    ] o.a.s.c.Overseer Starting to work on the main queue : 127.0.0.1:46672_
   [junit4]   2> 1738804 INFO  (TEST-BasicDistributedZkTest.test-seed#[6DBC95514E2684D]) [n:127.0.0.1:46672_    ] o.a.s.c.ZkController Register node as live in ZooKeeper:/live_nodes/127.0.0.1:46672_
   [junit4]   2> 1738808 INFO  (zkCallback-3552-thread-1) [    ] o.a.s.c.c.ZkStateReader Updated live nodes from ZooKeeper... (0) -> (1)
   [junit4]   2> 1738817 INFO  (zkCallback-3545-thread-1) [    ] o.a.s.c.c.ZkStateReader Updated live nodes from ZooKeeper... (0) -> (1)
   [junit4]   2> 1738827 INFO  (TEST-BasicDistributedZkTest.test-seed#[6DBC95514E2684D]) [n:127.0.0.1:46672_    ] o.a.s.h.a.MetricsHistoryHandler No .system collection, keeping metrics history in memory.
   [junit4]   2> 1738842 INFO  (TEST-BasicDistributedZkTest.test-seed#[6DBC95514E2684D]) [n:127.0.0.1:46672_    ] o.a.s.m.r.SolrJmxReporter JMX monitoring for 'solr.node' (registry 'solr.node') enabled at server: com.sun.jmx.mbeanserver.JmxMBeanServer@4de642f7
   [junit4]   2> 1738852 INFO  (TEST-BasicDistributedZkTest.test-seed#[6DBC95514E2684D]) [n:127.0.0.1:46672_    ] o.a.s.m.r.SolrJmxReporter JMX monitoring for 'solr.jvm' (registry 'solr.jvm') enabled at server: com.sun.jmx.mbeanserver.JmxMBeanServer@4de642f7
   [junit4]   2> 1738852 INFO  (TEST-BasicDistributedZkTest.test-seed#[6DBC95514E2684D]) [n:127.0.0.1:46672_    ] o.a.s.m.r.SolrJmxReporter JMX monitoring for 'solr.jetty' (registry 'solr.jetty') enabled at server: com.sun.jmx.mbeanserver.JmxMBeanServer@4de642f7
   [junit4]   2> 1738853 INFO  (TEST-BasicDistributedZkTest.test-seed#[6DBC95514E2684D]) [n:127.0.0.1:46672_    ] o.a.s.c.CorePropertiesLocator Found 0 core definitions underneath /x1/jenkins/jenkins-slave/workspace/Lucene-Solr-NightlyTests-7.x/checkout/solr/build/solr-core/test/J1/../../../../../../../../../../../x1/jenkins/jenkins-slave/workspace/Lucene-Solr-NightlyTests-7.x/checkout/solr/build/solr-core/test/J1/temp/solr.cloud.BasicDistributedZkTest_6DBC95514E2684D-001/control-001/cores
   [junit4]   2> 1738871 INFO  (zkConnectionManagerCallback-3559-thread-1) [    ] o.a.s.c.c.ConnectionManager zkClient has connected
   [junit4]   2> 1738872 INFO  (TEST-BasicDistributedZkTest.test-seed#[6DBC95514E2684D]) [    ] o.a.s.c.c.ZkStateReader Updated live nodes from ZooKeeper... (0) -> (1)
   [junit4]   2> 1738872 INFO  (TEST-BasicDistributedZkTest.test-seed#[6DBC95514E2684D]) [    ] o.a.s.c.s.i.ZkClientClusterStateProvider Cluster at 127.0.0.1:33405/solr ready
   [junit4]   2> 1738876 INFO  (qtp972400038-13471) [n:127.0.0.1:46672_    ] o.a.s.h.a.CollectionsHandler Invoked Collection Action :create with params collection.configName=conf1&name=control_collection&nrtReplicas=1&action=CREATE&numShards=1&createNodeSet=127.0.0.1:46672_&wt=javabin&version=2 and sendToOCPQueue=true
   [junit4]   2> 1738879 INFO  (OverseerThreadFactory-5659-thread-1-processing-n:127.0.0.1:46672_) [n:127.0.0.1:46672_    ] o.a.s.c.a.c.CreateCollectionCmd Create collection control_collection
   [junit4]   2> 1738986 INFO  (qtp972400038-13466) [n:127.0.0.1:46672_    x:control_collection_shard1_replica_n1] o.a.s.h.a.CoreAdminOperation core create command qt=/admin/cores&collection.configName=conf1&newCollection=true&name=control_collection_shard1_replica_n1&action=CREATE&numShards=1&collection=control_collection&shard=shard1&wt=javabin&version=2&replicaType=NRT
   [junit4]   2> 1738987 INFO  (qtp972400038-13466) [n:127.0.0.1:46672_    x:control_collection_shard1_replica_n1] o.a.s.c.TransientSolrCoreCacheDefault Allocating transient cache for 4 transient cores
   [junit4]   2> 1740001 INFO  (qtp972400038-13466) [n:127.0.0.1:46672_ c:control_collection s:shard1  x:control_collection_shard1_replica_n1] o.a.s.c.SolrConfig Using Lucene MatchVersion: 7.5.0
   [junit4]   2> 1740023 INFO  (qtp972400038-13466) [n:127.0.0.1:46672_ c:control_collection s:shard1  x:control_collection_shard1_replica_n1] o.a.s.s.IndexSchema [control_collection_shard1_replica_n1] Schema name=test
   [junit4]   2> 1740121 INFO  (qtp972400038-13466) [n:127.0.0.1:46672_ c:control_collection s:shard1  x:control_collection_shard1_replica_n1] o.a.s.s.IndexSchema Loaded schema test/1.0 with uniqueid field id
   [junit4]   2> 1740132 INFO  (qtp972400038-13466) [n:127.0.0.1:46672_ c:control_collection s:shard1  x:control_collection_shard1_replica_n1] o.a.s.c.CoreContainer Creating SolrCore 'control_collection_shard1_replica_n1' using configuration from collection control_collection, trusted=true
   [junit4]   2> 1740133 INFO  (qtp972400038-13466) [n:127.0.0.1:46672_ c:control_collection s:shard1  x:control_collection_shard1_replica_n1] o.a.s.m.r.SolrJmxReporter JMX monitoring for 'solr.core.control_collection.shard1.replica_n1' (registry 'solr.core.control_collection.shard1.replica_n1') enabled at server: com.sun.jmx.mbeanserver.JmxMBeanServer@4de642f7
   [junit4]   2> 1740133 INFO  (qtp972400038-13466) [n:127.0.0.1:46672_ c:control_collection s:shard1  x:control_collection_shard1_replica_n1] o.a.s.c.SolrCore solr.RecoveryStrategy.Builder
   [junit4]   2> 1740133 INFO  (qtp972400038-13466) [n:127.0.0.1:46672_ c:control_collection s:shard1  x:control_collection_shard1_replica_n1] o.a.s.c.SolrCore [[control_collection_shard1_replica_n1] ] Opening new SolrCore at [/x1/jenkins/jenkins-slave/workspace/Lucene-Solr-NightlyTests-7.x/checkout/solr/build/solr-core/test/J1/temp/solr.cloud.BasicDistributedZkTest_6DBC95514E2684D-001/control-001/cores/control_collection_shard1_replica_n1], dataDir=[/x1/jenkins/jenkins-slave/workspace/Lucene-Solr-NightlyTests-7.x/checkout/solr/build/solr-core/test/J1/../../../../../../../../../../../x1/jenkins/jenkins-slave/workspace/Lucene-Solr-NightlyTests-7.x/checkout/solr/build/solr-core/test/J1/temp/solr.cloud.BasicDistributedZkTest_6DBC95514E2684D-001/control-001/cores/control_collection_shard1_replica_n1/data/]
   [junit4]   2> 1740135 INFO  (qtp972400038-13466) [n:127.0.0.1:46672_ c:control_collection s:shard1  x:control_collection_shard1_replica_n1] o.a.s.u.RandomMergePolicy RandomMergePolicy wrapping class org.apache.lucene.index.LogByteSizeMergePolicy: [LogByteSizeMergePolicy: minMergeSize=1677721, mergeFactor=47, maxMergeSize=2147483648, maxMergeSizeForForcedMerge=9223372036854775807, calibrateSizeByDeletes=true, maxMergeDocs=2147483647, maxCFSSegmentSizeMB=8.796093022207999E12, noCFSRatio=0.0]
   [junit4]   2> 1740144 WARN  (qtp972400038-13466) [n:127.0.0.1:46672_ c:control_collection s:shard1  x:control_collection_shard1_replica_n1] o.a.s.c.RequestHandlers INVALID paramSet a in requestHandler {type = requestHandler,name = /dump,class = DumpRequestHandler,attributes = {initParams=a, name=/dump, class=DumpRequestHandler},args = {defaults={a=A,b=B}}}
   [junit4]   2> 1740186 INFO  (qtp972400038-13466) [n:127.0.0.1:46672_ c:control_collection s:shard1  x:control_collection_shard1_replica_n1] o.a.s.u.UpdateHandler Using UpdateLog implementation: org.apache.solr.update.UpdateLog
   [junit4]   2> 1740186 INFO  (qtp972400038-13466) [n:127.0.0.1:46672_ c:control_collection s:shard1  x:control_collection_shard1_replica_n1] o.a.s.u.UpdateLog Initializing UpdateLog: dataDir= defaultSyncLevel=FLUSH numRecordsToKeep=100 maxNumLogsToKeep=10 numVersionBuckets=65536
   [junit4]   2> 1740187 INFO  (qtp972400038-13466) [n:127.0.0.1:46672_ c:control_collection s:shard1  x:control_collection_shard1_replica_n1] o.a.s.u.CommitTracker Hard AutoCommit: disabled
   [junit4]   2> 1740187 INFO  (qtp972400038-13466) [n:127.0.0.1:46672_ c:control_collection s:shard1  x:control_collection_shard1_replica_n1] o.a.s.u.CommitTracker Soft AutoCommit: disabled
   [junit4]   2> 1740188 INFO  (qtp972400038-13466) [n:127.0.0.1:46672_ c:control_collection s:shard1  x:control_collection_shard1_replica_n1] o.a.s.u.RandomMergePolicy RandomMergePolicy wrapping class org.apache.lucene.index.TieredMergePolicy: [TieredMergePolicy: maxMergeAtOnce=26, maxMergeAtOnceExplicit=10, maxMergedSegmentMB=31.75, floorSegmentMB=0.376953125, forceMergeDeletesPctAllowed=15.154936850745244, segmentsPerTier=30.0, maxCFSSegmentSizeMB=8.796093022207999E12, noCFSRatio=0.27173081292550416, deletesPctAllowed=44.33404226310273
   [junit4]   2> 1740189 INFO  (qtp972400038-13466) [n:127.0.0.1:46672_ c:control_collection s:shard1  x:control_collection_shard1_replica_n1] o.a.s.s.SolrIndexSearcher Opening [Searcher@7fff5e8[control_collection_shard1_replica_n1] main]
   [junit4]   2> 1740190 INFO  (qtp972400038-13466) [n:127.0.0.1:46672_ c:control_collection s:shard1  x:control_collection_shard1_replica_n1] o.a.s.r.ManagedResourceStorage Configured ZooKeeperStorageIO with znodeBase: /configs/conf1
   [junit4]   2> 1740190 INFO  (qtp972400038-13466) [n:127.0.0.1:46672_ c:control_collection s:shard1  x:control_collection_shard1_replica_n1] o.a.s.r.ManagedResourceStorage Loaded null at path _rest_managed.json using ZooKeeperStorageIO:path=/configs/conf1
   [junit4]   2> 1740190 INFO  (qtp972400038-13466) [n:127.0.0.1:46672_ c:control_collection s:shard1  x:control_collection_shard1_replica_n1] o.a.s.h.ReplicationHandler Commits will be reserved for 10000ms.
   [junit4]   2> 1740191 INFO  (searcherExecutor-5664-thread-1-processing-n:127.0.0.1:46672_ x:control_collection_shard1_replica_n1 c:control_collection s:shard1) [n:127.0.0.1:46672_ c:control_collection s:shard1  x:control_collection_shard1_replica_n1] o.a.s.c.SolrCore [control_collection_shard1_replica_n1] Registered new searcher Searcher@7fff5e8[control_collection_shard1_replica_n1] main{ExitableDirectoryReader(UninvertingDirectoryReader())}
   [junit4]   2> 1740191 INFO  (qtp972400038-13466) [n:127.0.0.1:46672_ c:control_collection s:shard1  x:control_collection_shard1_replica_n1] o.a.s.u.UpdateLog Could not find max version in index or recent updates, using new clock 1610642457804931072
   [junit4]   2> 1740196 INFO  (qtp972400038-13466) [n:127.0.0.1:46672_ c:control_collection s:shard1  x:control_collection_shard1_replica_n1] o.a.s.c.ZkShardTerms Successful update of terms at /collections/control_collection/terms/shard1 to Terms{values={core_node2=0}, version=0}
   [junit4]   2> 1740199 INFO  (qtp972400038-13466) [n:127.0.0.1:46672_ c:control_collection s:shard1  x:control_collection_shard1_replica_n1] o.a.s.c.ShardLeaderElectionContext Enough replicas found to continue.
   [junit4]   2> 1740199 INFO  (qtp972400038-13466) [n:127.0.0.1:46672_ c:control_collection s:shard1  x:control_collection_shard1_replica_n1] o.a.s.c.ShardLeaderElectionContext I may be the new leader - try and sync
   [junit4]   2> 1740199 INFO  (qtp972400038-13466) [n:127.0.0.1:46672_ c:control_collection s:shard1  x:control_collection_shard1_replica_n1] o.a.s.c.SyncStrategy Sync replicas to http://127.0.0.1:46672/control_collection_shard1_replica_n1/
   [junit4]   2> 1740199 INFO  (qtp972400038-13466) [n:127.0.0.1:46672_ c:control_collection s:shard1  x:control_collection_shard1_replica_n1] o.a.s.c.SyncStrategy Sync Success - now sync replicas to me
   [junit4]   2> 1740199 INFO  (qtp972400038-13466) [n:127.0.0.1:46672_ c:control_collection s:shard1  x:control_collection_shard1_replica_n1] o.a.s.c.SyncStrategy http://127.0.0.1:46672/control_collection_shard1_replica_n1/ has no replicas
   [junit4]   2> 1740199 INFO  (qtp972400038-13466) [n:127.0.0.1:46672_ c:control_collection s:shard1  x:control_collection_shard1_replica_n1] o.a.s.c.ShardLeaderElectionContext Found all replicas participating in election, clear LIR
   [junit4]   2> 1740202 INFO  (qtp972400038-13466) [n:127.0.0.1:46672_ c:control_collection s:shard1  x:control_collection_shard1_replica_n1] o.a.s.c.ShardLeaderElectionContext I am the new leader: http://127.0.0.1:46672/control_collection_shard1_replica_n1/ shard1
   [junit4]   2> 1740304 INFO  (qtp972400038-13466) [n:127.0.0.1:46672_ c:control_collection s:shard1  x:control_collection_shard1_replica_n1] o.a.s.c.ZkController I am the leader, no recovery necessary
   [junit4]   2> 1740306 INFO  (qtp972400038-13466) [n:127.0.0.1:46672_ c:control_collection s:shard1  x:control_collection_shard1_replica_n1] o.a.s.s.HttpSolrCall [admin] webapp=null path=/admin/cores params={qt=/admin/cores&collection.configName=conf1&newCollection=true&name=control_collection_shard1_replica_n1&action=CREATE&numShards=1&collection=control_collection&shard=shard1&wt=javabin&version=2&replicaType=NRT} status=0 QTime=1320
   [junit4]   2> 1740308 INFO  (qtp972400038-13471) [n:127.0.0.1:46672_    ] o.a.s.h.a.CollectionsHandler Wait for new collection to be active for at most 30 seconds. Check all shard replicas
   [junit4]   2> 1740406 INFO  (zkCallback-3545-thread-1) [    ] o.a.s.c.c.ZkStateReader A cluster state change: [WatchedEvent state:SyncConnected type:NodeDataChanged path:/collections/control_collection/state.json] for collection [control_collection] has occurred - updating... (live nodes size: [1])
   [junit4]   2> 1740881 INFO  (OverseerCollectionConfigSetProcessor-72274983583678468-127.0.0.1:46672_-n_0000000000) [n:127.0.0.1:46672_    ] o.a.s.c.OverseerTaskQueue Response ZK path: /overseer/collection-queue-work/qnr-0000000000 doesn't exist.  Requestor may have disconnected from ZooKeeper
   [junit4]   2> 1741308 INFO  (qtp972400038-13471) [n:127.0.0.1:46672_    ] o.a.s.s.HttpSolrCall [admin] webapp=null path=/admin/collections params={collection.configName=conf1&name=control_collection&nrtReplicas=1&action=CREATE&numShards=1&createNodeSet=127.0.0.1:46672_&wt=javabin&version=2} status=0 QTime=2431
   [junit4]   2> 1741316 INFO  (zkConnectionManagerCallback-3564-thread-1) [    ] o.a.s.c.c.ConnectionManager zkClient has connected
   [junit4]   2> 1741318 INFO  (TEST-BasicDistributedZkTest.test-seed#[6DBC95514E2684D]) [    ] o.a.s.c.c.ZkStateReader Updated live nodes from ZooKeeper... (0) -> (1)
   [junit4]   2> 1741319 INFO  (TEST-BasicDistributedZkTest.test-seed#[6DBC95514E2684D]) [    ] o.a.s.c.s.i.ZkClientClusterStateProvider Cluster at 127.0.0.1:33405/solr ready
   [junit4]   2> 1741319 INFO  (TEST-BasicDistributedZkTest.test-seed#[6DBC95514E2684D]) [    ] o.a.s.c.ChaosMonkey monkey: init - expire sessions:false cause connection loss:false
   [junit4]   2> 1741320 INFO  (qtp972400038-13467) [n:127.0.0.1:46672_    ] o.a.s.h.a.CollectionsHandler Invoked Collection Action :create with params collection.configName=conf1&name=collection1&nrtReplicas=1&action=CREATE&numShards=2&createNodeSet=&stateFormat=2&wt=javabin&version=2 and sendToOCPQueue=true
   [junit4]   2> 1741333 INFO  (OverseerThreadFactory-5659-thread-2-processing-n:127.0.0.1:46672_) [n:127.0.0.1:46672_    ] o.a.s.c.a.c.CreateCollectionCmd Create collection collection1
   [junit4]   2> 1741538 WARN  (OverseerThreadFactory-5659-thread-2-processing-n:127.0.0.1:46672_) [n:127.0.0.1:46672_    ] o.a.s.c.a.c.CreateCollectionCmd It is unusual to create a collection (collection1) without cores.
   [junit4]   2> 1741539 INFO  (qtp972400038-13467) [n:127.0.0.1:46672_    ] o.a.s.h.a.CollectionsHandler Wait for new collection to be active for at most 30 seconds. Check all shard replicas
   [junit4]   2> 1741539 INFO  (qtp972400038-13467) [n:127.0.0.1:46672_    ] o.a.s.s.HttpSolrCall [admin] webapp=null path=/admin/collections params={collection.configName=conf1&name=collection1&nrtReplicas=1&action=CREATE&numShards=2&createNodeSet=&stateFormat=2&wt=javabin&version=2} status=0 QTime=219
   [junit4]   2> 1741645 INFO  (TEST-BasicDistributedZkTest.test-seed#[6DBC95514E2684D]) [    ] o.a.s.c.AbstractFullDistribZkTestBase create jetty 1 in directory /x1/jenkins/jenkins-slave/workspace/Lucene-Solr-NightlyTests-7.x/checkout/solr/build/solr-core/test/J1/temp/solr.cloud.BasicDistributedZkTest_6DBC95514E2684D-001/shard-1-001 of type TLOG
   [junit4]   2> 1741646 INFO  (TEST-BasicDistributedZkTest.test-seed#[6DBC95514E2684D]) [    ] o.e.j.s.Server jetty-9.4.11.v20180605; built: 2018-06-05T18:24:03.829Z; git: d5fc0523cfa96bfebfbda19606cad384d772f04c; jvm 1.8.0_172-b11
   [junit4]   2> 1741646 INFO  (TEST-BasicDistributedZkTest.test-seed#[6DBC95514E2684D]) [    ] o.e.j.s.session DefaultSessionIdManager workerName=node0
   [junit4]   2> 1741646 INFO  (TEST-BasicDistributedZkTest.test-seed#[6DBC95514E2684D]) [    ] o.e.j.s.session No SessionScavenger set, using defaults
   [junit4]   2> 1741646 INFO  (TEST-BasicDistributedZkTest.test-seed#[6DBC95514E2684D]) [    ] o.e.j.s.session node0 Scavenging every 600000ms
   [junit4]   2> 1741647 INFO  (TEST-BasicDistributedZkTest.test-seed#[6DBC95514E2684D]) [    ] o.e.j.s.h.ContextHandler Started o.e.j.s.ServletContextHandler@19bc1394{/,null,AVAILABLE}
   [junit4]   2> 1741647 INFO  (TEST-BasicDistributedZkTest.test-seed#[6DBC95514E2684D]) [    ] o.e.j.s.AbstractConnector Started ServerConnector@1bb9ba4e{HTTP/1.1,[http/1.1]}{127.0.0.1:41180}
   [junit4]   2> 1741647 INFO  (TEST-BasicDistributedZkTest.test-seed#[6DBC95514E2684D]) [    ] o.e.j.s.Server Started @1741698ms
   [junit4]   2> 1741647 INFO  (TEST-BasicDistributedZkTest.test-seed#[6DBC95514E2684D]) [    ] o.a.s.c.s.e.JettySolrRunner Jetty properties: {solr.data.dir=/x1/jenkins/jenkins-slave/workspace/Lucene-Solr-NightlyTests-7.x/checkout/solr/build/solr-core/test/J1/temp/solr.cloud.BasicDistributedZkTest_6DBC95514E2684D-001/tempDir-001/jetty1, replicaType=TLOG, solrconfig=solrconfig.xml, hostContext=/, hostPort=41180, coreRootDirectory=/x1/jenkins/jenkins-slave/workspace/Lucene-Solr-NightlyTests-7.x/checkout/solr/build/solr-core/test/J1/temp/solr.cloud.BasicDistributedZkTest_6DBC95514E2684D-001/shard-1-001/cores}
   [junit4]   2> 1741647 ERROR (TEST-BasicDistributedZkTest.test-seed#[6DBC95514E2684D]) [    ] o.a.s.u.StartupLoggingUtils Missing Java Option solr.log.dir. Logging may be missing or incomplete.
   [junit4]   2> 1741647 INFO  (TEST-BasicDistributedZkTest.test-seed#[6DBC95514E2684D]) [    ] o.a.s.s.SolrDispatchFilter Using logger factory org.apache.logging.slf4j.Log4jLoggerFactory
   [junit4]   2> 1741647 INFO  (TEST-BasicDistributedZkTest.test-seed#[6DBC95514E2684D]) [    ] o.a.s.s.SolrDispatchFilter  ___      _       Welcome to Apache Solr™ version 7.5.0
   [junit4]   2> 1741647 INFO  (TEST-BasicDistributedZkTest.test-seed#[6DBC95514E2684D]) [    ] o.a.s.s.SolrDispatchFilter / __| ___| |_ _   Starting in cloud mode on port null
   [junit4]   2> 1741647 INFO  (TEST-BasicDistributedZkTest.test-seed#[6DBC95514E2684D]) [    ] o.a.s.s.SolrDispatchFilter \__ \/ _ \ | '_|  Install dir: null
   [junit4]   2> 1741647 INFO  (TEST-BasicDistributedZkTest.test-seed#[6DBC95514E2684D]) [    ] o.a.s.s.SolrDispatchFilter |___/\___/_|_|    Start time: 2018-09-04T02:32:26.378Z
   [junit4]   2> 1741649 INFO  (zkConnectionManagerCallback-3566-thread-1) [    ] o.a.s.c.c.ConnectionManager zkClient has connected
   [junit4]   2> 1741650 INFO  (TEST-BasicDistributedZkTest.test-seed#[6DBC95514E2684D]) [    ] o.a.s.s.SolrDispatchFilter Loading solr.xml from SolrHome (not found in ZooKeeper)
   [junit4]   2> 1741650 INFO  (TEST-BasicDistributedZkTest.test-seed#[6DBC95514E2684D]) [    ] o.a.s.c.SolrXmlConfig Loading container configuration from /x1/jenkins/jenkins-slave/workspace/Lucene-Solr-NightlyTests-7.x/checkout/solr/build/solr-core/test/J1/temp/solr.cloud.BasicDistributedZkTest_6DBC95514E2684D-001/shard-1-001/solr.xml
   [junit4]   2> 1741653 INFO  (TEST-BasicDistributedZkTest.test-seed#[6DBC95514E2684D]) [    ] o.a.s.c.SolrXmlConfig Configuration parameter autoReplicaFailoverWorkLoopDelay is ignored
   [junit4]   2> 1741653 INFO  (TEST-BasicDistributedZkTest.test-seed#[6DBC95514E2684D]) [    ] o.a.s.c.SolrXmlConfig Configuration parameter autoReplicaFailoverBadNodeExpiration is ignored
   [junit4]   2> 1741655 INFO  (TEST-BasicDistributedZkTest.test-seed#[6DBC95514E2684D]) [    ] o.a.s.c.SolrXmlConfig MBean server found: com.sun.jmx.mbeanserver.JmxMBeanServer@4de642f7, but no JMX reporters were configured - adding default JMX reporter.
   [junit4]   2> 1741785 INFO  (TEST-BasicDistributedZkTest.test-seed#[6DBC95514E2684D]) [    ] o.a.s.c.ZkContainer Zookeeper client=127.0.0.1:33405/solr
   [junit4]   2> 1741786 INFO  (zkConnectionManagerCallback-3570-thread-1) [    ] o.a.s.c.c.ConnectionManager zkClient has connected
   [junit4]   2> 1741788 INFO  (zkConnectionManagerCallback-3572-thread-1) [    ] o.a.s.c.c.ConnectionManager zkClient has connected
   [junit4]   2> 1741793 INFO  (TEST-BasicDistributedZkTest.test-seed#[6DBC95514E2684D]) [    ] o.a.s.c.c.ZkStateReader Updated live nodes from ZooKeeper... (0) -> (1)
   [junit4]   2> 1741796 INFO  (TEST-BasicDistributedZkTest.test-seed#[6DBC95514E2684D]) [    ] o.a.s.c.TransientSolrCoreCacheDefault Allocating transient cache for 4 transient cores
   [junit4]   2> 1741796 INFO  (TEST-BasicDistributedZkTest.test-seed#[6DBC95514E2684D]) [    ] o.a.s.c.ZkController Register node as live in ZooKeeper:/live_nodes/127.0.0.1:41180_
   [junit4]   2> 1741797 INFO  (zkCallback-3545-thread-1) [    ] o.a.s.c.c.ZkStateReader Updated live nodes from ZooKeeper... (1) -> (2)
   [junit4]   2> 1741797 INFO  (zkCallback-3552-thread-1) [    ] o.a.s.c.c.ZkStateReader Updated live nodes from ZooKeeper... (1) -> (2)
   [junit4]   2> 1741797 INFO  (zkCallback-3571-thread-1) [    ] o.a.s.c.c.ZkStateReader Updated live nodes from ZooKeeper... (1) -> (2)
   [junit4]   2> 1741802 INFO  (zkCallback-3563-thread-1) [    ] o.a.s.c.c.ZkStateReader Updated live nodes from ZooKeeper... (1) -> (2)
   [junit4]   2> 1741816 INFO  (zkConnectionManagerCallback-3579-thread-1) [    ] o.a.s.c.c.ConnectionManager zkClient has connected
   [junit4]   2> 1741817 INFO  (TEST-BasicDistributedZkTest.test-seed#[6DBC95514E2684D]) [    ] o.a.s.c.c.ZkStateReader Updated live nodes from ZooKeeper... (0) -> (2)
   [junit4]   2> 1741818 INFO  (TEST-BasicDistributedZkTest.test-seed#[6DBC95514E2684D]) [    ] o.a.s.c.s.i.ZkClientClusterStateProvider Cluster at 127.0.0.1:33405/solr ready
   [junit4]   2> 1741818 INFO  (TEST-BasicDistributedZkTest.test-seed#[6DBC95514E2684D]) [    ] o.a.s.h.a.MetricsHistoryHandler No .system collection, keeping metrics history in memory.
   [junit4]   2> 1741834 INFO  (TEST-BasicDistributedZkTest.test-seed#[6DBC95514E2684D]) [    ] o.a.s.m.r.SolrJmxReporter JMX monitoring for 'solr.node' (registry 'solr.node') enabled at server: com.sun.jmx.mbeanserver.JmxMBeanServer@4de642f7
   [junit4]   2> 1741842 INFO  (TEST-BasicDistributedZkTest.test-seed#[6DBC95514E2684D]) [    ] o.a.s.m.r.SolrJmxReporter JMX monitoring for 'solr.jvm' (registry 'solr.jvm') enabled at server: com.sun.jmx.mbeanserver.JmxMBeanServer@4de642f7
   [junit4]   2> 1741842 INFO  (TEST-BasicDistributedZkTest.test-seed#[6DBC95514E2684D]) [    ] o.a.s.m.r.SolrJmxReporter JMX monitoring for 'solr.jetty' (registry 'solr.jetty') enabled at server: com.sun.jmx.mbeanserver.JmxMBeanServer@4de642f7
   [junit4]   2> 1741844 INFO  (TEST-BasicDistributedZkTest.test-seed#[6DBC95514E2684D]) [    ] o.a.s.c.CorePropertiesLocator Found 0 core definitions underneath /x1/jenkins/jenkins-slave/workspace/Lucene-Solr-NightlyTests-7.x/checkout/solr/build/solr-core/test/J1/temp/solr.cloud.BasicDistributedZkTest_6DBC95514E2684D-001/shard-1-001/cores
   [junit4]   2> 1741868 INFO  (qtp378920599-13525) [n:127.0.0.1:41180_    ] o.a.s.h.a.CollectionsHandler Invoked Collection Action :addreplica with params node=127.0.0.1:41180_&action=ADDREPLICA&collection=collection1&shard=shard2&type=TLOG&wt=javabin&version=2 and sendToOCPQueue=true
   [junit4]   2> 1741870 INFO  (OverseerCollectionConfigSetProcessor-72274983583678468-127.0.0.1:46672_-n_0000000000) [n:127.0.0.1:46672_    ] o.a.s.c.OverseerTaskQueue Response ZK path: /overseer/collection-queue-work/qnr-0000000002 doesn't exist.  Requestor may have disconnected from ZooKeeper
   [junit4]   2> 1741870 INFO  (OverseerThreadFactory-5659-thread-3-processing-n:127.0.0.1:46672_) [n:127.0.0.1:46672_ c:collection1 s:shard2  ] o.a.s.c.a.c.AddReplicaCmd Node Identified 127.0.0.1:41180_ for creating new replica of shard shard2
   [junit4]   2> 1741873 INFO  (qtp378920599-13520) [n:127.0.0.1:41180_    x:collection1_shard2_replica_t41] o.a.s.h.a.CoreAdminOperation core create command qt=/admin/cores&collection.configName=conf1&name=collection1_shard2_replica_t41&action=CREATE&collection=collection1&shard=shard2&wt=javabin&version=2&replicaType=TLOG
   [junit4]   2> 1742887 INFO  (qtp378920599-13520) [n:127.0.0.1:41180_ c:collection1 s:shard2  x:collection1_shard2_replica_t41] o.a.s.c.SolrConfig Using Lucene MatchVersion: 7.5.0
   [junit4]   2> 1742900 INFO  (qtp378920599-13520) [n:127.0.0.1:41180_ c:collection1 s:shard2  x:collection1_shard2_replica_t41] o.a.s.s.IndexSchema [collection1_shard2_replica_t41] Schema name=test
   [junit4]   2> 1743013 INFO  (qtp378920599-13520) [n:127.0.0.1:41180_ c:collection1 s:shard2  x:collection1_shard2_replica_t41] o.a.s.s.IndexSchema Loaded schema test/1.0 with uniqueid field id
   [junit4]   2> 1743025 INFO  (qtp378920599-13520) [n:127.0.0.1:41180_ c:collection1 s:shard2  x:collection1_shard2_replica_t41] o.a.s.c.CoreContainer Creating SolrCore 'collection1_shard2_replica_t41' using configuration from collection collection1, trusted=true
   [junit4]   2> 1743026 INFO  (qtp378920599-13520) [n:127.0.0.1:41180_ c:collection1 s:shard2  x:collection1_shard2_replica_t41] o.a.s.m.r.SolrJmxReporter JMX monitoring for 'solr.core.collection1.shard2.replica_t41' (registry 'solr.core.collection1.shard2.replica_t41') enabled at server: com.sun.jmx.mbeanserver.JmxMBeanServer@4de642f7
   [junit4]   2> 1743026 INFO  (qtp378920599-13520) [n:127.0.0.1:41180_ c:collection1 s:shard2  x:collection1_shard2_replica_t41] o.a.s.c.SolrCore solr.RecoveryStrategy.Builder
   [junit4]   2> 1743026 INFO  (qtp378920599-13520) [n:127.0.0.1:41180_ c:collection1 s:shard2  x:collection1_shard2_replica_t41] o.a.s.c.SolrCore [[collection1_shard2_replica_t41] ] Opening new SolrCore at [/x1/jenkins/jenkins-slave/workspace/Lucene-Solr-NightlyTests-7.x/checkout/solr/build/solr-core/test/J1/temp/solr.cloud.BasicDistributedZkTest_6DBC95514E2684D-001/shard-1-001/cores/collection1_shard2_replica_t41], dataDir=[/x1/jenkins/jenkins-slave/workspace/Lucene-Solr-NightlyTests-7.x/checkout/solr/build/solr-core/test/J1/temp/solr.cloud.BasicDistributedZkTest_6DBC95514E2684D-001/shard-1-001/cores/collection1_shard2_replica_t41/data/]
   [junit4]   2> 1743028 INFO  (qtp378920599-13520) [n:127.0.0.1:41180_ c:collection1 s:shard2  x:collection1_shard2_replica_t41] o.a.s.u.RandomMergePolicy RandomMergePolicy wrapping class org.apache.lucene.index.LogByteSizeMergePolicy: [LogByteSizeMergePolicy: minMergeSize=1677721, mergeFactor=47, maxMergeSize=2147483648, maxMergeSizeForForcedMerge=9223372036854775807, calibrateSizeByDeletes=true, maxMergeDocs=2147483647, maxCFSSegmentSizeMB=8.796093022207999E12, noCFSRatio=0.0]
   [junit4]   2> 1743029 WARN  (qtp378920599-13520) [n:127.0.0.1:41180_ c:collection1 s:shard2  x:collection1_shard2_replica_t41] o.a.s.c.RequestHandlers INVALID paramSet a in requestHandler {type = requestHandler,name = /dump,class = DumpRequestHandler,attributes = {initParams=a, name=/dump, class=DumpRequestHandler},args = {defaults={a=A,b=B}}}
   [junit4]   2> 1743069 INFO  (qtp378920599-13520) [n:127.0.0.1:41180_ c:collection1 s:shard2  x:collection1_shard2_replica_t41] o.a.s.u.UpdateHandler Using UpdateLog implementation: org.apache.solr.update.UpdateLog
   [junit4]   2> 1743069 INFO  (qtp378920599-13520) [n:127.0.0.1:41180_ c:collection1 s:shard2  x:collection1_shard2_replica_t41] o.a.s.u.UpdateLog Initializing UpdateLog: dataDir= defaultSyncLevel=FLUSH numRecordsToKeep=100 maxNumLogsToKeep=10 numVersionBuckets=65536
   [junit4]   2> 1743070 INFO  (qtp378920599-13520) [n:127.0.0.1:41180_ c:collection1 s:shard2  x:collection1_shard2_replica_t41] o.a.s.u.CommitTracker Hard AutoCommit: disabled
   [junit4]   2> 1743070 INFO  (qtp378920599-13520) [n:127.0.0.1:41180_ c:collection1 s:shard2  x:collection1_shard2_replica_t41] o.a.s.u.CommitTracker Soft AutoCommit: disabled
   [junit4]   2> 1743071 INFO  (qtp378920599-13520) [n:127.0.0.1:41180_ c:collection1 s:shard2  x:collection1_shard2_replica_t41] o.a.s.u.RandomMergePolicy RandomMergePolicy wrapping class org.apache.lucene.index.TieredMergePolicy: [TieredMergePolicy: maxMergeAtOnce=26, maxMergeAtOnceExplicit=10, maxMergedSegmentMB=31.75, floorSegmentMB=0.376953125, forceMergeDeletesPctAllowed=15.154936850745244, segmentsPerTier=30.0, maxCFSSegmentSizeMB=8.796093022207999E12, noCFSRatio=0.27173081292550416, deletesPctAllowed=44.33404226310273
   [junit4]   2> 1743071 INFO  (qtp378920599-13520) [n:127.0.0.1:41180_ c:collection1 s:shard2  x:collection1_shard2_replica_t41] o.a.s.s.SolrIndexSearcher Opening [Searcher@1dd75950[collection1_shard2_replica_t41] main]
   [junit4]   2> 1743072 INFO  (qtp378920599-13520) [n:127.0.0.1:41180_ c:collection1 s:shard2  x:collection1_shard2_replica_t41] o.a.s.r.ManagedResourceStorage Configured ZooKeeperStorageIO with znodeBase: /configs/conf1
   [junit4]   2> 1743072 INFO  (qtp378920599-13520) [n:127.0.0.1:41180_ c:collection1 s:shard2  x:collection1_shard2_replica_t41] o.a.s.r.ManagedResourceStorage Loaded null at path _rest_managed.json using ZooKeeperStorageIO:path=/configs/conf1
   [junit4]   2> 1743073 INFO  (qtp378920599-13520) [n:127.0.0.1:41180_ c:collection1 s:shard2  x:collection1_shard2_replica_t41] o.a.s.h.ReplicationHandler Commits will be reserved for 10000ms.
   [junit4]   2> 1743073 INFO  (qtp378920599-13520) [n:127.0.0.1:41180_ c:collection1 s:shard2  x:collection1_shard2_replica_t41] o.a.s.u.UpdateLog Could not find max version in index or recent updates, using new clock 1610642460826927104
   [junit4]   2> 1743073 INFO  (searcherExecutor-5678-thread-1-processing-n:127.0.0.1:41180_ x:collection1_shard2_replica_t41 c:collection1 s:shard2) [n:127.0.0.1:41180_ c:collection1 s:shard2  x:collection1_shard2_replica_t41] o.a.s.c.SolrCore [collection1_shard2_replica_t41] Registered new searcher Searcher@1dd75950[collection1_shard2_replica_t41] main{ExitableDirectoryReader(UninvertingDirectoryReader())}
   [junit4]   2> 1743078 INFO  (qtp378920599-13520) [n:127.0.0.1:41180_ c:collection1 s:shard2  x:collection1_shard2_replica_t41] o.a.s.c.ZkShardTerms Successful update of terms at /collections/collection1/terms/shard2 to Terms{values={core_node42=0}, version=0}
   [junit4]   2> 1743080 INFO  (qtp378920599-13520) [n:127.0.0.1:41180_ c:collection1 s:shard2  x:collection1_shard2_replica_t41] o.a.s.c.ShardLeaderElectionContext Enough replicas found to continue.
   [junit4]   2> 1743080 INFO  (qtp378920599-13520) [n:127.0.0.1:41180_ c:collection1 s:shard2  x:collection1_shard2_replica_t41] o.a.s.c.ShardLeaderElectionContext I may be the new leader - try and sync
   [junit4]   2> 1743080 INFO  (qtp378920599-13520) [n:127.0.0.1:41180_ c:collection1 s:shard2  x:collection1_shard2_replica_t41] o.a.s.c.SyncStrategy Sync replicas to http://127.0.0.1:41180/collection1_shard2_replica_t41/
   [junit4]   2> 1743080 INFO  (qtp378920599-13520) [n:127.0.0.1:41180_ c:collection1 s:shard2  x:collection1_shard2_replica_t41] o.a.s.c.SyncStrategy Sync Success - now sync replicas to me
   [junit4]   2> 1743080 INFO  (qtp378920599-13520) [n:127.0.0.1:41180_ c:collection1 s:shard2  x:collection1_shard2_replica_t41] o.a.s.c.SyncStrategy http://127.0.0.1:41180/collection1_shard2_replica_t41/ has no replicas
   [junit4]   2> 1743080 INFO  (qtp378920599-13520) [n:127.0.0.1:41180_ c:collection1 s:shard2  x:collection1_shard2_replica_t41] o.a.s.c.ShardLeaderElectionContext Found all replicas participating in election, clear LIR
   [junit4]   2> 1743081 INFO  (qtp378920599-13520) [n:127.0.0.1:41180_ c:collection1 s:shard2  x:collection1_shard2_replica_t41] o.a.s.c.ZkController collection1_shard2_replica_t41 stopping background replication from leader
   [junit4]   2> 1743083 INFO  (qtp378920599-13520) [n:127.0.0.1:41180_ c:collection1 s:shard2  x:collection1_shard2_replica_t41] o.a.s.c.ShardLeaderElectionContext I am the new leader: http://127.0.0.1:41180/collection1_shard2_replica_t41/ shard2
   [junit4]   2> 1743185 INFO  (qtp378920599-13520) [n:127.0.0.1:41180_ c:collection1 s:shard2  x:collection1_shard2_replica_t41] o.a.s.c.ZkController I am the leader, no recovery necessary
   [junit4]   2> 1743188 INFO  (qtp378920599-13520) [n:127.0.0.1:41180_ c:collection1 s:shard2  x:collection1_shard2_replica_t41] o.a.s.s.HttpSolrCall [admin] webapp=null path=/admin/cores params={qt=/admin/cores&collection.configName=conf1&name=collection1_shard2_replica_t41&action=CREATE&collection=collection1&shard=shard2&wt=javabin&version=2&replicaType=TLOG} status=0 QTime=1315
   [junit4]   2> 1743190 INFO  (qtp378920599-13525) [n:127.0.0.1:41180_ c:collection1   ] o.a.s.s.HttpSolrCall [admin] webapp=null path=/admin/collections params={node=127.0.0.1:41180_&action=ADDREPLICA&collection=collection1&shard=shard2&type=TLOG&wt=javabin&version=2} status=0 QTime=1322
   [junit4]   2> 1743287 INFO  (zkCallback-3571-thread-1) [    ] o.a.s.c.c.ZkStateReader A cluster state change: [WatchedEvent state:SyncConnected type:NodeDataChanged path:/collections/collection1/state.json] for collection [collection1] has occurred - updating... (live nodes size: [2])
   [junit4]   2> 1743297 INFO  (TEST-BasicDistributedZkTest.test-seed#[6DBC95514E2684D]) [    ] o.a.s.c.AbstractFullDistribZkTestBase create jetty 2 in directory /x1/jenkins/jenkins-slave/workspace/Lucene-Solr-NightlyTests-7.x/checkout/solr/build/solr-core/test/J1/temp/solr.cloud.BasicDistributedZkTest_6DBC95514E2684D-001/shard-2-001 of type TLOG
   [junit4]   2> 1743298 INFO  (TEST-BasicDistributedZkTest.test-seed#[6DBC95514E2684D]) [    ] o.e.j.s.Server jetty-9.4.11.v20180605; built: 2018-06-05T18:24:03.829Z; git: d5fc0523cfa96bfebfbda19606cad384d772f04c; jvm 1.8.0_172-b11
   [junit4]   2> 1743299 INFO  (TEST-BasicDistributedZkTest.test-seed#[6DBC95514E2684D]) [    ] o.e.j.s.session DefaultSessionIdManager workerName=node0
   [junit4]   2> 1743299 INFO  (TEST-BasicDistributedZkTest.test-seed#[6DBC95514E2684D]) [    ] o.e.j.s.session No SessionScavenger set, using defaults
   [junit4]   2> 1743299 INFO  (TEST-BasicDistributedZkTest.test-seed#[6DBC95514E2684D]) [    ] o.e.j.s.session node0 Scavenging every 660000ms
   [junit4]   2> 1743299 INFO  (TEST-BasicDistributedZkTest.test-seed#[6DBC95514E2684D]) [    ] o.e.j.s.h.ContextHandler Started o.e.j.s.ServletContextHandler@1887bffe{/,null,AVAILABLE}
   [junit4]   2> 1743299 INFO  (TEST-BasicDistributedZkTest.test-seed#[6DBC95514E2684D]) [    ] o.e.j.s.AbstractConnector Started ServerConnector@df851c3{HTTP/1.1,[http/1.1]}{127.0.0.1:45681}
   [junit4]   2> 1743299 INFO  (TEST-BasicDistributedZkTest.test-seed#[6DBC95514E2684D]) [    ] o.e.j.s.Server Started @1743350ms
   [junit4]   2> 1743299 INFO  (TEST-BasicDistributedZkTest.test-seed#[6DBC95514E2684D]) [    ] o.a.s.c.s.e.JettySolrRunner Jetty properties: {solr.data.dir=/x1/jenkins/jenkins-slave/workspace/Lucene-Solr-NightlyTests-7.x/checkout/solr/build/solr-core/test/J1/temp/solr.cloud.BasicDistributedZkTest_6DBC95514E2684D-001/tempDir-001/jetty2, replicaType=TLOG, solrconfig=solrconfig.xml, hostContext=/, hostPort=45681, coreRootDirectory=/x1/jenkins/jenkins-slave/workspace/Lucene-Solr-NightlyTests-7.x/checkout/solr/build/solr-core/test/J1/../../../../../../../../../../../x1/jenkins/jenkins-slave/workspace/Lucene-Solr-NightlyTests-7.x/checkout/solr/build/solr-core/test/J1/temp/solr.cloud.BasicDistributedZkTest_6DBC95514E2684D-001/shard-2-001/cores}
   [junit4]   2> 1743300 ERROR (TEST-BasicDistributedZkTest.test-seed#[6DBC95514E2684D]) [    ] o.a.s.u.StartupLoggingUtils Missing Java Option solr.log.dir. Logging may be missing or incomplete.
   [junit4]   2> 1743300 INFO  (TEST-BasicDistributedZkTest.test-seed#[6DBC95514E2684D]) [    ] o.a.s.s.SolrDispatchFilter Using logger factory org.apache.logging.slf4j.Log4jLoggerFactory
   [junit4]   2> 1743300 INFO  (TEST-BasicDistributedZkTest.test-seed#[6DBC95514E2684D]) [    ] o.a.s.s.SolrDispatchFilter  ___      _       Welcome to Apache Solr™ version 7.5.0
   [junit4]   2> 1743300 INFO  (TEST-BasicDistributedZkTest.test-seed#[6DBC95514E2684D]) [    ] o.a.s.s.SolrDispatchFilter / __| ___| |_ _   Starting in cloud mode on port null
   [junit4]   2> 1743300 INFO  (TEST-BasicDistributedZkTest.test-seed#[6DBC95514E2684D]) [    ] o.a.s.s.SolrDispatchFilter \__ \/ _ \ | '_|  Install dir: null
   [junit4]   2> 1743300 INFO  (TEST-BasicDistributedZkTest.test-seed#[6DBC95514E2684D]) [    ] o.a.s.s.SolrDispatchFilter |___/\___/_|_|    Start time: 2018-09-04T02:32:28.031Z
   [junit4]   2> 1743301 INFO  (zkConnectionManagerCallback-3582-thread-1) [    ] o.a.s.c.c.ConnectionManager zkClient has connected
   [junit4]   2> 1743302 INFO  (TEST-BasicDistributedZkTest.test-seed#[6DBC95514E2684D]) [    ] o.a.s.s.SolrDispatchFilter Loading solr.xml from SolrHome (not found in ZooKeeper)
   [junit4]   2> 1743302 INFO  (TEST-BasicDistributedZkTest.test-seed#[6DBC95514E2684D]) [    ] o.a.s.c.SolrXmlConfig Loading container configuration from /x1/jenkins/jenkins-slave/workspace/Lucene-Solr-NightlyTests-7.x/checkout/solr/build/solr-core/test/J1/temp/solr.cloud.BasicDistributedZkTest_6DBC95514E2684D-001/shard-2-001/solr.xml
   [junit4]   2> 1743305 INFO  (TEST-BasicDistributedZkTest.test-seed#[6DBC95514E2684D]) [    ] o.a.s.c.SolrXmlConfig Configuration parameter autoReplicaFailoverWorkLoopDelay is ignored
   [junit4]   2> 1743305 INFO  (TEST-BasicDistributedZkTest.test-seed#[6DBC95514E2684D]) [    ] o.a.s.c.SolrXmlConfig Configuration parameter autoReplicaFailoverBadNodeExpiration is ignored
   [junit4]   2> 1743307 INFO  (TEST-BasicDistributedZkTest.test-seed#[6DBC95514E2684D]) [    ] o.a.s.c.SolrXmlConfig MBean server found: com.sun.jmx.mbeanserver.JmxMBeanServer@4de642f7, but no JMX reporters were configured - adding default JMX reporter.
   [junit4]   2> 1743576 INFO  (TEST-BasicDistributedZkTest.test-seed#[6DBC95514E2684D]) [    ] o.a.s.c.ZkContainer Zookeeper client=127.0.0.1:33405/solr
   [junit4]   2> 1743577 INFO  (zkConnectionManagerCallback-3586-thread-1) [    ] o.a.s.c.c.ConnectionManager zkClient has connected
   [junit4]   2> 1743579 INFO  (zkConnectionManagerCallback-3588-thread-1) [    ] o.a.s.c.c.ConnectionManager zkClient has connected
   [junit4]   2> 1743584 INFO  (TEST-BasicDistributedZkTest.test-seed#[6DBC95514E2684D]) [    ] o.a.s.c.c.ZkStateReader Updated live nodes from ZooKeeper... (0) -> (2)
   [junit4]   2> 1743587 INFO  (TEST-BasicDistributedZkTest.test-seed#[6DBC95514E2684D]) [    ] o.a.s.c.TransientSolrCoreCacheDefault Allocating transient cache for 4 transient cores
   [junit4]   2> 1743587 INFO  (TEST-BasicDistributedZkTest.test-seed#[6DBC95514E2684D]) [    ] o.a.s.c.ZkController Register node as live in ZooKeeper:/live_nodes/127.0.0.1:45681_
   [junit4]   2> 1743588 INFO  (zkCallback-3571-thread-1) [    ] o.a.s.c.c.ZkStateReader Updated live nodes from ZooKeeper... (2) -> (3)
   [junit4]   2> 1743588 INFO  (zkCallback-3552-thread-1) [    ] o.a.s.c.c.ZkStateReader Updated live nodes from ZooKeeper... (2) -> (3)
   [junit4]   2> 1743588 INFO  (zkCallback-3563-thread-1) [    ] o.a.s.c.c.ZkStateReader Updated live nodes from ZooKeeper... (2) -> (3)
   [junit4]   2> 1743589 INFO  (zkCallback-3545-thread-1) [    ] o.a.s.c.c.ZkStateReader Updated live nodes from ZooKeeper... (2) -> (3)
   [junit4]   2> 1743589 INFO  (zkCallback-3578-thread-1) [    ] o.a.s.c.c.ZkStateReader Updated live nodes from ZooKeeper... (2) -> (3)
   [junit4]   2> 1743593 INFO  (zkCallback-3587-thread-1) [    ] o.a.s.c.c.ZkStateReader Updated live nodes from ZooKeeper... (2) -> (3)
   [junit4]   2> 1743607 INFO  (zkConnectionManagerCallback-3595-thread-1) [    ] o.a.s.c.c.ConnectionManager zkClient has connected
   [junit4]   2> 1743608 INFO  (TEST-BasicDistributedZkTest.test-seed#[6DBC95514E2684D]) [    ] o.a.s.c.c.ZkStateReader Updated live nodes from ZooKeeper... (0) -> (3)
   [junit4]   2> 1743608 INFO  (TEST-BasicDistributedZkTest.test-seed#[6DBC95514E2684D]) [    ] o.a.s.c.s.i.ZkClientClusterStateProvider Cluster at 127.0.0.1:33405/solr ready
   [junit4]   2> 1743609 INFO  (TEST-BasicDistributedZkTest.test-seed#[6DBC95514E2684D]) [    ] o.a.s.h.a.MetricsHistoryHandler No .system collection, keeping metrics history in memory.
   [junit4]   2> 1743633 INFO  (TEST-BasicDistributedZkTest.test-seed#[6DBC95514E2684D]) [    ] o.a.s.m.r.SolrJmxReporter JMX monitoring for 'solr.node' (registry 'solr.node') enabled at server: com.sun.jmx.mbeanserver.JmxMBeanServer@4de642f7
   [junit4]   2> 1743642 INFO  (TEST-BasicDistributedZkTest.test-seed#[6DBC95514E2684D]) [    ] o.a.s.m.r.SolrJmxReporter JMX monitoring for 'solr.jvm' (registry 'solr.jvm') enabled at server: com.sun.jmx.mbeanserver.JmxMBeanServer@4de642f7
   [junit4]   2> 1743642 INFO  (TEST-BasicDistributedZkTest.test-seed#[6DBC95514E2684D]) [    ] o.a.s.m.r.SolrJmxReporter JMX monitoring for 'solr.jetty' (registry 'solr.jetty') enabled at server: com.sun.jmx.mbeanserver.JmxMBeanServer@4de642f7
   [junit4]   2> 1743644 INFO  (TEST-BasicDistributedZkTest.test-seed#[6DBC95514E2684D]) [    ] o.a.s.c.CorePropertiesLocator Found 0 core definitions underneath /x1/jenkins/jenkins-slave/workspace/Lucene-Solr-NightlyTests-7.x/checkout/solr/build/solr-core/test/J1/../../../../../../../../../../../x1/jenkins/jenkins-slave/workspace/Lucene-Solr-NightlyTests-7.x/checkout/solr/build/solr-core/test/J1/temp/solr.cloud.BasicDistributedZkTest_6DBC95514E2684D-001/shard-2-001/cores
   [junit4]   2> 1743675 INFO  (qtp378920599-13521) [n:127.0.0.1:41180_    ] o.a.s.h.a.CollectionsHandler Invoked Collection Action :addreplica with params node=127.0.0.1:45681_&action=ADDREPLICA&collection=collection1&shard=shard1&type=TLOG&wt=javabin&version=2 and sendToOCPQueue=true
   [junit4]   2> 1743677 INFO  (OverseerCollectionConfigSetProcessor-72274983583678468-127.0.0.1:46672_-n_0000000000) [n:127.0.0.1:46672_    ] o.a.s.c.OverseerTaskQueue Response ZK path: /overseer/collection-queue-work/qnr-0000000004 doesn't exist.  Requestor may have disconnected from ZooKeeper
   [junit4]   2> 1743678 INFO  (OverseerThreadFactory-5659-thread-4-processing-n:127.0.0.1:46672_) [n:127.0.0.1:46672_ c:collection1 s:shard1  ] o.a.s.c.a.c.AddReplicaCmd Node Identified 127.0.0.1:45681_ for creating new replica of shard shard1
   [junit4]   2> 1743680 INFO  (qtp1133494198-13563) [n:127.0.0.1:45681_    x:collection1_shard1_replica_t43] o.a.s.h.a.CoreAdminOperation core create command qt=/admin/cores&collection.configName=conf1&name=collection1_shard1_replica_t43&action=CREATE&collection=collection1&shard=shard1&wt=javabin&version=2&replicaType=TLOG
   [junit4]   2> 1743784 INFO  (zkCallback-3571-thread-1) [    ] o.a.s.c.c.ZkStateReader A cluster state change: [WatchedEvent state:SyncConnected type:NodeDataChanged path:/collections/collection1/state.json] for collection [collection1] has occurred - updating... (live nodes size: [3])
   [junit4]   2> 1744696 INFO  (qtp1133494198-13563) [n:127.0.0.1:45681_ c:collection1 s:shard1  x:collection1_shard1_replica_t43] o.a.s.c.SolrConfig Using Lucene MatchVersion: 7.5.0
   [junit4]   2> 1744709 INFO  (qtp1133494198-13563) [n:127.0.0.1:45681_ c:collection1 s:shard1  x:collection1_shard1_replica_t43] o.a.s.s.IndexSchema [collection1_shard1_replica_t43] Schema name=test
   [junit4]   2> 1744816 INFO  (qtp1133494198-13563) [n:127.0.0.1:45681_ c:collection1 s:shard1  x:collection1_shard1_replica_t43] o.a.s.s.IndexSchema Loaded schema test/1.0 with uniqueid field id
   [junit4]   2> 1744832 INFO  (qtp1133494198-13563) [n:127.0.0.1:45681_ c:collection1 s:shard1  x:collection1_shard1_replica_t43] o.a.s.c.CoreContainer Creating SolrCore 'collection1_shard1_replica_t43' using configuration from collection collection1, trusted=true
   [junit4]   2> 1744833 INFO  (qtp1133494198-13563) [n:127.0.0.1:45681_ c:collection1 s:shard1  x:collection1_shard1_replica_t43] o.a.s.m.r.SolrJmxReporter JMX monitoring for 'solr.core.collection1.shard1.replica_t43' (registry 'solr.core.collection1.shard1.replica_t43') enabled at server: com.sun.jmx.mbeanserver.JmxMBeanServer@4de642f7
   [junit4]   2> 1744833 INFO  (qtp1133494198-13563) [n:127.0.0.1:45681_ c:collection1 s:shard1  x:collection1_shard1_replica_t43] o.a.s.c.SolrCore solr.RecoveryStrategy.Builder
   [junit4]   2> 1744833 INFO  (qtp1133494198-13563) [n:127.0.0.1:45681_ c:collection1 s:shard1  x:collection1_shard1_replica_t43] o.a.s.c.SolrCore [[collection1_shard1_replica_t43] ] Opening new SolrCore at [/x1/jenkins/jenkins-slave/workspace/Lucene-Solr-NightlyTests-7.x/checkout/solr/build/solr-core/test/J1/temp/solr.cloud.BasicDistributedZkTest_6DBC95514E2684D-001/shard-2-001/cores/collection1_shard1_replica_t43], dataDir=[/x1/jenkins/jenkins-slave/workspace/Lucene-Solr-NightlyTests-7.x/checkout/solr/build/solr-core/test/J1/../../../../../../../../../../../x1/jenkins/jenkins-slave/workspace/Lucene-Solr-NightlyTests-7.x/checkout/solr/build/solr-core/test/J1/temp/solr.cloud.BasicDistributedZkTest_6DBC95514E2684D-001/shard-2-001/cores/collection1_shard1_replica_t43/data/]
   [junit4]   2> 1744835 INFO  (qtp1133494198-13563) [n:127.0.0.1:45681_ c:collection1 s:shard1  x:collection1_shard1_replica_t43] o.a.s.u.RandomMergePolicy RandomMergePolicy wrapping class org.apache.lucene.index.LogByteSizeMergePolicy: [LogByteSizeMergePolicy: minMergeSize=1677721, mergeFactor=47, maxMergeSize=2147483648, maxMergeSizeForForcedMerge=9223372036854775807, calibrateSizeByDeletes=true, maxMergeDocs=2147483647, maxCFSSegmentSizeMB=8.796093022207999E12, noCFSRatio=0.0]
   [junit4]   2> 1744837 WARN  (qtp1133494198-13563) [n:127.0.0.1:45681_ c:collection1 s:shard1  x:collection1_shard1_replica_t43] o.a.s.c.RequestHandlers INVALID paramSet a in requestHandler {type = requestHandler,name = /dump,class = DumpRequestHandler,attributes = {initParams=a, name=/dump, class=DumpRequestHandler},args = {defaults={a=A,b=B}}}
   [junit4]   2> 1744877 INFO  (qtp1133494198-13563) [n:127.0.0.1:45681_ c:collection1 s:shard1  x:collection1_shard1_replica_t43] o.a.s.u.UpdateHandler Using UpdateLog implementation: org.apache.solr.update.UpdateLog
   [junit4]   2> 1744877 INFO  (qtp1133494198-13563) [n:127.0.0.1:45681_ c:collection1 s:shard1  x:collection1_shard1_replica_t43] o.a.s.u.UpdateLog Initializing UpdateLog: dataDir= defaultSyncLevel=FLUSH numRecordsToKeep=100 maxNumLogsToKeep=10 numVersionBuckets=65536
   [junit4]   2> 1744878 INFO  (qtp1133494198-13563) [n:127.0.0.1:45681_ c:collection1 s:shard1  x:collection1_shard1_replica_t43] o.a.s.u.CommitTracker Hard AutoCommit: disabled
   [junit4]   2> 1744878 INFO  (qtp1133494198-13563) [n:127.0.0.1:45681_ c:collection1 s:shard1  x:collection1_shard1_replica_t43] o.a.s.u.CommitTracker Soft AutoCommit: disabled
   [junit4]   2> 1744879 INFO  (qtp1133494198-13563) [n:127.0.0.1:45681_ c:collection1 s:shard1  x:collection1_shard1_replica_t43] o.a.s.u.RandomMergePolicy RandomMergePolicy wrapping class org.apache.lucene.index.TieredMergePolicy: [TieredMergePolicy: maxMergeAtOnce=26, maxMergeAtOnceExplicit=10, maxMergedSegmentMB=31.75, floorSegmentMB=0.376953125, forceMergeDeletesPctAllowed=15.154936850745244, segmentsPerTier=30.0, maxCFSSegmentSizeMB=8.796093022207999E12, noCFSRatio=0.27173081292550416, deletesPctAllowed=44.33404226310273
   [junit4]   2> 1744879 INFO  (qtp1133494198-13563) [n:127.0.0.1:45681_ c:collection1 s:shard1  x:collection1_shard1_replica_t43] o.a.s.s.SolrIndexSearcher Opening [Searcher@169c543e[collection1_shard1_replica_t43] main]
   [junit4]   2> 1744880 INFO  (qtp1133494198-13563) [n:127.0.0.1:45681_ c:collection1 s:shard1  x:collection1_shard1_replica_t43] o.a.s.r.ManagedResourceStorage Configured ZooKeeperStorageIO with znodeBase: /configs/conf1
   [junit4]   2> 1744880 INFO  (qtp1133494198-13563) [n:127.0.0.1:45681_ c:collection1 s:shard1  x:collection1_shard1_replica_t43] o.a.s.r.ManagedResourceStorage Loaded null at path _rest_managed.json using ZooKeeperStorageIO:path=/configs/conf1
   [junit4]   2> 1744881 INFO  (qtp1133494198-13563) [n:127.0.0.1:45681_ c:collection1 s:shard1  x:collection1_shard1_replica_t43] o.a.s.h.ReplicationHandler Commits will be reserved for 10000ms.
   [junit4]   2> 1744882 INFO  (searcherExecutor-5692-thread-1-processing-n:127.0.0.1:45681_ x:collection1_shard1_replica_t43 c:collection1 s:shard1) [n:127.0.0.1:45681_ c:collection1 s:shard1  x:collection1_shard1_replica_t43] o.a.s.c.SolrCore [collection1_shard1_replica_t43] Registered new searcher Searcher@169c543e[collection1_shard1_replica_t43] main{ExitableDirectoryReader(UninvertingDirectoryReader())}
   [junit4]   2> 1744882 INFO  (qtp1133494198-13563) [n:127.0.0.1:45681_ c:collection1 s:shard1  x:collection1_shard1_replica_t43] o.a.s.u.UpdateLog Could not find max version in index or recent updates, using new clock 1610642462723801088
   [junit4]   2> 1744886 INFO  (qtp1133494198-13563) [n:127.0.0.1:45681_ c:collection1 s:shard1  x:collection1_shard1_replica_t43] o.a.s.c.ZkShardTerms Successful update of terms at /collections/collection1/terms/shard1 to Terms{values={core_node44=0}, version=0}
   [junit4]   2> 1744888 INFO  (qtp1133494198-13563) [n:127.0.0.1:45681_ c:collection1 s:shard1  x:collection1_shard1_replica_t43] o.a.s.c.ShardLeaderElectionContext Enough replicas found to continue.
   [junit4]   2> 1744888 INFO  (qtp1133494198-13563) [n:127.0.0.1:45681_ c:collection1 s:shard1  x:collection1_shard1_replica_t43] o.a.s.c.ShardLeaderElectionContext I may be the new leader - try and sync
   [junit4]   2> 1744888 INFO  (qtp1133494198-13563) [n:127.0.0.1:45681_ c:collection1 s:shard1  x:collection1_shard1_replica_t43] o.a.s.c.SyncStrategy Sync replicas to http://127.0.0.1:45681/collection1_shard1_replica_t43/
   [junit4]   2> 1744888 INFO  (qtp1133494198-13563) [n:127.0.0.1:45681_ c:collection1 s:shard1  x:collection1_shard1_replica_t43] o.a.s.c.SyncStrategy Sync Success - now sync replicas to me
   [junit4]   2> 1744888 INFO  (qtp1133494198-13563) [n:127.0.0.1:45681_ c:collection1 s:shard1  x:collection1_shard1_replica_t43] o.a.s.c.SyncStrategy http://127.0.0.1:45681/collection1_shard1_replica_t43/ has no replicas
   [junit4]   2> 1744888 INFO  (qtp1133494198-13563) [n:127.0.0.1:45681_ c:collection1 s:shard1  x:collection1_shard1_replica_t43] o.a.s.c.ShardLeaderElectionContext Found all replicas participating in election, clear LIR
   [junit4]   2> 1744888 INFO  (qtp1133494198-13563) [n:127.0.0.1:45681_ c:collection1 s:shard1  x:collection1_shard1_replica_t43] o.a.s.c.ZkController collection1_shard1_replica_t43 stopping background replication from leader
   [junit4]   2> 1744891 INFO  (qtp1133494198-13563) [n:127.0.0.1:45681_ c:collection1 s:shard1  x:collection1_shard1_replica_t43] o.a.s.c.ShardLeaderElectionContext I am the new leader: http://127.0.0.1:45681/collection1_shard1_replica_t43/ shard1
   [junit4]   2> 1744992 INFO  (zkCallback-3571-thread-1) [    ] o.a.s.c.c.ZkStateReader A cluster state change: [WatchedEvent state:SyncConnected type:NodeDataChanged path:/collections/collection1/state.json] for collection [collection1] has occurred - updating... (live nodes size: [3])
   [junit4]   2> 1744993 INFO  (qtp1133494198-13563) [n:127.0.0.1:45681_ c:collection1 s:shard1  x:collection1_shard1_replica_t43] o.a.s.c.ZkController I am the leader, no recovery necessary
   [junit4]   2> 1744994 INFO  (qtp1133494198-13563) [n:127.0.0.1:45681_ c:collection1 s:shard1  x:collection1_shard1_replica_t43] o.a.s.s.HttpSolrCall [admin] webapp=null path=/admin/cores params={qt=/admin/cores&collection.configName=conf1&name=collection1_shard1_replica_t43&action=CREATE&collection=collection1&shard=shard1&wt=javabin&version=2&replicaType=TLOG} status=0 QTime=1314
   [junit4]   2> 1744999 INFO  (qtp378920599-13521) [n:127.0.0.1:41180_ c:collection1   ] o.a.s.s.HttpSolrCall [admin] webapp=null path=/admin/collections params={node=127.0.0.1:45681_&action=ADDREPLICA&collection=collection1&shard=shard1&type=TLOG&wt=javabin&version=2} status=0 QTime=1323
   [junit4]   2> 1745095 INFO  (zkCallback-3571-thread-1) [    ] o.a.s.c.c.ZkStateReader A cluster state change: [WatchedEvent state:SyncConnected type:NodeDataChanged path:/collections/collection1/state.json] for collection [collection1] has occurred - updating... (live nodes size: [3])
   [junit4]   2> 1745095 INFO  (zkCallback-3587-thread-1) [    ] o.a.s.c.c.ZkStateReader A cluster state change: [WatchedEvent state:SyncConnected type:NodeDataChanged path:/collections/collection1/state.json] for collection [collection1] has occurred - updating... (live nodes size: [3])
   [junit4]   2> 1745120 INFO  (TEST-BasicDistributedZkTest.test-seed#[6DBC95514E2684D]) [    ] o.a.s.c.AbstractFullDistribZkTestBase create jetty 3 in directory /x1/jenkins/jenkins-slave/workspace/Lucene-Solr-NightlyTests-7.x/checkout/solr/build/solr-core/test/J1/temp/solr.cloud.BasicDistributedZkTest_6DBC95514E2684D-001/shard-3-001 of type TLOG
   [junit4]   2> 1745120 INFO  (TEST-BasicDistributedZkTest.test-seed#[6DBC95514E2684D]) [    ] o.e.j.s.Server jetty-9.4.11.v20180605; built: 2018-06-05T18:24:03.829Z; git: d5fc0523cfa96bfebfbda19606cad384d772f04c; jvm 1.8.0_172-b11
   [junit4]   2> 1745121 INFO  (TEST-BasicDistributedZkTest.test-seed#[6DBC95514E2684D]) [    ] o.e.j.s.session DefaultSessionIdManager workerName=node0
   [junit4]   2> 1745121 INFO  (TEST-BasicDistributedZkTest.test-seed#[6DBC95514E2684D]) [    ] o.e.j.s.session No SessionScavenger set, using defaults
   [junit4]   2> 1745121 INFO  (TEST-BasicDistributedZkTest.test-seed#[6DBC95514E2684D]) [    ] o.e.j.s.session node0 Scavenging every 660000ms
   [junit4]   2> 1745122 INFO  (TEST-BasicDistributedZkTest.test-seed#[6DBC95514E2684D]) [    ] o.e.j.s.h.ContextHandler Started o.e.j.s.ServletContextHandler@162b73ec{/,null,AVAILABLE}
   [junit4]   2> 1745122 INFO  (TEST-BasicDistributedZkTest.test-seed#[6DBC95514E2684D]) [    ] o.e.j.s.AbstractConnector Started ServerConnector@28c9b70{HTTP/1.1,[http/1.1]}{127.0.0.1:37567}
   [junit4]   2> 1745122 INFO  (TEST-BasicDistributedZkTest.test-seed#[6DBC95514E2684D]) [    ] o.e.j.s.Server Started @1745173ms
   [junit4]   2> 1745122 INFO  (TEST-BasicDistributedZkTest.test-seed#[6DBC95514E2684D]) [    ] o.a.s.c.s.e.JettySolrRunner Jetty properties: {solr.data.dir=/x1/jenkins/jenkins-slave/workspace/Lucene-Solr-NightlyTests-7.x/checkout/solr/build/solr-core/test/J1/temp/solr.cloud.BasicDistributedZkTest_6DBC95514E2684D-001/tempDir-001/jetty3, replicaType=TLOG, solrconfig=solrconfig.xml, hostContext=/, hostPort=37567, coreRootDirectory=/x1/jenkins/jenkins-slave/workspace/Lucene-Solr-NightlyTests-7.x/checkout/solr/build/solr-core/test/J1/../../../../../../../../../../../x1/jenkins/jenkins-slave/workspace/Lucene-Solr-NightlyTests-7.x/checkout/solr/build/solr-core/test/J1/temp/solr.cloud.BasicDistributedZkTest_6DBC95514E2684D-001/shard-3-001/cores}
   [junit4]   2> 1745122 ERROR (TEST-BasicDistributedZkTest.test-seed#[6DBC95514E2684D]) [    ] o.a.s.u.StartupLoggingUtils Missing Java Option solr.log.dir. Logging may be missing or incomplete.
   [junit4]   2> 1745122 INFO  (TEST-BasicDistributedZkTest.test-seed#[6DBC95514E2684D]) [    ] o.a.s.s.SolrDispatchFilter Using logger factory org.apache.logging.slf4j.Log4jLoggerFactory
   [junit4]   2> 1745122 INFO  (TEST-BasicDistributedZkTest.test-seed#[6DBC95514E2684D]) [    ] o.a.s.s.SolrDispatchFilter  ___      _       Welcome to Apache Solr™ version 7.5.0
   [junit4]   2> 1745122 INFO  (TEST-BasicDistributedZkTest.test-seed#[6DBC95514E2684D]) [    ] o.a.s.s.SolrDispatchFilter / __| ___| |_ _   Starting in cloud mode on port null
   [junit4]   2> 1745122 INFO  (TEST-BasicDistributedZkTest.test-seed#[6DBC95514E2684D]) [    ] o.a.s.s.SolrDispatchFilter \__ \/ _ \ | '_|  Install dir: null
   [junit4]   2> 1745122 INFO  (TEST-BasicDistributedZkTest.test-seed#[6DBC95514E2684D]) [    ] o.a.s.s.SolrDispatchFilter |___/\___/_|_|    Start time: 2018-09-04T02:32:29.853Z
   [junit4]   2> 1745124 INFO  (zkConnectionManagerCallback-3598-thread-1) [    ] o.a.s.c.c.ConnectionManager zkClient has connected
   [junit4]   2> 1745125 INFO  (TEST-BasicDistributedZkTest.test-seed#[6DBC95514E2684D]) [    ] o.a.s.s.SolrDispatchFilter Loading solr.xml from SolrHome (not found in ZooKeeper)
   [junit4]   2> 1745125 INFO  (TEST-BasicDistributedZkTest.test-seed#[6DBC95514E2684D]) [    ] o.a.s.c.SolrXmlConfig Loading container configuration from /x1/jenkins/jenkins-slave/workspace/Lucene-Solr-NightlyTests-7.x/checkout/solr/build/solr-core/test/J1/temp/solr.cloud.BasicDistributedZkTest_6DBC95514E2684D-001/shard-3-001/solr.xml
   [junit4]   2> 1745128 INFO  (TEST-BasicDistributedZkTest.test-seed#[6DBC95514E2684D]) [    ] o.a.s.c.SolrXmlConfig Configuration parameter autoReplicaFailoverWorkLoopDelay is ignored
   [junit4]   2> 1745128 INFO  (TEST-BasicDistributedZkTest.test-seed#[6DBC95514E2684D]) [    ] o.a.s.c.SolrXmlConfig Configuration parameter autoReplicaFailoverBadNodeExpiration is ignored
   [junit4]   2> 1745129 INFO  (TEST-BasicDistributedZkTest.test-seed#[6DBC95514E2684D]) [    ] o.a.s.c.SolrXmlConfig MBean server found: com.sun.jmx.mbeanserver.JmxMBeanServer@4de642f7, but no JMX reporters were configured - adding default JMX reporter.
   [junit4]   2> 1745306 INFO  (TEST-BasicDistributedZkTest.test-seed#[6DBC95514E2684D]) [    ] o.a.s.c.ZkContainer Zookeeper client=127.0.0.1:33405/solr
   [junit4]   2> 1745307 INFO  (zkConnectionManagerCallback-3602-thread-1) [    ] o.a.s.c.c.ConnectionManager zkClient has connected
   [junit4]   2> 1745309 INFO  (zkConnectionManagerCallback-3604-thread-1) [    ] o.a.s.c.c.ConnectionManager zkClient has connected
   [junit4]   2> 1745313 INFO  (TEST-BasicDistributedZkTest.test-seed#[6DBC95514E2684D]) [    ] o.a.s.c.c.ZkStateReader Updated live nodes from ZooKeeper... (0) -> (3)
   [junit4]   2> 1745316 INFO  (TEST-BasicDistributedZkTest.test-seed#[6DBC95514E2684D]) [    ] o.a.s.c.TransientSolrCoreCacheDefault Allocating transient cache for 4 transient cores
   [junit4]   2> 1745317 INFO  (TEST-BasicDistributedZkTest.test-seed#[6DBC95514E2684D]) [    ] o.a.s.c.ZkController Register node as live in ZooKeeper:/live_nodes/127.0.0.1:37567_
   [junit4]   2> 1745317 INFO  (zkCallback-3578-thread-1) [    ] o.a.s.c.c.ZkStateReader Updated live nodes from ZooKeeper... (3) -> (4)
   [junit4]   2> 1745318 INFO  (zkCallback-3563-thread-1) [    ] o.a.s.c.c.ZkStateReader Updated live nodes from ZooKeeper... (3) -> (4)
   [junit4]   2> 1745318 INFO  (zkCallback-3587-thread-1) [    ] o.a.s.c.c.ZkStateReader Updated live nodes from ZooKeeper... (3) -> (4)
   [junit4]   2> 1745318 INFO  (zkCallback-3545-thread-1) [    ] o.a.s.c.c.ZkStateReader Updated live nodes from ZooKeeper... (3) -> (4)
   [junit4]   2> 1745318 INFO  (zkCallback-3552-thread-1) [    ] o.a.s.c.c.ZkStateReader Updated live nodes from ZooKeeper... (3) -> (4)
   [junit4]   2> 1745318 INFO  (zkCallback-3571-thread-1) [    ] o.a.s.c.c.ZkStateReader Updated live nodes from ZooKeeper... (3) -> (4)
   [junit4]   2> 1745318 INFO  (zkCallback-3603-thread-1) [    ] o.a.s.c.c.ZkStateReader Updated live nodes from ZooKeeper... (3) -> (4)
   [junit4]   2> 1745318 INFO  (zkCallback-3594-thread-1) [    ] o.a.s.c.c.ZkStateReader Updated live nodes from ZooKeeper... (3) -> (4)
   [junit4]   2> 1745335 INFO  (zkConnectionManagerCallback-3611-thread-1) [    ] o.a.s.c.c.ConnectionManager zkClient has connected
   [junit4]   2> 1745336 INFO  (TEST-BasicDistributedZkTest.test-seed#[6DBC95514E2684D]) [    ] o.a.s.c.c.ZkStateReader Updated live nodes from ZooKeeper... (0) -> (4)
   [junit4]   2> 1745336 INFO  (TEST-BasicDistributedZkTest.test-seed#[6DBC95514E2684D]) [    ] o.a.s.c.s.i.ZkClientClusterStateProvider Cluster at 127.0.0.1:33405/solr ready
   [junit4]   2> 1745337 INFO  (TEST-BasicDistributedZkTest.test-seed#[6DBC95514E2684D]) [    ] o.a.s.h.a.MetricsHistoryHandler No .system collection, keeping metrics history in memory.
   [junit4]   2> 1745355 INFO  (TEST-BasicDistributedZkTest.test-seed#[6DBC95514E2684D]) [    ] o.a.s.m.r.SolrJmxReporter JMX monitoring for 'solr.node' (registry 'solr.node') enabled at server: com.sun.jmx.mbeanserver.JmxMBeanServer@4de642f7
   [junit4]   2> 1745364 INFO  (TEST-BasicDistributedZkTest.test-seed#[6DBC95514E2684D]) [    ] o.a.s.m.r.SolrJmxReporter JMX monitoring for 'solr.jvm' (registry 'solr.jvm') enabled at server: com.sun.jmx.mbeanserver.JmxMBeanServer@4de642f7
   [junit4]   2> 1745364 INFO  (TEST-BasicDistributedZkTest.test-seed#[6DBC95514E2684D]) [    ] o.a.s.m.r.SolrJmxReporter JMX monitoring for 'solr.jetty' (registry 'solr.jetty') enabled at server: com.sun.jmx.mbeanserver.JmxMBeanServer@4de642f7
   [junit4]   2> 1745366 INFO  (TEST-BasicDistributedZkTest.test-seed#[6DBC95514E2684D]) [    ] o.a.s.c.CorePropertiesLocator Found 0 core definitions underneath /x1/jenkins/jenkins-slave/workspace/Lucene-Solr-NightlyTests-7.x/checkout/solr/build/solr-core/test/J1/../../../../../../../../../../../x1/jenkins/jenkins-slave/workspace/Lucene-Solr-NightlyTests-7.x/checkout/solr/build/solr-core/test/J1/temp/solr.cloud.BasicDistributedZkTest_6DBC95514E2684D-001/shard-3-001/cores
   [junit4]   2> 1745408 INFO  (qtp1395569545-13601) [n:127.0.0.1:37567_    ] o.a.s.h.a.CollectionsHandler Invoked Collection Action :addreplica with params node=127.0.0.1:37567_&action=ADDREPLICA&collection=collection1&shard=shard2&type=TLOG&wt=javabin&version=2 and sendToOCPQueue=true
   [junit4]   2> 1745417 INFO  (OverseerCollectionConfigSetProcessor-72274983583678468-127.0.0.1:46672_-n_0000000000) [n:127.0.0.1:46672_    ] o.a.s.c.OverseerTaskQueue Response ZK path: /overseer/collection-queue-work/qnr-0000000006 doesn't exist.  Requestor may have disconnected from ZooKeeper
   [junit4]   2> 1745418 INFO  (OverseerThreadFactory-5659-thread-5-processing-n:127.0.0.1:46672_) [n:127.0.0.1:46672_ c:collection1 s:shard2  ] o.a.s.c.a.c.AddReplicaCmd Node Identified 127.0.0.1:37567_ for creating new replica of shard shard2
   [junit4]   2> 1745421 INFO  (qtp1395569545-13596) [n:127.0.0.1:37567_    x:collection1_shard2_replica_t45] o.a.s.h.a.CoreAdminOperation core create command qt=/admin/cores&collection.configName=conf1&name=collection1_shard2_replica_t45&action=CREATE&collection=collection1&shard=shard2&wt=javabin&version=2&replicaType=TLOG
   [junit4]   2> 1745524 INFO  (zkCallback-3571-thread-1) [    ] o.a.s.c.c.ZkStateReader A cluster state change: [WatchedEvent state:SyncConnected type:NodeDataChanged path:/collections/collection1/state.json] for collection [collection1] has occurred - updating... (live nodes size: [4])
   [junit4]   2> 1745524 INFO  (zkCallback-3587-thread-1) [    ] o.a.s.c.c.ZkStateReader A cluster state change: [WatchedEvent state:SyncConnected type:NodeDataChanged path:/collections/collection1/state.json] for collection [collection1] has occurred - updating... (live nodes size: [4])
   [junit4]   2> 1746475 INFO  (qtp1395569545-13596) [n:127.0.0.1:37567_ c:collection1 s:shard2  x:collection1_shard2_replica_t45] o.a.s.c.SolrConfig Using Lucene MatchVersion: 7.5.0
   [junit4]   2> 1746493 INFO  (qtp1395569545-13596) [n:127.0.0.1:37567_ c:collection1 s:shard2  x:collection1_shard2_replica_t45] o.a.s.s.IndexSchema [collection1_shard2_replica_t45] Schema name=test
   [junit4]   2> 1746667 INFO  (qtp1395569545-13596) [n:127.0.0.1:37567_ c:collection1 s:shard2  x:collection1_shard2_replica_t45] o.a.s.s.IndexSchema Loaded schema test/1.0 with uniqueid field id
   [junit4]   2> 1746688 INFO  (qtp1395569545-13596) [n:127.0.0.1:37567_ c:collection1 s:shard2  x:collection1_shard2_replica_t45] o.a.s.c.CoreContainer Creating SolrCore 'collection1_shard2_replica_t45' using configuration from collection collection1, trusted=true
   [junit4]   2> 1746689 INFO  (qtp1395569545-13596) [n:127.0.0.1:37567_ c:collection1 s:shard2  x:collection1_shard2_replica_t45] o.a.s.m.r.SolrJmxReporter JMX monitoring for 'solr.core.collection1.shard2.replica_t45' (registry 'solr.core.collection1.shard2.replica_t45') enabled at server: com.sun.jmx.mbeanserver.JmxMBeanServer@4de642f7
   [junit4]   2> 1746689 INFO  (qtp1395569545-13596) [n:127.0.0.1:37567_ c:collection1 s:shard2  x:collection1_shard2_replica_t45] o.a.s.c.SolrCore solr.RecoveryStrategy.Builder
   [junit4]   2> 1746689 INFO  (qtp1395569545-13596) [n:127.0.0.1:37567_ c:collection1 s:shard2  x:collection1_shard2_replica_t45] o.a.s.c.SolrCore [[collection1_shard2_replica_t45] ] Opening new SolrCore at [/x1/jenkins/jenkins-slave/workspace/Lucene-Solr-NightlyTests-7.x/checkout/solr/build/solr-core/test/J1/temp/solr.cloud.BasicDistributedZkTest_6DBC95514E2684D-001/shard-3-001/cores/collection1_shard2_replica_t45], dataDir=[/x1/jenkins/jenkins-slave/workspace/Lucene-Solr-NightlyTests-7.x/checkout/solr/build/solr-core/test/J1/../../../../../../../../../../../x1/jenkins/jenkins-slave/workspace/Lucene-Solr-NightlyTests-7.x/checkout/solr/build/solr-core/test/J1/temp/solr.cloud.BasicDistributedZkTest_6DBC95514E2684D-001/shard-3-001/cores/collection1_shard2_replica_t45/data/]
   [junit4]   2> 1746693 INFO  (qtp1395569545-13596) [n:127.0.0.1:37567_ c:collection1 s:shard2  x:collection1_shard2_replica_t45] o.a.s.u.RandomMergePolicy RandomMergePolicy wrapping class org.apache.lucene.index.LogByteSizeMergePolicy: [LogByteSizeMergePolicy: minMergeSize=1677721, mergeFactor=47, maxMergeSize=2147483648, maxMergeSizeForForcedMerge=9223372036854775807, calibrateSizeByDeletes=true, maxMergeDocs=2147483647, maxCFSSegmentSizeMB=8.796093022207999E12, noCFSRatio=0.0]
   [junit4]   2> 1746695 WARN  (qtp1395569545-13596) [n:127.0.0.1:37567_ c:collection1 s:shard2  x:collection1_shard2_replica_t45] o.a.s.c.RequestHandlers INVALID paramSet a in requestHandler {type = requestHandler,name = /dump,class = DumpRequestHandler,attributes = {initParams=a, name=/dump, class=DumpRequestHandler},args = {defaults={a=A,b=B}}}
   [junit4]   2> 1746743 INFO  (qtp1395569545-13596) [n:127.0.0.1:37567_ c:collection1 s:shard2  x:collection1_shard2_replica_t45] o.a.s.u.UpdateHandler Using UpdateLog implementation: org.apache.solr.update.UpdateLog
   [junit4]   2> 1746743 INFO  (qtp1395569545-13596) [n:127.0.0.1:37567_ c:collection1 s:shard2  x:collection1_shard2_replica_t45] o.a.s.u.UpdateLog Initializing UpdateLog: dataDir= defaultSyncLevel=FLUSH numRecordsToKeep=100 maxNumLogsToKeep=10 numVersionBuckets=65536
   [junit4]   2> 1746744 INFO  (qtp1395569545-13596) [n:127.0.0.1:37567_ c:collection1 s:shard2  x:collection1_shard2_replica_t45] o.a.s.u.CommitTracker Hard AutoCommit: disabled
   [junit4]   2> 1746744 INFO  (qtp1395569545-13596) [n:127.0.0.1

[...truncated too long message...]

heckout/lucene/top-level-ivy-settings.xml

resolve:

ivy-availability-check:
[loadresource] Do not set property disallowed.ivy.jars.list as its length is 0.

-ivy-fail-disallowed-ivy-version:

ivy-fail:

ivy-configure:
[ivy:configure] :: loading settings :: file = /x1/jenkins/jenkins-slave/workspace/Lucene-Solr-NightlyTests-7.x/checkout/lucene/top-level-ivy-settings.xml

resolve:

ivy-availability-check:
[loadresource] Do not set property disallowed.ivy.jars.list as its length is 0.

-ivy-fail-disallowed-ivy-version:

ivy-fail:

ivy-fail:

ivy-configure:
[ivy:configure] :: loading settings :: file = /x1/jenkins/jenkins-slave/workspace/Lucene-Solr-NightlyTests-7.x/checkout/lucene/top-level-ivy-settings.xml

resolve:

ivy-availability-check:
[loadresource] Do not set property disallowed.ivy.jars.list as its length is 0.

-ivy-fail-disallowed-ivy-version:

ivy-fail:

ivy-configure:
[ivy:configure] :: loading settings :: file = /x1/jenkins/jenkins-slave/workspace/Lucene-Solr-NightlyTests-7.x/checkout/lucene/top-level-ivy-settings.xml

resolve:

ivy-availability-check:
[loadresource] Do not set property disallowed.ivy.jars.list as its length is 0.

-ivy-fail-disallowed-ivy-version:

ivy-fail:

ivy-fail:

ivy-configure:
[ivy:configure] :: loading settings :: file = /x1/jenkins/jenkins-slave/workspace/Lucene-Solr-NightlyTests-7.x/checkout/lucene/top-level-ivy-settings.xml

resolve:

ivy-availability-check:
[loadresource] Do not set property disallowed.ivy.jars.list as its length is 0.

-ivy-fail-disallowed-ivy-version:

ivy-fail:

ivy-fail:

ivy-configure:
[ivy:configure] :: loading settings :: file = /x1/jenkins/jenkins-slave/workspace/Lucene-Solr-NightlyTests-7.x/checkout/lucene/top-level-ivy-settings.xml

resolve:

ivy-availability-check:
[loadresource] Do not set property disallowed.ivy.jars.list as its length is 0.

-ivy-fail-disallowed-ivy-version:

ivy-fail:

ivy-fail:

ivy-configure:
[ivy:configure] :: loading settings :: file = /x1/jenkins/jenkins-slave/workspace/Lucene-Solr-NightlyTests-7.x/checkout/lucene/top-level-ivy-settings.xml

resolve:

ivy-availability-check:
[loadresource] Do not set property disallowed.ivy.jars.list as its length is 0.

-ivy-fail-disallowed-ivy-version:

ivy-fail:

ivy-fail:

ivy-configure:
[ivy:configure] :: loading settings :: file = /x1/jenkins/jenkins-slave/workspace/Lucene-Solr-NightlyTests-7.x/checkout/lucene/top-level-ivy-settings.xml

resolve:

ivy-availability-check:
[loadresource] Do not set property disallowed.ivy.jars.list as its length is 0.

-ivy-fail-disallowed-ivy-version:

ivy-fail:

ivy-fail:

ivy-configure:
[ivy:configure] :: loading settings :: file = /x1/jenkins/jenkins-slave/workspace/Lucene-Solr-NightlyTests-7.x/checkout/lucene/top-level-ivy-settings.xml

resolve:

ivy-availability-check:
[loadresource] Do not set property disallowed.ivy.jars.list as its length is 0.

-ivy-fail-disallowed-ivy-version:

ivy-fail:

ivy-fail:

ivy-configure:
[ivy:configure] :: loading settings :: file = /x1/jenkins/jenkins-slave/workspace/Lucene-Solr-NightlyTests-7.x/checkout/lucene/top-level-ivy-settings.xml

resolve:

ivy-availability-check:
[loadresource] Do not set property disallowed.ivy.jars.list as its length is 0.

-ivy-fail-disallowed-ivy-version:

ivy-fail:

ivy-fail:

ivy-configure:
[ivy:configure] :: loading settings :: file = /x1/jenkins/jenkins-slave/workspace/Lucene-Solr-NightlyTests-7.x/checkout/lucene/top-level-ivy-settings.xml

resolve:

ivy-availability-check:
[loadresource] Do not set property disallowed.ivy.jars.list as its length is 0.

-ivy-fail-disallowed-ivy-version:

ivy-fail:

ivy-fail:

ivy-configure:
[ivy:configure] :: loading settings :: file = /x1/jenkins/jenkins-slave/workspace/Lucene-Solr-NightlyTests-7.x/checkout/lucene/top-level-ivy-settings.xml

resolve:

ivy-availability-check:
[loadresource] Do not set property disallowed.ivy.jars.list as its length is 0.

-ivy-fail-disallowed-ivy-version:

ivy-fail:

ivy-fail:

ivy-configure:
[ivy:configure] :: loading settings :: file = /x1/jenkins/jenkins-slave/workspace/Lucene-Solr-NightlyTests-7.x/checkout/lucene/top-level-ivy-settings.xml

resolve:

ivy-availability-check:
[loadresource] Do not set property disallowed.ivy.jars.list as its length is 0.

-ivy-fail-disallowed-ivy-version:

ivy-fail:

ivy-fail:

ivy-configure:
[ivy:configure] :: loading settings :: file = /x1/jenkins/jenkins-slave/workspace/Lucene-Solr-NightlyTests-7.x/checkout/lucene/top-level-ivy-settings.xml

resolve:

jar-checksums:
    [mkdir] Created dir: /x1/jenkins/jenkins-slave/workspace/Lucene-Solr-NightlyTests-7.x/checkout/solr/null641910822
     [copy] Copying 239 files to /x1/jenkins/jenkins-slave/workspace/Lucene-Solr-NightlyTests-7.x/checkout/solr/null641910822
   [delete] Deleting directory /x1/jenkins/jenkins-slave/workspace/Lucene-Solr-NightlyTests-7.x/checkout/solr/null641910822

check-working-copy:
[ivy:cachepath] :: resolving dependencies :: org.eclipse.jgit#org.eclipse.jgit-caller;working
[ivy:cachepath] 	confs: [default]
[ivy:cachepath] 	found org.eclipse.jgit#org.eclipse.jgit;4.6.0.201612231935-r in public
[ivy:cachepath] 	found com.jcraft#jsch;0.1.53 in public
[ivy:cachepath] 	found com.googlecode.javaewah#JavaEWAH;1.1.6 in public
[ivy:cachepath] 	found org.apache.httpcomponents#httpclient;4.3.6 in public
[ivy:cachepath] 	found org.apache.httpcomponents#httpcore;4.3.3 in public
[ivy:cachepath] 	found commons-logging#commons-logging;1.1.3 in public
[ivy:cachepath] 	found commons-codec#commons-codec;1.6 in public
[ivy:cachepath] 	found org.slf4j#slf4j-api;1.7.2 in public
[ivy:cachepath] :: resolution report :: resolve 71ms :: artifacts dl 3ms
	---------------------------------------------------------------------
	|                  |            modules            ||   artifacts   |
	|       conf       | number| search|dwnlded|evicted|| number|dwnlded|
	---------------------------------------------------------------------
	|      default     |   8   |   0   |   0   |   0   ||   8   |   0   |
	---------------------------------------------------------------------
[wc-checker] Initializing working copy...
[wc-checker] SLF4J: Failed to load class "org.slf4j.impl.StaticLoggerBinder".
[wc-checker] SLF4J: Defaulting to no-operation (NOP) logger implementation
[wc-checker] SLF4J: See http://www.slf4j.org/codes.html#StaticLoggerBinder for further details.
[wc-checker] Checking working copy status...

-jenkins-base:

BUILD SUCCESSFUL
Total time: 302 minutes 34 seconds
Archiving artifacts
java.lang.InterruptedException: no matches found within 10000
	at hudson.FilePath$34.hasMatch(FilePath.java:2678)
	at hudson.FilePath$34.invoke(FilePath.java:2557)
	at hudson.FilePath$34.invoke(FilePath.java:2547)
	at hudson.FilePath$FileCallableWrapper.call(FilePath.java:2918)
Also:   hudson.remoting.Channel$CallSiteStackTrace: Remote call to lucene
		at hudson.remoting.Channel.attachCallSiteStackTrace(Channel.java:1741)
		at hudson.remoting.UserRequest$ExceptionResponse.retrieve(UserRequest.java:357)
		at hudson.remoting.Channel.call(Channel.java:955)
		at hudson.FilePath.act(FilePath.java:1036)
		at hudson.FilePath.act(FilePath.java:1025)
		at hudson.FilePath.validateAntFileMask(FilePath.java:2547)
		at hudson.tasks.ArtifactArchiver.perform(ArtifactArchiver.java:243)
		at hudson.tasks.BuildStepCompatibilityLayer.perform(BuildStepCompatibilityLayer.java:81)
		at hudson.tasks.BuildStepMonitor$1.perform(BuildStepMonitor.java:20)
		at hudson.model.AbstractBuild$AbstractBuildExecution.perform(AbstractBuild.java:744)
		at hudson.model.AbstractBuild$AbstractBuildExecution.performAllBuildSteps(AbstractBuild.java:690)
		at hudson.model.Build$BuildExecution.post2(Build.java:186)
		at hudson.model.AbstractBuild$AbstractBuildExecution.post(AbstractBuild.java:635)
		at hudson.model.Run.execute(Run.java:1819)
		at hudson.model.FreeStyleBuild.run(FreeStyleBuild.java:43)
		at hudson.model.ResourceController.execute(ResourceController.java:97)
		at hudson.model.Executor.run(Executor.java:429)
Caused: hudson.FilePath$TunneledInterruptedException
	at hudson.FilePath$FileCallableWrapper.call(FilePath.java:2920)
	at hudson.remoting.UserRequest.perform(UserRequest.java:212)
	at hudson.remoting.UserRequest.perform(UserRequest.java:54)
	at hudson.remoting.Request$2.run(Request.java:369)
	at hudson.remoting.InterceptingExecutorService$1.call(InterceptingExecutorService.java:72)
	at java.util.concurrent.FutureTask.run(FutureTask.java:266)
	at java.util.concurrent.ThreadPoolExecutor.runWorker(ThreadPoolExecutor.java:1142)
	at java.util.concurrent.ThreadPoolExecutor$Worker.run(ThreadPoolExecutor.java:617)
	at java.lang.Thread.run(Thread.java:748)
Caused: java.lang.InterruptedException: java.lang.InterruptedException: no matches found within 10000
	at hudson.FilePath.act(FilePath.java:1038)
	at hudson.FilePath.act(FilePath.java:1025)
	at hudson.FilePath.validateAntFileMask(FilePath.java:2547)
	at hudson.tasks.ArtifactArchiver.perform(ArtifactArchiver.java:243)
	at hudson.tasks.BuildStepCompatibilityLayer.perform(BuildStepCompatibilityLayer.java:81)
	at hudson.tasks.BuildStepMonitor$1.perform(BuildStepMonitor.java:20)
	at hudson.model.AbstractBuild$AbstractBuildExecution.perform(AbstractBuild.java:744)
	at hudson.model.AbstractBuild$AbstractBuildExecution.performAllBuildSteps(AbstractBuild.java:690)
	at hudson.model.Build$BuildExecution.post2(Build.java:186)
	at hudson.model.AbstractBuild$AbstractBuildExecution.post(AbstractBuild.java:635)
	at hudson.model.Run.execute(Run.java:1819)
	at hudson.model.FreeStyleBuild.run(FreeStyleBuild.java:43)
	at hudson.model.ResourceController.execute(ResourceController.java:97)
	at hudson.model.Executor.run(Executor.java:429)
No artifacts found that match the file pattern "**/*.events,heapdumps/**,**/hs_err_pid*". Configuration error?
Recording test results
Build step 'Publish JUnit test result report' changed build result to UNSTABLE
Email was triggered for: Unstable (Test Failures)
Sending email for trigger: Unstable (Test Failures)

Mime
View raw message