lucene-dev mailing list archives

Site index · List index
Message view « Date » · « Thread »
Top « Date » · « Thread »
From Policeman Jenkins Server <jenk...@thetaphi.de>
Subject [JENKINS] Lucene-Solr-master-Solaris (64bit/jdk1.8.0) - Build # 2071 - Still Unstable!
Date Sun, 23 Sep 2018 03:47:59 GMT
Build: https://jenkins.thetaphi.de/job/Lucene-Solr-master-Solaris/2071/
Java: 64bit/jdk1.8.0 -XX:+UseCompressedOops -XX:+UseParallelGC

5 tests failed.
FAILED:  org.apache.solr.cloud.MoveReplicaHDFSTest.testFailedMove

Error Message:
No live SolrServers available to handle this request:[http://127.0.0.1:33232/solr/MoveReplicaHDFSTest_failed_coll_true, http://127.0.0.1:33394/solr/MoveReplicaHDFSTest_failed_coll_true]

Stack Trace:
org.apache.solr.client.solrj.SolrServerException: No live SolrServers available to handle this request:[http://127.0.0.1:33232/solr/MoveReplicaHDFSTest_failed_coll_true, http://127.0.0.1:33394/solr/MoveReplicaHDFSTest_failed_coll_true]
	at __randomizedtesting.SeedInfo.seed([C2C6E33908AA1145:680B30CBBF79C495]:0)
	at org.apache.solr.client.solrj.impl.LBHttpSolrClient.request(LBHttpSolrClient.java:462)
	at org.apache.solr.client.solrj.impl.CloudSolrClient.sendRequest(CloudSolrClient.java:1107)
	at org.apache.solr.client.solrj.impl.CloudSolrClient.requestWithRetryOnStaleState(CloudSolrClient.java:884)
	at org.apache.solr.client.solrj.impl.CloudSolrClient.requestWithRetryOnStaleState(CloudSolrClient.java:994)
	at org.apache.solr.client.solrj.impl.CloudSolrClient.request(CloudSolrClient.java:817)
	at org.apache.solr.client.solrj.SolrRequest.process(SolrRequest.java:194)
	at org.apache.solr.client.solrj.SolrClient.query(SolrClient.java:942)
	at org.apache.solr.cloud.MoveReplicaTest.testFailedMove(MoveReplicaTest.java:301)
	at sun.reflect.NativeMethodAccessorImpl.invoke0(Native Method)
	at sun.reflect.NativeMethodAccessorImpl.invoke(NativeMethodAccessorImpl.java:62)
	at sun.reflect.DelegatingMethodAccessorImpl.invoke(DelegatingMethodAccessorImpl.java:43)
	at java.lang.reflect.Method.invoke(Method.java:498)
	at com.carrotsearch.randomizedtesting.RandomizedRunner.invoke(RandomizedRunner.java:1742)
	at com.carrotsearch.randomizedtesting.RandomizedRunner$8.evaluate(RandomizedRunner.java:935)
	at com.carrotsearch.randomizedtesting.RandomizedRunner$9.evaluate(RandomizedRunner.java:971)
	at com.carrotsearch.randomizedtesting.RandomizedRunner$10.evaluate(RandomizedRunner.java:985)
	at com.carrotsearch.randomizedtesting.rules.SystemPropertiesRestoreRule$1.evaluate(SystemPropertiesRestoreRule.java:57)
	at org.apache.lucene.util.TestRuleSetupTeardownChained$1.evaluate(TestRuleSetupTeardownChained.java:49)
	at org.apache.lucene.util.AbstractBeforeAfterRule$1.evaluate(AbstractBeforeAfterRule.java:45)
	at org.apache.lucene.util.TestRuleThreadAndTestName$1.evaluate(TestRuleThreadAndTestName.java:48)
	at org.apache.lucene.util.TestRuleIgnoreAfterMaxFailures$1.evaluate(TestRuleIgnoreAfterMaxFailures.java:64)
	at org.apache.lucene.util.TestRuleMarkFailure$1.evaluate(TestRuleMarkFailure.java:47)
	at com.carrotsearch.randomizedtesting.rules.StatementAdapter.evaluate(StatementAdapter.java:36)
	at com.carrotsearch.randomizedtesting.ThreadLeakControl$StatementRunner.run(ThreadLeakControl.java:368)
	at com.carrotsearch.randomizedtesting.ThreadLeakControl.forkTimeoutingTask(ThreadLeakControl.java:817)
	at com.carrotsearch.randomizedtesting.ThreadLeakControl$3.evaluate(ThreadLeakControl.java:468)
	at com.carrotsearch.randomizedtesting.RandomizedRunner.runSingleTest(RandomizedRunner.java:944)
	at com.carrotsearch.randomizedtesting.RandomizedRunner$5.evaluate(RandomizedRunner.java:830)
	at com.carrotsearch.randomizedtesting.RandomizedRunner$6.evaluate(RandomizedRunner.java:880)
	at com.carrotsearch.randomizedtesting.RandomizedRunner$7.evaluate(RandomizedRunner.java:891)
	at com.carrotsearch.randomizedtesting.rules.StatementAdapter.evaluate(StatementAdapter.java:36)
	at com.carrotsearch.randomizedtesting.rules.SystemPropertiesRestoreRule$1.evaluate(SystemPropertiesRestoreRule.java:57)
	at org.apache.lucene.util.AbstractBeforeAfterRule$1.evaluate(AbstractBeforeAfterRule.java:45)
	at com.carrotsearch.randomizedtesting.rules.StatementAdapter.evaluate(StatementAdapter.java:36)
	at org.apache.lucene.util.TestRuleStoreClassName$1.evaluate(TestRuleStoreClassName.java:41)
	at com.carrotsearch.randomizedtesting.rules.NoShadowingOrOverridesOnMethodsRule$1.evaluate(NoShadowingOrOverridesOnMethodsRule.java:40)
	at com.carrotsearch.randomizedtesting.rules.NoShadowingOrOverridesOnMethodsRule$1.evaluate(NoShadowingOrOverridesOnMethodsRule.java:40)
	at com.carrotsearch.randomizedtesting.rules.StatementAdapter.evaluate(StatementAdapter.java:36)
	at com.carrotsearch.randomizedtesting.rules.StatementAdapter.evaluate(StatementAdapter.java:36)
	at com.carrotsearch.randomizedtesting.rules.StatementAdapter.evaluate(StatementAdapter.java:36)
	at org.apache.lucene.util.TestRuleAssertionsRequired$1.evaluate(TestRuleAssertionsRequired.java:53)
	at org.apache.lucene.util.TestRuleMarkFailure$1.evaluate(TestRuleMarkFailure.java:47)
	at org.apache.lucene.util.TestRuleIgnoreAfterMaxFailures$1.evaluate(TestRuleIgnoreAfterMaxFailures.java:64)
	at org.apache.lucene.util.TestRuleIgnoreTestSuites$1.evaluate(TestRuleIgnoreTestSuites.java:54)
	at com.carrotsearch.randomizedtesting.rules.StatementAdapter.evaluate(StatementAdapter.java:36)
	at com.carrotsearch.randomizedtesting.ThreadLeakControl$StatementRunner.run(ThreadLeakControl.java:368)
	at java.lang.Thread.run(Thread.java:748)
Caused by: org.apache.solr.client.solrj.impl.HttpSolrClient$RemoteSolrException: Error from server at http://127.0.0.1:33232/solr/MoveReplicaHDFSTest_failed_coll_true: no servers hosting shard: shard2
	at org.apache.solr.client.solrj.impl.HttpSolrClient.executeMethod(HttpSolrClient.java:643)
	at org.apache.solr.client.solrj.impl.HttpSolrClient.request(HttpSolrClient.java:255)
	at org.apache.solr.client.solrj.impl.HttpSolrClient.request(HttpSolrClient.java:244)
	at org.apache.solr.client.solrj.impl.LBHttpSolrClient.doRequest(LBHttpSolrClient.java:483)
	at org.apache.solr.client.solrj.impl.LBHttpSolrClient.request(LBHttpSolrClient.java:436)
	... 46 more


FAILED:  org.apache.solr.cloud.MoveReplicaHDFSTest.testFailedMove

Error Message:
No live SolrServers available to handle this request:[http://127.0.0.1:64837/solr/MoveReplicaHDFSTest_failed_coll_true, http://127.0.0.1:62363/solr/MoveReplicaHDFSTest_failed_coll_true]

Stack Trace:
org.apache.solr.client.solrj.SolrServerException: No live SolrServers available to handle this request:[http://127.0.0.1:64837/solr/MoveReplicaHDFSTest_failed_coll_true, http://127.0.0.1:62363/solr/MoveReplicaHDFSTest_failed_coll_true]
	at __randomizedtesting.SeedInfo.seed([C2C6E33908AA1145:680B30CBBF79C495]:0)
	at org.apache.solr.client.solrj.impl.LBHttpSolrClient.request(LBHttpSolrClient.java:462)
	at org.apache.solr.client.solrj.impl.CloudSolrClient.sendRequest(CloudSolrClient.java:1107)
	at org.apache.solr.client.solrj.impl.CloudSolrClient.requestWithRetryOnStaleState(CloudSolrClient.java:884)
	at org.apache.solr.client.solrj.impl.CloudSolrClient.requestWithRetryOnStaleState(CloudSolrClient.java:994)
	at org.apache.solr.client.solrj.impl.CloudSolrClient.request(CloudSolrClient.java:817)
	at org.apache.solr.client.solrj.SolrRequest.process(SolrRequest.java:194)
	at org.apache.solr.client.solrj.SolrClient.query(SolrClient.java:942)
	at org.apache.solr.cloud.MoveReplicaTest.testFailedMove(MoveReplicaTest.java:301)
	at sun.reflect.NativeMethodAccessorImpl.invoke0(Native Method)
	at sun.reflect.NativeMethodAccessorImpl.invoke(NativeMethodAccessorImpl.java:62)
	at sun.reflect.DelegatingMethodAccessorImpl.invoke(DelegatingMethodAccessorImpl.java:43)
	at java.lang.reflect.Method.invoke(Method.java:498)
	at com.carrotsearch.randomizedtesting.RandomizedRunner.invoke(RandomizedRunner.java:1742)
	at com.carrotsearch.randomizedtesting.RandomizedRunner$8.evaluate(RandomizedRunner.java:935)
	at com.carrotsearch.randomizedtesting.RandomizedRunner$9.evaluate(RandomizedRunner.java:971)
	at com.carrotsearch.randomizedtesting.RandomizedRunner$10.evaluate(RandomizedRunner.java:985)
	at com.carrotsearch.randomizedtesting.rules.SystemPropertiesRestoreRule$1.evaluate(SystemPropertiesRestoreRule.java:57)
	at org.apache.lucene.util.TestRuleSetupTeardownChained$1.evaluate(TestRuleSetupTeardownChained.java:49)
	at org.apache.lucene.util.AbstractBeforeAfterRule$1.evaluate(AbstractBeforeAfterRule.java:45)
	at org.apache.lucene.util.TestRuleThreadAndTestName$1.evaluate(TestRuleThreadAndTestName.java:48)
	at org.apache.lucene.util.TestRuleIgnoreAfterMaxFailures$1.evaluate(TestRuleIgnoreAfterMaxFailures.java:64)
	at org.apache.lucene.util.TestRuleMarkFailure$1.evaluate(TestRuleMarkFailure.java:47)
	at com.carrotsearch.randomizedtesting.rules.StatementAdapter.evaluate(StatementAdapter.java:36)
	at com.carrotsearch.randomizedtesting.ThreadLeakControl$StatementRunner.run(ThreadLeakControl.java:368)
	at com.carrotsearch.randomizedtesting.ThreadLeakControl.forkTimeoutingTask(ThreadLeakControl.java:817)
	at com.carrotsearch.randomizedtesting.ThreadLeakControl$3.evaluate(ThreadLeakControl.java:468)
	at com.carrotsearch.randomizedtesting.RandomizedRunner.runSingleTest(RandomizedRunner.java:944)
	at com.carrotsearch.randomizedtesting.RandomizedRunner$5.evaluate(RandomizedRunner.java:830)
	at com.carrotsearch.randomizedtesting.RandomizedRunner$6.evaluate(RandomizedRunner.java:880)
	at com.carrotsearch.randomizedtesting.RandomizedRunner$7.evaluate(RandomizedRunner.java:891)
	at com.carrotsearch.randomizedtesting.rules.StatementAdapter.evaluate(StatementAdapter.java:36)
	at com.carrotsearch.randomizedtesting.rules.SystemPropertiesRestoreRule$1.evaluate(SystemPropertiesRestoreRule.java:57)
	at org.apache.lucene.util.AbstractBeforeAfterRule$1.evaluate(AbstractBeforeAfterRule.java:45)
	at com.carrotsearch.randomizedtesting.rules.StatementAdapter.evaluate(StatementAdapter.java:36)
	at org.apache.lucene.util.TestRuleStoreClassName$1.evaluate(TestRuleStoreClassName.java:41)
	at com.carrotsearch.randomizedtesting.rules.NoShadowingOrOverridesOnMethodsRule$1.evaluate(NoShadowingOrOverridesOnMethodsRule.java:40)
	at com.carrotsearch.randomizedtesting.rules.NoShadowingOrOverridesOnMethodsRule$1.evaluate(NoShadowingOrOverridesOnMethodsRule.java:40)
	at com.carrotsearch.randomizedtesting.rules.StatementAdapter.evaluate(StatementAdapter.java:36)
	at com.carrotsearch.randomizedtesting.rules.StatementAdapter.evaluate(StatementAdapter.java:36)
	at com.carrotsearch.randomizedtesting.rules.StatementAdapter.evaluate(StatementAdapter.java:36)
	at org.apache.lucene.util.TestRuleAssertionsRequired$1.evaluate(TestRuleAssertionsRequired.java:53)
	at org.apache.lucene.util.TestRuleMarkFailure$1.evaluate(TestRuleMarkFailure.java:47)
	at org.apache.lucene.util.TestRuleIgnoreAfterMaxFailures$1.evaluate(TestRuleIgnoreAfterMaxFailures.java:64)
	at org.apache.lucene.util.TestRuleIgnoreTestSuites$1.evaluate(TestRuleIgnoreTestSuites.java:54)
	at com.carrotsearch.randomizedtesting.rules.StatementAdapter.evaluate(StatementAdapter.java:36)
	at com.carrotsearch.randomizedtesting.ThreadLeakControl$StatementRunner.run(ThreadLeakControl.java:368)
	at java.lang.Thread.run(Thread.java:748)
Caused by: org.apache.solr.client.solrj.impl.HttpSolrClient$RemoteSolrException: Error from server at http://127.0.0.1:64837/solr/MoveReplicaHDFSTest_failed_coll_true: no servers hosting shard: shard2
	at org.apache.solr.client.solrj.impl.HttpSolrClient.executeMethod(HttpSolrClient.java:643)
	at org.apache.solr.client.solrj.impl.HttpSolrClient.request(HttpSolrClient.java:255)
	at org.apache.solr.client.solrj.impl.HttpSolrClient.request(HttpSolrClient.java:244)
	at org.apache.solr.client.solrj.impl.LBHttpSolrClient.doRequest(LBHttpSolrClient.java:483)
	at org.apache.solr.client.solrj.impl.LBHttpSolrClient.request(LBHttpSolrClient.java:413)
	... 46 more


FAILED:  org.apache.solr.cloud.MoveReplicaHDFSTest.testFailedMove

Error Message:
No live SolrServers available to handle this request:[http://127.0.0.1:62633/solr/MoveReplicaHDFSTest_failed_coll_true, http://127.0.0.1:48818/solr/MoveReplicaHDFSTest_failed_coll_true]

Stack Trace:
org.apache.solr.client.solrj.SolrServerException: No live SolrServers available to handle this request:[http://127.0.0.1:62633/solr/MoveReplicaHDFSTest_failed_coll_true, http://127.0.0.1:48818/solr/MoveReplicaHDFSTest_failed_coll_true]
	at __randomizedtesting.SeedInfo.seed([C2C6E33908AA1145:680B30CBBF79C495]:0)
	at org.apache.solr.client.solrj.impl.LBHttpSolrClient.request(LBHttpSolrClient.java:462)
	at org.apache.solr.client.solrj.impl.CloudSolrClient.sendRequest(CloudSolrClient.java:1107)
	at org.apache.solr.client.solrj.impl.CloudSolrClient.requestWithRetryOnStaleState(CloudSolrClient.java:884)
	at org.apache.solr.client.solrj.impl.CloudSolrClient.requestWithRetryOnStaleState(CloudSolrClient.java:994)
	at org.apache.solr.client.solrj.impl.CloudSolrClient.request(CloudSolrClient.java:817)
	at org.apache.solr.client.solrj.SolrRequest.process(SolrRequest.java:194)
	at org.apache.solr.client.solrj.SolrClient.query(SolrClient.java:942)
	at org.apache.solr.cloud.MoveReplicaTest.testFailedMove(MoveReplicaTest.java:301)
	at sun.reflect.NativeMethodAccessorImpl.invoke0(Native Method)
	at sun.reflect.NativeMethodAccessorImpl.invoke(NativeMethodAccessorImpl.java:62)
	at sun.reflect.DelegatingMethodAccessorImpl.invoke(DelegatingMethodAccessorImpl.java:43)
	at java.lang.reflect.Method.invoke(Method.java:498)
	at com.carrotsearch.randomizedtesting.RandomizedRunner.invoke(RandomizedRunner.java:1742)
	at com.carrotsearch.randomizedtesting.RandomizedRunner$8.evaluate(RandomizedRunner.java:935)
	at com.carrotsearch.randomizedtesting.RandomizedRunner$9.evaluate(RandomizedRunner.java:971)
	at com.carrotsearch.randomizedtesting.RandomizedRunner$10.evaluate(RandomizedRunner.java:985)
	at com.carrotsearch.randomizedtesting.rules.SystemPropertiesRestoreRule$1.evaluate(SystemPropertiesRestoreRule.java:57)
	at org.apache.lucene.util.TestRuleSetupTeardownChained$1.evaluate(TestRuleSetupTeardownChained.java:49)
	at org.apache.lucene.util.AbstractBeforeAfterRule$1.evaluate(AbstractBeforeAfterRule.java:45)
	at org.apache.lucene.util.TestRuleThreadAndTestName$1.evaluate(TestRuleThreadAndTestName.java:48)
	at org.apache.lucene.util.TestRuleIgnoreAfterMaxFailures$1.evaluate(TestRuleIgnoreAfterMaxFailures.java:64)
	at org.apache.lucene.util.TestRuleMarkFailure$1.evaluate(TestRuleMarkFailure.java:47)
	at com.carrotsearch.randomizedtesting.rules.StatementAdapter.evaluate(StatementAdapter.java:36)
	at com.carrotsearch.randomizedtesting.ThreadLeakControl$StatementRunner.run(ThreadLeakControl.java:368)
	at com.carrotsearch.randomizedtesting.ThreadLeakControl.forkTimeoutingTask(ThreadLeakControl.java:817)
	at com.carrotsearch.randomizedtesting.ThreadLeakControl$3.evaluate(ThreadLeakControl.java:468)
	at com.carrotsearch.randomizedtesting.RandomizedRunner.runSingleTest(RandomizedRunner.java:944)
	at com.carrotsearch.randomizedtesting.RandomizedRunner$5.evaluate(RandomizedRunner.java:830)
	at com.carrotsearch.randomizedtesting.RandomizedRunner$6.evaluate(RandomizedRunner.java:880)
	at com.carrotsearch.randomizedtesting.RandomizedRunner$7.evaluate(RandomizedRunner.java:891)
	at com.carrotsearch.randomizedtesting.rules.StatementAdapter.evaluate(StatementAdapter.java:36)
	at com.carrotsearch.randomizedtesting.rules.SystemPropertiesRestoreRule$1.evaluate(SystemPropertiesRestoreRule.java:57)
	at org.apache.lucene.util.AbstractBeforeAfterRule$1.evaluate(AbstractBeforeAfterRule.java:45)
	at com.carrotsearch.randomizedtesting.rules.StatementAdapter.evaluate(StatementAdapter.java:36)
	at org.apache.lucene.util.TestRuleStoreClassName$1.evaluate(TestRuleStoreClassName.java:41)
	at com.carrotsearch.randomizedtesting.rules.NoShadowingOrOverridesOnMethodsRule$1.evaluate(NoShadowingOrOverridesOnMethodsRule.java:40)
	at com.carrotsearch.randomizedtesting.rules.NoShadowingOrOverridesOnMethodsRule$1.evaluate(NoShadowingOrOverridesOnMethodsRule.java:40)
	at com.carrotsearch.randomizedtesting.rules.StatementAdapter.evaluate(StatementAdapter.java:36)
	at com.carrotsearch.randomizedtesting.rules.StatementAdapter.evaluate(StatementAdapter.java:36)
	at com.carrotsearch.randomizedtesting.rules.StatementAdapter.evaluate(StatementAdapter.java:36)
	at org.apache.lucene.util.TestRuleAssertionsRequired$1.evaluate(TestRuleAssertionsRequired.java:53)
	at org.apache.lucene.util.TestRuleMarkFailure$1.evaluate(TestRuleMarkFailure.java:47)
	at org.apache.lucene.util.TestRuleIgnoreAfterMaxFailures$1.evaluate(TestRuleIgnoreAfterMaxFailures.java:64)
	at org.apache.lucene.util.TestRuleIgnoreTestSuites$1.evaluate(TestRuleIgnoreTestSuites.java:54)
	at com.carrotsearch.randomizedtesting.rules.StatementAdapter.evaluate(StatementAdapter.java:36)
	at com.carrotsearch.randomizedtesting.ThreadLeakControl$StatementRunner.run(ThreadLeakControl.java:368)
	at java.lang.Thread.run(Thread.java:748)
Caused by: org.apache.solr.client.solrj.impl.HttpSolrClient$RemoteSolrException: Error from server at http://127.0.0.1:48818/solr/MoveReplicaHDFSTest_failed_coll_true: no servers hosting shard: shard2
	at org.apache.solr.client.solrj.impl.HttpSolrClient.executeMethod(HttpSolrClient.java:643)
	at org.apache.solr.client.solrj.impl.HttpSolrClient.request(HttpSolrClient.java:255)
	at org.apache.solr.client.solrj.impl.HttpSolrClient.request(HttpSolrClient.java:244)
	at org.apache.solr.client.solrj.impl.LBHttpSolrClient.doRequest(LBHttpSolrClient.java:483)
	at org.apache.solr.client.solrj.impl.LBHttpSolrClient.request(LBHttpSolrClient.java:436)
	... 46 more


FAILED:  org.apache.solr.cloud.MoveReplicaHDFSTest.testFailedMove

Error Message:
No live SolrServers available to handle this request:[http://127.0.0.1:45252/solr/MoveReplicaHDFSTest_failed_coll_true, http://127.0.0.1:41877/solr/MoveReplicaHDFSTest_failed_coll_true]

Stack Trace:
org.apache.solr.client.solrj.SolrServerException: No live SolrServers available to handle this request:[http://127.0.0.1:45252/solr/MoveReplicaHDFSTest_failed_coll_true, http://127.0.0.1:41877/solr/MoveReplicaHDFSTest_failed_coll_true]
	at __randomizedtesting.SeedInfo.seed([C2C6E33908AA1145:680B30CBBF79C495]:0)
	at org.apache.solr.client.solrj.impl.LBHttpSolrClient.request(LBHttpSolrClient.java:462)
	at org.apache.solr.client.solrj.impl.CloudSolrClient.sendRequest(CloudSolrClient.java:1107)
	at org.apache.solr.client.solrj.impl.CloudSolrClient.requestWithRetryOnStaleState(CloudSolrClient.java:884)
	at org.apache.solr.client.solrj.impl.CloudSolrClient.requestWithRetryOnStaleState(CloudSolrClient.java:994)
	at org.apache.solr.client.solrj.impl.CloudSolrClient.request(CloudSolrClient.java:817)
	at org.apache.solr.client.solrj.SolrRequest.process(SolrRequest.java:194)
	at org.apache.solr.client.solrj.SolrClient.query(SolrClient.java:942)
	at org.apache.solr.cloud.MoveReplicaTest.testFailedMove(MoveReplicaTest.java:301)
	at sun.reflect.NativeMethodAccessorImpl.invoke0(Native Method)
	at sun.reflect.NativeMethodAccessorImpl.invoke(NativeMethodAccessorImpl.java:62)
	at sun.reflect.DelegatingMethodAccessorImpl.invoke(DelegatingMethodAccessorImpl.java:43)
	at java.lang.reflect.Method.invoke(Method.java:498)
	at com.carrotsearch.randomizedtesting.RandomizedRunner.invoke(RandomizedRunner.java:1742)
	at com.carrotsearch.randomizedtesting.RandomizedRunner$8.evaluate(RandomizedRunner.java:935)
	at com.carrotsearch.randomizedtesting.RandomizedRunner$9.evaluate(RandomizedRunner.java:971)
	at com.carrotsearch.randomizedtesting.RandomizedRunner$10.evaluate(RandomizedRunner.java:985)
	at com.carrotsearch.randomizedtesting.rules.SystemPropertiesRestoreRule$1.evaluate(SystemPropertiesRestoreRule.java:57)
	at org.apache.lucene.util.TestRuleSetupTeardownChained$1.evaluate(TestRuleSetupTeardownChained.java:49)
	at org.apache.lucene.util.AbstractBeforeAfterRule$1.evaluate(AbstractBeforeAfterRule.java:45)
	at org.apache.lucene.util.TestRuleThreadAndTestName$1.evaluate(TestRuleThreadAndTestName.java:48)
	at org.apache.lucene.util.TestRuleIgnoreAfterMaxFailures$1.evaluate(TestRuleIgnoreAfterMaxFailures.java:64)
	at org.apache.lucene.util.TestRuleMarkFailure$1.evaluate(TestRuleMarkFailure.java:47)
	at com.carrotsearch.randomizedtesting.rules.StatementAdapter.evaluate(StatementAdapter.java:36)
	at com.carrotsearch.randomizedtesting.ThreadLeakControl$StatementRunner.run(ThreadLeakControl.java:368)
	at com.carrotsearch.randomizedtesting.ThreadLeakControl.forkTimeoutingTask(ThreadLeakControl.java:817)
	at com.carrotsearch.randomizedtesting.ThreadLeakControl$3.evaluate(ThreadLeakControl.java:468)
	at com.carrotsearch.randomizedtesting.RandomizedRunner.runSingleTest(RandomizedRunner.java:944)
	at com.carrotsearch.randomizedtesting.RandomizedRunner$5.evaluate(RandomizedRunner.java:830)
	at com.carrotsearch.randomizedtesting.RandomizedRunner$6.evaluate(RandomizedRunner.java:880)
	at com.carrotsearch.randomizedtesting.RandomizedRunner$7.evaluate(RandomizedRunner.java:891)
	at com.carrotsearch.randomizedtesting.rules.StatementAdapter.evaluate(StatementAdapter.java:36)
	at com.carrotsearch.randomizedtesting.rules.SystemPropertiesRestoreRule$1.evaluate(SystemPropertiesRestoreRule.java:57)
	at org.apache.lucene.util.AbstractBeforeAfterRule$1.evaluate(AbstractBeforeAfterRule.java:45)
	at com.carrotsearch.randomizedtesting.rules.StatementAdapter.evaluate(StatementAdapter.java:36)
	at org.apache.lucene.util.TestRuleStoreClassName$1.evaluate(TestRuleStoreClassName.java:41)
	at com.carrotsearch.randomizedtesting.rules.NoShadowingOrOverridesOnMethodsRule$1.evaluate(NoShadowingOrOverridesOnMethodsRule.java:40)
	at com.carrotsearch.randomizedtesting.rules.NoShadowingOrOverridesOnMethodsRule$1.evaluate(NoShadowingOrOverridesOnMethodsRule.java:40)
	at com.carrotsearch.randomizedtesting.rules.StatementAdapter.evaluate(StatementAdapter.java:36)
	at com.carrotsearch.randomizedtesting.rules.StatementAdapter.evaluate(StatementAdapter.java:36)
	at com.carrotsearch.randomizedtesting.rules.StatementAdapter.evaluate(StatementAdapter.java:36)
	at org.apache.lucene.util.TestRuleAssertionsRequired$1.evaluate(TestRuleAssertionsRequired.java:53)
	at org.apache.lucene.util.TestRuleMarkFailure$1.evaluate(TestRuleMarkFailure.java:47)
	at org.apache.lucene.util.TestRuleIgnoreAfterMaxFailures$1.evaluate(TestRuleIgnoreAfterMaxFailures.java:64)
	at org.apache.lucene.util.TestRuleIgnoreTestSuites$1.evaluate(TestRuleIgnoreTestSuites.java:54)
	at com.carrotsearch.randomizedtesting.rules.StatementAdapter.evaluate(StatementAdapter.java:36)
	at com.carrotsearch.randomizedtesting.ThreadLeakControl$StatementRunner.run(ThreadLeakControl.java:368)
	at java.lang.Thread.run(Thread.java:748)
Caused by: org.apache.solr.client.solrj.impl.HttpSolrClient$RemoteSolrException: Error from server at http://127.0.0.1:41877/solr/MoveReplicaHDFSTest_failed_coll_true: no servers hosting shard: shard2
	at org.apache.solr.client.solrj.impl.HttpSolrClient.executeMethod(HttpSolrClient.java:643)
	at org.apache.solr.client.solrj.impl.HttpSolrClient.request(HttpSolrClient.java:255)
	at org.apache.solr.client.solrj.impl.HttpSolrClient.request(HttpSolrClient.java:244)
	at org.apache.solr.client.solrj.impl.LBHttpSolrClient.doRequest(LBHttpSolrClient.java:483)
	at org.apache.solr.client.solrj.impl.LBHttpSolrClient.request(LBHttpSolrClient.java:413)
	... 46 more


FAILED:  org.apache.solr.cloud.MoveReplicaHDFSTest.testFailedMove

Error Message:
No live SolrServers available to handle this request:[http://127.0.0.1:55392/solr/MoveReplicaHDFSTest_failed_coll_true, http://127.0.0.1:39243/solr/MoveReplicaHDFSTest_failed_coll_true]

Stack Trace:
org.apache.solr.client.solrj.SolrServerException: No live SolrServers available to handle this request:[http://127.0.0.1:55392/solr/MoveReplicaHDFSTest_failed_coll_true, http://127.0.0.1:39243/solr/MoveReplicaHDFSTest_failed_coll_true]
	at __randomizedtesting.SeedInfo.seed([C2C6E33908AA1145:680B30CBBF79C495]:0)
	at org.apache.solr.client.solrj.impl.LBHttpSolrClient.request(LBHttpSolrClient.java:462)
	at org.apache.solr.client.solrj.impl.CloudSolrClient.sendRequest(CloudSolrClient.java:1107)
	at org.apache.solr.client.solrj.impl.CloudSolrClient.requestWithRetryOnStaleState(CloudSolrClient.java:884)
	at org.apache.solr.client.solrj.impl.CloudSolrClient.requestWithRetryOnStaleState(CloudSolrClient.java:994)
	at org.apache.solr.client.solrj.impl.CloudSolrClient.request(CloudSolrClient.java:817)
	at org.apache.solr.client.solrj.SolrRequest.process(SolrRequest.java:194)
	at org.apache.solr.client.solrj.SolrClient.query(SolrClient.java:942)
	at org.apache.solr.cloud.MoveReplicaTest.testFailedMove(MoveReplicaTest.java:301)
	at sun.reflect.NativeMethodAccessorImpl.invoke0(Native Method)
	at sun.reflect.NativeMethodAccessorImpl.invoke(NativeMethodAccessorImpl.java:62)
	at sun.reflect.DelegatingMethodAccessorImpl.invoke(DelegatingMethodAccessorImpl.java:43)
	at java.lang.reflect.Method.invoke(Method.java:498)
	at com.carrotsearch.randomizedtesting.RandomizedRunner.invoke(RandomizedRunner.java:1742)
	at com.carrotsearch.randomizedtesting.RandomizedRunner$8.evaluate(RandomizedRunner.java:935)
	at com.carrotsearch.randomizedtesting.RandomizedRunner$9.evaluate(RandomizedRunner.java:971)
	at com.carrotsearch.randomizedtesting.RandomizedRunner$10.evaluate(RandomizedRunner.java:985)
	at com.carrotsearch.randomizedtesting.rules.SystemPropertiesRestoreRule$1.evaluate(SystemPropertiesRestoreRule.java:57)
	at org.apache.lucene.util.TestRuleSetupTeardownChained$1.evaluate(TestRuleSetupTeardownChained.java:49)
	at org.apache.lucene.util.AbstractBeforeAfterRule$1.evaluate(AbstractBeforeAfterRule.java:45)
	at org.apache.lucene.util.TestRuleThreadAndTestName$1.evaluate(TestRuleThreadAndTestName.java:48)
	at org.apache.lucene.util.TestRuleIgnoreAfterMaxFailures$1.evaluate(TestRuleIgnoreAfterMaxFailures.java:64)
	at org.apache.lucene.util.TestRuleMarkFailure$1.evaluate(TestRuleMarkFailure.java:47)
	at com.carrotsearch.randomizedtesting.rules.StatementAdapter.evaluate(StatementAdapter.java:36)
	at com.carrotsearch.randomizedtesting.ThreadLeakControl$StatementRunner.run(ThreadLeakControl.java:368)
	at com.carrotsearch.randomizedtesting.ThreadLeakControl.forkTimeoutingTask(ThreadLeakControl.java:817)
	at com.carrotsearch.randomizedtesting.ThreadLeakControl$3.evaluate(ThreadLeakControl.java:468)
	at com.carrotsearch.randomizedtesting.RandomizedRunner.runSingleTest(RandomizedRunner.java:944)
	at com.carrotsearch.randomizedtesting.RandomizedRunner$5.evaluate(RandomizedRunner.java:830)
	at com.carrotsearch.randomizedtesting.RandomizedRunner$6.evaluate(RandomizedRunner.java:880)
	at com.carrotsearch.randomizedtesting.RandomizedRunner$7.evaluate(RandomizedRunner.java:891)
	at com.carrotsearch.randomizedtesting.rules.StatementAdapter.evaluate(StatementAdapter.java:36)
	at com.carrotsearch.randomizedtesting.rules.SystemPropertiesRestoreRule$1.evaluate(SystemPropertiesRestoreRule.java:57)
	at org.apache.lucene.util.AbstractBeforeAfterRule$1.evaluate(AbstractBeforeAfterRule.java:45)
	at com.carrotsearch.randomizedtesting.rules.StatementAdapter.evaluate(StatementAdapter.java:36)
	at org.apache.lucene.util.TestRuleStoreClassName$1.evaluate(TestRuleStoreClassName.java:41)
	at com.carrotsearch.randomizedtesting.rules.NoShadowingOrOverridesOnMethodsRule$1.evaluate(NoShadowingOrOverridesOnMethodsRule.java:40)
	at com.carrotsearch.randomizedtesting.rules.NoShadowingOrOverridesOnMethodsRule$1.evaluate(NoShadowingOrOverridesOnMethodsRule.java:40)
	at com.carrotsearch.randomizedtesting.rules.StatementAdapter.evaluate(StatementAdapter.java:36)
	at com.carrotsearch.randomizedtesting.rules.StatementAdapter.evaluate(StatementAdapter.java:36)
	at com.carrotsearch.randomizedtesting.rules.StatementAdapter.evaluate(StatementAdapter.java:36)
	at org.apache.lucene.util.TestRuleAssertionsRequired$1.evaluate(TestRuleAssertionsRequired.java:53)
	at org.apache.lucene.util.TestRuleMarkFailure$1.evaluate(TestRuleMarkFailure.java:47)
	at org.apache.lucene.util.TestRuleIgnoreAfterMaxFailures$1.evaluate(TestRuleIgnoreAfterMaxFailures.java:64)
	at org.apache.lucene.util.TestRuleIgnoreTestSuites$1.evaluate(TestRuleIgnoreTestSuites.java:54)
	at com.carrotsearch.randomizedtesting.rules.StatementAdapter.evaluate(StatementAdapter.java:36)
	at com.carrotsearch.randomizedtesting.ThreadLeakControl$StatementRunner.run(ThreadLeakControl.java:368)
	at java.lang.Thread.run(Thread.java:748)
Caused by: org.apache.solr.client.solrj.impl.HttpSolrClient$RemoteSolrException: Error from server at http://127.0.0.1:39243/solr/MoveReplicaHDFSTest_failed_coll_true: no servers hosting shard: shard1
	at org.apache.solr.client.solrj.impl.HttpSolrClient.executeMethod(HttpSolrClient.java:643)
	at org.apache.solr.client.solrj.impl.HttpSolrClient.request(HttpSolrClient.java:255)
	at org.apache.solr.client.solrj.impl.HttpSolrClient.request(HttpSolrClient.java:244)
	at org.apache.solr.client.solrj.impl.LBHttpSolrClient.doRequest(LBHttpSolrClient.java:483)
	at org.apache.solr.client.solrj.impl.LBHttpSolrClient.request(LBHttpSolrClient.java:436)
	... 46 more




Build Log:
[...truncated 14050 lines...]
   [junit4] Suite: org.apache.solr.cloud.MoveReplicaHDFSTest
   [junit4]   2> Creating dataDir: /export/home/jenkins/workspace/Lucene-Solr-master-Solaris/solr/build/solr-core/test/J0/temp/solr.cloud.MoveReplicaHDFSTest_C2C6E33908AA1145-001/init-core-data-001
   [junit4]   2> 2943702 INFO  (SUITE-MoveReplicaHDFSTest-seed#[C2C6E33908AA1145]-worker) [    ] o.a.s.c.MiniSolrCloudCluster Starting cluster of 4 servers in /export/home/jenkins/workspace/Lucene-Solr-master-Solaris/solr/build/solr-core/test/J0/temp/solr.cloud.MoveReplicaHDFSTest_C2C6E33908AA1145-001/tempDir-001
   [junit4]   2> 2943703 INFO  (SUITE-MoveReplicaHDFSTest-seed#[C2C6E33908AA1145]-worker) [    ] o.a.s.c.ZkTestServer STARTING ZK TEST SERVER
   [junit4]   2> 2943703 INFO  (Thread-5154) [    ] o.a.s.c.ZkTestServer client port:0.0.0.0/0.0.0.0:0
   [junit4]   2> 2943703 INFO  (Thread-5154) [    ] o.a.s.c.ZkTestServer Starting server
   [junit4]   2> 2943707 ERROR (Thread-5154) [    ] o.a.z.s.ZooKeeperServer ZKShutdownHandler is not registered, so ZooKeeper server won't take any action on ERROR or SHUTDOWN server state changes
   [junit4]   2> 2943803 INFO  (SUITE-MoveReplicaHDFSTest-seed#[C2C6E33908AA1145]-worker) [    ] o.a.s.c.ZkTestServer start zk server on port:47634
   [junit4]   2> 2943808 INFO  (zkConnectionManagerCallback-7160-thread-1) [    ] o.a.s.c.c.ConnectionManager zkClient has connected
   [junit4]   2> 2943815 INFO  (jetty-launcher-7157-thread-2) [    ] o.e.j.s.Server jetty-9.4.11.v20180605; built: 2018-06-05T18:24:03.829Z; git: d5fc0523cfa96bfebfbda19606cad384d772f04c; jvm 1.8.0_172-b11
   [junit4]   2> 2943815 INFO  (jetty-launcher-7157-thread-1) [    ] o.e.j.s.Server jetty-9.4.11.v20180605; built: 2018-06-05T18:24:03.829Z; git: d5fc0523cfa96bfebfbda19606cad384d772f04c; jvm 1.8.0_172-b11
   [junit4]   2> 2943815 INFO  (jetty-launcher-7157-thread-3) [    ] o.e.j.s.Server jetty-9.4.11.v20180605; built: 2018-06-05T18:24:03.829Z; git: d5fc0523cfa96bfebfbda19606cad384d772f04c; jvm 1.8.0_172-b11
   [junit4]   2> 2943816 INFO  (jetty-launcher-7157-thread-4) [    ] o.e.j.s.Server jetty-9.4.11.v20180605; built: 2018-06-05T18:24:03.829Z; git: d5fc0523cfa96bfebfbda19606cad384d772f04c; jvm 1.8.0_172-b11
   [junit4]   2> 2943816 INFO  (jetty-launcher-7157-thread-2) [    ] o.e.j.s.session DefaultSessionIdManager workerName=node0
   [junit4]   2> 2943816 INFO  (jetty-launcher-7157-thread-2) [    ] o.e.j.s.session No SessionScavenger set, using defaults
   [junit4]   2> 2943816 INFO  (jetty-launcher-7157-thread-2) [    ] o.e.j.s.session node0 Scavenging every 600000ms
   [junit4]   2> 2943817 INFO  (jetty-launcher-7157-thread-2) [    ] o.e.j.s.h.ContextHandler Started o.e.j.s.ServletContextHandler@407e1309{/solr,null,AVAILABLE}
   [junit4]   2> 2943818 INFO  (jetty-launcher-7157-thread-3) [    ] o.e.j.s.session DefaultSessionIdManager workerName=node0
   [junit4]   2> 2943818 INFO  (jetty-launcher-7157-thread-2) [    ] o.e.j.s.AbstractConnector Started ServerConnector@737047b8{HTTP/1.1,[http/1.1]}{127.0.0.1:56848}
   [junit4]   2> 2943818 INFO  (jetty-launcher-7157-thread-3) [    ] o.e.j.s.session No SessionScavenger set, using defaults
   [junit4]   2> 2943818 INFO  (jetty-launcher-7157-thread-2) [    ] o.e.j.s.Server Started @2945666ms
   [junit4]   2> 2943818 INFO  (jetty-launcher-7157-thread-2) [    ] o.a.s.c.s.e.JettySolrRunner Jetty properties: {hostContext=/solr, hostPort=56848}
   [junit4]   2> 2943818 INFO  (jetty-launcher-7157-thread-3) [    ] o.e.j.s.session node0 Scavenging every 600000ms
   [junit4]   2> 2943818 ERROR (jetty-launcher-7157-thread-2) [    ] o.a.s.u.StartupLoggingUtils Missing Java Option solr.log.dir. Logging may be missing or incomplete.
   [junit4]   2> 2943818 INFO  (jetty-launcher-7157-thread-2) [    ] o.a.s.s.SolrDispatchFilter Using logger factory org.apache.logging.slf4j.Log4jLoggerFactory
   [junit4]   2> 2943818 INFO  (jetty-launcher-7157-thread-2) [    ] o.a.s.s.SolrDispatchFilter  ___      _       Welcome to Apache Solr? version 8.0.0
   [junit4]   2> 2943818 INFO  (jetty-launcher-7157-thread-2) [    ] o.a.s.s.SolrDispatchFilter / __| ___| |_ _   Starting in cloud mode on port null
   [junit4]   2> 2943818 INFO  (jetty-launcher-7157-thread-2) [    ] o.a.s.s.SolrDispatchFilter \__ \/ _ \ | '_|  Install dir: null
   [junit4]   2> 2943818 INFO  (jetty-launcher-7157-thread-2) [    ] o.a.s.s.SolrDispatchFilter |___/\___/_|_|    Start time: 2018-09-23T02:49:14.417Z
   [junit4]   2> 2943819 INFO  (jetty-launcher-7157-thread-4) [    ] o.e.j.s.session DefaultSessionIdManager workerName=node0
   [junit4]   2> 2943820 INFO  (jetty-launcher-7157-thread-4) [    ] o.e.j.s.session No SessionScavenger set, using defaults
   [junit4]   2> 2943820 INFO  (jetty-launcher-7157-thread-4) [    ] o.e.j.s.session node0 Scavenging every 600000ms
   [junit4]   2> 2943820 INFO  (jetty-launcher-7157-thread-4) [    ] o.e.j.s.h.ContextHandler Started o.e.j.s.ServletContextHandler@15c5f254{/solr,null,AVAILABLE}
   [junit4]   2> 2943820 INFO  (jetty-launcher-7157-thread-1) [    ] o.e.j.s.session DefaultSessionIdManager workerName=node0
   [junit4]   2> 2943820 INFO  (jetty-launcher-7157-thread-1) [    ] o.e.j.s.session No SessionScavenger set, using defaults
   [junit4]   2> 2943820 INFO  (jetty-launcher-7157-thread-1) [    ] o.e.j.s.session node0 Scavenging every 600000ms
   [junit4]   2> 2943820 INFO  (jetty-launcher-7157-thread-3) [    ] o.e.j.s.h.ContextHandler Started o.e.j.s.ServletContextHandler@53442025{/solr,null,AVAILABLE}
   [junit4]   2> 2943821 INFO  (jetty-launcher-7157-thread-3) [    ] o.e.j.s.AbstractConnector Started ServerConnector@7069f99e{HTTP/1.1,[http/1.1]}{127.0.0.1:59992}
   [junit4]   2> 2943821 INFO  (jetty-launcher-7157-thread-4) [    ] o.e.j.s.AbstractConnector Started ServerConnector@4c79ff4d{HTTP/1.1,[http/1.1]}{127.0.0.1:39243}
   [junit4]   2> 2943821 INFO  (jetty-launcher-7157-thread-3) [    ] o.e.j.s.Server Started @2945670ms
   [junit4]   2> 2943821 INFO  (jetty-launcher-7157-thread-4) [    ] o.e.j.s.Server Started @2945670ms
   [junit4]   2> 2943821 INFO  (jetty-launcher-7157-thread-3) [    ] o.a.s.c.s.e.JettySolrRunner Jetty properties: {hostContext=/solr, hostPort=59992}
   [junit4]   2> 2943821 INFO  (jetty-launcher-7157-thread-1) [    ] o.e.j.s.h.ContextHandler Started o.e.j.s.ServletContextHandler@64e808b4{/solr,null,AVAILABLE}
   [junit4]   2> 2943821 ERROR (jetty-launcher-7157-thread-3) [    ] o.a.s.u.StartupLoggingUtils Missing Java Option solr.log.dir. Logging may be missing or incomplete.
   [junit4]   2> 2943821 INFO  (jetty-launcher-7157-thread-3) [    ] o.a.s.s.SolrDispatchFilter Using logger factory org.apache.logging.slf4j.Log4jLoggerFactory
   [junit4]   2> 2943821 INFO  (jetty-launcher-7157-thread-3) [    ] o.a.s.s.SolrDispatchFilter  ___      _       Welcome to Apache Solr? version 8.0.0
   [junit4]   2> 2943821 INFO  (jetty-launcher-7157-thread-1) [    ] o.e.j.s.AbstractConnector Started ServerConnector@23f19f67{HTTP/1.1,[http/1.1]}{127.0.0.1:55392}
   [junit4]   2> 2943821 INFO  (jetty-launcher-7157-thread-1) [    ] o.e.j.s.Server Started @2945670ms
   [junit4]   2> 2943821 INFO  (jetty-launcher-7157-thread-1) [    ] o.a.s.c.s.e.JettySolrRunner Jetty properties: {hostContext=/solr, hostPort=55392}
   [junit4]   2> 2943821 ERROR (jetty-launcher-7157-thread-1) [    ] o.a.s.u.StartupLoggingUtils Missing Java Option solr.log.dir. Logging may be missing or incomplete.
   [junit4]   2> 2943821 INFO  (jetty-launcher-7157-thread-4) [    ] o.a.s.c.s.e.JettySolrRunner Jetty properties: {hostContext=/solr, hostPort=39243}
   [junit4]   2> 2943821 INFO  (jetty-launcher-7157-thread-1) [    ] o.a.s.s.SolrDispatchFilter Using logger factory org.apache.logging.slf4j.Log4jLoggerFactory
   [junit4]   2> 2943821 INFO  (jetty-launcher-7157-thread-3) [    ] o.a.s.s.SolrDispatchFilter / __| ___| |_ _   Starting in cloud mode on port null
   [junit4]   2> 2943821 INFO  (jetty-launcher-7157-thread-3) [    ] o.a.s.s.SolrDispatchFilter \__ \/ _ \ | '_|  Install dir: null
   [junit4]   2> 2943821 INFO  (jetty-launcher-7157-thread-1) [    ] o.a.s.s.SolrDispatchFilter  ___      _       Welcome to Apache Solr? version 8.0.0
   [junit4]   2> 2943821 INFO  (jetty-launcher-7157-thread-3) [    ] o.a.s.s.SolrDispatchFilter |___/\___/_|_|    Start time: 2018-09-23T02:49:14.420Z
   [junit4]   2> 2943821 ERROR (jetty-launcher-7157-thread-4) [    ] o.a.s.u.StartupLoggingUtils Missing Java Option solr.log.dir. Logging may be missing or incomplete.
   [junit4]   2> 2943821 INFO  (jetty-launcher-7157-thread-1) [    ] o.a.s.s.SolrDispatchFilter / __| ___| |_ _   Starting in cloud mode on port null
   [junit4]   2> 2943821 INFO  (jetty-launcher-7157-thread-4) [    ] o.a.s.s.SolrDispatchFilter Using logger factory org.apache.logging.slf4j.Log4jLoggerFactory
   [junit4]   2> 2943821 INFO  (jetty-launcher-7157-thread-1) [    ] o.a.s.s.SolrDispatchFilter \__ \/ _ \ | '_|  Install dir: null
   [junit4]   2> 2943821 INFO  (jetty-launcher-7157-thread-1) [    ] o.a.s.s.SolrDispatchFilter |___/\___/_|_|    Start time: 2018-09-23T02:49:14.420Z
   [junit4]   2> 2943821 INFO  (jetty-launcher-7157-thread-4) [    ] o.a.s.s.SolrDispatchFilter  ___      _       Welcome to Apache Solr? version 8.0.0
   [junit4]   2> 2943821 INFO  (jetty-launcher-7157-thread-4) [    ] o.a.s.s.SolrDispatchFilter / __| ___| |_ _   Starting in cloud mode on port null
   [junit4]   2> 2943821 INFO  (jetty-launcher-7157-thread-4) [    ] o.a.s.s.SolrDispatchFilter \__ \/ _ \ | '_|  Install dir: null
   [junit4]   2> 2943821 INFO  (jetty-launcher-7157-thread-4) [    ] o.a.s.s.SolrDispatchFilter |___/\___/_|_|    Start time: 2018-09-23T02:49:14.420Z
   [junit4]   2> 2943822 INFO  (zkConnectionManagerCallback-7162-thread-1) [    ] o.a.s.c.c.ConnectionManager zkClient has connected
   [junit4]   2> 2943823 INFO  (jetty-launcher-7157-thread-2) [    ] o.a.s.s.SolrDispatchFilter solr.xml found in ZooKeeper. Loading...
   [junit4]   2> 2943823 INFO  (zkConnectionManagerCallback-7165-thread-1) [    ] o.a.s.c.c.ConnectionManager zkClient has connected
   [junit4]   2> 2943825 INFO  (jetty-launcher-7157-thread-1) [    ] o.a.s.s.SolrDispatchFilter solr.xml found in ZooKeeper. Loading...
   [junit4]   2> 2943826 INFO  (zkConnectionManagerCallback-7166-thread-1) [    ] o.a.s.c.c.ConnectionManager zkClient has connected
   [junit4]   2> 2943826 INFO  (zkConnectionManagerCallback-7168-thread-1) [    ] o.a.s.c.c.ConnectionManager zkClient has connected
   [junit4]   2> 2943827 INFO  (jetty-launcher-7157-thread-3) [    ] o.a.s.s.SolrDispatchFilter solr.xml found in ZooKeeper. Loading...
   [junit4]   2> 2943827 INFO  (jetty-launcher-7157-thread-4) [    ] o.a.s.s.SolrDispatchFilter solr.xml found in ZooKeeper. Loading...
   [junit4]   2> 2943845 WARN  (NIOServerCxn.Factory:0.0.0.0/0.0.0.0:0) [    ] o.a.z.s.NIOServerCnxn Unable to read additional data from client sessionid 0x1000771eb600003, likely client has closed socket
   [junit4]   2> 2944015 INFO  (jetty-launcher-7157-thread-2) [    ] o.a.s.c.ZkContainer Zookeeper client=127.0.0.1:47634/solr
   [junit4]   2> 2944032 INFO  (zkConnectionManagerCallback-7172-thread-1) [    ] o.a.s.c.c.ConnectionManager zkClient has connected
   [junit4]   2> 2944033 DEBUG (jetty-launcher-7157-thread-2) [n:127.0.0.1:56848_solr    ] o.a.s.c.ZkController Added new OnReconnect listener org.apache.solr.cloud.ZkController$$Lambda$315/1961763290@73d56547
   [junit4]   2> 2944033 INFO  (zkConnectionManagerCallback-7174-thread-1) [    ] o.a.s.c.c.ConnectionManager zkClient has connected
   [junit4]   2> 2944132 DEBUG (SyncThread:0) [    ] o.a.s.c.ZkTestServer Watch added: create/delete: /solr/clusterprops.json
   [junit4]   2> 2944133 DEBUG (SyncThread:0) [    ] o.a.s.c.ZkTestServer Watch added: children: /solr/live_nodes
   [junit4]   2> 2944133 DEBUG (SyncThread:0) [    ] o.a.s.c.ZkTestServer Watch added: data: /solr/clusterstate.json
   [junit4]   2> 2944133 DEBUG (SyncThread:0) [    ] o.a.s.c.ZkTestServer Watch added: children: /solr/collections
   [junit4]   2> 2944133 DEBUG (SyncThread:0) [    ] o.a.s.c.ZkTestServer Watch added: create/delete: /solr/aliases.json
   [junit4]   2> 2944134 DEBUG (SyncThread:0) [    ] o.a.s.c.ZkTestServer Watch added: create/delete: /solr/security.json
   [junit4]   2> 2944137 DEBUG (jetty-launcher-7157-thread-2) [n:127.0.0.1:56848_solr    ] o.a.s.c.LeaderElector Joined leadership election with path: /overseer_elect/election/72065779899564038-127.0.0.1:56848_solr-n_0000000000
   [junit4]   2> 2944137 INFO  (jetty-launcher-7157-thread-2) [n:127.0.0.1:56848_solr    ] o.a.s.c.OverseerElectionContext I am going to be the leader 127.0.0.1:56848_solr
   [junit4]   2> 2944138 INFO  (jetty-launcher-7157-thread-2) [n:127.0.0.1:56848_solr    ] o.a.s.c.Overseer Overseer (id=72065779899564038-127.0.0.1:56848_solr-n_0000000000) starting
   [junit4]   2> 2944146 INFO  (zkConnectionManagerCallback-7181-thread-1) [    ] o.a.s.c.c.ConnectionManager zkClient has connected
   [junit4]   2> 2944147 DEBUG (SyncThread:0) [    ] o.a.s.c.ZkTestServer Watch added: create/delete: /solr/clusterprops.json
   [junit4]   2> 2944147 DEBUG (SyncThread:0) [    ] o.a.s.c.ZkTestServer Watch added: children: /solr/live_nodes
   [junit4]   2> 2944147 DEBUG (SyncThread:0) [    ] o.a.s.c.ZkTestServer Watch added: data: /solr/clusterstate.json
   [junit4]   2> 2944148 DEBUG (SyncThread:0) [    ] o.a.s.c.ZkTestServer Watch added: children: /solr/collections
   [junit4]   2> 2944148 DEBUG (SyncThread:0) [    ] o.a.s.c.ZkTestServer Watch added: create/delete: /solr/aliases.json
   [junit4]   2> 2944148 INFO  (jetty-launcher-7157-thread-2) [n:127.0.0.1:56848_solr    ] o.a.s.c.s.i.ZkClientClusterStateProvider Cluster at 127.0.0.1:47634/solr ready
   [junit4]   2> 2944149 INFO  (OverseerStateUpdate-72065779899564038-127.0.0.1:56848_solr-n_0000000000) [n:127.0.0.1:56848_solr    ] o.a.s.c.Overseer Starting to work on the main queue : 127.0.0.1:56848_solr
   [junit4]   2> 2944149 DEBUG (OverseerCollectionConfigSetProcessor-72065779899564038-127.0.0.1:56848_solr-n_0000000000) [n:127.0.0.1:56848_solr    ] o.a.s.c.OverseerTaskProcessor Process current queue of overseer operations
   [junit4]   2> 2944150 DEBUG (SyncThread:0) [    ] o.a.s.c.ZkTestServer Watch added: children: /solr/overseer/queue-work
   [junit4]   2> 2944151 DEBUG (SyncThread:0) [    ] o.a.s.c.ZkTestServer Watch added: children: /solr/overseer/queue
   [junit4]   2> 2944151 DEBUG (OverseerCollectionConfigSetProcessor-72065779899564038-127.0.0.1:56848_solr-n_0000000000) [n:127.0.0.1:56848_solr    ] o.a.s.c.OverseerTaskProcessor Cleaning up work-queue. #Running tasks: 0
   [junit4]   2> 2944151 DEBUG (OverseerCollectionConfigSetProcessor-72065779899564038-127.0.0.1:56848_solr-n_0000000000) [n:127.0.0.1:56848_solr    ] o.a.s.c.OverseerTaskProcessor RunningTasks: []
   [junit4]   2> 2944151 DEBUG (OverseerCollectionConfigSetProcessor-72065779899564038-127.0.0.1:56848_solr-n_0000000000) [n:127.0.0.1:56848_solr    ] o.a.s.c.OverseerTaskProcessor BlockedTasks: []
   [junit4]   2> 2944151 DEBUG (OverseerCollectionConfigSetProcessor-72065779899564038-127.0.0.1:56848_solr-n_0000000000) [n:127.0.0.1:56848_solr    ] o.a.s.c.OverseerTaskProcessor CompletedTasks: []
   [junit4]   2> 2944151 DEBUG (OverseerCollectionConfigSetProcessor-72065779899564038-127.0.0.1:56848_solr-n_0000000000) [n:127.0.0.1:56848_solr    ] o.a.s.c.OverseerTaskProcessor RunningZKTasks: []
   [junit4]   2> 2944151 DEBUG (OverseerCollectionConfigSetProcessor-72065779899564038-127.0.0.1:56848_solr-n_0000000000) [n:127.0.0.1:56848_solr    ] o.a.s.c.OverseerTaskQueue Peeking for top 100 elements. ExcludeSet: []
   [junit4]   2> 2944152 DEBUG (SyncThread:0) [    ] o.a.s.c.ZkTestServer Watch added: children: /solr/overseer/collection-queue-work
   [junit4]   2> 2944152 INFO  (jetty-launcher-7157-thread-2) [n:127.0.0.1:56848_solr    ] o.a.s.c.ZkController Register node as live in ZooKeeper:/live_nodes/127.0.0.1:56848_solr
   [junit4]   2> 2944152 DEBUG (OverseerAutoScalingTriggerThread-72065779899564038-127.0.0.1:56848_solr-n_0000000000) [    ] o.a.s.c.a.OverseerTriggerThread Adding .auto_add_replicas and .scheduled_maintenance triggers
   [junit4]   2> 2944153 DEBUG (SyncThread:0) [    ] o.a.s.c.ZkTestServer Watch fired: children: /solr/live_nodes
   [junit4]   2> 2944153 DEBUG (SyncThread:0) [    ] o.a.s.c.ZkTestServer Watch fired: children: /solr/live_nodes
   [junit4]   2> 2944153 DEBUG (SyncThread:0) [    ] o.a.s.c.ZkTestServer Watch added: data: /solr/autoscaling.json
   [junit4]   2> 2944153 DEBUG (OverseerAutoScalingTriggerThread-72065779899564038-127.0.0.1:56848_solr-n_0000000000) [    ] o.a.s.c.a.OverseerTriggerThread Refreshing /autoscaling.json with znode version 1
   [junit4]   2> 2944153 DEBUG (SyncThread:0) [    ] o.a.s.c.ZkTestServer Watch added: children: /solr/live_nodes
   [junit4]   2> 2944154 INFO  (zkCallback-7173-thread-1) [    ] o.a.s.c.c.ZkStateReader Updated live nodes from ZooKeeper... (0) -> (1)
   [junit4]   2> 2944154 DEBUG (OverseerAutoScalingTriggerThread-72065779899564038-127.0.0.1:56848_solr-n_0000000000) [    ] o.a.s.c.a.OverseerTriggerThread Current znodeVersion 1, lastZnodeVersion -1
   [junit4]   2> 2944154 DEBUG (OverseerAutoScalingTriggerThread-72065779899564038-127.0.0.1:56848_solr-n_0000000000) [    ] o.a.s.c.a.OverseerTriggerThread Processed trigger updates upto znodeVersion 1
   [junit4]   2> 2944163 DEBUG (SyncThread:0) [    ] o.a.s.c.ZkTestServer Watch added: children: /solr/autoscaling/events/.scheduled_maintenance
   [junit4]   2> 2944165 DEBUG (OverseerAutoScalingTriggerThread-72065779899564038-127.0.0.1:56848_solr-n_0000000000) [    ] o.a.s.c.a.NodeLostTrigger NodeLostTrigger .auto_add_replicas - Initial livenodes: []
   [junit4]   2> 2944166 DEBUG (OverseerAutoScalingTriggerThread-72065779899564038-127.0.0.1:56848_solr-n_0000000000) [    ] o.a.s.c.a.OverseerTriggerThread -- clean old nodeAdded markers
   [junit4]   2> 2944166 DEBUG (OverseerAutoScalingTriggerThread-72065779899564038-127.0.0.1:56848_solr-n_0000000000) [    ] o.a.s.c.a.OverseerTriggerThread Current znodeVersion 1, lastZnodeVersion 1
   [junit4]   2> 2944166 DEBUG (SyncThread:0) [    ] o.a.s.c.ZkTestServer Watch added: children: /solr/autoscaling/events/.auto_add_replicas
   [junit4]   2> 2944166 DEBUG (ScheduledTrigger-11742-thread-1) [    ] o.a.s.c.a.NodeLostTrigger Running NodeLostTrigger: .auto_add_replicas with currently live nodes: 0
   [junit4]   2> 2944174 INFO  (jetty-launcher-7157-thread-2) [n:127.0.0.1:56848_solr    ] o.a.s.h.a.MetricsHistoryHandler No .system collection, keeping metrics history in memory.
   [junit4]   2> 2944195 DEBUG (SyncThread:0) [    ] o.a.s.c.ZkTestServer Watch added: children: /solr/live_nodes
   [junit4]   2> 2944195 INFO  (zkCallback-7180-thread-1) [    ] o.a.s.c.c.ZkStateReader Updated live nodes from ZooKeeper... (0) -> (1)
   [junit4]   2> 2944212 INFO  (jetty-launcher-7157-thread-2) [n:127.0.0.1:56848_solr    ] o.a.s.m.r.SolrJmxReporter JMX monitoring for 'solr_56848.solr.node' (registry 'solr.node') enabled at server: com.sun.jmx.mbeanserver.JmxMBeanServer@6e8b98b3
   [junit4]   2> 2944220 INFO  (jetty-launcher-7157-thread-2) [n:127.0.0.1:56848_solr    ] o.a.s.m.r.SolrJmxReporter JMX monitoring for 'solr_56848.solr.jvm' (registry 'solr.jvm') enabled at server: com.sun.jmx.mbeanserver.JmxMBeanServer@6e8b98b3
   [junit4]   2> 2944220 INFO  (jetty-launcher-7157-thread-2) [n:127.0.0.1:56848_solr    ] o.a.s.m.r.SolrJmxReporter JMX monitoring for 'solr_56848.solr.jetty' (registry 'solr.jetty') enabled at server: com.sun.jmx.mbeanserver.JmxMBeanServer@6e8b98b3
   [junit4]   2> 2944228 INFO  (jetty-launcher-7157-thread-2) [n:127.0.0.1:56848_solr    ] o.a.s.c.CorePropertiesLocator Found 0 core definitions underneath /export/home/jenkins/workspace/Lucene-Solr-master-Solaris/solr/build/solr-core/test/J0/temp/solr.cloud.MoveReplicaHDFSTest_C2C6E33908AA1145-001/tempDir-001/node1/.
   [junit4]   2> 2944618 INFO  (jetty-launcher-7157-thread-4) [    ] o.a.s.c.ZkContainer Zookeeper client=127.0.0.1:47634/solr
   [junit4]   2> 2944620 INFO  (zkConnectionManagerCallback-7186-thread-1) [    ] o.a.s.c.c.ConnectionManager zkClient has connected
   [junit4]   2> 2944621 DEBUG (jetty-launcher-7157-thread-4) [n:127.0.0.1:39243_solr    ] o.a.s.c.ZkController Added new OnReconnect listener org.apache.solr.cloud.ZkController$$Lambda$315/1961763290@2b131cc0
   [junit4]   2> 2944623 INFO  (zkConnectionManagerCallback-7188-thread-1) [    ] o.a.s.c.c.ConnectionManager zkClient has connected
   [junit4]   2> 2944630 DEBUG (SyncThread:0) [    ] o.a.s.c.ZkTestServer Watch added: create/delete: /solr/clusterprops.json
   [junit4]   2> 2944630 DEBUG (SyncThread:0) [    ] o.a.s.c.ZkTestServer Watch added: children: /solr/live_nodes
   [junit4]   2> 2944630 INFO  (jetty-launcher-7157-thread-4) [n:127.0.0.1:39243_solr    ] o.a.s.c.c.ZkStateReader Updated live nodes from ZooKeeper... (0) -> (1)
   [junit4]   2> 2944630 DEBUG (SyncThread:0) [    ] o.a.s.c.ZkTestServer Watch added: data: /solr/clusterstate.json
   [junit4]   2> 2944631 DEBUG (SyncThread:0) [    ] o.a.s.c.ZkTestServer Watch added: children: /solr/collections
   [junit4]   2> 2944631 DEBUG (SyncThread:0) [    ] o.a.s.c.ZkTestServer Watch added: create/delete: /solr/aliases.json
   [junit4]   2> 2944631 DEBUG (SyncThread:0) [    ] o.a.s.c.ZkTestServer Watch added: create/delete: /solr/security.json
   [junit4]   2> 2944633 DEBUG (jetty-launcher-7157-thread-4) [n:127.0.0.1:39243_solr    ] o.a.s.c.LeaderElector Joined leadership election with path: /overseer_elect/election/72065779899564041-127.0.0.1:39243_solr-n_0000000001
   [junit4]   2> 2944633 DEBUG (SyncThread:0) [    ] o.a.s.c.ZkTestServer Watch added: data: /solr/overseer_elect/election/72065779899564038-127.0.0.1:56848_solr-n_0000000000
   [junit4]   2> 2944633 DEBUG (jetty-launcher-7157-thread-4) [n:127.0.0.1:39243_solr    ] o.a.s.c.LeaderElector Watching path /overseer_elect/election/72065779899564038-127.0.0.1:56848_solr-n_0000000000 to know if I could be the leader
   [junit4]   2> 2944633 DEBUG (jetty-launcher-7157-thread-4) [n:127.0.0.1:39243_solr    ] o.a.s.c.ZkController Publish node=127.0.0.1:39243_solr as DOWN
   [junit4]   2> 2944634 DEBUG (SyncThread:0) [    ] o.a.s.c.ZkTestServer Watch fired: children: /solr/overseer/queue
   [junit4]   2> 2944634 INFO  (jetty-launcher-7157-thread-4) [n:127.0.0.1:39243_solr    ] o.a.s.c.TransientSolrCoreCacheDefault Allocating transient cache for 2147483647 transient cores
   [junit4]   2> 2944634 INFO  (jetty-launcher-7157-thread-4) [n:127.0.0.1:39243_solr    ] o.a.s.c.ZkController Register node as live in ZooKeeper:/live_nodes/127.0.0.1:39243_solr
   [junit4]   2> 2944635 DEBUG (SyncThread:0) [    ] o.a.s.c.ZkTestServer Watch fired: children: /solr/live_nodes
   [junit4]   2> 2944635 DEBUG (SyncThread:0) [    ] o.a.s.c.ZkTestServer Watch fired: children: /solr/live_nodes
   [junit4]   2> 2944635 DEBUG (SyncThread:0) [    ] o.a.s.c.ZkTestServer Watch fired: children: /solr/live_nodes
   [junit4]   2> 2944635 DEBUG (SyncThread:0) [    ] o.a.s.c.ZkTestServer Watch added: children: /solr/live_nodes
   [junit4]   2> 2944635 INFO  (zkCallback-7180-thread-1) [    ] o.a.s.c.c.ZkStateReader Updated live nodes from ZooKeeper... (1) -> (2)
   [junit4]   2> 2944637 DEBUG (SyncThread:0) [    ] o.a.s.c.ZkTestServer Watch added: children: /solr/overseer/queue
   [junit4]   2> 2944637 DEBUG (SyncThread:0) [    ] o.a.s.c.ZkTestServer Watch added: children: /solr/live_nodes
   [junit4]   2> 2944637 INFO  (zkCallback-7173-thread-1) [    ] o.a.s.c.c.ZkStateReader Updated live nodes from ZooKeeper... (1) -> (2)
   [junit4]   2> 2944651 DEBUG (SyncThread:0) [    ] o.a.s.c.ZkTestServer Watch added: children: /solr/live_nodes
   [junit4]   2> 2944652 INFO  (zkCallback-7187-thread-1) [    ] o.a.s.c.c.ZkStateReader Updated live nodes from ZooKeeper... (1) -> (2)
   [junit4]   2> 2944652 INFO  (zkConnectionManagerCallback-7195-thread-1) [    ] o.a.s.c.c.ConnectionManager zkClient has connected
   [junit4]   2> 2944653 DEBUG (SyncThread:0) [    ] o.a.s.c.ZkTestServer Watch added: create/delete: /solr/clusterprops.json
   [junit4]   2> 2944653 DEBUG (SyncThread:0) [    ] o.a.s.c.ZkTestServer Watch added: children: /solr/live_nodes
   [junit4]   2> 2944653 INFO  (jetty-launcher-7157-thread-4) [n:127.0.0.1:39243_solr    ] o.a.s.c.c.ZkStateReader Updated live nodes from ZooKeeper... (0) -> (2)
   [junit4]   2> 2944653 DEBUG (SyncThread:0) [    ] o.a.s.c.ZkTestServer Watch added: data: /solr/clusterstate.json
   [junit4]   2> 2944654 DEBUG (SyncThread:0) [    ] o.a.s.c.ZkTestServer Watch added: children: /solr/collections
   [junit4]   2> 2944654 DEBUG (SyncThread:0) [    ] o.a.s.c.ZkTestServer Watch added: create/delete: /solr/aliases.json
   [junit4]   2> 2944654 INFO  (jetty-launcher-7157-thread-4) [n:127.0.0.1:39243_solr    ] o.a.s.c.s.i.ZkClientClusterStateProvider Cluster at 127.0.0.1:47634/solr ready
   [junit4]   2> 2944655 INFO  (jetty-launcher-7157-thread-4) [n:127.0.0.1:39243_solr    ] o.a.s.h.a.MetricsHistoryHandler No .system collection, keeping metrics history in memory.
   [junit4]   2> 2944666 INFO  (jetty-launcher-7157-thread-4) [n:127.0.0.1:39243_solr    ] o.a.s.m.r.SolrJmxReporter JMX monitoring for 'solr_39243.solr.node' (registry 'solr.node') enabled at server: com.sun.jmx.mbeanserver.JmxMBeanServer@6e8b98b3
   [junit4]   2> 2944671 INFO  (jetty-launcher-7157-thread-4) [n:127.0.0.1:39243_solr    ] o.a.s.m.r.SolrJmxReporter JMX monitoring for 'solr_39243.solr.jvm' (registry 'solr.jvm') enabled at server: com.sun.jmx.mbeanserver.JmxMBeanServer@6e8b98b3
   [junit4]   2> 2944671 INFO  (jetty-launcher-7157-thread-4) [n:127.0.0.1:39243_solr    ] o.a.s.m.r.SolrJmxReporter JMX monitoring for 'solr_39243.solr.jetty' (registry 'solr.jetty') enabled at server: com.sun.jmx.mbeanserver.JmxMBeanServer@6e8b98b3
   [junit4]   2> 2944672 INFO  (jetty-launcher-7157-thread-4) [n:127.0.0.1:39243_solr    ] o.a.s.c.CorePropertiesLocator Found 0 core definitions underneath /export/home/jenkins/workspace/Lucene-Solr-master-Solaris/solr/build/solr-core/test/J0/temp/solr.cloud.MoveReplicaHDFSTest_C2C6E33908AA1145-001/tempDir-001/node4/.
   [junit4]   2> 2944738 DEBUG (SyncThread:0) [    ] o.a.s.c.ZkTestServer Watch fired: children: /solr/overseer/queue
   [junit4]   2> 2944738 DEBUG (SyncThread:0) [    ] o.a.s.c.ZkTestServer Watch added: children: /solr/overseer/queue
   [junit4]   2> 2944863 INFO  (jetty-launcher-7157-thread-1) [    ] o.a.s.c.ZkContainer Zookeeper client=127.0.0.1:47634/solr
   [junit4]   2> 2944865 INFO  (zkConnectionManagerCallback-7200-thread-1) [    ] o.a.s.c.c.ConnectionManager zkClient has connected
   [junit4]   2> 2944866 DEBUG (jetty-launcher-7157-thread-1) [n:127.0.0.1:55392_solr    ] o.a.s.c.ZkController Added new OnReconnect listener org.apache.solr.cloud.ZkController$$Lambda$315/1961763290@60e7b819
   [junit4]   2> 2944868 INFO  (zkConnectionManagerCallback-7202-thread-1) [    ] o.a.s.c.c.ConnectionManager zkClient has connected
   [junit4]   2> 2944879 DEBUG (SyncThread:0) [    ] o.a.s.c.ZkTestServer Watch added: create/delete: /solr/clusterprops.json
   [junit4]   2> 2944879 DEBUG (SyncThread:0) [    ] o.a.s.c.ZkTestServer Watch added: children: /solr/live_nodes
   [junit4]   2> 2944879 INFO  (jetty-launcher-7157-thread-1) [n:127.0.0.1:55392_solr    ] o.a.s.c.c.ZkStateReader Updated live nodes from ZooKeeper... (0) -> (2)
   [junit4]   2> 2944880 DEBUG (SyncThread:0) [    ] o.a.s.c.ZkTestServer Watch added: data: /solr/clusterstate.json
   [junit4]   2> 2944880 DEBUG (SyncThread:0) [    ] o.a.s.c.ZkTestServer Watch added: children: /solr/collections
   [junit4]   2> 2944880 DEBUG (SyncThread:0) [    ] o.a.s.c.ZkTestServer Watch added: create/delete: /solr/aliases.json
   [junit4]   2> 2944881 DEBUG (SyncThread:0) [    ] o.a.s.c.ZkTestServer Watch added: create/delete: /solr/security.json
   [junit4]   2> 2944884 DEBUG (jetty-launcher-7157-thread-1) [n:127.0.0.1:55392_solr    ] o.a.s.c.LeaderElector Joined leadership election with path: /overseer_elect/election/72065779899564044-127.0.0.1:55392_solr-n_0000000002
   [junit4]   2> 2944884 DEBUG (SyncThread:0) [    ] o.a.s.c.ZkTestServer Watch added: data: /solr/overseer_elect/election/72065779899564041-127.0.0.1:39243_solr-n_0000000001
   [junit4]   2> 2944885 DEBUG (jetty-launcher-7157-thread-1) [n:127.0.0.1:55392_solr    ] o.a.s.c.LeaderElector Watching path /overseer_elect/election/72065779899564041-127.0.0.1:39243_solr-n_0000000001 to know if I could be the leader
   [junit4]   2> 2944885 DEBUG (jetty-launcher-7157-thread-1) [n:127.0.0.1:55392_solr    ] o.a.s.c.ZkController Publish node=127.0.0.1:55392_solr as DOWN
   [junit4]   2> 2944887 DEBUG (SyncThread:0) [    ] o.a.s.c.ZkTestServer Watch fired: children: /solr/overseer/queue
   [junit4]   2> 2944887 DEBUG (SyncThread:0) [    ] o.a.s.c.ZkTestServer Watch added: children: /solr/overseer/queue
   [junit4]   2> 2944887 INFO  (jetty-launcher-7157-thread-1) [n:127.0.0.1:55392_solr    ] o.a.s.c.TransientSolrCoreCacheDefault Allocating transient cache for 2147483647 transient cores
   [junit4]   2> 2944887 INFO  (jetty-launcher-7157-thread-1) [n:127.0.0.1:55392_solr    ] o.a.s.c.ZkController Register node as live in ZooKeeper:/live_nodes/127.0.0.1:55392_solr
   [junit4]   2> 2944888 DEBUG (SyncThread:0) [    ] o.a.s.c.ZkTestServer Watch fired: children: /solr/live_nodes
   [junit4]   2> 2944888 DEBUG (SyncThread:0) [    ] o.a.s.c.ZkTestServer Watch fired: children: /solr/live_nodes
   [junit4]   2> 2944888 DEBUG (SyncThread:0) [    ] o.a.s.c.ZkTestServer Watch fired: children: /solr/live_nodes
   [junit4]   2> 2944888 DEBUG (SyncThread:0) [    ] o.a.s.c.ZkTestServer Watch fired: children: /solr/live_nodes
   [junit4]   2> 2944888 DEBUG (SyncThread:0) [    ] o.a.s.c.ZkTestServer Watch fired: children: /solr/live_nodes
   [junit4]   2> 2944889 DEBUG (SyncThread:0) [    ] o.a.s.c.ZkTestServer Watch added: children: /solr/live_nodes
   [junit4]   2> 2944889 DEBUG (SyncThread:0) [    ] o.a.s.c.ZkTestServer Watch added: children: /solr/live_nodes
   [junit4]   2> 2944889 INFO  (zkCallback-7173-thread-1) [    ] o.a.s.c.c.ZkStateReader Updated live nodes from ZooKeeper... (2) -> (3)
   [junit4]   2> 2944889 INFO  (zkCallback-7180-thread-1) [    ] o.a.s.c.c.ZkStateReader Updated live nodes from ZooKeeper... (2) -> (3)
   [junit4]   2> 2944889 DEBUG (SyncThread:0) [    ] o.a.s.c.ZkTestServer Watch added: children: /solr/live_nodes
   [junit4]   2> 2944889 INFO  (zkCallback-7187-thread-1) [    ] o.a.s.c.c.ZkStateReader Updated live nodes from ZooKeeper... (2) -> (3)
   [junit4]   2> 2944890 DEBUG (SyncThread:0) [    ] o.a.s.c.ZkTestServer Watch added: children: /solr/live_nodes
   [junit4]   2> 2944890 INFO  (zkCallback-7201-thread-1) [    ] o.a.s.c.c.ZkStateReader Updated live nodes from ZooKeeper... (2) -> (3)
   [junit4]   2> 2944890 DEBUG (SyncThread:0) [    ] o.a.s.c.ZkTestServer Watch added: children: /solr/live_nodes
   [junit4]   2> 2944891 INFO  (zkCallback-7194-thread-1) [    ] o.a.s.c.c.ZkStateReader Updated live nodes from ZooKeeper... (2) -> (3)
   [junit4]   2> 2944908 INFO  (zkConnectionManagerCallback-7209-thread-1) [    ] o.a.s.c.c.ConnectionManager zkClient has connected
   [junit4]   2> 2944909 DEBUG (SyncThread:0) [    ] o.a.s.c.ZkTestServer Watch added: create/delete: /solr/clusterprops.json
   [junit4]   2> 2944910 DEBUG (SyncThread:0) [    ] o.a.s.c.ZkTestServer Watch added: children: /solr/live_nodes
   [junit4]   2> 2944910 INFO  (jetty-launcher-7157-thread-1) [n:127.0.0.1:55392_solr    ] o.a.s.c.c.ZkStateReader Updated live nodes from ZooKeeper... (0) -> (3)
   [junit4]   2> 2944910 DEBUG (SyncThread:0) [    ] o.a.s.c.ZkTestServer Watch added: data: /solr/clusterstate.json
   [junit4]   2> 2944910 DEBUG (SyncThread:0) [    ] o.a.s.c.ZkTestServer Watch added: children: /solr/collections
   [junit4]   2> 2944911 DEBUG (SyncThread:0) [    ] o.a.s.c.ZkTestServer Watch added: create/delete: /solr/aliases.json
   [junit4]   2> 2944911 INFO  (jetty-launcher-7157-thread-1) [n:127.0.0.1:55392_solr    ] o.a.s.c.s.i.ZkClientClusterStateProvider Cluster at 127.0.0.1:47634/solr ready
   [junit4]   2> 2944912 INFO  (jetty-launcher-7157-thread-1) [n:127.0.0.1:55392_solr    ] o.a.s.h.a.MetricsHistoryHandler No .system collection, keeping metrics history in memory.
   [junit4]   2> 2944931 INFO  (jetty-launcher-7157-thread-1) [n:127.0.0.1:55392_solr    ] o.a.s.m.r.SolrJmxReporter JMX monitoring for 'solr_55392.solr.node' (registry 'solr.node') enabled at server: com.sun.jmx.mbeanserver.JmxMBeanServer@6e8b98b3
   [junit4]   2> 2944938 INFO  (jetty-launcher-7157-thread-1) [n:127.0.0.1:55392_solr    ] o.a.s.m.r.SolrJmxReporter JMX monitoring for 'solr_55392.solr.jvm' (registry 'solr.jvm') enabled at server: com.sun.jmx.mbeanserver.JmxMBeanServer@6e8b98b3
   [junit4]   2> 2944938 INFO  (jetty-launcher-7157-thread-1) [n:127.0.0.1:55392_solr    ] o.a.s.m.r.SolrJmxReporter JMX monitoring for 'solr_55392.solr.jetty' (registry 'solr.jetty') enabled at server: com.sun.jmx.mbeanserver.JmxMBeanServer@6e8b98b3
   [junit4]   2> 2944939 INFO  (jetty-launcher-7157-thread-1) [n:127.0.0.1:55392_solr    ] o.a.s.c.CorePropertiesLocator Found 0 core definitions underneath /export/home/jenkins/workspace/Lucene-Solr-master-Solaris/solr/build/solr-core/test/J0/temp/solr.cloud.MoveReplicaHDFSTest_C2C6E33908AA1145-001/tempDir-001/node2/.
   [junit4]   2> 2944988 DEBUG (SyncThread:0) [    ] o.a.s.c.ZkTestServer Watch fired: children: /solr/overseer/queue
   [junit4]   2> 2944989 DEBUG (SyncThread:0) [    ] o.a.s.c.ZkTestServer Watch added: children: /solr/overseer/queue
   [junit4]   2> 2945173 DEBUG (ScheduledTrigger-11742-thread-3) [    ] o.a.s.c.a.NodeLostTrigger Running NodeLostTrigger: .auto_add_replicas with currently live nodes: 3
   [junit4]   2> 2945819 INFO  (jetty-launcher-7157-thread-3) [    ] o.a.s.c.ZkContainer Zookeeper client=127.0.0.1:47634/solr
   [junit4]   2> 2945821 INFO  (zkConnectionManagerCallback-7214-thread-1) [    ] o.a.s.c.c.ConnectionManager zkClient has connected
   [junit4]   2> 2945821 DEBUG (jetty-launcher-7157-thread-3) [n:127.0.0.1:59992_solr    ] o.a.s.c.ZkController Added new OnReconnect listener org.apache.solr.cloud.ZkController$$Lambda$315/1961763290@522d5d29
   [junit4]   2> 2945827 INFO  (zkConnectionManagerCallback-7216-thread-1) [    ] o.a.s.c.c.ConnectionManager zkClient has connected
   [junit4]   2> 2945849 DEBUG (SyncThread:0) [    ] o.a.s.c.ZkTestServer Watch added: create/delete: /solr/clusterprops.json
   [junit4]   2> 2945849 DEBUG (SyncThread:0) [    ] o.a.s.c.ZkTestServer Watch added: children: /solr/live_nodes
   [junit4]   2> 2945849 INFO  (jetty-launcher-7157-thread-3) [n:127.0.0.1:59992_solr    ] o.a.s.c.c.ZkStateReader Updated live nodes from ZooKeeper... (0) -> (3)
   [junit4]   2> 2945850 DEBUG (SyncThread:0) [    ] o.a.s.c.ZkTestServer Watch added: data: /solr/clusterstate.json
   [junit4]   2> 2945850 DEBUG (SyncThread:0) [    ] o.a.s.c.ZkTestServer Watch added: children: /solr/collections
   [junit4]   2> 2945850 DEBUG (SyncThread:0) [    ] o.a.s.c.ZkTestServer Watch added: create/delete: /solr/aliases.json
   [junit4]   2> 2945851 DEBUG (SyncThread:0) [    ] o.a.s.c.ZkTestServer Watch added: create/delete: /solr/security.json
   [junit4]   2> 2945854 DEBUG (jetty-launcher-7157-thread-3) [n:127.0.0.1:59992_solr    ] o.a.s.c.LeaderElector Joined leadership election with path: /overseer_elect/election/72065779899564047-127.0.0.1:59992_solr-n_0000000003
   [junit4]   2> 2945854 DEBUG (SyncThread:0) [    ] o.a.s.c.ZkTestServer Watch added: data: /solr/overseer_elect/election/72065779899564044-127.0.0.1:55392_solr-n_0000000002
   [junit4]   2> 2945854 DEBUG (jetty-launcher-7157-thread-3) [n:127.0.0.1:59992_solr    ] o.a.s.c.LeaderElector Watching path /overseer_elect/election/72065779899564044-127.0.0.1:55392_solr-n_0000000002 to know if I could be the leader
   [junit4]   2> 2945855 DEBUG (jetty-launcher-7157-thread-3) [n:127.0.0.1:59992_solr    ] o.a.s.c.ZkController Publish node=127.0.0.1:59992_solr as DOWN
   [junit4]   2> 2945856 DEBUG (SyncThread:0) [    ] o.a.s.c.ZkTestServer Watch fired: children: /solr/overseer/queue
   [junit4]   2> 2945857 DEBUG (SyncThread:0) [    ] o.a.s.c.ZkTestServer Watch added: children: /solr/overseer/queue
   [junit4]   2> 2945857 INFO  (jetty-launcher-7157-thread-3) [n:127.0.0.1:59992_solr    ] o.a.s.c.TransientSolrCoreCacheDefault Allocating transient cache for 2147483647 transient cores
   [junit4]   2> 2945857 INFO  (jetty-launcher-7157-thread-3) [n:127.0.0.1:59992_solr    ] o.a.s.c.ZkController Register node as live in ZooKeeper:/live_nodes/127.0.0.1:59992_solr
   [junit4]   2> 2945857 DEBUG (SyncThread:0) [    ] o.a.s.c.ZkTestServer Watch fired: children: /solr/live_nodes
   [junit4]   2> 2945857 DEBUG (SyncThread:0) [    ] o.a.s.c.ZkTestServer Watch fired: children: /solr/live_nodes
   [junit4]   2> 2945857 DEBUG (SyncThread:0) [    ] o.a.s.c.ZkTestServer Watch fired: children: /solr/live_nodes
   [junit4]   2> 2945857 DEBUG (SyncThread:0) [    ] o.a.s.c.ZkTestServer Watch fired: children: /solr/live_nodes
   [junit4]   2> 2945857 DEBUG (SyncThread:0) [    ] o.a.s.c.ZkTestServer Watch fired: children: /solr/live_nodes
   [junit4]   2> 2945857 DEBUG (SyncThread:0) [    ] o.a.s.c.ZkTestServer Watch fired: children: /solr/live_nodes
   [junit4]   2> 2945857 DEBUG (SyncThread:0) [    ] o.a.s.c.ZkTestServer Watch fired: children: /solr/live_nodes
   [junit4]   2> 2945857 DEBUG (SyncThread:0) [    ] o.a.s.c.ZkTestServer Watch added: children: /solr/live_nodes
   [junit4]   2> 2945857 DEBUG (SyncThread:0) [    ] o.a.s.c.ZkTestServer Watch added: children: /solr/live_nodes
   [junit4]   2> 2945862 INFO  (zkCallback-7173-thread-1) [    ] o.a.s.c.c.ZkStateReader Updated live nodes from ZooKeeper... (3) -> (4)
   [junit4]   2> 2945862 INFO  (zkCallback-7180-thread-1) [    ] o.a.s.c.c.ZkStateReader Updated live nodes from ZooKeeper... (3) -> (4)
   [junit4]   2> 2945863 DEBUG (SyncThread:0) [    ] o.a.s.c.ZkTestServer Watch added: children: /solr/live_nodes
   [junit4]   2> 2945864 DEBUG (SyncThread:0) [    ] o.a.s.c.ZkTestServer Watch added: children: /solr/live_nodes
   [junit4]   2> 2945864 DEBUG (SyncThread:0) [    ] o.a.s.c.ZkTestServer Watch added: children: /solr/live_nodes
   [junit4]   2> 2945864 DEBUG (SyncThread:0) [    ] o.a.s.c.ZkTestServer Watch added: children: /solr/live_nodes
   [junit4]   2> 2945864 INFO  (zkCallback-7194-thread-1) [    ] o.a.s.c.c.ZkStateReader Updated live nodes from ZooKeeper... (3) -> (4)
   [junit4]   2> 2945864 INFO  (zkCallback-7208-thread-1) [    ] o.a.s.c.c.ZkStateReader Updated live nodes from ZooKeeper... (3) -> (4)
   [junit4]   2> 2945864 INFO  (zkCallback-7201-thread-1) [    ] o.a.s.c.c.ZkStateReader Updated live nodes from ZooKeeper... (3) -> (4)
   [junit4]   2> 2945864 INFO  (zkCallback-7215-thread-1) [    ] o.a.s.c.c.ZkStateReader Updated live nodes from ZooKeeper... (3) -> (4)
   [junit4]   2> 2945865 DEBUG (SyncThread:0) [    ] o.a.s.c.ZkTestServer Watch added: children: /solr/live_nodes
   [junit4]   2> 2945865 INFO  (zkCallback-7187-thread-1) [    ] o.a.s.c.c.ZkStateReader Updated live nodes from ZooKeeper... (3) -> (4)
   [junit4]   2> 2945888 INFO  (zkConnectionManagerCallback-7223-thread-1) [    ] o.a.s.c.c.ConnectionManager zkClient has connected
   [junit4]   2> 2945889 DEBUG (SyncThread:0) [    ] o.a.s.c.ZkTestServer Watch added: create/delete: /solr/clusterprops.json
   [junit4]   2> 2945890 DEBUG (SyncThread:0) [    ] o.a.s.c.ZkTestServer Watch added: children: /solr/live_nodes
   [junit4]   2> 2945890 INFO  (jetty-launcher-7157-thread-3) [n:127.0.0.1:59992_solr    ] o.a.s.c.c.ZkStateReader Updated live nodes from ZooKeeper... (0) -> (4)
   [junit4]   2> 2945890 DEBUG (SyncThread:0) [    ] o.a.s.c.ZkTestServer Watch added: data: /solr/clusterstate.json
   [junit4]   2> 2945890 DEBUG (SyncThread:0) [    ] o.a.s.c.ZkTestServer Watch added: children: /solr/collections
   [junit4]   2> 2945891 DEBUG (SyncThread:0) [    ] o.a.s.c.ZkTestServer Watch added: create/delete: /solr/aliases.json
   [junit4]   2> 2945891 INFO  (jetty-launcher-7157-thread-3) [n:127.0.0.1:59992_solr    ] o.a.s.c.s.i.ZkClientClusterStateProvider Cluster at 127.0.0.1:47634/solr ready
   [junit4]   2> 2945892 INFO  (jetty-launcher-7157-thread-3) [n:127.0.0.1:59992_solr    ] o.a.s.h.a.MetricsHistoryHandler No .system collection, keeping metrics history in memory.
   [junit4]   2> 2945916 INFO  (jetty-launcher-7157-thread-3) [n:127.0.0.1:59992_solr    ] o.a.s.m.r.SolrJmxReporter JMX monitoring for 'solr_59992.solr.node' (registry 'solr.node') enabled at server: com.sun.jmx.mbeanserver.JmxMBeanServer@6e8b98b3
   [junit4]   2> 2945934 INFO  (jetty-launcher-7157-thread-3) [n:127.0.0.1:59992_solr    ] o.a.s.m.r.SolrJmxReporter JMX monitoring for 'solr_59992.solr.jvm' (registry 'solr.jvm') enabled at server: com.sun.jmx.mbeanserver.JmxMBeanServer@6e8b98b3
   [junit4]   2> 2945935 INFO  (jetty-launcher-7157-thread-3) [n:127.0.0.1:59992_solr    ] o.a.s.m.r.SolrJmxReporter JMX monitoring for 'solr_59992.solr.jetty' (registry 'solr.jetty') enabled at server: com.sun.jmx.mbeanserver.JmxMBeanServer@6e8b98b3
   [junit4]   2> 2945935 INFO  (jetty-launcher-7157-thread-3) [n:127.0.0.1:59992_solr    ] o.a.s.c.CorePropertiesLocator Found 0 core definitions underneath /export/home/jenkins/workspace/Lucene-Solr-master-Solaris/solr/build/solr-core/test/J0/temp/solr.cloud.MoveReplicaHDFSTest_C2C6E33908AA1145-001/tempDir-001/node3/.
   [junit4]   2> 2945958 DEBUG (SyncThread:0) [    ] o.a.s.c.ZkTestServer Watch fired: children: /solr/overseer/queue
   [junit4]   2> 2945959 DEBUG (SyncThread:0) [    ] o.a.s.c.ZkTestServer Watch added: children: /solr/overseer/queue
   [junit4]   2> 2945983 INFO  (zkConnectionManagerCallback-7226-thread-1) [    ] o.a.s.c.c.ConnectionManager zkClient has connected
   [junit4]   2> 2945986 INFO  (zkConnectionManagerCallback-7231-thread-1) [    ] o.a.s.c.c.ConnectionManager zkClient has connected
   [junit4]   2> 2945988 DEBUG (SyncThread:0) [    ] o.a.s.c.ZkTestServer Watch added: create/delete: /solr/clusterprops.json
   [junit4]   2> 2945988 DEBUG (SyncThread:0) [    ] o.a.s.c.ZkTestServer Watch added: children: /solr/live_nodes
   [junit4]   2> 2945988 INFO  (SUITE-MoveReplicaHDFSTest-seed#[C2C6E33908AA1145]-worker) [    ] o.a.s.c.c.ZkStateReader Updated live nodes from ZooKeeper... (0) -> (4)
   [junit4]   2> 2945988 DEBUG (SyncThread:0) [    ] o.a.s.c.ZkTestServer Watch added: data: /solr/clusterstate.json
   [junit4]   2> 2945989 DEBUG (SyncThread:0) [    ] o.a.s.c.ZkTestServer Watch added: children: /solr/collections
   [junit4]   2> 2945989 DEBUG (SyncThread:0) [    ] o.a.s.c.ZkTestServer Watch added: create/delete: /solr/aliases.json
   [junit4]   2> 2945990 INFO  (SUITE-MoveReplicaHDFSTest-seed#[C2C6E33908AA1145]-worker) [    ] o.a.s.c.s.i.ZkClientClusterStateProvider Cluster at 127.0.0.1:47634/solr ready
   [junit4]   2> 2945995 INFO  (qtp268480514-29091) [n:127.0.0.1:59992_solr    ] o.a.s.h.a.CollectionsHandler Invoked Collection Action :overseerstatus with params action=OVERSEERSTATUS&wt=javabin&version=2 and sendToOCPQueue=true
   [junit4]   2> 2945996 DEBUG (SyncThread:0) [    ] o.a.s.c.ZkTestServer Watch fired: children: /solr/overseer/collection-queue-work
   [junit4]   2> 2945996 DEBUG (SyncThread:0) [    ] o.a.s.c.ZkTestServer Watch added: children: /solr/overseer/collection-queue-work
   [junit4]   2> 2945996 DEBUG (SyncThread:0) [    ] o.a.s.c.ZkTestServer Watch added: create/delete: /solr/overseer/collection-queue-work/qnr-0000000000
   [junit4]   2> 2945997 DEBUG (OverseerCollectionConfigSetProcessor-72065779899564038-127.0.0.1:56848_solr-n_0000000000) [n:127.0.0.1:56848_solr    ] o.a.s.c.ZkDistributedQueue Found child node with improper name: qnr-0000000000
   [junit4]   2> 2945997 DEBUG (SyncThread:0) [    ] o.a.s.c.ZkTestServer Watch fired: children: /solr/overseer/collection-queue-work
   [junit4]   2> 2945997 DEBUG (SyncThread:0) [    ] o.a.s.c.ZkTestServer Watch added: children: /solr/overseer/collection-queue-work
   [junit4]   2> 2945997 DEBUG (OverseerCollectionConfigSetProcessor-72065779899564038-127.0.0.1:56848_solr-n_0000000000) [n:127.0.0.1:56848_solr    ] o.a.s.c.ZkDistributedQueue Found child node with improper name: qnr-0000000000
   [junit4]   2> 2945998 DEBUG (OverseerCollectionConfigSetProcessor-72065779899564038-127.0.0.1:56848_solr-n_0000000000) [n:127.0.0.1:56848_solr    ] o.a.s.c.OverseerTaskQueue Returning topN elements: [/overseer/collection-queue-work/qn-0000000000, ]
   [junit4]   2> 2945998 DEBUG (OverseerCollectionConfigSetProcessor-72065779899564038-127.0.0.1:56848_solr-n_0000000000) [n:127.0.0.1:56848_solr    ] o.a.s.c.OverseerTaskProcessor Got 1 tasks from work-queue : [[org.apache.solr.cloud.OverseerTaskQueue$QueueEvent@2e684ecf]]
   [junit4]   2> 2945998 DEBUG (OverseerCollectionConfigSetProcessor-72065779899564038-127.0.0.1:56848_solr-n_0000000000) [n:127.0.0.1:56848_solr    ] o.a.s.c.OverseerTaskProcessor Marked task [/overseer/collection-queue-work/qn-0000000000] as running
   [junit4]   2> 2945998 DEBUG (OverseerCollectionConfigSetProcessor-72065779899564038-127.0.0.1:56848_solr-n_0000000000) [n:127.0.0.1:56848_solr    ] o.a.s.c.OverseerTaskProcessor Overseer Collection Message Handler: Get the message id:/overseer/collection-queue-work/qn-0000000000 message:{"operation":"overseerstatus"}
   [junit4]   2> 2945998 DEBUG (OverseerThreadFactory-11744-thread-1-processing-n:127.0.0.1:56848_solr) [n:127.0.0.1:56848_solr    ] o.a.s.c.OverseerTaskProcessor Runner processing /overseer/collection-queue-work/qn-0000000000
   [junit4]   2> 2945998 DEBUG (OverseerThreadFactory-11744-thread-1-processing-n:127.0.0.1:56848_solr) [n:127.0.0.1:56848_solr    ] o.a.s.c.a.c.OverseerCollectionMessageHandler OverseerCollectionMessageHandler.processMessage : overseerstatus , {"operation":"overseerstatus"}
   [junit4]   2> 2945999 DEBUG (OverseerCollectionConfigSetProcessor-72065779899564038-127.0.0.1:56848_solr-n_0000000000) [n:127.0.0.1:56848_solr    ] o.a.s.c.OverseerTaskProcessor Cleaning up work-queue. #Running tasks: 1
   [junit4]   2> 2945999 DEBUG (OverseerCollectionConfigSetProcessor-72065779899564038-127.0.0.1:56848_solr-n_0000000000) [n:127.0.0.1:56848_solr    ] o.a.s.c.OverseerTaskProcessor RunningTasks: [/overseer/collection-queue-work/qn-0000000000]
   [junit4]   2> 2945999 DEBUG (OverseerCollectionConfigSetProcessor-72065779899564038-127.0.0.1:56848_solr-n_0000000000) [n:127.0.0.1:56848_solr    ] o.a.s.c.OverseerTaskProcessor BlockedTasks: []
   [junit4]   2> 2945999 DEBUG (OverseerCollectionConfigSetProcessor-72065779899564038-127.0.0.1:56848_solr-n_0000000000) [n:127.0.0.1:56848_solr    ] o.a.s.c.OverseerTaskProcessor CompletedTasks: []
   [junit4]   2> 2945999 DEBUG (OverseerCollectionConfigSetProcessor-72065779899564038-127.0.0.1:56848_solr-n_0000000000) [n:127.0.0.1:56848_solr    ] o.a.s.c.OverseerTaskProcessor RunningZKTasks: [/overseer/collection-queue-work/qn-0000000000]
   [junit4]   2> 2945999 DEBUG (OverseerCollectionConfigSetProcessor-72065779899564038-127.0.0.1:56848_solr-n_0000000000) [n:127.0.0.1:56848_solr    ] o.a.s.c.OverseerTaskQueue Peeking for top 99 elements. ExcludeSet: [/overseer/collection-queue-work/qn-0000000000],[]
   [junit4]   2> 2946000 DEBUG (OverseerThreadFactory-11744-thread-1-processing-n:127.0.0.1:56848_solr) [n:127.0.0.1:56848_solr    ] o.a.s.c.OverseerTaskProcessor Completed task:[/overseer/collection-queue-work/qn-0000000000]
   [junit4]   2> 2946001 DEBUG (SyncThread:0) [    ] o.a.s.c.ZkTestServer Watch fired: data: /solr/overseer/collection-queue-work/qnr-0000000000
   [junit4]   2> 2946002 DEBUG (SyncThread:0) [    ] o.a.s.c.ZkTestServer Watch fired: children: /solr/overseer/collection-queue-work
   [junit4]   2> 2946002 DEBUG (OverseerThreadFactory-11744-thread-1-processing-n:127.0.0.1:56848_solr) [n:127.0.0.1:56848_solr    ] o.a.s.c.OverseerTaskProcessor Marked task [/overseer/collection-queue-work/qn-0000000000] as completed.
   [junit4]   2> 2946002 DEBUG (OverseerThreadFactory-11744-thread-1-processing-n:127.0.0.1:56848_solr) [n:127.0.0.1:56848_solr    ] o.a.s.c.OverseerTaskProcessor RunningTasks: []
   [junit4]   2> 2946002 DEBUG (OverseerThreadFactory-11744-thread-1-processing-n:127.0.0.1:56848_solr) [n:127.0.0.1:56848_solr    ] o.a.s.c.OverseerTaskProcessor BlockedTasks: []
   [junit4]   2> 2946002 DEBUG (OverseerThreadFactory-11744-thread-1-processing-n:127.0.0.1:56848_solr) [n:127.0.0.1:56848_solr    ] o.a.s.c.OverseerTaskProcessor CompletedTasks: [/overseer/collection-queue-work/qn-0000000000]
   [junit4]   2> 2946002 DEBUG (OverseerThreadFactory-11744-thread-1-processing-n:127.0.0.1:56848_solr) [n:127.0.0.1:56848_solr    ] o.a.s.c.OverseerTaskProcessor RunningZKTasks: [/overseer/collection-queue-work/qn-0000000000]
   [junit4]   2> 2946002 DEBUG (OverseerThreadFactory-11744-thread-1-processing-n:127.0.0.1:56848_solr) [n:127.0.0.1:56848_solr    ] o.a.s.c.OverseerTaskProcessor Overseer Collection Message Handler: Message id:/overseer/collection-queue-work/qn-0000000000 complete, response:{leader=127.0.0.1:56848_solr,overseer_queue_size=0,overseer_work_queue_size=0,overseer_collection_queue_size=2,overseer_operations={am_i_leader={requests=5,errors=0,avgRequestsPerSecond=2.7000003978180587,5minRateRequestsPerSecond=0.0,15minRateRequestsPerSecond=0.0,avgTimePerRequest=0.2977097345673159,medianRequestTime=0.291691,75thPcRequestTime=0.373167,95thPcRequestTime=0.421617,99thPcRequestTime=0.421617,999thPcRequestTime=0.421617},downnode={requests=3,errors=0,avgRequestsPerSecond=2.2011258801432034,5minRateRequestsPerSecond=0.0,15minRateRequestsPerSecond=0.0,avgTimePerRequest=0.004302034658912573,medianRequestTime=0.006417,75thPcRequestTime=0.006546,95thPcRequestTime=0.006546,99thPcRequestTime=0.006546,999thPcRequestTime=0.006546}},collection_operations={am_i_leader={requests=3,errors=0,avgRequestsPerSecond=1.6205992433749492,5minRateRequestsPerSecond=0.0,15minRateRequestsPerSecond=0.0,avgTimePerRequest=0.6437614319585322,medianRequestTime=0.451386,75thPcRequestTime=1.261793,95thPcRequestTime=1.261793,99thPcRequestTime=1.261793,999thPcRequestTime=1.261793},overseerstatus={requests=0,errors=0,avgRequestsPerSecond=0.0,5minRateRequestsPerSecond=0.0,15minRateRequestsPerSecond=0.0,avgTimePerRequest=0.0,medianRequestTime=0.0,75thPcRequestTime=0.0,95thPcRequestTime=0.0,99thPcRequestTime=0.0,999thPcRequestTime=0.0}},overseer_queue={},overseer_internal_queue={peek={avgRequestsPerSecond=0.5404283423584452,5minRateRequestsPerSecond=0.0,15minRateRequestsPerSecond=0.0,avgTimePerRequest=0.192814,medianRequestTime=0.192814,75thPcRequestTime=0.192814,95thPcRequestTime=0.192814,99thPcRequestTime=0.192814,999thPcRequestTime=0.192814}},collection_queue={peektopn_wait2000={avgRequestsPerSecond=0.5408183562991632,5minRateRequestsPerSecond=0.0,15minRateRequestsPerSecond=0.0,avgTimePerRequest=1846.756976,medianRequestTime=1846.756976,75thPcRequestTime=1846.756976,95thPcRequestTime=1846.756976,99thPcRequestTime=1846.756976,999thPcRequestTime=1846.756976}}}
   [junit4]   2> 2946003 DEBUG (SyncThread:0) [    ] o.a.s.c.ZkTestServer Watch added: children: /solr/overseer/collection-queue-work
   [junit4]   2> 2946003 DEBUG (OverseerCollectionConfigSetProcessor-72065779899564038-127.0.0.1:56848_solr-n_0000000000) [n:127.0.0.1:56848_solr    ] o.a.s.c.ZkDistributedQueue Found child node with improper name: qnr-0000000000
   [junit4]   2> 2946003 DEBUG (zkCallback-7215-thread-1) [    ] o.a.s.c.OverseerTaskQueue NodeDataChanged fired on path /overseer/collection-queue-work/qnr-0000000000 state SyncConnected latchEventType null
   [junit4]   2> 2946004 DEBUG (SyncThread:0) [    ] o.a.s.c.ZkTestServer Watch fired: children: /solr/overseer/collection-queue-work
   [junit4]   2> 2946004 DEBUG (SyncThread:0) [    ] o.a.s.c.ZkTestServer Watch added: children: /solr/overseer/collection-queue-work
   [junit4]   2> 2946005 INFO  (qtp268480514-29091) [n:127.0.0.1:59992_solr    ] o.a.s.s.HttpSolrCall [admin] webapp=null path=/admin/collections params={action=OVERSEERSTATUS&wt=javabin&version=2} status=0 QTime=9
   [junit4]   1> Formatting using clusterid: testClusterID
   [junit4]   2> 2946111 WARN  (SUITE-MoveReplicaHDFSTest-seed#[C2C6E33908AA1145]-worker) [    ] o.a.h.m.i.MetricsConfig Cannot locate configuration: tried hadoop-metrics2-namenode.properties,hadoop-metrics2.properties
   [junit4]   2> 2946127 WARN  (SUITE-MoveReplicaHDFSTest-seed#[C2C6E33908AA1145]-worker) [    ] o.a.h.h.HttpRequestLog Jetty request log can only be enabled using Log4j
   [junit4]   2> 2946130 INFO  (SUITE-MoveReplicaHDFSTest-seed#[C2C6E33908AA1145]-worker) [    ] o.m.log jetty-6.1.26
   [junit4]   2> 2946153 INFO  (SUITE-MoveReplicaHDFSTest-seed#[C2C6E33908AA1145]-worker) [    ] o.m.log Extract jar:file:/export/home/jenkins/.ivy2/cache/org.apache.hadoop/hadoop-hdfs/tests/hadoop-hdfs-2.7.4-tests.jar!/webapps/hdfs to ./temp/Jetty_serv1.vm3_55082_hdfs____tin83v/webapp
   [junit4]   2> 2946174 DEBUG (ScheduledTrigger-11742-thread-4) [    ] o.a.s.c.a.NodeLostTrigger Running NodeLostTrigger: .auto_add_replicas with currently live nodes: 4
   [junit4]   2> 2946643 INFO  (SUITE-MoveReplicaHDFSTest-seed#[C2C6E33908AA1145]-worker) [    ] o.m.log Started HttpServer2$SelectChannelConnectorWithSafeStartup@serv1-vm3:55082
   [junit4]   2> 2946905 WARN  (SUITE-MoveReplicaHDFSTest-seed#[C2C6E33908AA1145]-worker) [    ] o.a.h.h.HttpRequestLog Jetty request log can only be enabled using Log4j
   [junit4]   2> 2946906 INFO  (SUITE-MoveReplicaHDFSTest-seed#[C2C6E33908AA1145]-worker) [    ] o.m.log jetty-6.1.26
   [junit4]   2> 2946921 INFO  (SUITE-MoveReplicaHDFSTest-seed#[C2C6E33908AA1145]-worker) [    ] o.m.log Extract jar:file:/export/home/jenkins/.ivy2/cache/org.apache.hadoop/hadoop-hdfs/tests/hadoop-hdfs-2.7.4-tests.jar!/webapps/datanode to ./temp/Jetty_localhost_61962_datanode____vuku9/webapp
   [junit4]   2> 2947175 DEBUG (ScheduledTrigger-11742-thread-3) [    ] o.a.s.c.a.NodeLostTrigger Running NodeLostTrigger: .auto_add_replicas with currently live nodes: 4
   [junit4]   2> 2947399 INFO  (SUITE-MoveReplicaHDFSTest-seed#[C2C6E33908AA1145]-worker) [    ] o.m.log Started HttpServer2$SelectChannelConnectorWithSafeStartup@localhost:61962
   [junit4]   2> 2947565 WARN  (SUITE-MoveReplicaHDFSTest-seed#[C2C6E33908AA1145]-worker) [    ] o.a.h.h.HttpRequestLog Jetty request log can only be enabled using Log4j
   [junit4]   2> 2947566 INFO  (SUITE-MoveReplicaHDFSTest-seed#[C2C6E33908AA1145]-worker) [    ] o.m.log jetty-6.1.26
   [junit4]   2> 2947579 INFO  (SUITE-MoveReplicaHDFSTest-seed#[C2C6E33908AA1145]-worker) [    ] o.m.log Extract jar:file:/export/home/jenkins/.ivy2/cache/org.apache.hadoop/hadoop-hdfs/tests/hadoop-hdfs-2.7.4-tests.jar!/webapps/datanode to ./temp/Jetty_localhost_50904_datanode____reoxux/webapp
   [junit4]   2> 2947743 ERROR (DataNode: [[[DISK]file:/export/home/jenkins/workspace/Lucene-Solr-master-Solaris/solr/build/solr-core/test/J0/temp/solr.cloud.MoveReplicaHDFSTest_C2C6E33908AA1145-001/tempDir-002/hdfsBaseDir/data/data1/, [DISK]file:/export/home/jenkins/workspace/Lucene-Solr-master-Solaris/solr/build/solr-core/test/J0/temp/solr.cloud.MoveReplicaHDFSTest_C2C6E33908AA1145-001/tempDir-002/hdfsBaseDir/data/data2/]]  heartbeating to serv1-vm3/127.0.0.1:57129) [    ] o.a.h.h.s.d.DirectoryScanner dfs.datanode.directoryscan.throttle.limit.ms.per.sec set to value below 1 ms/sec. Assuming default value of 1000
   [junit4]   2> 2947801 INFO  (Block report processor) [    ] BlockStateChange BLOCK* processReport 0x719afa0637d1: from storage DS-f8f1eca1-38e6-4086-afda-30754676cbda node DatanodeRegistration(127.0.0.1:63429, datanodeUuid=06812485-a86e-4adf-8b4d-227642b66a81, infoPort=63829, infoSecurePort=0, ipcPort=34791, storageInfo=lv=-56;cid=testClusterID;nsid=1344645313;c=0), blocks: 0, hasStaleStorage: true, processing time: 0 msecs
   [junit4]   2> 2947801 INFO  (Block report processor) [    ] BlockStateChange BLOCK* processReport 0x719afa0637d1: from storage DS-103d306f-b275-4671-8952-2e6525611194 node DatanodeRegistration(127.0.0.1:63429, datanodeUuid=06812485-a86e-4adf-8b4d-227642b66a81, infoPort=63829, infoSecurePort=0, ipcPort=34791, storageInfo=lv=-56;cid=testClusterID;nsid=1344645313;c=0), blocks: 0, hasStaleStorage: false, processing time: 0 msecs
   [junit4]   2> 2948000 DEBUG (OverseerCollectionConfigSetProcessor-72065779899564038-127.0.0.1:56848_solr-n_0000000000) [n:127.0.0.1:56848_solr    ] o.a.s.c.OverseerTaskProcessor Got 0 tasks from work-queue : [[]]
   [junit4]   2> 2948000 DEBUG (OverseerCollectionConfigSetProcessor-72065779899564038-127.0.0.1:56848_solr-n_0000000000) [n:127.0.0.1:56848_solr    ] o.a.s.c.OverseerTaskProcessor Cleaning up work-queue. #Running tasks: 0
   [junit4]   2> 2948001 INFO  (OverseerCollectionConfigSetProcessor-72065779899564038-127.0.0.1:56848_solr-n_0000000000) [n:127.0.0.1:56848_solr    ] o.a.s.c.OverseerTaskQueue Response ZK path: /overseer/collection-queue-work/qnr-0000000000 doesn't exist.  Requestor may have disconnected from ZooKeeper
   [junit4]   2> 2948001 DEBUG (OverseerCollectionConfigSetProcessor-72065779899564038-127.0.0.1:56848_solr-n_0000000000) [n:127.0.0.1:56848_solr    ] o.a.s.c.OverseerTaskProcessor RunningTasks: []
   [junit4]   2> 2948001 DEBUG (OverseerCollectionConfigSetProcessor-72065779899564038-127.0.0.1:56848_solr-n_0000000000) [n:127.0.0.1:56848_solr    ] o.a.s.c.OverseerTaskProcessor BlockedTasks: []
   [junit4]   2> 2948001 DEBUG (OverseerCollectionConfigSetProcessor-72065779899564038-127.0.0.1:56848_solr-n_0000000000) [n:127.0.0.1:56848_solr    ] o.a.s.c.OverseerTaskProcessor CompletedTasks: []
   [junit4]   2> 2948002 DEBUG (OverseerCollectionConfigSetProcessor-72065779899564038-127.0.0.1:56848_solr-n_0000000000) [n:127.0.0.1:56848_solr    ] o.a.s.c.OverseerTaskProcessor RunningZKTasks: []
   [junit4]   2> 2948002 DEBUG (OverseerCollectionConfigSetProcessor-72065779899564038-127.0.0.1:56848_solr-n_0000000000) [n:127.0.0.1:56848_solr    ] o.a.s.c.OverseerTaskQueue Peeking for top 100 elements. ExcludeSet: []
   [junit4]   2> 2948168 INFO  (SUITE-MoveReplicaHDFSTest-seed#[C2C6E33908AA1145]-worker) [    ] o.m.log Started HttpServer2$SelectChannelConnectorWithSafeStartup@localhost:50904
   [junit4]   2> 2948177 DEBUG (ScheduledTrigger-11742-thread-2) [    ] o.a.s.c.a.NodeLostTrigger Running NodeLostTrigger: .auto_add_replicas with currently live nodes: 4
   [junit4]   2> 2948418 ERROR (DataNode: [[[DISK]file:/export/home/jenkins/workspace/Lucene-Solr-master-Solaris/solr/build/solr-core/test/J0/temp/solr.cloud.MoveReplicaHDFSTest_C2C6E33908AA1145-001/tempDir-002/hdfsBaseDir/data/data3/, [DISK]file:/export/home/jenkins/workspace/Lucene-Solr-master-Solaris/solr/build/solr-core/test/J0/temp/solr.cloud.MoveReplicaHDFSTest_C2C6E33908AA1145-001/tempDir-002/hdfsBaseDir/data/data4/]]  heartbeating to serv1-vm3/127.0.0.1:57129) [    ] o.a.h.h.s.d.DirectoryScanner dfs.datanode.directoryscan.throttle.limit.ms.per.sec set to value below 1 ms/sec. Assuming default value of 1000
   [junit4]   2> 2948428 INFO  (Block report processor) [    ] BlockStateChange BLOCK* processReport 0x719b1f680c9d: from storage DS-8292364b-efd4-445a-9928-4cf64e6825ae node DatanodeRegistration(127.0.0.1:35979, datanodeUuid=c9f8dae7-e5ed-4d76-9958-e8811b363703, infoPort=37704, infoSecurePort=0, ipcPort=38206, storageInfo=lv=-56;cid=testClusterID;nsid=1344645313;c=0), blocks: 0, hasStaleStorage: true, processing time: 0 msecs
   [junit4]   2> 2948428 INFO  (Block report processor) [    ] BlockStateChange BLOCK* processReport 0x719b1f680c9d: from storage DS-64002ff0-e6d0-495a-9f0a-6fb9a4e8ed32 node DatanodeRegistration(127.0.0.1:35979, datanodeUuid=c9f8dae7-e5ed-4d76-9958-e8811b363703, infoPort=37704, infoSecurePort=0, ipcPort=38206, storageInfo=lv=-56;cid=testClusterID;nsid=1344645313;c=0), blocks: 0, hasStaleStorage: false, processing time: 0 msecs
   [junit4] IGNOR/A 0.00s J0 | MoveReplicaHDFSTest.testNormalFailedMove
   [junit4]    > Assumption #1: 'badapple' test group is disabled (@BadApple(bugUrl=https://issues.apache.org/jira/browse/SOLR-12028))
   [junit4]   2> 2949060 DEBUG (SyncThread:0) [    ] o.a.s.c.ZkTestServer Watch added: create/delete: /solr/clusterprops.json
   [junit4]   2> 2949060 DEBUG (SyncThread:0) [    ] o.a.s.c.ZkTestServer Watch added: children: /solr/live_nodes
   [junit4]   2> 2949060 INFO  (TEST-MoveReplicaHDFSTest.test-seed#[C2C6E33908AA1145]) [    ] o.a.s.c.c.ZkStateReader Updated live nodes from ZooKeeper... (0) -> (4)
   [junit4]   2> 2949061 DEBUG (SyncThread:0) [    ] o.a.s.c.ZkTestServer Watch added: data: /solr/clusterstate.json
   [junit4]   2> 2949061 DEBUG (SyncThread:0) [    ] o.a.s.c.ZkTestServer Watch added: children: /solr/collections
   [junit4]   2> 2949061 DEBUG (SyncThread:0) [    ] o.a.s.c.ZkTestServer Watch added: create/delete: /solr/aliases.json
   [junit4]   2> 2949062 D

[...truncated too long message...]

ontextHandler Stopped o.e.j.s.ServletContextHandler@70351981{/solr,null,UNAVAILABLE}
   [junit4]   2> 283273 INFO  (jetty-closer-290-thread-4) [    ] o.e.j.s.session node0 Stopped scavenging
   [junit4]   2> 283275 ERROR (SUITE-MoveReplicaHDFSTest-seed#[C2C6E33908AA1145]-worker) [    ] o.a.z.s.ZooKeeperServer ZKShutdownHandler is not registered, so ZooKeeper server won't take any action on ERROR or SHUTDOWN server state changes
   [junit4]   2> 283276 INFO  (SUITE-MoveReplicaHDFSTest-seed#[C2C6E33908AA1145]-worker) [    ] o.a.s.c.ZkTestServer connecting to 127.0.0.1:40935 40935
   [junit4]   2> 283315 INFO  (Thread-4213) [    ] o.a.s.c.ZkTestServer connecting to 127.0.0.1:40935 40935
   [junit4]   2> 283316 WARN  (Thread-4213) [    ] o.a.s.c.ZkTestServer Watch limit violations: 
   [junit4]   2> Maximum concurrent create/delete watches above limit:
   [junit4]   2> 
   [junit4]   2> 	31	/solr/collections/MoveReplicaHDFSTest_coll_false/terms/shard2
   [junit4]   2> 	22	/solr/collections/MoveReplicaHDFSTest_coll_true/terms/shard2
   [junit4]   2> 	19	/solr/aliases.json
   [junit4]   2> 	19	/solr/clusterprops.json
   [junit4]   2> 	18	/solr/configs/conf1
   [junit4]   2> 	10	/solr/collections/MoveReplicaHDFSTest_failed_coll_true/terms/shard1
   [junit4]   2> 	10	/solr/collections/MoveReplicaHDFSTest_coll_true/terms/shard1
   [junit4]   2> 	9	/solr/collections/MoveReplicaHDFSTest_failed_coll_false/terms/shard2
   [junit4]   2> 	9	/solr/collections/MoveReplicaHDFSTest_failed_coll_false/terms/shard1
   [junit4]   2> 	8	/solr/collections/MoveReplicaHDFSTest_failed_coll_true/terms/shard2
   [junit4]   2> 	7	/solr/security.json
   [junit4]   2> 	7	/solr/collections/MoveReplicaHDFSTest_coll_false/terms/shard1
   [junit4]   2> 
   [junit4]   2> Maximum concurrent data watches above limit:
   [junit4]   2> 
   [junit4]   2> 	19	/solr/clusterstate.json
   [junit4]   2> 	10	/solr/aliases.json
   [junit4]   2> 	7	/solr/collections/MoveReplicaHDFSTest_coll_false/state.json
   [junit4]   2> 	4	/solr/collections/MoveReplicaHDFSTest_failed_coll_false/state.json
   [junit4]   2> 	4	/solr/collections/MoveReplicaHDFSTest_coll_true/state.json
   [junit4]   2> 	4	/solr/collections/MoveReplicaHDFSTest_failed_coll_true/state.json
   [junit4]   2> 	3	/solr/collections/MoveReplicaHDFSTest_coll_false/leader_elect/shard2/election/72065993754738720-core_node7-n_0000000000
   [junit4]   2> 	3	/solr/overseer_elect/election/72065993754738694-127.0.0.1:43198_solr-n_0000000001
   [junit4]   2> 	2	/solr/collections/MoveReplicaHDFSTest_coll_true/leader_elect/shard2/election/72065993754738696-core_node8-n_0000000000
   [junit4]   2> 	2	/solr/overseer_elect/election/72065993754738696-127.0.0.1:33663_solr-n_0000000000
   [junit4]   2> 	2	/solr/overseer_elect/election/72065993754738700-127.0.0.1:36021_solr-n_0000000002
   [junit4]   2> 
   [junit4]   2> Maximum concurrent children watches above limit:
   [junit4]   2> 
   [junit4]   2> 	34	/solr/collections
   [junit4]   2> 	30	/solr/live_nodes
   [junit4]   2> 
   [junit4]   2> 283318 WARN  (SUITE-MoveReplicaHDFSTest-seed#[C2C6E33908AA1145]-worker) [    ] o.a.h.h.s.d.DirectoryScanner DirectoryScanner: shutdown has been called
   [junit4]   2> 283324 INFO  (SUITE-MoveReplicaHDFSTest-seed#[C2C6E33908AA1145]-worker) [    ] o.m.log Stopped HttpServer2$SelectChannelConnectorWithSafeStartup@localhost:0
   [junit4]   2> 283428 WARN  (DataNode: [[[DISK]file:/export/home/jenkins/workspace/Lucene-Solr-master-Solaris/solr/build/solr-core/test/J1/temp/solr.cloud.MoveReplicaHDFSTest_C2C6E33908AA1145-003/tempDir-002/hdfsBaseDir/data/data3/, [DISK]file:/export/home/jenkins/workspace/Lucene-Solr-master-Solaris/solr/build/solr-core/test/J1/temp/solr.cloud.MoveReplicaHDFSTest_C2C6E33908AA1145-003/tempDir-002/hdfsBaseDir/data/data4/]]  heartbeating to serv1-vm3/127.0.0.1:45001) [    ] o.a.h.h.s.d.IncrementalBlockReportManager IncrementalBlockReportManager interrupted
   [junit4]   2> 283428 WARN  (DataNode: [[[DISK]file:/export/home/jenkins/workspace/Lucene-Solr-master-Solaris/solr/build/solr-core/test/J1/temp/solr.cloud.MoveReplicaHDFSTest_C2C6E33908AA1145-003/tempDir-002/hdfsBaseDir/data/data3/, [DISK]file:/export/home/jenkins/workspace/Lucene-Solr-master-Solaris/solr/build/solr-core/test/J1/temp/solr.cloud.MoveReplicaHDFSTest_C2C6E33908AA1145-003/tempDir-002/hdfsBaseDir/data/data4/]]  heartbeating to serv1-vm3/127.0.0.1:45001) [    ] o.a.h.h.s.d.DataNode Ending block pool service for: Block pool BP-978976802-127.0.0.1-1537674216961 (Datanode Uuid 4e8da56a-c14f-4753-92b0-372489ecf3df) service to serv1-vm3/127.0.0.1:45001
   [junit4]   2> 283434 WARN  (SUITE-MoveReplicaHDFSTest-seed#[C2C6E33908AA1145]-worker) [    ] o.a.h.h.s.d.DirectoryScanner DirectoryScanner: shutdown has been called
   [junit4]   2> 283444 INFO  (SUITE-MoveReplicaHDFSTest-seed#[C2C6E33908AA1145]-worker) [    ] o.m.log Stopped HttpServer2$SelectChannelConnectorWithSafeStartup@localhost:0
   [junit4]   2> 283546 WARN  (DataNode: [[[DISK]file:/export/home/jenkins/workspace/Lucene-Solr-master-Solaris/solr/build/solr-core/test/J1/temp/solr.cloud.MoveReplicaHDFSTest_C2C6E33908AA1145-003/tempDir-002/hdfsBaseDir/data/data1/, [DISK]file:/export/home/jenkins/workspace/Lucene-Solr-master-Solaris/solr/build/solr-core/test/J1/temp/solr.cloud.MoveReplicaHDFSTest_C2C6E33908AA1145-003/tempDir-002/hdfsBaseDir/data/data2/]]  heartbeating to serv1-vm3/127.0.0.1:45001) [    ] o.a.h.h.s.d.IncrementalBlockReportManager IncrementalBlockReportManager interrupted
   [junit4]   2> 283546 WARN  (DataNode: [[[DISK]file:/export/home/jenkins/workspace/Lucene-Solr-master-Solaris/solr/build/solr-core/test/J1/temp/solr.cloud.MoveReplicaHDFSTest_C2C6E33908AA1145-003/tempDir-002/hdfsBaseDir/data/data1/, [DISK]file:/export/home/jenkins/workspace/Lucene-Solr-master-Solaris/solr/build/solr-core/test/J1/temp/solr.cloud.MoveReplicaHDFSTest_C2C6E33908AA1145-003/tempDir-002/hdfsBaseDir/data/data2/]]  heartbeating to serv1-vm3/127.0.0.1:45001) [    ] o.a.h.h.s.d.DataNode Ending block pool service for: Block pool BP-978976802-127.0.0.1-1537674216961 (Datanode Uuid ea3060d7-f797-43f2-ad79-7818608b4979) service to serv1-vm3/127.0.0.1:45001
   [junit4]   2> 283562 INFO  (SUITE-MoveReplicaHDFSTest-seed#[C2C6E33908AA1145]-worker) [    ] o.m.log Stopped HttpServer2$SelectChannelConnectorWithSafeStartup@serv1-vm3:0
   [junit4]   2> 283678 INFO  (SUITE-MoveReplicaHDFSTest-seed#[C2C6E33908AA1145]-worker) [    ] o.a.s.c.ZkTestServer connecting to 127.0.0.1:40935 40935
   [junit4]   2> NOTE: leaving temporary files on disk at: /export/home/jenkins/workspace/Lucene-Solr-master-Solaris/solr/build/solr-core/test/J1/temp/solr.cloud.MoveReplicaHDFSTest_C2C6E33908AA1145-003
   [junit4]   2> Sep 23, 2018 3:44:51 AM com.carrotsearch.randomizedtesting.ThreadLeakControl checkThreadLeaks
   [junit4]   2> WARNING: Will linger awaiting termination of 27 leaked thread(s).
   [junit4]   2> NOTE: test params are: codec=Asserting(Lucene80), sim=Asserting(org.apache.lucene.search.similarities.AssertingSimilarity@21e6df2a), locale=sr-BA, timezone=MST
   [junit4]   2> NOTE: SunOS 5.11 amd64/Oracle Corporation 1.8.0_172 (64-bit)/cpus=3,threads=2,free=280334976,total=429916160
   [junit4]   2> NOTE: All tests run in this JVM: [MoveReplicaHDFSTest, MoveReplicaHDFSTest, MoveReplicaHDFSTest]
   [junit4] Completed [5/5 (4!)] on J1 in 85.77s, 4 tests, 1 error <<< FAILURES!
   [junit4] 
   [junit4] 
   [junit4] Tests with failures [seed: C2C6E33908AA1145]:
   [junit4]   - org.apache.solr.cloud.MoveReplicaHDFSTest.testFailedMove
   [junit4]   - org.apache.solr.cloud.MoveReplicaHDFSTest.testFailedMove
   [junit4]   - org.apache.solr.cloud.MoveReplicaHDFSTest.testFailedMove
   [junit4]   - org.apache.solr.cloud.MoveReplicaHDFSTest.testFailedMove
   [junit4] 
   [junit4] 
   [junit4] JVM J0:     0.72 ..   211.54 =   210.82s
   [junit4] JVM J1:     0.72 ..   294.21 =   293.49s
   [junit4] Execution time total: 4 minutes 54 seconds
   [junit4] Tests summary: 5 suites, 20 tests, 4 errors

BUILD FAILED
/export/home/jenkins/workspace/Lucene-Solr-master-Solaris/lucene/common-build.xml:1567: The following error occurred while executing this line:
/export/home/jenkins/workspace/Lucene-Solr-master-Solaris/lucene/common-build.xml:1092: There were test failures: 5 suites, 20 tests, 4 errors [seed: C2C6E33908AA1145]

Total time: 4 minutes 56 seconds

[repro] Setting last failure code to 256

[repro] Failures:
[repro]   4/5 failed: org.apache.solr.cloud.MoveReplicaHDFSTest
[repro] Exiting with code 256
+ mv lucene/build lucene/build.repro
+ mv solr/build solr/build.repro
+ mv lucene/build.orig lucene/build
+ mv solr/build.orig solr/build
Archiving artifacts
Setting ANT_1_8_2_HOME=/export/home/jenkins/tools/hudson.tasks.Ant_AntInstallation/ANT_1.8.2
[WARNINGS] Parsing warnings in console log with parser Java Compiler (javac)
Setting ANT_1_8_2_HOME=/export/home/jenkins/tools/hudson.tasks.Ant_AntInstallation/ANT_1.8.2
Setting ANT_1_8_2_HOME=/export/home/jenkins/tools/hudson.tasks.Ant_AntInstallation/ANT_1.8.2
<Git Blamer> Using GitBlamer to create author and commit information for all warnings.
<Git Blamer> GIT_COMMIT=4ccf0fb8f6ce269de8b4501fca201f5b4763cfe7, workspace=/export/home/jenkins/workspace/Lucene-Solr-master-Solaris
[WARNINGS] Computing warning deltas based on reference build #2070
Recording test results
Setting ANT_1_8_2_HOME=/export/home/jenkins/tools/hudson.tasks.Ant_AntInstallation/ANT_1.8.2
Build step 'Publish JUnit test result report' changed build result to UNSTABLE
Email was triggered for: Unstable (Test Failures)
Sending email for trigger: Unstable (Test Failures)
Setting ANT_1_8_2_HOME=/export/home/jenkins/tools/hudson.tasks.Ant_AntInstallation/ANT_1.8.2
Setting ANT_1_8_2_HOME=/export/home/jenkins/tools/hudson.tasks.Ant_AntInstallation/ANT_1.8.2
Setting ANT_1_8_2_HOME=/export/home/jenkins/tools/hudson.tasks.Ant_AntInstallation/ANT_1.8.2
Setting ANT_1_8_2_HOME=/export/home/jenkins/tools/hudson.tasks.Ant_AntInstallation/ANT_1.8.2

Mime
View raw message