lucene-dev mailing list archives

Site index · List index
Message view « Date » · « Thread »
Top « Date » · « Thread »
From Policeman Jenkins Server <jenk...@thetaphi.de>
Subject [JENKINS] Lucene-Solr-7.x-MacOSX (64bit/jdk-9) - Build # 842 - Unstable!
Date Sun, 16 Sep 2018 00:25:38 GMT
Build: https://jenkins.thetaphi.de/job/Lucene-Solr-7.x-MacOSX/842/
Java: 64bit/jdk-9 -XX:-UseCompressedOops -XX:+UseParallelGC

1 tests failed.
FAILED:  org.apache.solr.cloud.autoscaling.sim.TestSimTriggerIntegration.testEventQueue

Error Message:
action did not start

Stack Trace:
java.lang.AssertionError: action did not start
	at __randomizedtesting.SeedInfo.seed([9B06C56F9E286412:52B387C1974FA2E7]:0)
	at org.junit.Assert.fail(Assert.java:93)
	at org.junit.Assert.assertTrue(Assert.java:43)
	at org.apache.solr.cloud.autoscaling.sim.TestSimTriggerIntegration.testEventQueue(TestSimTriggerIntegration.java:663)
	at java.base/jdk.internal.reflect.NativeMethodAccessorImpl.invoke0(Native Method)
	at java.base/jdk.internal.reflect.NativeMethodAccessorImpl.invoke(NativeMethodAccessorImpl.java:62)
	at java.base/jdk.internal.reflect.DelegatingMethodAccessorImpl.invoke(DelegatingMethodAccessorImpl.java:43)
	at java.base/java.lang.reflect.Method.invoke(Method.java:564)
	at com.carrotsearch.randomizedtesting.RandomizedRunner.invoke(RandomizedRunner.java:1742)
	at com.carrotsearch.randomizedtesting.RandomizedRunner$8.evaluate(RandomizedRunner.java:935)
	at com.carrotsearch.randomizedtesting.RandomizedRunner$9.evaluate(RandomizedRunner.java:971)
	at com.carrotsearch.randomizedtesting.RandomizedRunner$10.evaluate(RandomizedRunner.java:985)
	at com.carrotsearch.randomizedtesting.rules.SystemPropertiesRestoreRule$1.evaluate(SystemPropertiesRestoreRule.java:57)
	at org.apache.lucene.util.TestRuleSetupTeardownChained$1.evaluate(TestRuleSetupTeardownChained.java:49)
	at org.apache.lucene.util.AbstractBeforeAfterRule$1.evaluate(AbstractBeforeAfterRule.java:45)
	at org.apache.lucene.util.TestRuleThreadAndTestName$1.evaluate(TestRuleThreadAndTestName.java:48)
	at org.apache.lucene.util.TestRuleIgnoreAfterMaxFailures$1.evaluate(TestRuleIgnoreAfterMaxFailures.java:64)
	at org.apache.lucene.util.TestRuleMarkFailure$1.evaluate(TestRuleMarkFailure.java:47)
	at com.carrotsearch.randomizedtesting.rules.StatementAdapter.evaluate(StatementAdapter.java:36)
	at com.carrotsearch.randomizedtesting.ThreadLeakControl$StatementRunner.run(ThreadLeakControl.java:368)
	at com.carrotsearch.randomizedtesting.ThreadLeakControl.forkTimeoutingTask(ThreadLeakControl.java:817)
	at com.carrotsearch.randomizedtesting.ThreadLeakControl$3.evaluate(ThreadLeakControl.java:468)
	at com.carrotsearch.randomizedtesting.RandomizedRunner.runSingleTest(RandomizedRunner.java:944)
	at com.carrotsearch.randomizedtesting.RandomizedRunner$5.evaluate(RandomizedRunner.java:830)
	at com.carrotsearch.randomizedtesting.RandomizedRunner$6.evaluate(RandomizedRunner.java:880)
	at com.carrotsearch.randomizedtesting.RandomizedRunner$7.evaluate(RandomizedRunner.java:891)
	at com.carrotsearch.randomizedtesting.rules.StatementAdapter.evaluate(StatementAdapter.java:36)
	at com.carrotsearch.randomizedtesting.rules.SystemPropertiesRestoreRule$1.evaluate(SystemPropertiesRestoreRule.java:57)
	at org.apache.lucene.util.AbstractBeforeAfterRule$1.evaluate(AbstractBeforeAfterRule.java:45)
	at com.carrotsearch.randomizedtesting.rules.StatementAdapter.evaluate(StatementAdapter.java:36)
	at org.apache.lucene.util.TestRuleStoreClassName$1.evaluate(TestRuleStoreClassName.java:41)
	at com.carrotsearch.randomizedtesting.rules.NoShadowingOrOverridesOnMethodsRule$1.evaluate(NoShadowingOrOverridesOnMethodsRule.java:40)
	at com.carrotsearch.randomizedtesting.rules.NoShadowingOrOverridesOnMethodsRule$1.evaluate(NoShadowingOrOverridesOnMethodsRule.java:40)
	at com.carrotsearch.randomizedtesting.rules.StatementAdapter.evaluate(StatementAdapter.java:36)
	at com.carrotsearch.randomizedtesting.rules.StatementAdapter.evaluate(StatementAdapter.java:36)
	at org.apache.lucene.util.TestRuleAssertionsRequired$1.evaluate(TestRuleAssertionsRequired.java:53)
	at org.apache.lucene.util.TestRuleMarkFailure$1.evaluate(TestRuleMarkFailure.java:47)
	at org.apache.lucene.util.TestRuleIgnoreAfterMaxFailures$1.evaluate(TestRuleIgnoreAfterMaxFailures.java:64)
	at org.apache.lucene.util.TestRuleIgnoreTestSuites$1.evaluate(TestRuleIgnoreTestSuites.java:54)
	at com.carrotsearch.randomizedtesting.rules.StatementAdapter.evaluate(StatementAdapter.java:36)
	at com.carrotsearch.randomizedtesting.ThreadLeakControl$StatementRunner.run(ThreadLeakControl.java:368)
	at java.base/java.lang.Thread.run(Thread.java:844)




Build Log:
[...truncated 12790 lines...]
   [junit4] Suite: org.apache.solr.cloud.autoscaling.sim.TestSimTriggerIntegration
   [junit4]   2> 623695 INFO  (SUITE-TestSimTriggerIntegration-seed#[9B06C56F9E286412]-worker) [    ] o.a.s.SolrTestCaseJ4 SecureRandom sanity checks: test.solr.allowed.securerandom=null & java.security.egd=file:/dev/./urandom
   [junit4]   2> Creating dataDir: /Users/jenkins/workspace/Lucene-Solr-7.x-MacOSX/solr/build/solr-core/test/J0/temp/solr.cloud.autoscaling.sim.TestSimTriggerIntegration_9B06C56F9E286412-001/init-core-data-001
   [junit4]   2> 623696 WARN  (SUITE-TestSimTriggerIntegration-seed#[9B06C56F9E286412]-worker) [    ] o.a.s.SolrTestCaseJ4 startTrackingSearchers: numOpens=1 numCloses=1
   [junit4]   2> 623696 INFO  (SUITE-TestSimTriggerIntegration-seed#[9B06C56F9E286412]-worker) [    ] o.a.s.SolrTestCaseJ4 Using PointFields (NUMERIC_POINTS_SYSPROP=true) w/NUMERIC_DOCVALUES_SYSPROP=true
   [junit4]   2> 623697 INFO  (SUITE-TestSimTriggerIntegration-seed#[9B06C56F9E286412]-worker) [    ] o.a.s.SolrTestCaseJ4 Randomized ssl (false) and clientAuth (false) via: @org.apache.solr.util.RandomizeSSL(reason="", value=0.0/0.0, ssl=0.0/0.0, clientAuth=0.0/0.0) w/ MAC_OS_X supressed clientAuth
   [junit4]   2> 623728 DEBUG (Simulated OverseerAutoScalingTriggerThread) [    ] o.a.s.c.a.OverseerTriggerThread Adding .auto_add_replicas and .scheduled_maintenance triggers
   [junit4]   2> 623728 DEBUG (Simulated OverseerAutoScalingTriggerThread) [    ] o.a.s.c.a.OverseerTriggerThread Refreshing /autoscaling.json with znode version 0
   [junit4]   2> 623729 DEBUG (SUITE-TestSimTriggerIntegration-seed#[9B06C56F9E286412]-worker) [    ] o.a.s.c.a.s.SimClusterStateProvider --- new Overseer leader: 127.0.0.1:10000_solr
   [junit4]   2> 623729 DEBUG (Simulated OverseerAutoScalingTriggerThread) [    ] o.a.s.c.a.OverseerTriggerThread Current znodeVersion 0, lastZnodeVersion -1
   [junit4]   2> 623729 DEBUG (Simulated OverseerAutoScalingTriggerThread) [    ] o.a.s.c.a.OverseerTriggerThread Processed trigger updates upto znodeVersion 0
   [junit4]   2> 623731 INFO  (SUITE-TestSimTriggerIntegration-seed#[9B06C56F9E286412]-worker) [    ] o.a.s.h.a.MetricsHistoryHandler No .system collection, keeping metrics history in memory.
   [junit4] IGNOR/A 0.00s J0 | TestSimTriggerIntegration.testNodeMarkersRegistration
   [junit4]    > Assumption #1: 'badapple' test group is disabled (@BadApple(bugUrl="https://issues.apache.org/jira/browse/SOLR-12028"))
   [junit4] IGNOR/A 0.00s J0 | TestSimTriggerIntegration.testTriggerThrottling
   [junit4]    > Assumption #1: 'badapple' test group is disabled (@BadApple(bugUrl="https://issues.apache.org/jira/browse/SOLR-12028"))
   [junit4]   2> 623732 DEBUG (Simulated OverseerAutoScalingTriggerThread) [    ] o.a.s.c.a.NodeLostTrigger NodeLostTrigger .auto_add_replicas - Initial livenodes: [127.0.0.1:10001_solr, 127.0.0.1:10000_solr]
   [junit4]   2> 623733 DEBUG (Simulated OverseerAutoScalingTriggerThread) [    ] o.a.s.c.a.OverseerTriggerThread -- clean old nodeAdded markers
   [junit4]   2> 623734 DEBUG (Simulated OverseerAutoScalingTriggerThread) [    ] o.a.s.c.a.OverseerTriggerThread Current znodeVersion 0, lastZnodeVersion 0
   [junit4]   2> 623734 INFO  (TEST-TestSimTriggerIntegration.testEventQueue-seed#[9B06C56F9E286412]) [    ] o.a.s.SolrTestCaseJ4 ###Starting testEventQueue
   [junit4]   2> 623734 DEBUG (TEST-TestSimTriggerIntegration.testEventQueue-seed#[9B06C56F9E286412]) [    ] o.a.s.c.a.OverseerTriggerThread Refreshing /autoscaling.json with znode version 1
   [junit4]   2> 623735 DEBUG (Simulated OverseerAutoScalingTriggerThread) [    ] o.a.s.c.a.OverseerTriggerThread Processed trigger updates upto znodeVersion 1
   [junit4]   2> 623735 DEBUG (Simulated OverseerAutoScalingTriggerThread) [    ] o.a.s.c.a.OverseerTriggerThread -- clean old nodeLost markers
   [junit4]   2> 623735 DEBUG (Simulated OverseerAutoScalingTriggerThread) [    ] o.a.s.c.a.OverseerTriggerThread -- clean old nodeAdded markers
   [junit4]   2> 623735 DEBUG (Simulated OverseerAutoScalingTriggerThread) [    ] o.a.s.c.a.OverseerTriggerThread Current znodeVersion 1, lastZnodeVersion 1
   [junit4]   2> 623735 WARN  (ScheduledTrigger-3130-thread-2) [    ] o.a.s.c.a.NodeLostTrigger NodeLostTrigger ran but was already closed
   [junit4]   2> 623735 WARN  (ScheduledTrigger-3130-thread-1) [    ] o.a.s.c.a.ScheduledTrigger ScheduledTrigger ran but was already closed
   [junit4]   2> 623736 ERROR (ScheduledTrigger-3130-thread-1) [    ] o.a.s.c.a.ScheduledTriggers Unexpected exception from trigger: .scheduled_maintenance
   [junit4]   2> java.lang.RuntimeException: Trigger has been closed
   [junit4]   2> 	at org.apache.solr.cloud.autoscaling.ScheduledTrigger.run(ScheduledTrigger.java:155) ~[java/:?]
   [junit4]   2> 	at org.apache.solr.cloud.autoscaling.ScheduledTriggers$TriggerWrapper.run(ScheduledTriggers.java:592) [java/:?]
   [junit4]   2> 	at java.util.concurrent.Executors$RunnableAdapter.call(Executors.java:514) [?:?]
   [junit4]   2> 	at java.util.concurrent.FutureTask.runAndReset(FutureTask.java:305) [?:?]
   [junit4]   2> 	at java.util.concurrent.ScheduledThreadPoolExecutor$ScheduledFutureTask.run(ScheduledThreadPoolExecutor.java:300) [?:?]
   [junit4]   2> 	at java.util.concurrent.ThreadPoolExecutor.runWorker(ThreadPoolExecutor.java:1167) [?:?]
   [junit4]   2> 	at java.util.concurrent.ThreadPoolExecutor$Worker.run(ThreadPoolExecutor.java:641) [?:?]
   [junit4]   2> 	at java.lang.Thread.run(Thread.java:844) [?:?]
   [junit4]   2> 623736 INFO  (TEST-TestSimTriggerIntegration.testEventQueue-seed#[9B06C56F9E286412]) [    ] o.a.s.c.a.s.SimCloudManager === Restarting OverseerTriggerThread and clearing object cache...
   [junit4]   2> 623737 DEBUG (TEST-TestSimTriggerIntegration.testEventQueue-seed#[9B06C56F9E286412]) [    ] o.a.s.c.a.ScheduledTriggers Shutting down scheduled thread pool executor now
   [junit4]   2> 623737 DEBUG (TEST-TestSimTriggerIntegration.testEventQueue-seed#[9B06C56F9E286412]) [    ] o.a.s.c.a.ScheduledTriggers Shutting down action executor now
   [junit4]   2> 623737 DEBUG (TEST-TestSimTriggerIntegration.testEventQueue-seed#[9B06C56F9E286412]) [    ] o.a.s.c.a.ScheduledTriggers Awaiting termination for action executor
   [junit4]   2> 623737 DEBUG (TEST-TestSimTriggerIntegration.testEventQueue-seed#[9B06C56F9E286412]) [    ] o.a.s.c.a.ScheduledTriggers Awaiting termination for scheduled thread pool executor
   [junit4]   2> 623737 WARN  (Simulated OverseerAutoScalingTriggerThread) [    ] o.a.s.c.a.OverseerTriggerThread Interrupted
   [junit4]   2> java.lang.InterruptedException: null
   [junit4]   2> 	at java.util.concurrent.locks.AbstractQueuedSynchronizer$ConditionObject.reportInterruptAfterWait(AbstractQueuedSynchronizer.java:2037) ~[?:?]
   [junit4]   2> 	at java.util.concurrent.locks.AbstractQueuedSynchronizer$ConditionObject.await(AbstractQueuedSynchronizer.java:2071) ~[?:?]
   [junit4]   2> 	at org.apache.solr.cloud.autoscaling.OverseerTriggerThread.run(OverseerTriggerThread.java:189) [java/:?]
   [junit4]   2> 	at java.lang.Thread.run(Thread.java:844) [?:?]
   [junit4]   2> 623737 DEBUG (TEST-TestSimTriggerIntegration.testEventQueue-seed#[9B06C56F9E286412]) [    ] o.a.s.c.a.ScheduledTriggers ScheduledTriggers closed completely
   [junit4]   2> 623737 DEBUG (TEST-TestSimTriggerIntegration.testEventQueue-seed#[9B06C56F9E286412]) [    ] o.a.s.c.a.OverseerTriggerThread OverseerTriggerThread has been closed explicitly
   [junit4]   2> 623738 DEBUG (Simulated OverseerAutoScalingTriggerThread) [    ] o.a.s.c.a.OverseerTriggerThread Adding .auto_add_replicas and .scheduled_maintenance triggers
   [junit4]   2> 623738 DEBUG (Simulated OverseerAutoScalingTriggerThread) [    ] o.a.s.c.a.OverseerTriggerThread Refreshing /autoscaling.json with znode version 2
   [junit4]   2> 623739 DEBUG (Simulated OverseerAutoScalingTriggerThread) [    ] o.a.s.c.a.OverseerTriggerThread Current znodeVersion 2, lastZnodeVersion -1
   [junit4]   2> 623739 DEBUG (Simulated OverseerAutoScalingTriggerThread) [    ] o.a.s.c.a.OverseerTriggerThread Processed trigger updates upto znodeVersion 2
   [junit4]   2> 623739 DEBUG (Simulated OverseerAutoScalingTriggerThread) [    ] o.a.s.c.a.NodeLostTrigger NodeLostTrigger .auto_add_replicas - Initial livenodes: [127.0.0.1:10001_solr, 127.0.0.1:10000_solr]
   [junit4]   2> 623739 DEBUG (Simulated OverseerAutoScalingTriggerThread) [    ] o.a.s.c.a.OverseerTriggerThread -- clean old nodeAdded markers
   [junit4]   2> 623739 DEBUG (Simulated OverseerAutoScalingTriggerThread) [    ] o.a.s.c.a.OverseerTriggerThread Current znodeVersion 2, lastZnodeVersion 2
   [junit4]   2> 623739 DEBUG (ScheduledTrigger-3135-thread-2) [    ] o.a.s.c.a.NodeLostTrigger Running NodeLostTrigger: .auto_add_replicas with currently live nodes: 2
   [junit4]   2> 623769 DEBUG (ScheduledTrigger-3135-thread-3) [    ] o.a.s.c.a.NodeLostTrigger Running NodeLostTrigger: .auto_add_replicas with currently live nodes: 2
   [junit4]   2> 623790 DEBUG (ScheduledTrigger-3135-thread-4) [    ] o.a.s.c.a.NodeLostTrigger Running NodeLostTrigger: .auto_add_replicas with currently live nodes: 2
   [junit4]   2> 623817 DEBUG (ScheduledTrigger-3135-thread-3) [    ] o.a.s.c.a.NodeLostTrigger Running NodeLostTrigger: .auto_add_replicas with currently live nodes: 2
   [junit4]   2> 623843 DEBUG (ScheduledTrigger-3135-thread-4) [    ] o.a.s.c.a.NodeLostTrigger Running NodeLostTrigger: .auto_add_replicas with currently live nodes: 2
   [junit4]   2> 623848 DEBUG (simCloudManagerPool-3134-thread-1) [    ] o.a.s.c.a.AutoScalingHandler Verified autoscaling configuration
   [junit4]   2> 623848 DEBUG (simCloudManagerPool-3134-thread-1) [    ] o.a.s.c.a.OverseerTriggerThread Refreshing /autoscaling.json with znode version 3
   [junit4]   2> 623849 DEBUG (Simulated OverseerAutoScalingTriggerThread) [    ] o.a.s.c.a.OverseerTriggerThread Processed trigger updates upto znodeVersion 3
   [junit4]   2> 623849 DEBUG (Simulated OverseerAutoScalingTriggerThread) [    ] o.a.s.c.a.OverseerTriggerThread -- clean old nodeAdded markers
   [junit4]   2> 623849 DEBUG (Simulated OverseerAutoScalingTriggerThread) [    ] o.a.s.c.a.OverseerTriggerThread Current znodeVersion 3, lastZnodeVersion 3
   [junit4]   2> 623865 DEBUG (ScheduledTrigger-3135-thread-1) [    ] o.a.s.c.a.NodeLostTrigger Running NodeLostTrigger: .auto_add_replicas with currently live nodes: 2
   [junit4]   2> 623880 DEBUG (simCloudManagerPool-3134-thread-2) [    ] o.a.s.c.a.s.SimClusterStateProvider -- submit leader election for .system / shard1
   [junit4]   2> 623881 DEBUG (simCloudManagerPool-3134-thread-3) [    ] o.a.s.c.a.s.SimClusterStateProvider Running leader election for .system / shard1
   [junit4]   2> 623882 DEBUG (simCloudManagerPool-3134-thread-3) [    ] o.a.s.c.a.s.SimClusterStateProvider -- elected new leader for .system / shard1: core_node1
   [junit4]   2> 623887 INFO  (simCloudManagerPool-3134-thread-4) [    ] o.a.s.c.a.s.TestSimTriggerIntegration TestEventQueueAction instantiated
   [junit4]   2> 623887 DEBUG (simCloudManagerPool-3134-thread-4) [    ] o.a.s.c.a.s.TestSimTriggerIntegration TestTriggerAction init
   [junit4]   2> 623888 DEBUG (simCloudManagerPool-3134-thread-4) [    ] o.a.s.c.a.AutoScalingHandler Verified autoscaling configuration
   [junit4]   2> 623888 DEBUG (simCloudManagerPool-3134-thread-4) [    ] o.a.s.c.a.OverseerTriggerThread Refreshing /autoscaling.json with znode version 4
   [junit4]   2> 623889 INFO  (simCloudManagerPool-3134-thread-4) [    ] o.a.s.c.a.s.TestSimTriggerIntegration TestEventQueueAction instantiated
   [junit4]   2> 623889 DEBUG (simCloudManagerPool-3134-thread-4) [    ] o.a.s.c.a.s.TestSimTriggerIntegration TestTriggerAction init
   [junit4]   2> 623889 DEBUG (Simulated OverseerAutoScalingTriggerThread) [    ] o.a.s.c.a.OverseerTriggerThread Processed trigger updates upto znodeVersion 4
   [junit4]   2> 623889 DEBUG (Simulated OverseerAutoScalingTriggerThread) [    ] o.a.s.c.a.NodeAddedTrigger NodeAddedTrigger node_added_trigger1 - Initial livenodes: [127.0.0.1:10001_solr, 127.0.0.1:10000_solr, 127.0.0.1:10002_solr]
   [junit4]   2> 623889 DEBUG (Simulated OverseerAutoScalingTriggerThread) [    ] o.a.s.c.a.NodeAddedTrigger NodeAddedTrigger node_added_trigger1 instantiated with properties: {event=nodeAdded, waitFor=1, actions=[{name=test, class=org.apache.solr.cloud.autoscaling.sim.TestSimTriggerIntegration$TestEventQueueAction}], enabled=true}
   [junit4]   2> 623889 DEBUG (Simulated OverseerAutoScalingTriggerThread) [    ] o.a.s.c.a.OverseerTriggerThread Current znodeVersion 4, lastZnodeVersion 4
   [junit4]   2> 623889 DEBUG (ScheduledTrigger-3135-thread-1) [    ] o.a.s.c.a.NodeLostTrigger Running NodeLostTrigger: .auto_add_replicas with currently live nodes: 3
   [junit4]   2> 623889 DEBUG (ScheduledTrigger-3135-thread-3) [    ] o.a.s.c.a.NodeAddedTrigger Running NodeAddedTrigger node_added_trigger1
   [junit4]   2> 623889 DEBUG (ScheduledTrigger-3135-thread-3) [    ] o.a.s.c.a.NodeAddedTrigger Found livenodes: 3
   [junit4]   2> 623913 DEBUG (ScheduledTrigger-3135-thread-1) [    ] o.a.s.c.a.NodeLostTrigger Running NodeLostTrigger: .auto_add_replicas with currently live nodes: 3
   [junit4]   2> 623913 DEBUG (ScheduledTrigger-3135-thread-2) [    ] o.a.s.c.a.NodeAddedTrigger Running NodeAddedTrigger node_added_trigger1
   [junit4]   2> 623914 DEBUG (ScheduledTrigger-3135-thread-2) [    ] o.a.s.c.a.NodeAddedTrigger Found livenodes: 3
   [junit4]   2> 623934 DEBUG (ScheduledTrigger-3135-thread-1) [    ] o.a.s.c.a.NodeLostTrigger Running NodeLostTrigger: .auto_add_replicas with currently live nodes: 3
   [junit4]   2> 623934 DEBUG (ScheduledTrigger-3135-thread-3) [    ] o.a.s.c.a.NodeAddedTrigger Running NodeAddedTrigger node_added_trigger1
   [junit4]   2> 623934 DEBUG (ScheduledTrigger-3135-thread-3) [    ] o.a.s.c.a.NodeAddedTrigger Found livenodes: 3
   [junit4]   2> 623955 DEBUG (ScheduledTrigger-3135-thread-1) [    ] o.a.s.c.a.NodeLostTrigger Running NodeLostTrigger: .auto_add_replicas with currently live nodes: 3
   [junit4]   2> 623955 DEBUG (ScheduledTrigger-3135-thread-1) [    ] o.a.s.c.a.NodeAddedTrigger Running NodeAddedTrigger node_added_trigger1
   [junit4]   2> 623955 DEBUG (ScheduledTrigger-3135-thread-1) [    ] o.a.s.c.a.NodeAddedTrigger Found livenodes: 3
   [junit4]   2> 623977 DEBUG (ScheduledTrigger-3135-thread-2) [    ] o.a.s.c.a.NodeLostTrigger Running NodeLostTrigger: .auto_add_replicas with currently live nodes: 3
   [junit4]   2> 623977 DEBUG (ScheduledTrigger-3135-thread-4) [    ] o.a.s.c.a.NodeAddedTrigger Running NodeAddedTrigger node_added_trigger1
   [junit4]   2> 623977 DEBUG (ScheduledTrigger-3135-thread-4) [    ] o.a.s.c.a.NodeAddedTrigger Found livenodes: 3
   [junit4]   2> 624000 DEBUG (ScheduledTrigger-3135-thread-2) [    ] o.a.s.c.a.NodeLostTrigger Running NodeLostTrigger: .auto_add_replicas with currently live nodes: 3
   [junit4]   2> 624000 DEBUG (ScheduledTrigger-3135-thread-1) [    ] o.a.s.c.a.NodeAddedTrigger Running NodeAddedTrigger node_added_trigger1
   [junit4]   2> 624000 DEBUG (ScheduledTrigger-3135-thread-1) [    ] o.a.s.c.a.NodeAddedTrigger Found livenodes: 3
   [junit4]   2> 624021 DEBUG (ScheduledTrigger-3135-thread-3) [    ] o.a.s.c.a.NodeAddedTrigger Running NodeAddedTrigger node_added_trigger1
   [junit4]   2> 624021 DEBUG (ScheduledTrigger-3135-thread-2) [    ] o.a.s.c.a.NodeLostTrigger Running NodeLostTrigger: .auto_add_replicas with currently live nodes: 3
   [junit4]   2> 624021 DEBUG (ScheduledTrigger-3135-thread-3) [    ] o.a.s.c.a.NodeAddedTrigger Found livenodes: 3
   [junit4]   2> 624050 DEBUG (ScheduledTrigger-3135-thread-2) [    ] o.a.s.c.a.NodeLostTrigger Running NodeLostTrigger: .auto_add_replicas with currently live nodes: 3
   [junit4]   2> 624050 DEBUG (ScheduledTrigger-3135-thread-1) [    ] o.a.s.c.a.NodeAddedTrigger Running NodeAddedTrigger node_added_trigger1
   [junit4]   2> 624050 DEBUG (ScheduledTrigger-3135-thread-1) [    ] o.a.s.c.a.NodeAddedTrigger Found livenodes: 3
   [junit4]   2> 624079 DEBUG (ScheduledTrigger-3135-thread-2) [    ] o.a.s.c.a.NodeLostTrigger Running NodeLostTrigger: .auto_add_replicas with currently live nodes: 3
   [junit4]   2> 624079 DEBUG (ScheduledTrigger-3135-thread-3) [    ] o.a.s.c.a.NodeAddedTrigger Running NodeAddedTrigger node_added_trigger1
   [junit4]   2> 624079 DEBUG (ScheduledTrigger-3135-thread-3) [    ] o.a.s.c.a.NodeAddedTrigger Found livenodes: 3
   [junit4]   2> 624100 DEBUG (ScheduledTrigger-3135-thread-2) [    ] o.a.s.c.a.NodeLostTrigger Running NodeLostTrigger: .auto_add_replicas with currently live nodes: 3
   [junit4]   2> 624100 DEBUG (ScheduledTrigger-3135-thread-1) [    ] o.a.s.c.a.NodeAddedTrigger Running NodeAddedTrigger node_added_trigger1
   [junit4]   2> 624100 DEBUG (ScheduledTrigger-3135-thread-1) [    ] o.a.s.c.a.NodeAddedTrigger Found livenodes: 3
   [junit4]   2> 624121 DEBUG (ScheduledTrigger-3135-thread-2) [    ] o.a.s.c.a.NodeLostTrigger Running NodeLostTrigger: .auto_add_replicas with currently live nodes: 3
   [junit4]   2> 624121 DEBUG (ScheduledTrigger-3135-thread-3) [    ] o.a.s.c.a.NodeAddedTrigger Running NodeAddedTrigger node_added_trigger1
   [junit4]   2> 624121 DEBUG (ScheduledTrigger-3135-thread-3) [    ] o.a.s.c.a.NodeAddedTrigger Found livenodes: 3
   [junit4]   2> 624142 DEBUG (ScheduledTrigger-3135-thread-2) [    ] o.a.s.c.a.NodeLostTrigger Running NodeLostTrigger: .auto_add_replicas with currently live nodes: 3
   [junit4]   2> 624142 DEBUG (ScheduledTrigger-3135-thread-1) [    ] o.a.s.c.a.NodeAddedTrigger Running NodeAddedTrigger node_added_trigger1
   [junit4]   2> 624142 DEBUG (ScheduledTrigger-3135-thread-1) [    ] o.a.s.c.a.NodeAddedTrigger Found livenodes: 3
   [junit4]   2> 624165 DEBUG (ScheduledTrigger-3135-thread-2) [    ] o.a.s.c.a.NodeLostTrigger Running NodeLostTrigger: .auto_add_replicas with currently live nodes: 3
   [junit4]   2> 624165 DEBUG (ScheduledTrigger-3135-thread-3) [    ] o.a.s.c.a.NodeAddedTrigger Running NodeAddedTrigger node_added_trigger1
   [junit4]   2> 624165 DEBUG (ScheduledTrigger-3135-thread-3) [    ] o.a.s.c.a.NodeAddedTrigger Found livenodes: 3
   [junit4]   2> 624185 DEBUG (ScheduledTrigger-3135-thread-2) [    ] o.a.s.c.a.NodeLostTrigger Running NodeLostTrigger: .auto_add_replicas with currently live nodes: 3
   [junit4]   2> 624185 DEBUG (ScheduledTrigger-3135-thread-4) [    ] o.a.s.c.a.NodeAddedTrigger Running NodeAddedTrigger node_added_trigger1
   [junit4]   2> 624185 DEBUG (ScheduledTrigger-3135-thread-4) [    ] o.a.s.c.a.NodeAddedTrigger Found livenodes: 3
   [junit4]   2> 624215 DEBUG (ScheduledTrigger-3135-thread-2) [    ] o.a.s.c.a.NodeLostTrigger Running NodeLostTrigger: .auto_add_replicas with currently live nodes: 3
   [junit4]   2> 624215 DEBUG (ScheduledTrigger-3135-thread-3) [    ] o.a.s.c.a.NodeAddedTrigger Running NodeAddedTrigger node_added_trigger1
   [junit4]   2> 624215 DEBUG (ScheduledTrigger-3135-thread-3) [    ] o.a.s.c.a.NodeAddedTrigger Found livenodes: 3
   [junit4]   2> 624238 DEBUG (ScheduledTrigger-3135-thread-4) [    ] o.a.s.c.a.NodeAddedTrigger Running NodeAddedTrigger node_added_trigger1
   [junit4]   2> 624238 DEBUG (ScheduledTrigger-3135-thread-2) [    ] o.a.s.c.a.NodeLostTrigger Running NodeLostTrigger: .auto_add_replicas with currently live nodes: 3
   [junit4]   2> 624238 DEBUG (ScheduledTrigger-3135-thread-4) [    ] o.a.s.c.a.NodeAddedTrigger Found livenodes: 3
   [junit4]   2> 624263 DEBUG (ScheduledTrigger-3135-thread-4) [    ] o.a.s.c.a.NodeAddedTrigger Running NodeAddedTrigger node_added_trigger1
   [junit4]   2> 624263 DEBUG (ScheduledTrigger-3135-thread-1) [    ] o.a.s.c.a.NodeLostTrigger Running NodeLostTrigger: .auto_add_replicas with currently live nodes: 3
   [junit4]   2> 624263 DEBUG (ScheduledTrigger-3135-thread-4) [    ] o.a.s.c.a.NodeAddedTrigger Found livenodes: 3
   [junit4]   2> 624291 DEBUG (ScheduledTrigger-3135-thread-1) [    ] o.a.s.c.a.NodeLostTrigger Running NodeLostTrigger: .auto_add_replicas with currently live nodes: 3
   [junit4]   2> 624291 DEBUG (ScheduledTrigger-3135-thread-3) [    ] o.a.s.c.a.NodeAddedTrigger Running NodeAddedTrigger node_added_trigger1
   [junit4]   2> 624291 DEBUG (ScheduledTrigger-3135-thread-3) [    ] o.a.s.c.a.NodeAddedTrigger Found livenodes: 3
   [junit4]   2> 624318 DEBUG (ScheduledTrigger-3135-thread-1) [    ] o.a.s.c.a.NodeLostTrigger Running NodeLostTrigger: .auto_add_replicas with currently live nodes: 3
   [junit4]   2> 624318 DEBUG (ScheduledTrigger-3135-thread-4) [    ] o.a.s.c.a.NodeAddedTrigger Running NodeAddedTrigger node_added_trigger1
   [junit4]   2> 624318 DEBUG (ScheduledTrigger-3135-thread-4) [    ] o.a.s.c.a.NodeAddedTrigger Found livenodes: 3
   [junit4]   2> 624345 DEBUG (ScheduledTrigger-3135-thread-1) [    ] o.a.s.c.a.NodeLostTrigger Running NodeLostTrigger: .auto_add_replicas with currently live nodes: 3
   [junit4]   2> 624345 DEBUG (ScheduledTrigger-3135-thread-3) [    ] o.a.s.c.a.NodeAddedTrigger Running NodeAddedTrigger node_added_trigger1
   [junit4]   2> 624345 DEBUG (ScheduledTrigger-3135-thread-3) [    ] o.a.s.c.a.NodeAddedTrigger Found livenodes: 3
   [junit4]   2> 624370 DEBUG (ScheduledTrigger-3135-thread-1) [    ] o.a.s.c.a.NodeLostTrigger Running NodeLostTrigger: .auto_add_replicas with currently live nodes: 3
   [junit4]   2> 624370 DEBUG (ScheduledTrigger-3135-thread-4) [    ] o.a.s.c.a.NodeAddedTrigger Running NodeAddedTrigger node_added_trigger1
   [junit4]   2> 624370 DEBUG (ScheduledTrigger-3135-thread-4) [    ] o.a.s.c.a.NodeAddedTrigger Found livenodes: 3
   [junit4]   2> 624390 DEBUG (ScheduledTrigger-3135-thread-4) [    ] o.a.s.c.a.NodeLostTrigger Running NodeLostTrigger: .auto_add_replicas with currently live nodes: 3
   [junit4]   2> 624390 DEBUG (ScheduledTrigger-3135-thread-3) [    ] o.a.s.c.a.NodeAddedTrigger Running NodeAddedTrigger node_added_trigger1
   [junit4]   2> 624390 DEBUG (ScheduledTrigger-3135-thread-3) [    ] o.a.s.c.a.NodeAddedTrigger Found livenodes: 3
   [junit4]   2> 624414 DEBUG (ScheduledTrigger-3135-thread-4) [    ] o.a.s.c.a.NodeLostTrigger Running NodeLostTrigger: .auto_add_replicas with currently live nodes: 3
   [junit4]   2> 624414 DEBUG (ScheduledTrigger-3135-thread-1) [    ] o.a.s.c.a.NodeAddedTrigger Running NodeAddedTrigger node_added_trigger1
   [junit4]   2> 624414 DEBUG (ScheduledTrigger-3135-thread-1) [    ] o.a.s.c.a.NodeAddedTrigger Found livenodes: 3
   [junit4]   2> 624435 DEBUG (ScheduledTrigger-3135-thread-4) [    ] o.a.s.c.a.NodeLostTrigger Running NodeLostTrigger: .auto_add_replicas with currently live nodes: 3
   [junit4]   2> 624435 DEBUG (ScheduledTrigger-3135-thread-2) [    ] o.a.s.c.a.NodeAddedTrigger Running NodeAddedTrigger node_added_trigger1
   [junit4]   2> 624435 DEBUG (ScheduledTrigger-3135-thread-2) [    ] o.a.s.c.a.NodeAddedTrigger Found livenodes: 3
   [junit4]   2> 624456 DEBUG (ScheduledTrigger-3135-thread-3) [    ] o.a.s.c.a.NodeAddedTrigger Running NodeAddedTrigger node_added_trigger1
   [junit4]   2> 624456 DEBUG (ScheduledTrigger-3135-thread-2) [    ] o.a.s.c.a.NodeLostTrigger Running NodeLostTrigger: .auto_add_replicas with currently live nodes: 3
   [junit4]   2> 624456 DEBUG (ScheduledTrigger-3135-thread-3) [    ] o.a.s.c.a.NodeAddedTrigger Found livenodes: 3
   [junit4]   2> 624480 DEBUG (ScheduledTrigger-3135-thread-3) [    ] o.a.s.c.a.NodeLostTrigger Running NodeLostTrigger: .auto_add_replicas with currently live nodes: 3
   [junit4]   2> 624480 DEBUG (ScheduledTrigger-3135-thread-4) [    ] o.a.s.c.a.NodeAddedTrigger Running NodeAddedTrigger node_added_trigger1
   [junit4]   2> 624480 DEBUG (ScheduledTrigger-3135-thread-4) [    ] o.a.s.c.a.NodeAddedTrigger Found livenodes: 3
   [junit4]   2> 624502 DEBUG (ScheduledTrigger-3135-thread-3) [    ] o.a.s.c.a.NodeLostTrigger Running NodeLostTrigger: .auto_add_replicas with currently live nodes: 3
   [junit4]   2> 624502 DEBUG (ScheduledTrigger-3135-thread-1) [    ] o.a.s.c.a.NodeAddedTrigger Running NodeAddedTrigger node_added_trigger1
   [junit4]   2> 624502 DEBUG (ScheduledTrigger-3135-thread-1) [    ] o.a.s.c.a.NodeAddedTrigger Found livenodes: 3
   [junit4]   2> 624523 DEBUG (ScheduledTrigger-3135-thread-2) [    ] o.a.s.c.a.NodeAddedTrigger Running NodeAddedTrigger node_added_trigger1
   [junit4]   2> 624523 DEBUG (ScheduledTrigger-3135-thread-3) [    ] o.a.s.c.a.NodeLostTrigger Running NodeLostTrigger: .auto_add_replicas with currently live nodes: 3
   [junit4]   2> 624523 DEBUG (ScheduledTrigger-3135-thread-2) [    ] o.a.s.c.a.NodeAddedTrigger Found livenodes: 3
   [junit4]   2> 624543 DEBUG (ScheduledTrigger-3135-thread-3) [    ] o.a.s.c.a.NodeAddedTrigger Running NodeAddedTrigger node_added_trigger1
   [junit4]   2> 624543 DEBUG (ScheduledTrigger-3135-thread-1) [    ] o.a.s.c.a.NodeLostTrigger Running NodeLostTrigger: .auto_add_replicas with currently live nodes: 3
   [junit4]   2> 624543 DEBUG (ScheduledTrigger-3135-thread-3) [    ] o.a.s.c.a.NodeAddedTrigger Found livenodes: 3
   [junit4]   2> 624564 DEBUG (ScheduledTrigger-3135-thread-3) [    ] o.a.s.c.a.NodeLostTrigger Running NodeLostTrigger: .auto_add_replicas with currently live nodes: 3
   [junit4]   2> 624564 DEBUG (ScheduledTrigger-3135-thread-4) [    ] o.a.s.c.a.NodeAddedTrigger Running NodeAddedTrigger node_added_trigger1
   [junit4]   2> 624564 DEBUG (ScheduledTrigger-3135-thread-4) [    ] o.a.s.c.a.NodeAddedTrigger Found livenodes: 3
   [junit4]   2> 624585 DEBUG (ScheduledTrigger-3135-thread-3) [    ] o.a.s.c.a.NodeLostTrigger Running NodeLostTrigger: .auto_add_replicas with currently live nodes: 3
   [junit4]   2> 624585 DEBUG (ScheduledTrigger-3135-thread-1) [    ] o.a.s.c.a.NodeAddedTrigger Running NodeAddedTrigger node_added_trigger1
   [junit4]   2> 624585 DEBUG (ScheduledTrigger-3135-thread-1) [    ] o.a.s.c.a.NodeAddedTrigger Found livenodes: 3
   [junit4]   2> 624610 DEBUG (ScheduledTrigger-3135-thread-3) [    ] o.a.s.c.a.NodeLostTrigger Running NodeLostTrigger: .auto_add_replicas with currently live nodes: 3
   [junit4]   2> 624610 DEBUG (ScheduledTrigger-3135-thread-2) [    ] o.a.s.c.a.NodeAddedTrigger Running NodeAddedTrigger node_added_trigger1
   [junit4]   2> 624610 DEBUG (ScheduledTrigger-3135-thread-2) [    ] o.a.s.c.a.NodeAddedTrigger Found livenodes: 3
   [junit4]   2> 624631 DEBUG (ScheduledTrigger-3135-thread-1) [    ] o.a.s.c.a.NodeAddedTrigger Running NodeAddedTrigger node_added_trigger1
   [junit4]   2> 624631 DEBUG (ScheduledTrigger-3135-thread-3) [    ] o.a.s.c.a.NodeLostTrigger Running NodeLostTrigger: .auto_add_replicas with currently live nodes: 3
   [junit4]   2> 624632 DEBUG (ScheduledTrigger-3135-thread-1) [    ] o.a.s.c.a.NodeAddedTrigger Found livenodes: 3
   [junit4]   2> 624657 DEBUG (ScheduledTrigger-3135-thread-3) [    ] o.a.s.c.a.NodeAddedTrigger Running NodeAddedTrigger node_added_trigger1
   [junit4]   2> 624657 DEBUG (ScheduledTrigger-3135-thread-2) [    ] o.a.s.c.a.NodeLostTrigger Running NodeLostTrigger: .auto_add_replicas with currently live nodes: 3
   [junit4]   2> 624657 DEBUG (ScheduledTrigger-3135-thread-3) [    ] o.a.s.c.a.NodeAddedTrigger Found livenodes: 3
   [junit4]   2> 624684 DEBUG (ScheduledTrigger-3135-thread-4) [    ] o.a.s.c.a.NodeAddedTrigger Running NodeAddedTrigger node_added_trigger1
   [junit4]   2> 624684 DEBUG (ScheduledTrigger-3135-thread-3) [    ] o.a.s.c.a.NodeLostTrigger Running NodeLostTrigger: .auto_add_replicas with currently live nodes: 3
   [junit4]   2> 624684 DEBUG (ScheduledTrigger-3135-thread-4) [    ] o.a.s.c.a.NodeAddedTrigger Found livenodes: 3
   [junit4]   2> 624710 DEBUG (ScheduledTrigger-3135-thread-4) [    ] o.a.s.c.a.NodeLostTrigger Running NodeLostTrigger: .auto_add_replicas with currently live nodes: 3
   [junit4]   2> 624710 DEBUG (ScheduledTrigger-3135-thread-1) [    ] o.a.s.c.a.NodeAddedTrigger Running NodeAddedTrigger node_added_trigger1
   [junit4]   2> 624710 DEBUG (ScheduledTrigger-3135-thread-1) [    ] o.a.s.c.a.NodeAddedTrigger Found livenodes: 3
   [junit4]   2> 624737 DEBUG (ScheduledTrigger-3135-thread-4) [    ] o.a.s.c.a.NodeLostTrigger Running NodeLostTrigger: .auto_add_replicas with currently live nodes: 3
   [junit4]   2> 624737 DEBUG (ScheduledTrigger-3135-thread-2) [    ] o.a.s.c.a.NodeAddedTrigger Running NodeAddedTrigger node_added_trigger1
   [junit4]   2> 624737 DEBUG (ScheduledTrigger-3135-thread-2) [    ] o.a.s.c.a.NodeAddedTrigger Found livenodes: 3
   [junit4]   2> 624764 DEBUG (ScheduledTrigger-3135-thread-4) [    ] o.a.s.c.a.NodeLostTrigger Running NodeLostTrigger: .auto_add_replicas with currently live nodes: 3
   [junit4]   2> 624764 DEBUG (ScheduledTrigger-3135-thread-4) [    ] o.a.s.c.a.NodeAddedTrigger Running NodeAddedTrigger node_added_trigger1
   [junit4]   2> 624764 DEBUG (ScheduledTrigger-3135-thread-4) [    ] o.a.s.c.a.NodeAddedTrigger Found livenodes: 3
   [junit4]   2> 624785 DEBUG (ScheduledTrigger-3135-thread-4) [    ] o.a.s.c.a.NodeLostTrigger Running NodeLostTrigger: .auto_add_replicas with currently live nodes: 3
   [junit4]   2> 624785 DEBUG (ScheduledTrigger-3135-thread-3) [    ] o.a.s.c.a.NodeAddedTrigger Running NodeAddedTrigger node_added_trigger1
   [junit4]   2> 624785 DEBUG (ScheduledTrigger-3135-thread-3) [    ] o.a.s.c.a.NodeAddedTrigger Found livenodes: 3
   [junit4]   2> 624807 DEBUG (ScheduledTrigger-3135-thread-4) [    ] o.a.s.c.a.NodeLostTrigger Running NodeLostTrigger: .auto_add_replicas with currently live nodes: 3
   [junit4]   2> 624807 DEBUG (ScheduledTrigger-3135-thread-4) [    ] o.a.s.c.a.NodeAddedTrigger Running NodeAddedTrigger node_added_trigger1
   [junit4]   2> 624807 DEBUG (ScheduledTrigger-3135-thread-4) [    ] o.a.s.c.a.NodeAddedTrigger Found livenodes: 3
   [junit4]   2> 624827 DEBUG (ScheduledTrigger-3135-thread-4) [    ] o.a.s.c.a.NodeLostTrigger Running NodeLostTrigger: .auto_add_replicas with currently live nodes: 3
   [junit4]   2> 624828 DEBUG (ScheduledTrigger-3135-thread-3) [    ] o.a.s.c.a.NodeAddedTrigger Running NodeAddedTrigger node_added_trigger1
   [junit4]   2> 624828 DEBUG (ScheduledTrigger-3135-thread-3) [    ] o.a.s.c.a.NodeAddedTrigger Found livenodes: 3
   [junit4]   2> 624848 DEBUG (ScheduledTrigger-3135-thread-4) [    ] o.a.s.c.a.NodeLostTrigger Running NodeLostTrigger: .auto_add_replicas with currently live nodes: 3
   [junit4]   2> 624848 DEBUG (ScheduledTrigger-3135-thread-1) [    ] o.a.s.c.a.NodeAddedTrigger Running NodeAddedTrigger node_added_trigger1
   [junit4]   2> 624848 DEBUG (ScheduledTrigger-3135-thread-1) [    ] o.a.s.c.a.NodeAddedTrigger Found livenodes: 3
   [junit4]   2> 624869 DEBUG (ScheduledTrigger-3135-thread-1) [    ] o.a.s.c.a.NodeLostTrigger Running NodeLostTrigger: .auto_add_replicas with currently live nodes: 3
   [junit4]   2> 624869 DEBUG (ScheduledTrigger-3135-thread-2) [    ] o.a.s.c.a.NodeAddedTrigger Running NodeAddedTrigger node_added_trigger1
   [junit4]   2> 624869 DEBUG (ScheduledTrigger-3135-thread-2) [    ] o.a.s.c.a.NodeAddedTrigger Found livenodes: 3
   [junit4]   2> 624889 DEBUG (ScheduledTrigger-3135-thread-1) [    ] o.a.s.c.a.NodeLostTrigger Running NodeLostTrigger: .auto_add_replicas with currently live nodes: 3
   [junit4]   2> 624889 DEBUG (ScheduledTrigger-3135-thread-4) [    ] o.a.s.c.a.NodeAddedTrigger Running NodeAddedTrigger node_added_trigger1
   [junit4]   2> 624889 DEBUG (ScheduledTrigger-3135-thread-4) [    ] o.a.s.c.a.NodeAddedTrigger Found livenodes: 3
   [junit4]   2> 624910 DEBUG (ScheduledTrigger-3135-thread-1) [    ] o.a.s.c.a.NodeLostTrigger Running NodeLostTrigger: .auto_add_replicas with currently live nodes: 3
   [junit4]   2> 624910 DEBUG (ScheduledTrigger-3135-thread-2) [    ] o.a.s.c.a.NodeAddedTrigger Running NodeAddedTrigger node_added_trigger1
   [junit4]   2> 624910 DEBUG (ScheduledTrigger-3135-thread-2) [    ] o.a.s.c.a.NodeAddedTrigger Found livenodes: 3
   [junit4]   2> 624932 DEBUG (ScheduledTrigger-3135-thread-1) [    ] o.a.s.c.a.NodeLostTrigger Running NodeLostTrigger: .auto_add_replicas with currently live nodes: 3
   [junit4]   2> 624932 DEBUG (ScheduledTrigger-3135-thread-4) [    ] o.a.s.c.a.NodeAddedTrigger Running NodeAddedTrigger node_added_trigger1
   [junit4]   2> 624932 DEBUG (ScheduledTrigger-3135-thread-4) [    ] o.a.s.c.a.NodeAddedTrigger Found livenodes: 3
   [junit4]   2> 624953 DEBUG (ScheduledTrigger-3135-thread-1) [    ] o.a.s.c.a.NodeLostTrigger Running NodeLostTrigger: .auto_add_replicas with currently live nodes: 3
   [junit4]   2> 624953 DEBUG (ScheduledTrigger-3135-thread-3) [    ] o.a.s.c.a.NodeAddedTrigger Running NodeAddedTrigger node_added_trigger1
   [junit4]   2> 624953 DEBUG (ScheduledTrigger-3135-thread-3) [    ] o.a.s.c.a.NodeAddedTrigger Found livenodes: 3
   [junit4]   2> 624973 DEBUG (ScheduledTrigger-3135-thread-1) [    ] o.a.s.c.a.NodeLostTrigger Running NodeLostTrigger: .auto_add_replicas with currently live nodes: 3
   [junit4]   2> 624973 DEBUG (ScheduledTrigger-3135-thread-4) [    ] o.a.s.c.a.NodeAddedTrigger Running NodeAddedTrigger node_added_trigger1
   [junit4]   2> 624973 DEBUG (ScheduledTrigger-3135-thread-4) [    ] o.a.s.c.a.NodeAddedTrigger Found livenodes: 3
   [junit4]   2> 624994 DEBUG (ScheduledTrigger-3135-thread-1) [    ] o.a.s.c.a.NodeLostTrigger Running NodeLostTrigger: .auto_add_replicas with currently live nodes: 3
   [junit4]   2> 624994 DEBUG (ScheduledTrigger-3135-thread-2) [    ] o.a.s.c.a.NodeAddedTrigger Running NodeAddedTrigger node_added_trigger1
   [junit4]   2> 624994 DEBUG (ScheduledTrigger-3135-thread-2) [    ] o.a.s.c.a.NodeAddedTrigger Found livenodes: 3
   [junit4]   2> 625018 DEBUG (ScheduledTrigger-3135-thread-4) [    ] o.a.s.c.a.NodeAddedTrigger Running NodeAddedTrigger node_added_trigger1
   [junit4]   2> 625018 DEBUG (ScheduledTrigger-3135-thread-1) [    ] o.a.s.c.a.NodeLostTrigger Running NodeLostTrigger: .auto_add_replicas with currently live nodes: 3
   [junit4]   2> 625018 DEBUG (ScheduledTrigger-3135-thread-4) [    ] o.a.s.c.a.NodeAddedTrigger Found livenodes: 3
   [junit4]   2> 625039 DEBUG (ScheduledTrigger-3135-thread-3) [    ] o.a.s.c.a.NodeAddedTrigger Running NodeAddedTrigger node_added_trigger1
   [junit4]   2> 625039 DEBUG (ScheduledTrigger-3135-thread-1) [    ] o.a.s.c.a.NodeLostTrigger Running NodeLostTrigger: .auto_add_replicas with currently live nodes: 3
   [junit4]   2> 625039 DEBUG (ScheduledTrigger-3135-thread-3) [    ] o.a.s.c.a.NodeAddedTrigger Found livenodes: 3
   [junit4]   2> 625059 DEBUG (ScheduledTrigger-3135-thread-3) [    ] o.a.s.c.a.NodeLostTrigger Running NodeLostTrigger: .auto_add_replicas with currently live nodes: 3
   [junit4]   2> 625059 DEBUG (ScheduledTrigger-3135-thread-4) [    ] o.a.s.c.a.NodeAddedTrigger Running NodeAddedTrigger node_added_trigger1
   [junit4]   2> 625059 DEBUG (ScheduledTrigger-3135-thread-4) [    ] o.a.s.c.a.NodeAddedTrigger Found livenodes: 3
   [junit4]   2> 625080 DEBUG (ScheduledTrigger-3135-thread-2) [    ] o.a.s.c.a.NodeAddedTrigger Running NodeAddedTrigger node_added_trigger1
   [junit4]   2> 625080 DEBUG (ScheduledTrigger-3135-thread-3) [    ] o.a.s.c.a.NodeLostTrigger Running NodeLostTrigger: .auto_add_replicas with currently live nodes: 3
   [junit4]   2> 625080 DEBUG (ScheduledTrigger-3135-thread-2) [    ] o.a.s.c.a.NodeAddedTrigger Found livenodes: 3
   [junit4]   2> 625092 INFO  (TEST-TestSimTriggerIntegration.testEventQueue-seed#[9B06C56F9E286412]) [    ] o.a.s.SolrTestCaseJ4 ###Ending testEventQueue
   [junit4]   2> 625095 INFO  (TEST-TestSimTriggerIntegration.testEventQueue-seed#[9B06C56F9E286412]) [    ] o.a.s.c.a.s.SimSolrCloudTestCase #######################################
   [junit4]   2> ############ CLUSTER STATE ############
   [junit4]   2> #######################################
   [junit4]   2> ## Live nodes:		3
   [junit4]   2> ## Empty nodes:	2
   [junit4]   2> ## Dead nodes:		0
   [junit4]   2> ## Collections:	[.system]
   [junit4]   2> ## Max replicas per node:	1
   [junit4]   2> ## Min replicas per node:	0
   [junit4]   2> ## Total replicas:		1
   [junit4]   2> ## * .system		1
   [junit4]   2> ##		- active           1
   [junit4]   2> ######### Solr op counts ##########
   [junit4]   2> ##		- autoscaling        2
   [junit4]   2> ######### Autoscaling event counts ###########
   [junit4]   2> 
   [junit4]   2> NOTE: reproduce with: ant test  -Dtestcase=TestSimTriggerIntegration -Dtests.method=testEventQueue -Dtests.seed=9B06C56F9E286412 -Dtests.slow=true -Dtests.locale=bm-ML -Dtests.timezone=America/Matamoros -Dtests.asserts=true -Dtests.file.encoding=ISO-8859-1
   [junit4] FAILURE 1.37s J0 | TestSimTriggerIntegration.testEventQueue <<<
   [junit4]    > Throwable #1: java.lang.AssertionError: action did not start
   [junit4]    > 	at __randomizedtesting.SeedInfo.seed([9B06C56F9E286412:52B387C1974FA2E7]:0)
   [junit4]    > 	at org.apache.solr.cloud.autoscaling.sim.TestSimTriggerIntegration.testEventQueue(TestSimTriggerIntegration.java:663)
   [junit4]    > 	at java.base/jdk.internal.reflect.NativeMethodAccessorImpl.invoke0(Native Method)
   [junit4]    > 	at java.base/jdk.internal.reflect.NativeMethodAccessorImpl.invoke(NativeMethodAccessorImpl.java:62)
   [junit4]    > 	at java.base/jdk.internal.reflect.DelegatingMethodAccessorImpl.invoke(DelegatingMethodAccessorImpl.java:43)
   [junit4]    > 	at java.base/java.lang.reflect.Method.invoke(Method.java:564)
   [junit4]    > 	at java.base/java.lang.Thread.run(Thread.java:844)
   [junit4]   2> 625103 INFO  (TEST-TestSimTriggerIntegration.testSearchRate-seed#[9B06C56F9E286412]) [    ] o.a.s.SolrTestCaseJ4 ###Starting testSearchRate
   [junit4]   2> 625103 DEBUG (TEST-TestSimTriggerIntegration.testSearchRate-seed#[9B06C56F9E286412]) [    ] o.a.s.c.a.OverseerTriggerThread Refreshing /autoscaling.json with znode version 5
   [junit4]   2> 625103 DEBUG (Simulated OverseerAutoScalingTriggerThread) [    ] o.a.s.c.a.OverseerTriggerThread Processed trigger updates upto znodeVersion 5
   [junit4]   2> 625103 DEBUG (Simulated OverseerAutoScalingTriggerThread) [    ] o.a.s.c.a.OverseerTriggerThread -- clean old nodeLost markers
   [junit4]   2> 625103 DEBUG (Simulated OverseerAutoScalingTriggerThread) [    ] o.a.s.c.a.OverseerTriggerThread -- clean old nodeAdded markers
   [junit4]   2> 625103 DEBUG (TEST-TestSimTriggerIntegration.testSearchRate-seed#[9B06C56F9E286412]) [    ] o.a.s.c.a.s.SimNodeStateProvider --removing value for 127.0.0.1:10001_solr
   [junit4]   2> 625104 INFO  (TEST-TestSimTriggerIntegration.testSearchRate-seed#[9B06C56F9E286412]) [    ] o.a.s.c.a.s.SimCloudManager === Restarting OverseerTriggerThread and clearing object cache...
   [junit4]   2> 625104 DEBUG (TEST-TestSimTriggerIntegration.testSearchRate-seed#[9B06C56F9E286412]) [    ] o.a.s.c.a.ScheduledTriggers Shutting down scheduled thread pool executor now
   [junit4]   2> 625104 DEBUG (TEST-TestSimTriggerIntegration.testSearchRate-seed#[9B06C56F9E286412]) [    ] o.a.s.c.a.ScheduledTriggers Shutting down action executor now
   [junit4]   2> 625104 DEBUG (TEST-TestSimTriggerIntegration.testSearchRate-seed#[9B06C56F9E286412]) [    ] o.a.s.c.a.ScheduledTriggers Awaiting termination for action executor
   [junit4]   2> 625104 DEBUG (TEST-TestSimTriggerIntegration.testSearchRate-seed#[9B06C56F9E286412]) [    ] o.a.s.c.a.ScheduledTriggers Awaiting termination for scheduled thread pool executor
   [junit4]   2> 625104 WARN  (Simulated OverseerAutoScalingTriggerThread) [    ] o.a.s.c.a.OverseerTriggerThread Interrupted
   [junit4]   2> java.lang.InterruptedException: null
   [junit4]   2> 	at java.util.concurrent.locks.AbstractQueuedSynchronizer.acquireInterruptibly(AbstractQueuedSynchronizer.java:1247) ~[?:?]
   [junit4]   2> 	at java.util.concurrent.locks.ReentrantLock.lockInterruptibly(ReentrantLock.java:317) ~[?:?]
   [junit4]   2> 	at org.apache.solr.cloud.autoscaling.OverseerTriggerThread.run(OverseerTriggerThread.java:177) [java/:?]
   [junit4]   2> 	at java.lang.Thread.run(Thread.java:844) [?:?]
   [junit4]   2> 625105 DEBUG (TEST-TestSimTriggerIntegration.testSearchRate-seed#[9B06C56F9E286412]) [    ] o.a.s.c.a.ScheduledTriggers ScheduledTriggers closed completely
   [junit4]   2> 625105 DEBUG (TEST-TestSimTriggerIntegration.testSearchRate-seed#[9B06C56F9E286412]) [    ] o.a.s.c.a.OverseerTriggerThread OverseerTriggerThread has been closed explicitly
   [junit4]   2> 625106 DEBUG (Simulated OverseerAutoScalingTriggerThread) [    ] o.a.s.c.a.OverseerTriggerThread Adding .auto_add_replicas and .scheduled_maintenance triggers
   [junit4]   2> 625106 DEBUG (Simulated OverseerAutoScalingTriggerThread) [    ] o.a.s.c.a.OverseerTriggerThread Refreshing /autoscaling.json with znode version 6
   [junit4]   2> 625107 DEBUG (Simulated OverseerAutoScalingTriggerThread) [    ] o.a.s.c.a.OverseerTriggerThread Current znodeVersion 6, lastZnodeVersion -1
   [junit4]   2> 625107 DEBUG (Simulated OverseerAutoScalingTriggerThread) [    ] o.a.s.c.a.OverseerTriggerThread Processed trigger updates upto znodeVersion 6
   [junit4]   2> 625109 DEBUG (Simulated OverseerAutoScalingTriggerThread) [    ] o.a.s.c.a.NodeLostTrigger NodeLostTrigger .auto_add_replicas - Initial livenodes: [127.0.0.1:10000_solr, 127.0.0.1:10002_solr]
   [junit4]   2> 625110 DEBUG (Simulated OverseerAutoScalingTriggerThread) [    ] o.a.s.c.a.OverseerTriggerThread -- clean old nodeAdded markers
   [junit4]   2> 625110 DEBUG (Simulated OverseerAutoScalingTriggerThread) [    ] o.a.s.c.a.OverseerTriggerThread Current znodeVersion 6, lastZnodeVersion 6
   [junit4]   2> 625111 DEBUG (ScheduledTrigger-3138-thread-2) [    ] o.a.s.c.a.NodeLostTrigger Running NodeLostTrigger: .auto_add_replicas with currently live nodes: 2
   [junit4]   2> 625132 DEBUG (ScheduledTrigger-3138-thread-3) [    ] o.a.s.c.a.NodeLostTrigger Running NodeLostTrigger: .auto_add_replicas with currently live nodes: 2
   [junit4]   2> 625157 DEBUG (ScheduledTrigger-3138-thread-4) [    ] o.a.s.c.a.NodeLostTrigger Running NodeLostTrigger: .auto_add_replicas with currently live nodes: 2
   [junit4]   2> 625182 DEBUG (ScheduledTrigger-3138-thread-3) [    ] o.a.s.c.a.NodeLostTrigger Running NodeLostTrigger: .auto_add_replicas with currently live nodes: 2
   [junit4]   2> 625204 DEBUG (ScheduledTrigger-3138-thread-4) [    ] o.a.s.c.a.NodeLostTrigger Running NodeLostTrigger: .auto_add_replicas with currently live nodes: 2
   [junit4]   2> 625210 DEBUG (simCloudManagerPool-3137-thread-1) [    ] o.a.s.c.a.AutoScalingHandler Verified autoscaling configuration
   [junit4]   2> 625211 DEBUG (simCloudManagerPool-3137-thread-1) [    ] o.a.s.c.a.OverseerTriggerThread Refreshing /autoscaling.json with znode version 7
   [junit4]   2> 625211 DEBUG (Simulated OverseerAutoScalingTriggerThread) [    ] o.a.s.c.a.OverseerTriggerThread Processed trigger updates upto znodeVersion 7
   [junit4]   2> 625212 DEBUG (Simulated OverseerAutoScalingTriggerThread) [    ] o.a.s.c.a.OverseerTriggerThread -- clean old nodeAdded markers
   [junit4]   2> 625212 DEBUG (Simulated OverseerAutoScalingTriggerThread) [    ] o.a.s.c.a.OverseerTriggerThread Current znodeVersion 7, lastZnodeVersion 7
   [junit4]   2> 625225 DEBUG (ScheduledTrigger-3138-thread-1) [    ] o.a.s.c.a.NodeLostTrigger Running NodeLostTrigger: .auto_add_replicas with currently live nodes: 2
   [junit4]   2> 625237 DEBUG (simCloudManagerPool-3137-thread-2) [    ] o.a.s.c.a.s.SimClusterStateProvider -- submit leader election for .system / shard1
   [junit4]   2> 625237 DEBUG (simCloudManagerPool-3137-thread-3) [    ] o.a.s.c.a.s.SimClusterStateProvider Running leader election for .system / shard1
   [junit4]   2> 625237 DEBUG (simCloudManagerPool-3137-thread-3) [    ] o.a.s.c.a.s.SimClusterStateProvider -- elected new leader for .system / shard1: core_node2
   [junit4]   2> 625251 DEBUG (ScheduledTrigger-3138-thread-1) [    ] o.a.s.c.a.NodeLostTrigger Running NodeLostTrigger: .auto_add_replicas with currently live nodes: 2
   [junit4]   2> 625268 DEBUG (simCloudManagerPool-3137-thread-5) [    ] o.a.s.c.a.s.SimClusterStateProvider -- submit leader election for collection1 / shard1
   [junit4]   2> 625269 DEBUG (simCloudManagerPool-3137-thread-7) [    ] o.a.s.c.a.s.SimClusterStateProvider Running leader election for collection1 / shard1
   [junit4]   2> 625269 DEBUG (simCloudManagerPool-3137-thread-7) [    ] o.a.s.c.a.s.SimClusterStateProvider -- elected new leader for collection1 / shard1: core_node1
   [junit4]   2> 625276 DEBUG (ScheduledTrigger-3138-thread-1) [    ] o.a.s.c.a.NodeLostTrigger Running NodeLostTrigger: .auto_add_replicas with currently live nodes: 2
   [junit4]   2> 625284 DEBUG (simCloudManagerPool-3137-thread-6) [    ] o.a.s.c.a.s.SimClusterStateProvider -- already has leader collection1 / shard1
   [junit4]   2> 625299 DEBUG (simCloudManagerPool-3137-thread-8) [    ] o.a.s.c.a.AutoScalingHandler Verified autoscaling configuration
   [junit4]   2> 625299 DEBUG (simCloudManagerPool-3137-thread-8) [    ] o.a.s.c.a.OverseerTriggerThread Refreshing /autoscaling.json with znode version 8
   [junit4]   2> 625300 DEBUG (Simulated OverseerAutoScalingTriggerThread) [    ] o.a.s.c.a.OverseerTriggerThread Processed trigger updates upto znodeVersion 8
   [junit4]   2> 625300 DEBUG (Simulated OverseerAutoScalingTriggerThread) [    ] o.a.s.c.a.OverseerTriggerThread -- clean old nodeAdded markers
   [junit4]   2> 625300 DEBUG (Simulated OverseerAutoScalingTriggerThread) [    ] o.a.s.c.a.OverseerTriggerThread Current znodeVersion 8, lastZnodeVersion 8
   [junit4]   2> 625300 DEBUG (ScheduledTrigger-3138-thread-1) [    ] o.a.s.c.a.NodeLostTrigger Running NodeLostTrigger: .auto_add_replicas with currently live nodes: 2
   [junit4]   2> 625302 DEBUG (simCloudManagerPool-3137-thread-9) [    ] o.a.s.c.a.AutoScalingHandler Verified autoscaling configuration
   [junit4]   2> 625302 DEBUG (simCloudManagerPool-3137-thread-9) [    ] o.a.s.c.a.OverseerTriggerThread Refreshing /autoscaling.json with znode version 9
   [junit4]   2> 625302 DEBUG (Simulated OverseerAutoScalingTriggerThread) [    ] o.a.s.c.a.OverseerTriggerThread Processed trigger updates upto znodeVersion 9
   [junit4]   2> 625303 DEBUG (Simulated OverseerAutoScalingTriggerThread) [    ] o.a.s.c.a.OverseerTriggerThread -- clean old nodeAdded markers
   [junit4]   2> 625303 DEBUG (Simulated OverseerAutoScalingTriggerThread) [    ] o.a.s.c.a.OverseerTriggerThread Current znodeVersion 9, lastZnodeVersion 9
   [junit4]   2> 625303 DEBUG (ScheduledTrigger-3138-thread-1) [    ] o.a.s.c.a.SearchRateTrigger ### rates for node 127.0.0.1:10000_solr
   [junit4]   2> 625303 DEBUG (ScheduledTrigger-3138-thread-1) [    ] o.a.s.c.a.SearchRateTrigger ###  metrics:solr.core.collection1.shard1.replica_n2:QUERY./select.requestTimes:1minRate	250
   [junit4]   2> 625305 DEBUG (ScheduledTrigger-3138-thread-1) [    ] o.a.s.c.a.SearchRateTrigger ### rates for node 127.0.0.1:10002_solr
   [junit4]   2> 625305 DEBUG (ScheduledTrigger-3138-thread-1) [    ] o.a.s.c.a.SearchRateTrigger ###  metrics:solr.core.collection1.shard1.replica_n1:QUERY./select.requestTimes:1minRate	250
   [junit4]   2> 625305 DEBUG (ScheduledTrigger-3138-thread-1) [    ] o.a.s.c.a.SearchRateTrigger ## Collection: collection1
   [junit4]   2> 625306 DEBUG (ScheduledTrigger-3138-thread-1) [    ] o.a.s.c.a.SearchRateTrigger ##  - shard1
   [junit4]   2> 625306 DEBUG (ScheduledTrigger-3138-thread-1) [    ] o.a.s.c.a.SearchRateTrigger ##     collection1_shard1_replica_n2  250.0
   [junit4]   2> 625306 DEBUG (ScheduledTrigger-3138-thread-1) [    ] o.a.s.c.a.SearchRateTrigger ##     collection1_shard1_replica_n1  250.0
   [junit4]   2> 625319 DEBUG (ScheduledTrigger-3138-thread-1) [    ] o.a.s.c.a.SearchRateTrigger -- collection1.shard1: totalShardRate=500.0, shardRate=250.0
   [junit4]   2> 625320 DEBUG (ScheduledTrigger-3138-thread-3) [    ] o.a.s.c.a.NodeLostTrigger Running NodeLostTrigger: .auto_add_replicas with currently live nodes: 2
   [junit4]   2> 625343 DEBUG (ScheduledTrigger-3138-thread-3) [    ] o.a.s.c.a.NodeLostTrigger Running NodeLostTrigger: .auto_add_replicas with currently live nodes: 2
   [junit4]   2> 625343 DEBUG (ScheduledTrigger-3138-thread-2) [    ] o.a.s.c.a.SearchRateTrigger ### rates for node 127.0.0.1:10000_solr
   [junit4]   2> 625343 DEBUG (ScheduledTrigger-3138-thread-2) [    ] o.a.s.c.a.SearchRateTrigger ###  metrics:solr.core.collection1.shard1.replica_n2:QUERY./select.requestTimes:1minRate	250
   [junit4]   2> 625343 DEBUG (ScheduledTrigger-3138-thread-2) [    ] o.a.s.c.a.SearchRateTrigger ### rates for node 127.0.0.1:10002_solr
   [junit4]   2> 625343 DEBUG (ScheduledTrigger-3138-thread-2) [    ] o.a.s.c.a.SearchRateTrigger ###  metrics:solr.core.collection1.shard1.replica_n1:QUERY./select.requestTimes:1minRate	250
   [junit4]   2> 625343 DEBUG (ScheduledTrigger-3138-thread-2) [    ] o.a.s.c.a.SearchRateTrigger ## Collection: collection1
   [junit4]   2> 625343 DEBUG (ScheduledTrigger-3138-thread-2) [    ] o.a.s.c.a.SearchRateTrigger ##  - shard1
   [junit4]   2> 625343 DEBUG (ScheduledTrigger-3138-thread-2) [    ] o.a.s.c.a.SearchRateTrigger ##     collection1_shard1_replica_n2  250.0
   [junit4]   2> 625343 DEBUG (ScheduledTrigger-3138-thread-2) [    ] o.a.s.c.a.SearchRateTrigger ##     collection1_shard1_replica_n1  250.0
   [junit4]   2> 625343 DEBUG (ScheduledTrigger-3138-thread-2) [    ] o.a.s.c.a.SearchRateTrigger -- collection1.shard1: totalShardRate=500.0, shardRate=250.0
   [junit4]   2> 625371 DEBUG (ScheduledTrigger-3138-thread-3) [    ] o.a.s.c.a.NodeLostTrigger Running NodeLostTrigger: .auto_add_replicas with currently live nodes: 2
   [junit4]   2> 625371 DEBUG (ScheduledTrigger-3138-thread-3) [    ] o.a.s.c.a.SearchRateTrigger ### rates for node 127.0.0.1:10000_solr
   [junit4]   2> 625371 DEBUG (ScheduledTrigger-3138-thread-3) [    ] o.a.s.c.a.SearchRateTrigger ###  metrics:solr.core.collection1.shard1.replica_n2:QUERY./select.requestTimes:1minRate	250
   [junit4]   2> 625371 DEBUG (ScheduledTrigger-3138-thread-3) [    ] o.a.s.c.a.SearchRateTrigger ### rates for node 127.0.0.1:10002_solr
   [junit4]   2> 625371 DEBUG (ScheduledTrigger-3138-thread-3) [    ] o.a.s.c.a.SearchRateTrigger ###  metrics:solr.core.collection1.shard1.replica_n1:QUERY./select.requestTimes:1minRate	250
   [junit4]   2> 625371 DEBUG (ScheduledTrigger-3138-thread-3) [    ] o.a.s.c.a.SearchRateTrigger ## Collection: collection1
   [junit4]   2> 625371 DEBUG (ScheduledTrigger-3138-thread-3) [    ] o.a.s.c.a.SearchRateTrigger ##  - shard1
   [junit4]   2> 625371 DEBUG (ScheduledTrigger-3138-thread-3) [    ] o.a.s.c.a.SearchRateTrigger ##     collection1_shard1_replica_n2  250.0
   [junit4]   2> 625371 DEBUG (ScheduledTrigger-3138-thread-3) [    ] o.a.s.c.a.SearchRateTrigger ##     collection1_shard1_replica_n1  250.0
   [junit4]   2> 625372 DEBUG (ScheduledTrigger-3138-thread-3) [    ] o.a.s.c.a.SearchRateTrigger -- collection1.shard1: totalShardRate=500.0, shardRate=250.0
   [junit4]   2> 625379 DEBUG (ScheduledTrigger-3138-thread-3) [    ] o.a.s.c.a.ScheduledTriggers ++++++++ Cooldown inactive - processing event: {
   [junit4]   2>   "id":"f788203d906e5T2tnzw37217yq7ldr0qfhnobwx",
   [junit4]   2>   "source":"search_rate_trigger",
   [junit4]   2>   "eventTime":4354624456296165,
   [junit4]   2>   "eventType":"SEARCHRATE",
   [junit4]   2>   "properties":{
   [junit4]   2>     "hotReplicas":[
   [junit4]   2>       {"core_node2":{
   [junit4]   2>           "core":"collection1_shard1_replica_n2",
   [junit4]   2>           "shard":"shard1",
   [junit4]   2>           "collection":"collection1",
   [junit4]   2>           "node_name":"127.0.0.1:10000_solr",
   [junit4]   2>           "type":"NRT",
   [junit4]   2>           "SEARCHER.searcher.maxDoc":0,
   [junit4]   2>           "SEARCHER.searcher.deletedDocs":0,
   [junit4]   2>           "INDEX.sizeInBytes":10240,
   [junit4]   2>           "rate":250.0,
   [junit4]   2>           "state":"active",
   [junit4]   2>           "QUERY./select.requestTimes:1minRate":250,
   [junit4]   2>           "INDEX.sizeInGB":9.5367431640625E-6,
   [junit4]   2>           "SEARCHER.searcher.numDocs":0}},
   [junit4]   2>       {"core_node1":{
   [junit4]   2>           "core":"collection1_shard1_replica_n1",
   [junit4]   2>           "shard":"shard1",
   [junit4]   2>           "collection":"collection1",
   [junit4]   2>           "node_name":"127.0.0.1:10002_solr",
   [junit4]   2>           "type":"NRT",
   [junit4]   2>           "leader":"true",
   [junit4]   2>           "SEARCHER.searcher.maxDoc":0,
   [junit4]   2>           "SEARCHER.searcher.deletedDocs":0,
   [junit4]   2>           "INDEX.sizeInBytes":10240,
   [junit4]   2>           "rate":250.0,
   [junit4]   2>           "state":"active",
   [junit4]   2>           "QUERY./select.requestTimes:1minRate":250,
   [junit4]   2>           "INDEX.sizeInGB":9.5367431640625E-6,
   [junit4]   2>           "SEARCHER.searcher.numDocs":0}}],
   [junit4]   2>     "coldNodes":{},
   [junit4]   2>     "coldShards":{},
   [junit4]   2>     "coldReplicas":[],
   [junit4]   2>     "violationType":["hotShards"],
   [junit4]   2>     "coldCollections":{},
   [junit4]   2>     "hotShards":{"collection1":{"shard1":250.0}},
   [junit4]   2>     "hotCollections":{"collection1":500.0},
   [junit4]   2>     "hotNodes":{
   [junit4]   2>       "127.0.0.1:10002_solr":250.0,
   [junit4]   2>       "127.0.0.1:10000_solr":250.0},
   [junit4]   2>     "requestedOps":[
   [junit4]   2>       {
   [junit4]   2>         "action":"ADDREPLICA",
   [junit4]   2>         "hints":{"COLL_SHARD":[{
   [junit4]   2>               "first":"collection1",
   [junit4]   2>               "second":"shard1"}]}},
   [junit4]   2>       {
   [junit4]   2>         "action":"ADDREPLICA",
   [junit4]   2>         "hints":{"COLL_SHARD":[{
   [junit4]   2>               "first":"collection1",
   [junit4]   2>               "second":"shard1"}]}},
   [junit4]   2>       {
   [junit4]   2>         "action":"ADDREPLICA",
   [junit4]   2>         "hints":{"COLL_SHARD":[{
   [junit4]   2>               "first":"collection1",
   [junit4]   2>               "second":"shard1"}]}}]}}
   [junit4]   2> 625380 DEBUG (ScheduledTrigger-3138-thread-3) [    ] o.a.s.c.a.ScheduledTriggers Pausing all triggers: [.auto_add_replicas, search_rate_trigger]
   [junit4]   2> 625383 DEBUG (AutoscalingActionExecutor-3139-thread-1) [    ] o.a.s.c.a.ScheduledTriggers -- processing actions for {
   [junit4]   2>   "id":"f788203d906e5T2tnzw37217yq7ldr0qfhnobwx",
   [junit4]   2>   "source":"search_rate_trigger",
   [junit4]   2>   "eventTime":4354624456296165,
   [junit4]   2>   "eventType":"SEARCHRATE",
   [junit4]   2>   "properties":{
   [junit4]   2>     "hotReplicas":[
   [junit4]   2>       {"core_node2":{
   [junit4]   2>           "core":"collection1_shard1_replica_n2",
   [junit4]   2>           "shard":"shard1",
   [junit4]   2>           "collection":"collection1",
   [junit4]   2>           "node_name":"127.0.0.1:10000_solr",
   [junit4]   2>           "type":"NRT",
   [junit4]   2>           "SEARCHER.searcher.maxDoc":0,
   [junit4]   2>           "SEARCHER.searcher.deletedDocs":0,
   [junit4]   2>           "INDEX.sizeInBytes":10240,
   [junit4]   2>           "rate":250.0,
   [junit4]   2>           "state":"active",
   [junit4]   2>           "QUERY./select.requestTimes:1minRate":250,
   [junit4]   2>           "INDEX.sizeInGB":9.5367431640625E-6,
   [junit4]   2>           "SEARCHER.searcher.numDocs":0}},
   [junit4]   2>       {"core_node1":{
   [junit4]   2>           "core":"collection1_shard1_replica_n1",
   [junit4]   2>           "shard":"shard1",
   [junit4]   2>           "collection":"collection1",
   [junit4]   2>           "node_name":"127.0.0.1:10002_solr",
   [junit4]   2>           "type":"NRT",
   [junit4]   2>           "leader":"true",
   [junit4]   2>           "SEARCHER.searcher.maxDoc":0,
   [junit4]   2>           "SEARCHER.searcher.deletedDocs":0,
   [junit4]   2>           "INDEX.sizeInBytes":10240,
   [junit4]   2>           "rate":250.0,
   [junit4]   2>           "state":"active",
   [junit4]   2>           "QUERY./select.requestTimes:1minRate":250,
   [junit4]   2>           "INDEX.sizeInGB":9.5367431640625E-6,
   [junit4]   2>           "SEARCHER.searcher.numDocs":0}}],
   [junit4]   2>     "coldNodes":{},
   [junit4]   2>     "coldShards":{},
   [junit4]   2>     "coldReplicas":[],
   [junit4]   2>     "violationType":["hotShards"],
   [junit4]   2>     "coldCollections":{},
   [junit4]   2>     "hotShards":{"collection1":{"shard1":250.0}},
   [junit4]   2>     "hotCollections":{"collection1":500.0},
   [junit4]   2>     "hotNodes":{
   [junit4]   2>       "127.0.0.1:10002_solr":250.0,
   [junit4]   2>       "127.0.0.1:10000_solr":250.0},
   [junit4]   2>     "_enqueue_time_":4354628155443065,
   [junit4]   2>     "requestedOps":[
   [junit4]   2>       {
   [junit4]   2>         "action":"ADDREPLICA",
   [junit4]   2>         "hints":{"COLL_SHARD":[{
   [junit4]   2>               "first":"collection1",
   [junit4]   2>               "second":"shard1"}]}},
   [junit4]   2>       {
   [junit4]   2>         "action":"ADDREPLICA",
   [junit4]   2>         "hints":{"COLL_SHARD":[{
   [junit4]   2>               "first":"collection1",
   [junit4]   2>               "second":"shard1"}]}},
   [junit4]   2>       {
   [junit4]   2>         "action":"ADDREPLICA",
   [junit4]   2>         "hints":{"COLL_SHARD":[{
   [junit4]   2>               "first":"collection1",
   [junit4]   2>               "second":"shard1"}]}}]}}
   [junit4]   2> 625383 DEBUG (AutoscalingActionExecutor-3139-thread-1) [    ] o.a.s.c.a.ComputePlanAction -- processing event: {
   [junit4]   2>   "id":"f788203d906e5T2tnzw37217yq7ldr0qfhnobwx",
   [junit4]   2>   "source":"search_rate_trigger",
   [junit4]   2>   "eventTime":4354624456296165,
   [junit4]   2>   "eventType":"SEARCHRATE",
   [junit4]   2>   "properties":{
   [junit4]   2>     "hotReplicas":[
   [junit4]   2>       {"core_node2":{
   [junit4]   2>           "core":"collection1_shard1_replica_n2",
   [junit4]   2>           "shard":"shard1",
   [junit4]   2>           "collection":"collection1",
   [junit4]   2>           "node_name":"127.0.0.1:10000_solr",
   [junit4]   2>           "type":"NRT",
   [junit4]   2>           "SEARCHER.searcher.maxDoc":0,
   [junit4]   2>           "SEARCHER.searcher.deletedDocs":0,
   [junit4]   2>           "INDEX.sizeInBytes":10240,
   [junit4]   2>           "rate":250.0,
   [junit4]   2>           "state":"active",
   [junit4]   2>           "QUERY./select.requestTimes:1minRate":250,
   [junit4]   2>           "INDEX.sizeInGB":9.5367431640625E-6,
   [junit4]   2>           "SEARCHER.searcher.numDocs":0}},
   [junit4]   2>       {"core_node1":{
   [junit4]   2>           "core":"collection1_shard1_replica_n1",
   [junit4]   2>           "shard":"shard1",
   [junit4]   2>           "collection":"collection1",
   [junit4]   2>           "node_name":"127.0.0.1:10002_solr",
   [junit4]   2>           "type":"NRT",
   [junit4]   2>           "leader":"true",
   [junit4]   2>           "SEARCHER.searcher.maxDoc":0,
   [junit4]   2>           "SEARCHER.searcher.deletedDocs":0,
   [junit4]   2>           "INDEX.sizeInBytes":10240,
   [junit4]   2>           "rate":250.0,
   [junit4]   2>           "state":"active",
   [junit4]   2>           "QUERY./select.requestTimes:1minRate":250,
   [junit4]   2>           "INDEX.sizeInGB":9.5367431640625E-6,
   [junit4]   2>           "SEARCHER.searcher.numDocs":0}}],
   [junit4]   2>     "coldNodes":{},
   [junit4]   2>     "coldShards":{},
   [junit4]   2>     "coldReplicas":[],
   [junit4]   2>     "violationType":["hotShards"],
   [junit4]   2>     "coldCollections":{},
   [junit4]   2>     "hotShards":{"collection1":{"shard1":250.0}},
   [junit4]   2>     "hotCollections":{"collection1":500.0},
   [junit4]   2>     "hotNodes":{
   [junit4]   2>       "127.0.0.1:10002_solr":250.0,
   [junit4]   2>       "127.0.0.1:10000_solr":250.0},
   [junit4]   2>     "_enqueue_time_":4354628155443065,
   [junit4]   2>     "requestedOps":[
   [junit4]   2>       {
   [junit4]   2>         "action":"ADDREPLICA",
   [junit4]   2>         "hints":{"COLL_SHARD":[{
   [junit4]   2>               "first":"collection1",
   [junit4]   2>               "second":"shard1"}]}},
   [junit4]   2>       {
   [junit4]   2>         "action":"ADDREPLICA",
   [junit4]   2>         "hints":{"COLL_SHARD":[{
   [junit4]   2>               "first":"collection1",
   [junit4]   2>               "second":"shard1"}]}},
   [junit4]   2>       {
   [junit4]   2>         "action":"ADDREPLICA",
   [junit4]   2>         "hints":{"COLL_SHARD":[{
   [junit4]   2>               "first":"collection1",
   [junit4]   2>               "second":"shard1"}]}}]}} with context properties: {AFTER_ACTION=[start], BEFORE_ACTION=[start, compute]}
   [junit4]   2> 625384 INFO  (AutoscalingActionExecutor-3139-thread-1) [    ] o.a.s.c.a.ComputePlanAction Computed Plan: action=ADDREPLICA&collection=collection1&shard=shard1&node=127.0.0.1:10000_solr&type=NRT
   [junit4]   2> 625385 INFO  (AutoscalingActionExecutor-3139-thread-1) [    ] o.a.s.c.a.ComputePlanAction Computed Plan: action=ADDREPLICA&collection=collection1&shard=shard1&node=127.0.0.1:10000_solr&type=NRT
   [junit4]   2> 625386 INFO  (AutoscalingActionExecutor-3139-thread-1) [    ] o.a.s.c.a.ComputePlanAction Computed Plan: action=ADDREPLICA&collection=collection1&shard=shard1&node=127.0.0.1:10002_solr&type=NRT
   [junit4]   2> 625386 INFO  (AutoscalingActionExecutor-3139-thread-1) [    ] o.a.s.c.s.c.a.PolicyHelper returnSession, curr-time 4354628459 sessionWrapper.createTime 4354628338629665, this.sessionWrapper.createTime 4354628338629665 
   [junit4]   2> 625387 DEBUG (AutoscalingActionExecutor-3139-thread-1) [    ] o.a.s.c.a.ExecutePlanAction -- processing event: {
   [junit4]   2>   "id":"f788203d906e5T2tnzw37217yq7ldr0qfhnobwx",
   [junit4]   2>   "source":"search_rate_trigger",
   [junit4]   2>   "eventTime":4354624456296165,
   [junit4]   2>   "eventType":"SEARCHRATE",
   [junit4]   2>   "properties":{
   [junit4]   2>     "hotReplicas":[
   [junit4]   2>       {"core_node2":{
   [junit4]   2>           "core":"collection1_shard1_replica_n2",
   [junit4]   2>           "shard":"shard1",
   [junit4]   2>           "collection":"collection1",
   [junit4]   2>           "node_name":"127.0.0.1:10000_solr",
   [junit4]   2>           "type":"NRT",
   [junit4]   2>           "SEARCHER.searcher.maxDoc":0,
   [junit4]   2>           "SEARCHER.searcher.deletedDocs":0,
   [junit4]   2>           "INDEX.sizeInBytes":10240,
   [junit4]   2>           "rate":250.0,
   [junit4]   2>           "state":"active",
   [junit4]   2>           "QUERY./select.requestTimes:1minRate":250,
   [junit4]   2>           "INDEX.sizeInGB":9.5367431640625E-6,
   [junit4]   2>           "SEARCHER.searcher.numDocs":0}},
   [junit4]   2>       {"core_node1":{
   [junit4]   2>           "core":"collection1_shard1_replica_n1",
   [junit4]   2>           "shard":"shard1",
   [junit4]   2>           "collection":"collection1",
   [junit4]   2>           "node_name":"127.0.0.1:10002_solr",
   [junit4]   2>           "type":"NRT",
   [junit4]   2>           "leader":"true",
   [junit4]   2>           "SEARCHER.searcher.maxDoc":0,
   [junit4]   2>           "SEARCHER.searcher.deletedDocs":0,
   [junit4]   2>           "INDEX.sizeInBytes":10240,
   [junit4]   2>           "rate":250.0,
   [junit4]   2>           "state":"active",
   [junit4]   2>           "QUERY./select.requestTimes:1minRate":250,
   [junit4]   2>           "INDEX.sizeInGB":9.5367431640625E-6,
   [junit4]   2>           "SEARCHER.searcher.numDocs":0}}],
   [junit4]   2>     "__start__":3,
   [junit4]   2>     "coldNodes":{},
   [junit4]   2>     "coldShards":{},
   [junit4]   2>     "coldReplicas":[],
   [junit4]   2>     "violationType":["hotShards"],
   [junit4]   2>     "coldCollections":{},
   [junit4]   2>     "hotShards":{"collection1":{"shard1":250.0}},
   [junit4]   2>     "hotCollections":{"collection1":500.0},
   [junit4]   2>     "hotNodes":{
   [junit4]   2>       "127.0.0.1:10002_solr":250.0,
   [junit4]   2>       "127.0.0.1:10000_solr":250.0},
   [junit4]   2>     "_enqueue_time_":4354628155443065,
   [junit4]   2>     "requestedOps":[
   [junit4]   2>       {
   [junit4]   2>         "action":"ADDREPLICA",
   [junit4]   2>         "hints":{"COLL_SHARD":[{
   [junit4]   2>               "first":"collection1",
   [junit4]   2>               "second":"shard1"}]}},
   [junit4]   2>       {
   [junit4]   2>         "action":"ADDREPLICA",
   [junit4]   2>         "hints":{"COLL_SHARD":[{
   [junit4]   2>               "first":"collection1",
   [junit4]   2>               "second":"shard1"}]}},
   [junit4]   2>       {
   [junit4]   2>         "action":"ADDREPLICA",
   [junit4]   2>         "hints":{"COLL_SHARD":[{
   [junit4]   2>               "first":"collection1",
   [junit4]   2>               "second":"shard1"}]}}]}} with context properties: {operations=[org.apache.solr.client.solrj.request.CollectionAdminRequest$AddReplica@52544220, org.apache.solr.client.solrj.request.CollectionAdminRequest$AddReplica@5c214b40, org.apache.solr.client.solrj.request.CollectionAdminRequest$AddReplica@43e03549], AFTER_ACTION=[start, compute], BEFORE_ACTION=[start, compute, execute]}
   [junit4]   2> 625387 DEBUG (AutoscalingActionExecutor-3139-thread-1) [    ] o.a.s.c.a.ExecutePlanAction Executing operation: action=ADDREPLICA&collection=collection1&shard=shard1&node=127.0.0.1:10000_solr&type=NRT
   [junit4]   2> 625389 INFO  (simCloudManagerPool-3137-thread-11) [    ] o.a.s.c.a.c.AddReplicaCmd Node Identified 127.0.0.1:10000_solr for creating new replica of shard shard1
   [junit4]   2> 625403 DEBUG (simCloudManagerPool-3137-thread-11) [    ] o.a.s.c.a.s.SimClusterStateProvider -- already has leader collection1 / shard1
   [junit4]   2> 625404 DEBUG (AutoscalingActionExecutor-3139-thread-1) [    ] o.a.s.c.a.ExecutePlanAction Executing operation: action=ADDREPLICA&collection=collection1&shard=shard1&node=127.0.0.1:10000_solr&type=NRT
   [junit4]   2> 625405 INFO  (simCloudManagerPool-3137-thread-14) [    ] o.a.s.c.a.c.AddReplicaCmd Node Identified 127.0.0.1:10000_solr for creating new replica of shard shard1
   [junit4]   2> 625417 DEBUG (simCloudManagerPool-3137-thread-14) [    ] o.a.s.c.a.s.SimClusterStateProvider -- already has leader collection1 / shard1
   [junit4]   2> 625418 DEBUG (AutoscalingActionExecutor-3139-thread-1) [    ] o.a.s.c.a.ExecutePlanAction Executing operation: action=ADDREPLICA&collection=collection1&shard=shard1&node=127.0.0.1:10002_solr&type=NRT
   [junit4]   2> 625419 INFO  (simCloudManagerPool-3137-thread-17) [    ] o.a.s.c.a.c.AddReplicaCmd Node Identified 127.0.0.1:10002_solr for creating new replica of shard shard1
   [junit4]   2> 625430 DEBUG (simCloudManagerPool-3137-thread-17) [    ] o.a.s.c.a.s.SimClusterStateProvider -- already has leader collection1 / shard1
   [junit4]   2> 625435 DEBUG (AutoscalingActionExecutor-3139-thread-1) [    ] o.a.s.c.a.ScheduledTriggers Resuming trigger: .auto_add_replicas after 100ms
   [junit4]   2> 625435 DEBUG (AutoscalingActionExecutor-3139-thread-1) [    ] o.a.s.c.a.ScheduledTriggers Resuming trigger: search_rate_trigger after 100ms
   [junit4]   2> 625435 DEBUG (AutoscalingActionExecutor-3139-thread-1) [    ] o.a.s.c.a.ScheduledTriggers -- processing took 2617 ms for event id=f788203d906e5T2tnzw37217yq7ldr0qfhnobwx
   [junit4]   2> 625535 INFO  (TEST-TestSimTriggerIntegration.testSearchRate-seed#[9B06C56F9E286412]) [    ] o.a.s.SolrTestCaseJ4 ###Ending testSearchRate
   [junit4]   2> 625536 INFO  (TEST-TestSimTriggerIntegration.testSearchRate-seed#[9B06C56F9E286412]) [    ] o.a.s.c.a.s.SimSolrCloudTestCase #######################################
   [junit4]   2> ############ CLUSTER STATE ############
   [junit4]   2> #######################################
   [junit4]   2> ## Live nodes:		2
   [junit4]   2> ## Empty nodes:	0
   [junit4]   2> ## Dead nodes:		0
   [junit4]   2> ## Collections:	[collection1, .system]
   [junit4]   2> ## Max replicas per node:	3
   [junit4]   2> ## Min replicas per node:	3
   [junit4]   2> ## Total replicas:		6
   [junit4]   2> ## * .system		1
   [junit4]   2> ##		- active           1
   [junit4]   2> ## * collection1		5
   [junit4]   2> ##		- active           5
   [junit4]   2> ######### Solr op counts ##########
   [junit4]   2> ##		- ADDREPLICA         3
   [junit4]   2> ##		- CREATE             1
   [junit4]   2> ##		- DELETESTATUS       3
   [junit4]   2> ##		- REQUESTSTATUS      3
   [junit4]   2> ##		- autoscaling        3
   [junit4]   2> ##		- update             2
   [junit4]   2> ######### Autoscaling event counts ###########
   [junit4]   2> ## * Trigger: search_rate_trigger
   [junit4]   2> ##		- STARTED         1
   [junit4]   2> ##		- SUCCEEDED       1
   [junit4]   2> 
   [junit4]   2> 625540 DEBUG (ScheduledTrigger-3138-thread-2) [    ] o.a.s.c.a.NodeLostTrigger Running NodeLostTrigger: .auto_add_replicas with currently live nodes: 2
   [junit4]   2> 625543 DEBUG (ScheduledTrigger-3138-thread-4) [    ] o.a.s.c.a.SearchRateTrigger ### rates for node 127.0.0.1:10000_solr
   [junit4]   2> 625543 DEBUG (ScheduledTrigger-3138-thread-4) [    ] o.a.s.c.a.SearchRateTrigger ###  metrics:solr.core.collection1.shard1.replica_n2:QUERY./select.requestTimes:1minRate	250
   [junit4]   2> 625545 DEBUG (ScheduledTrigger-3138-thread-4) [    ] o.a.s.c.a.SearchRateTrigger ### rates for node 127.0.0.1:10002_solr
   [junit4]   2> 625545 DEBUG (ScheduledTrigger-3138-thread-4) [    ] o.a.s.c.a.SearchRateTrigger ###  metrics:solr.core.collection1.shard1.replica_n1:QUERY./select.requestTimes:1minRate	250
   [junit4]   2> 625546 DEBUG (ScheduledTrigger-3138-thread-4) [    ] o.a.s.c.a.SearchRateTrigger ## Collection: collection1
   [junit4]   2> 625546 DEBUG (ScheduledTrigger-3138-thread-4) [    ] o.a.s.c.a.SearchRateTrigger ##  - shard1
   [junit4]   2> 625546 DEBUG (ScheduledTrigger-3138-thread-4) [    ] o.a.s.c.a.SearchRateTrigger ##     collection1_shard1_replica_n2  250.0
   [junit4]   2> 625546 INFO  (TEST-TestSimTriggerIntegration.testEventFromRestoredState-seed#[9B06C56F9E286412]) [    ] o.a.s.SolrTestCaseJ4 ###Starting testEventFromRestoredState
   [junit4]   2> 625546 DEBUG (ScheduledTrigger-3138-thread-4) [    ] o.a.s.c.a.SearchRateTrigger ##     collection1_shard1_replica_n1  250.0
   [junit4]   2> 625546 DEBUG (TEST-TestSimTriggerIntegration.testEventFromRestoredState-seed#[9B06C56F9E286412]) [    ] o.a.s.c.a.OverseerTriggerThread Refreshing /autoscaling.json with znode version 10
   [junit4]   2> 625546 DEBUG (ScheduledTrigger-3138-thread-4) [    ] o.a.s.c.a.SearchRateTrigger -- collection1.shard1: totalShardRate=500.0, shardRate=100.0
   [junit4]   2> 625546 INFO  (TEST-TestSimTriggerIntegration.testEventFromRestoredState-seed#[9B06C56F9E286412]) [    ] o.a.s.c.a.s.SimCloudManager === Restarting OverseerTriggerThread and clearing object cache...
   [junit4]   2> 625546 WARN  (Simulated OverseerAutoScalingTriggerThread) [    ] o.a.s.c.a.OverseerTriggerThread OverseerTriggerThread woken up but we are closed, exiting.
   [junit4]   2> 625546 DEBUG (TEST-TestSimTriggerIntegration.testEventFromRestoredState-seed#[9B06C56F9E286412]) [    ] o.a.s.c.a.ScheduledTriggers Shutting down scheduled thread pool executor now
   [junit4]   2> 625546 DEBUG (TEST-TestSimTriggerIntegration.testEventFromRestoredState-seed#[9B06C56F9E286412]) [    ] o.a.s.c.a.ScheduledTriggers Shutting down action executor now
   [junit4]   2> 625546 DEBUG (TEST-TestSimTriggerIntegration.testEventFromRestoredState-seed#[9B06C56F9E286412]) [    ] o.a.s.c.a.ScheduledTriggers Awaiting termination for action executor
   [junit4]   2> 625547 DEBUG (TEST-TestSimTriggerIntegration.testEventFromRestoredState-seed#[9B06C56F9E286412]) [    ] o.a.s.c.a.ScheduledTriggers Awaiting termination for scheduled thread pool executor
   [junit4]   2> 625547 WARN  (ScheduledTrigger-3138-thread-4) [    ] o.a.s.c.a.SystemLogListener Exception sending event to collection .system
   [junit4]   2> java.io.IOException: java.lang.InterruptedException
   [junit4]   2> 	at org.apache.solr.cloud.autoscaling.sim.SimCloudManager.request(SimCloudManager.java:632) ~[test/:?]
   [junit4]   2> 	at org.apache.solr.cloud.autoscaling.SystemLogListener.onEvent(SystemLogListener.java:118) [java/:?]
   [junit4]   2> 	at org.apache.solr.cloud.autoscaling.ScheduledTriggers$TriggerListeners.fireListeners(ScheduledTriggers.java:793) [java/:?]
   [junit4]   2> 	at org.apache.solr.cloud.autoscaling.ScheduledTriggers$TriggerListeners.fireListeners(ScheduledTriggers.java:764) [java/:?]
   [junit4]   2> 	at org.apache.solr.cloud.autoscaling.ScheduledTriggers.lambda$add$4(ScheduledTriggers.java:251) [java/:?]
   [junit4]   2> 	at org.apache.solr.cloud.autoscaling.SearchRateTrigger.run(SearchRateTrigger.java:578) [java/:?]
   [junit4]   2> 	at org.apache.solr.cloud.autoscaling.ScheduledTriggers$TriggerWrapper.run(ScheduledTriggers.java:592) [java/:?]
   [junit4]   2> 	at java.util.concurrent.Executors$RunnableAdapter.call(Executors.java:514) [?:?]
   [junit4]   2> 	at java.util.concurrent.FutureTask.runAndReset(FutureTask.java:305) [?:?]
   [junit4]   2> 	at java.util.concurrent.ScheduledThreadPoolExecutor$ScheduledFutureTask.run(ScheduledThreadPoolExecutor.java:300) [?:?]
   [junit4]   2> 	at java.util.concurrent.ThreadPoolExecutor.runWorker(ThreadPoolExecutor.java:1167) [?:?]
   [junit4]   2> 	at java.util.concurrent.ThreadPoolExecutor$Worker.run(ThreadPoolExecutor.java:641) [?:?]
   [junit4]   2> 	at java.lang.Thread.run(Thread.java:844) [?:?]
   [junit4]   2> Caused by: java.lang.InterruptedException
   [junit4]   2> 	at java.util.concurrent.FutureTask.awaitDone(FutureTask.java:418) ~[?:?]
   [junit4]   2> 	at java.util.concurrent.FutureTask.get(FutureTask.java:190) ~[?:?]
   [junit4]   2> 	at org.apache.solr.cloud.autoscaling.sim.SimCloudManager.request(SimCloudManager.java:630) ~[test/:?]
   [junit4]   2> 	... 12 more
   [junit4]   2> 625548 WARN  (ScheduledTrigger-3138-thread-4) [    ] o.a.s.c.a.ScheduledTriggers Ignoring autoscaling event {
   [junit4]   2>   "id":"f7882c78bcbdbT2tnzw37217yq7ldr0qfhnobx0",
   [junit4]   2>   "source":"search_rate_trigger",
   [junit4]   2>   "eventTime":4354627739569115,
   [junit4]   2>   "eventType":"SEARCHRATE",
   [junit4]   2>   "properties":{
   [junit4]   2>     "hotReplicas":[
   [junit4]   2>       {"core_node2":{
   [junit4]   2>           "core":"collection1_shard1_replica_n2",
   [junit4]   2>           "shard":"shard1",
   [junit4]   2>           "collection":"collection1",
   [junit4]   2>           "node_name":"127.0.0.1:10000_solr",
   [junit4]   2>           "type":"NRT",
   [junit4]   2>           "SEARCHER.searcher.maxDoc":0,
   [junit4]   2>           "SEARCHER.searcher.deletedDocs":0,
   [junit4]   2>           "INDEX.sizeInBytes":10240,
   [junit4]   2>           "rate":250.0,
   [junit4]   2>           "state":"active",
   [junit4]   2>           "QUERY./select.requestTimes:1minRate":250,
   [junit4]   2>           "INDEX.sizeInGB":9.5367431640625E-6,
   [junit4]   2>           "SEARCHER.searcher.numDocs":0}},
   [junit4]   2>       {"core_node1":{
   [junit4]   2>           "core":"collection1_shard1_replica_n1",
   [junit4]   2>           "shard":"shard1",
   [junit4]   2>           "collection":"collection1",
   [junit4]   2>           "node_name":"127.0.0.1:10002_solr",
   [junit4]   2>           "type":"NRT",
   [junit4]   2>           "leader":"true",
   [junit4]   2>           "SEARCHER.searcher.maxDoc":0,
   [junit4]   2>           "SEARCHER.searcher.deletedDocs":0,
   [junit4]   2>           "INDEX.sizeInBytes":10240,
   [junit4]   2>           "rate":250.0,
   [junit4]   2>           "state":"active",
   [junit4]   2>           "QUERY./select.requestTimes:1minRate":250,
   [junit4]   2>           "INDEX.sizeInGB":9.5367431640625E-6,
   [junit4]   2>           "SEARCHER.searcher.numDocs":0}}],
   [junit4]   2>     "coldNodes":{},
   [junit4]   2>     "coldShards":{},
   [junit4]   2>     "coldReplicas":[],
   [junit4]   2>     "violationType":["hotShards"],
   [junit4]   2>     "coldCollections":{},
   [junit4]   2>     "hotShards":{"collection1":{"shard1":100.0}},
   [junit4]   2>     "hotCollections":{"collection1":500.0},
   [junit4]   2>     "hotNodes":{
   [junit4]   2>       "127.0.0.1:10002_solr":250.0,
   [junit4]   2>       "127.0.0.1:10000_solr":250.0},
   [junit4]   2>     "requestedOps":[
   [junit4]   2>       {
   [junit4]   2>         "action":"ADDREPLICA",
   [junit4]   2>         "hints":{"COLL_SHARD":[{
   [junit4]   2>               "first":"collection1",
   [junit4]   2>               "second":"shard1"}]}},
   [junit4]   2>       {
   [junit4]   2>         "action":"ADDREPLICA",
   [junit4]   2>         "hints":{"COLL_SHARD":[{
   [junit4]   2>               "first":"collection1",
   [junit4]   2>               "second":"shard1"}]}},
   [junit4]   2>       {
   [junit4]   2>         "action":"ADDREPLICA",
   [junit4]   2>         "hints":{"COLL_SHARD":[{
   [junit4]   2>               "first":"collection1",
   [junit4]   2>               "second":"shard1"}]}}]}} because the source trigger: org.apache.solr.cloud.autoscaling.SearchRateTrigger@3aed726e has already been closed
   [junit4]   2> 625548 DEBUG (TEST-TestSimTriggerIntegration.testEventFromRestoredState-seed#[9B06C56F9E286412]) [    ] o.a.s.c.a.ScheduledTriggers ScheduledTriggers closed completely
   [junit4]   2> 625548 DEBUG (TEST-TestSimTriggerIntegration.testEventFromRestoredState-seed#[9B06C56F9E286412]) [    ] o.a.s.c.a.OverseerTriggerThread OverseerTriggerThread has been closed explicitly
   [junit4]   2> 625549 DEBUG (Simulated OverseerAutoScalingTriggerThread) [    ] o.a.s.c.a.OverseerTriggerThread Adding .auto_add_replicas and .scheduled_maintenance triggers
   [junit4]   2> 625549 DEBUG (Simulated OverseerAutoScalingTriggerThread) [    ] o.a.s.c.a.OverseerTriggerThread Refreshing /autoscaling.json with znode version 11
   [junit4]   2> 625550 DEBUG (Simulated OverseerAutoScalingTriggerThread) [    ] o.a.s.c.a.OverseerTriggerThread Current znodeVersion 11, lastZnodeVersion -1
   [junit4]   2> 625550 DEBUG (Simulated OverseerAutoScalingTriggerThread) [    ] o.a.s.c.a.OverseerTriggerThread Processed trigger updates upto znodeVersion 11
   [junit4]   2> 625550 DEBUG (Simulated OverseerAutoScalingTriggerThread) [    ] o.a.s.c.a.NodeLostTrigger NodeLostTrigger .auto_add_replicas - Initial livenodes: [127.0.0.1:10000_solr, 127.0.0.1:10002_solr]
   [junit4]   2> 625551 DEBUG (Simulated OverseerAutoScalingTriggerThread) [    ] o.a.s.c.a.OverseerTriggerThread -- clean old nodeAdded markers
   [junit4]   2> 625551 DEBUG (Simulated OverseerAutoScalingTriggerThread) [    ] o.a.s.c.a.OverseerTriggerThread Current znodeVersion 11, lastZnodeVersion 11
   [junit4]   2> 625551 DEBUG (ScheduledTrigger-3141-thread-2) [    ] o.a.s.c.a.NodeLostTrigger Running NodeLostTrigger: .auto_add_replicas with currently live nodes: 2
   [junit4]   2> 625577 DEBUG (ScheduledTrigger-3141-thread-3) [    ] o.a.s.c.a.NodeLostTrigger Running NodeLostTrigger: .auto_add_replicas with currently live nodes: 2
   [junit4]   2> 625598 DEBUG (ScheduledTrigger-3141-thread-4) [    ] o.a.s.c.a.NodeLostTrigger Running NodeLostTrigger: .auto_add_replicas with currently live nodes: 2
   [junit4]   2> 625621 DEBUG (ScheduledTrigger-3141-thread-3) [    ] o.a.s.c.a.NodeLostTrigger Running NodeLostTrigger: .auto_add_replicas with currently live nodes: 2
   [junit4]   2> 625644 DEBUG (ScheduledTrigger-3141-thread-4) [    ] o.a.s.c.a.NodeLostTrigger Running NodeLostTrigger: .auto_add_replicas with currently live nodes: 2
   [junit4]   2> 625660 DEBUG (simCloudManagerPool-3140-thread-1) [    ] o.a.s.c.a.AutoScalingHandler Verified autoscaling configuration
   [junit4]   2> 625660 DEBUG (simCloudManagerPool-3140-thread-1) [    ] o.a.s.c.a.OverseerTriggerThread Refreshing /autoscaling.json with znode version 12
   [junit4]   2> 625661 DEBUG (Simulated OverseerAutoScalingTriggerThread) [    ] o.a.s.c.a.OverseerTriggerThread Processed trigger updates upto znodeVersion 12
   [junit4]   2> 625661 DEBUG (Simulated OverseerAutoScalingTriggerThread) [    ] o.a.s.c.a.OverseerTriggerThread -- clean old nodeAdded markers
   [junit4]   2> 625661 DEBUG (Simulated OverseerAutoScalingTriggerThread) [    ] o.a.s.c.a.OverseerTriggerThread Current znodeVersion 12, lastZnodeVersion 12
   [junit4]   2> 625672 DEBUG (ScheduledTrigger-3141-thread-1) [    ] o.a.s.c.a.NodeLostTrigger Running NodeLostTrigger: .auto_add_replicas with currently live nodes: 2
   [junit4]   2> 625694 DEBUG (simCloudManagerPool-3140-thread-2) [    ] o.a.s.c.a.s.SimClusterStateProvider -- submit leader election for .system / shard1
   [junit4]   2> 625694 DEBUG (simCloudManagerPool-3140-thread-3) [    ] o.a.s.c.a.s.SimClusterStateProvider Running leader election for .system / shard1
   [junit4]   2> 625695 DEBUG (simCloudManagerPool-3140-thread-3) [    ] o.a.s.c.a.s.SimClusterStateProvider -- elected new leader for .system / shard1: core_node3
   [junit4]   2> 625697 DEBUG (ScheduledTrigger-3141-thread-1) [    ] o.a.s.c.a.NodeLostTrigger Running NodeLostTrigger: .auto_add_replicas with currently live nodes: 2
   [junit4]   2> 625698 DEBUG (simCloudManagerPool-3140-thread-4) [    ] o.a.s.c.a.AutoScalingHandler Verified autoscaling configuration
   [junit4]   2> 625698 DEBUG (simCloudManagerPool-3140-thread-4) [    ] o.a.s.c.a.OverseerTriggerThread Refreshing /autoscaling.json with znode version 13
   [junit4]   2> 625699 DEBUG (Simulated OverseerAutoScalingTriggerThread) [    ] o.a.s.c.a.OverseerTriggerThread Processed trigger updates upto znodeVersion 13
   [junit4]   2> 625699 INFO  (Simulated OverseerAutoScalingTriggerThread) [    ] o.a.s.c.a.s.TestSimTriggerIntegration TestTriggerAction init
   [junit4]   2> 625699 DEBUG (Simulated OverseerAutoScalingTriggerThread) [    ] o.a.s.c.a.NodeAddedTrigger NodeAddedTrigger node_added_trigger - Initial livenodes: [127.0.0.1:10000_solr, 127.0.0.1:10002_solr]
   [junit4]   2> 625699 DEBUG (Simulated OverseerAutoScalingTriggerThread) [    ] o.a.s.c.a.NodeAddedTrigger NodeAddedTrigger node_added_trigger instantiated with properties: {event=nodeAdded, waitFor=10, actions=[{name=test, class=org.apache.solr.cloud.autoscaling.sim.TestSimTriggerIntegration$TestTriggerAction}], enabled=true}
   [junit4]   2> 625699 DEBUG (Simulated OverseerAutoScalingTriggerThread) [    ] o.a.s.c.a.OverseerTriggerThread Current znodeVersion 13, lastZnodeVersion 13
   [junit4]   2> 625699 DEBUG (ScheduledTrigger-3141-thread-4) [    ] o.a.s.c.a.NodeAddedTrigger Running NodeAddedTrigger node_added_trigger
   [junit4]   2> 625699 DEBUG (ScheduledTrigger-3141-thread-4) [    ] o.a.s.c.a.NodeAddedTrigger Found livenodes: 3
   [junit4]   2> 625699 DEBUG (ScheduledTrigger-3141-thread-4) [    ] o.a.s.c.a.NodeAddedTrigger Tracking new node: 127.0.0.1:10003_solr at time 4354644130256365
   [junit4]   2> 625723 DEBUG (ScheduledTrigger-3141-thread-3) [    ] o.a.s.c.a.NodeLostTrigger Running NodeLostTrigger: .auto_add_replicas with currently live nodes: 3
   [junit4]   2> 625724 DEBUG (ScheduledTrigger-3141-thread-1) [    ] o.a.s.c.a.NodeAddedTrigger Running NodeAddedTrigger node_added_trigger
   [junit4]   2> 625724 DEBUG (ScheduledTrigger-3141-thread-1) [    ] o.a.s.c.a.NodeAddedTrigger Found livenodes: 3
   [junit4]   2> 625754 DEBUG (ScheduledTrigger-3141-thread-4) [    ] o.a.s.c.a.NodeLostTrigger Running NodeLostTrigger: .auto_add_replicas with currently live nodes: 3
   [junit4]   2> 625754 DEBUG (ScheduledTrigger-3141-thread-2) [    ] o.a.s.c.a.NodeAddedTrigger Running NodeAddedTrigger node_added_trigger
   [junit4]   2> 625754 DEBUG (ScheduledTrigger-3141-thread-2) [    ] o.a.s.c.a.NodeAddedTrigger Found livenodes: 3
   [junit4]   2> 625779 DEBUG (ScheduledTrigger-3141-thread-4) [    ] o.a.s.c.a.NodeLostTrigger Running NodeLostTrigger: .auto_add_replicas with currently live nodes: 3
   [junit4]   2> 625779 DEBUG (ScheduledTrigger-3141-thread-1) [    ] o.a.s.c.a.NodeAddedTrigger Running NodeAddedTrigger node_added_trigger
   [junit4]   2> 625780 DEBUG (ScheduledTrigger-3141-thread-1) [    ] o.a.s.c.a.NodeAddedTrigger Found livenodes: 3
   [junit4]   2> 625801 DEBUG (ScheduledTrigger-3141-thread-4) [    ] o.a.s.c.a.NodeLostTrigger Running NodeLostTrigger: .auto_add_replicas with currently live nodes: 3
   [junit4]   2> 625801 DEBUG (ScheduledTrigger-3141-thread-3) [    ] o.a.s.c.a.NodeAddedTrigger Running NodeAddedTrigger node_added_trigger
   [junit4]   2> 625801 DEBUG (ScheduledTrigger-3141-thread-3) [    ] o.a.s.c.a.NodeAddedTrigger Found livenodes: 3
   [junit4]   2> 625821 DEBUG (ScheduledTrigger-3141-thread-4) [    ] o.a.s.c.a.NodeLostTrigger Running NodeLostTrigger: .auto_add_replicas with currently live nodes: 3
   [junit4]   2> 625821 DEBUG (ScheduledTrigger-3141-thread-2) [    ] o.a.s.c.a.NodeAddedTrigger Running NodeAddedTrigger node_added_trigger
   [junit4]   2> 625821 DEBUG (ScheduledTrigger-3141-thread-2) [    ] o.a.s.c.a.NodeAddedTrigger Found livenodes: 3
   [junit4]   2> 625848 DEBUG (ScheduledTrigger-3141-thread-4) [    ] o.a.s.c.a.NodeLostTrigger Running NodeLostTrigger: .auto_add_replicas with currently live nodes: 3
   [junit4]   2> 625848 DEBUG (ScheduledTrigger-3141-thread-3) [    ] o.a.s.c.a.NodeAddedTrigger Running NodeAddedTrigger node_added_trigger
   [junit4]   2> 625848 DEBUG (ScheduledTrigger-3141-thread-3) [    ] o.a.s.c.a.NodeAddedTrigger Found liveno

[...truncated too long message...]

ad-6) [    ] o.a.s.c.a.s.SimClusterStateProvider -- no leader in shard1:{
   [junit4]   2>   "replicas":{"core_node5":{
   [junit4]   2>       "core":".system_shard1_replica_n1",
   [junit4]   2>       "SEARCHER.searcher.maxDoc":0,
   [junit4]   2>       "SEARCHER.searcher.deletedDocs":0,
   [junit4]   2>       "INDEX.sizeInBytes":10240,
   [junit4]   2>       "node_name":"127.0.0.1:10000_solr",
   [junit4]   2>       "state":"down",
   [junit4]   2>       "type":"NRT",
   [junit4]   2>       "INDEX.sizeInGB":9.5367431640625E-6,
   [junit4]   2>       "SEARCHER.searcher.numDocs":0}},
   [junit4]   2>   "range":"80000000-7fffffff",
   [junit4]   2>   "state":"active"}
   [junit4]   2> 626624 DEBUG (AutoscalingActionExecutor-3151-thread-1) [    ] o.a.s.c.a.ScheduledTriggers -- processing actions for {
   [junit4]   2>   "id":"f7891180128afT2tnzw37217yq7ldr0qfhnobxb",
   [junit4]   2>   "source":"node_lost_trigger",
   [junit4]   2>   "eventTime":4354689218980015,
   [junit4]   2>   "eventType":"NODELOST",
   [junit4]   2>   "properties":{
   [junit4]   2>     "eventTimes":[4354689218980015],
   [junit4]   2>     "preferredOperation":"movereplica",
   [junit4]   2>     "_enqueue_time_":4354690322560315,
   [junit4]   2>     "nodeNames":["127.0.0.1:10000_solr"]}}
   [junit4]   2> 626625 DEBUG (simCloudManagerPool-3149-thread-8) [    ] o.a.s.c.a.s.SimClusterStateProvider -- no leader in shard1:{
   [junit4]   2>   "replicas":{"core_node5":{
   [junit4]   2>       "core":".system_shard1_replica_n1",
   [junit4]   2>       "SEARCHER.searcher.maxDoc":0,
   [junit4]   2>       "SEARCHER.searcher.deletedDocs":0,
   [junit4]   2>       "INDEX.sizeInBytes":10240,
   [junit4]   2>       "node_name":"127.0.0.1:10000_solr",
   [junit4]   2>       "state":"down",
   [junit4]   2>       "type":"NRT",
   [junit4]   2>       "INDEX.sizeInGB":9.5367431640625E-6,
   [junit4]   2>       "SEARCHER.searcher.numDocs":0}},
   [junit4]   2>   "range":"80000000-7fffffff",
   [junit4]   2>   "state":"active"}
   [junit4]   2> 626625 DEBUG (AutoscalingActionExecutor-3151-thread-1) [    ] o.a.s.c.a.ScheduledTriggers Resuming trigger: .auto_add_replicas after 100ms
   [junit4]   2> 626625 DEBUG (AutoscalingActionExecutor-3151-thread-1) [    ] o.a.s.c.a.ScheduledTriggers Resuming trigger: node_lost_trigger after 100ms
   [junit4]   2> 626625 DEBUG (AutoscalingActionExecutor-3151-thread-1) [    ] o.a.s.c.a.ScheduledTriggers -- processing took 64 ms for event id=f7891180128afT2tnzw37217yq7ldr0qfhnobxb
   [junit4]   2> 626626 DEBUG (simCloudManagerPool-3149-thread-7) [    ] o.a.s.c.a.AutoScalingHandler Verified autoscaling configuration
   [junit4]   2> 626626 DEBUG (simCloudManagerPool-3149-thread-7) [    ] o.a.s.c.a.OverseerTriggerThread Refreshing /autoscaling.json with znode version 23
   [junit4]   2> 626626 DEBUG (Simulated OverseerAutoScalingTriggerThread) [    ] o.a.s.c.a.OverseerTriggerThread Processed trigger updates upto znodeVersion 23
   [junit4]   2> 626626 DEBUG (Simulated OverseerAutoScalingTriggerThread) [    ] o.a.s.c.a.OverseerTriggerThread -- clean old nodeAdded markers
   [junit4]   2> 626626 DEBUG (Simulated OverseerAutoScalingTriggerThread) [    ] o.a.s.c.a.OverseerTriggerThread Current znodeVersion 23, lastZnodeVersion 23
   [junit4]   2> 626672 INFO  (TEST-TestSimTriggerIntegration.testNodeLostTrigger-seed#[9B06C56F9E286412]) [    ] o.a.s.SolrTestCaseJ4 ###Ending testNodeLostTrigger
   [junit4]   2> 626672 INFO  (TEST-TestSimTriggerIntegration.testNodeLostTrigger-seed#[9B06C56F9E286412]) [    ] o.a.s.c.a.s.SimSolrCloudTestCase #######################################
   [junit4]   2> ############ CLUSTER STATE ############
   [junit4]   2> #######################################
   [junit4]   2> ## Live nodes:		1
   [junit4]   2> ## Empty nodes:	1
   [junit4]   2> ## Dead nodes:		1
   [junit4]   2> ##		127.0.0.1:10000_solr
   [junit4]   2> ## Collections:	[.system]
   [junit4]   2> ## Max replicas per node:	0
   [junit4]   2> ## Min replicas per node:	0
   [junit4]   2> ## Total replicas:		0
   [junit4]   2> ######### Solr op counts ##########
   [junit4]   2> ##		- autoscaling        3
   [junit4]   2> ##		- update             2
   [junit4]   2> ######### Autoscaling event counts ###########
   [junit4]   2> ## * Trigger: node_lost_trigger
   [junit4]   2> ##		- STARTED         1
   [junit4]   2> ##		- SUCCEEDED       1
   [junit4]   2> 
   [junit4] IGNOR/A 0.00s J0 | TestSimTriggerIntegration.testNodeAddedTrigger
   [junit4]    > Assumption #1: 'badapple' test group is disabled (@BadApple(bugUrl="https://issues.apache.org/jira/browse/SOLR-12028"))
   [junit4] IGNOR/A 0.00s J0 | TestSimTriggerIntegration.testCooldown
   [junit4]    > Assumption #1: 'badapple' test group is disabled (@BadApple(bugUrl="https://issues.apache.org/jira/browse/SOLR-12028"))
   [junit4] IGNOR/A 0.00s J0 | TestSimTriggerIntegration.testListeners
   [junit4]    > Assumption #1: 'badapple' test group is disabled (@BadApple(bugUrl="https://issues.apache.org/jira/browse/SOLR-12028"))
   [junit4]   2> 626674 DEBUG (SUITE-TestSimTriggerIntegration-seed#[9B06C56F9E286412]-worker) [    ] o.a.s.c.a.ScheduledTriggers Shutting down scheduled thread pool executor now
   [junit4]   2> 626674 DEBUG (SUITE-TestSimTriggerIntegration-seed#[9B06C56F9E286412]-worker) [    ] o.a.s.c.a.ScheduledTriggers Shutting down action executor now
   [junit4]   2> 626674 DEBUG (SUITE-TestSimTriggerIntegration-seed#[9B06C56F9E286412]-worker) [    ] o.a.s.c.a.ScheduledTriggers Awaiting termination for action executor
   [junit4]   2> 626674 WARN  (Simulated OverseerAutoScalingTriggerThread) [    ] o.a.s.c.a.OverseerTriggerThread OverseerTriggerThread woken up but we are closed, exiting.
   [junit4]   2> 626675 DEBUG (SUITE-TestSimTriggerIntegration-seed#[9B06C56F9E286412]-worker) [    ] o.a.s.c.a.ScheduledTriggers Awaiting termination for scheduled thread pool executor
   [junit4]   2> 626675 DEBUG (SUITE-TestSimTriggerIntegration-seed#[9B06C56F9E286412]-worker) [    ] o.a.s.c.a.ScheduledTriggers ScheduledTriggers closed completely
   [junit4]   2> 626675 DEBUG (SUITE-TestSimTriggerIntegration-seed#[9B06C56F9E286412]-worker) [    ] o.a.s.c.a.OverseerTriggerThread OverseerTriggerThread has been closed explicitly
   [junit4]   2> NOTE: leaving temporary files on disk at: /Users/jenkins/workspace/Lucene-Solr-7.x-MacOSX/solr/build/solr-core/test/J0/temp/solr.cloud.autoscaling.sim.TestSimTriggerIntegration_9B06C56F9E286412-001
   [junit4]   2> NOTE: test params are: codec=Asserting(Lucene70): {}, docValues:{}, maxPointsInLeafNode=52, maxMBSortInHeap=7.655576091924036, sim=RandomSimilarity(queryNorm=true): {}, locale=bm-ML, timezone=America/Matamoros
   [junit4]   2> NOTE: Mac OS X 10.11.6 x86_64/Oracle Corporation 9 (64-bit)/cpus=3,threads=1,free=69018064,total=455081984
   [junit4]   2> NOTE: All tests run in this JVM: [SuggesterTest, TestLRUStatsCache, SynonymTokenizerTest, AnalyticsQueryTest, CreateRoutedAliasTest, HdfsBasicDistributedZk2Test, TestMacroExpander, TestStressUserVersions, TestSchemalessBufferedUpdates, TestCrossCoreJoin, TriLevelCompositeIdRoutingTest, CdcrRequestHandlerTest, SpellPossibilityIteratorTest, FileBasedSpellCheckerTest, VMParamsZkACLAndCredentialsProvidersTest, HighlighterTest, TestStressRecovery, SolrCoreMetricManagerTest, CdcrBidirectionalTest, TestComplexPhraseLeadingWildcard, TestDynamicFieldCollectionResource, TestRandomFlRTGCloud, ShardRoutingTest, ProtectedTermFilterFactoryTest, RangeFacetCloudTest, TestNumericRangeQuery32, TestBulkSchemaConcurrent, SaslZkACLProviderTest, StatsComponentTest, DistributedQueueTest, TestSolrFieldCacheBean, TestSolrConfigHandlerCloud, TestConfigsApi, TestSchemaSimilarityResource, ChaosMonkeyNothingIsSafeTest, TestTrie, TestBlendedInfixSuggestions, RestoreTriggerStateTest, TestDocSet, CacheHeaderTest, TestUtilizeNode, TestSubQueryTransformer, TestHashPartitioner, OverseerCollectionConfigSetProcessorTest, DistribDocExpirationUpdateProcessorTest, AliasIntegrationTest, HdfsWriteToMultipleCollectionsTest, SyncSliceTest, HttpPartitionTest, TestAtomicUpdateErrorCases, CollectionsAPIAsyncDistributedZkTest, TestBM25SimilarityFactory, UtilsToolTest, TestConfigOverlay, TestFieldCacheReopen, TestCustomDocTransformer, EnumFieldTest, TestRetrieveFieldsOptimizer, TestSafeXMLParsing, CustomHighlightComponentTest, TestExactSharedStatsCache, TestSolrCoreSnapshots, CloudMLTQParserTest, TestPayloadCheckQParserPlugin, SolrGangliaReporterTest, TestMergePolicyConfig, MetricsHandlerTest, SystemLogListenerTest, TestDistribDocBasedVersion, TestInfoStreamLogging, ActionThrottleTest, TestValueSourceCache, TestSimTriggerIntegration]
   [junit4] Completed [133/833 (1!)] on J0 in 3.00s, 11 tests, 1 failure, 6 skipped <<< FAILURES!

[...truncated 44707 lines...]
[repro] Jenkins log URL: https://jenkins.thetaphi.de/job/Lucene-Solr-7.x-MacOSX/842/consoleText

[repro] Revision: dfe2778b1c2fcbfd72e11cfc168652e506eba719

[repro] Ant options: "-Dargs=-XX:-UseCompressedOops -XX:+UseParallelGC"
[repro] Repro line:  ant test  -Dtestcase=TestSimTriggerIntegration -Dtests.method=testEventQueue -Dtests.seed=9B06C56F9E286412 -Dtests.slow=true -Dtests.locale=bm-ML -Dtests.timezone=America/Matamoros -Dtests.asserts=true -Dtests.file.encoding=ISO-8859-1

[repro] ant clean

[...truncated 6 lines...]
[repro] Test suites by module:
[repro]    solr/core
[repro]       TestSimTriggerIntegration
[repro] ant compile-test

[...truncated 3464 lines...]
[repro] ant test-nocompile -Dtests.dups=5 -Dtests.maxfailures=5 -Dtests.class="*.TestSimTriggerIntegration" -Dtests.showOutput=onerror "-Dargs=-XX:-UseCompressedOops -XX:+UseParallelGC" -Dtests.seed=9B06C56F9E286412 -Dtests.slow=true -Dtests.locale=bm-ML -Dtests.timezone=America/Matamoros -Dtests.asserts=true -Dtests.file.encoding=ISO-8859-1

[...truncated 123 lines...]
[repro] Failures:
[repro]   0/5 failed: org.apache.solr.cloud.autoscaling.sim.TestSimTriggerIntegration
[repro] Exiting with code 0

[...truncated 70 lines...]

Mime
View raw message