lucene-dev mailing list archives

Site index · List index
Message view « Date » · « Thread »
Top « Date » · « Thread »
From Apache Jenkins Server <jenk...@builds.apache.org>
Subject [JENKINS] Lucene-Solr-NightlyTests-7.x - Build # 331 - Unstable
Date Sat, 29 Sep 2018 08:36:25 GMT
Build: https://builds.apache.org/job/Lucene-Solr-NightlyTests-7.x/331/

1 tests failed.
FAILED:  org.apache.solr.search.mlt.SimpleMLTQParserTest.doTest

Error Message:
Exception during query

Stack Trace:
java.lang.RuntimeException: Exception during query
	at __randomizedtesting.SeedInfo.seed([A894B8BA0A775547:FD0001E67CC46FE]:0)
	at org.apache.solr.SolrTestCaseJ4.assertQ(SolrTestCaseJ4.java:917)
	at org.apache.solr.SolrTestCaseJ4.assertQ(SolrTestCaseJ4.java:877)
	at org.apache.solr.search.mlt.SimpleMLTQParserTest.doTest(SimpleMLTQParserTest.java:82)
	at sun.reflect.NativeMethodAccessorImpl.invoke0(Native Method)
	at sun.reflect.NativeMethodAccessorImpl.invoke(NativeMethodAccessorImpl.java:62)
	at sun.reflect.DelegatingMethodAccessorImpl.invoke(DelegatingMethodAccessorImpl.java:43)
	at java.lang.reflect.Method.invoke(Method.java:498)
	at com.carrotsearch.randomizedtesting.RandomizedRunner.invoke(RandomizedRunner.java:1742)
	at com.carrotsearch.randomizedtesting.RandomizedRunner$8.evaluate(RandomizedRunner.java:935)
	at com.carrotsearch.randomizedtesting.RandomizedRunner$9.evaluate(RandomizedRunner.java:971)
	at com.carrotsearch.randomizedtesting.RandomizedRunner$10.evaluate(RandomizedRunner.java:985)
	at com.carrotsearch.randomizedtesting.rules.SystemPropertiesRestoreRule$1.evaluate(SystemPropertiesRestoreRule.java:57)
	at org.apache.lucene.util.TestRuleSetupTeardownChained$1.evaluate(TestRuleSetupTeardownChained.java:49)
	at org.apache.lucene.util.AbstractBeforeAfterRule$1.evaluate(AbstractBeforeAfterRule.java:45)
	at org.apache.lucene.util.TestRuleThreadAndTestName$1.evaluate(TestRuleThreadAndTestName.java:48)
	at org.apache.lucene.util.TestRuleIgnoreAfterMaxFailures$1.evaluate(TestRuleIgnoreAfterMaxFailures.java:64)
	at org.apache.lucene.util.TestRuleMarkFailure$1.evaluate(TestRuleMarkFailure.java:47)
	at com.carrotsearch.randomizedtesting.rules.StatementAdapter.evaluate(StatementAdapter.java:36)
	at com.carrotsearch.randomizedtesting.ThreadLeakControl$StatementRunner.run(ThreadLeakControl.java:368)
	at com.carrotsearch.randomizedtesting.ThreadLeakControl.forkTimeoutingTask(ThreadLeakControl.java:817)
	at com.carrotsearch.randomizedtesting.ThreadLeakControl$3.evaluate(ThreadLeakControl.java:468)
	at com.carrotsearch.randomizedtesting.RandomizedRunner.runSingleTest(RandomizedRunner.java:944)
	at com.carrotsearch.randomizedtesting.RandomizedRunner$5.evaluate(RandomizedRunner.java:830)
	at com.carrotsearch.randomizedtesting.RandomizedRunner$6.evaluate(RandomizedRunner.java:880)
	at com.carrotsearch.randomizedtesting.RandomizedRunner$7.evaluate(RandomizedRunner.java:891)
	at com.carrotsearch.randomizedtesting.rules.StatementAdapter.evaluate(StatementAdapter.java:36)
	at com.carrotsearch.randomizedtesting.rules.SystemPropertiesRestoreRule$1.evaluate(SystemPropertiesRestoreRule.java:57)
	at org.apache.lucene.util.AbstractBeforeAfterRule$1.evaluate(AbstractBeforeAfterRule.java:45)
	at com.carrotsearch.randomizedtesting.rules.StatementAdapter.evaluate(StatementAdapter.java:36)
	at org.apache.lucene.util.TestRuleStoreClassName$1.evaluate(TestRuleStoreClassName.java:41)
	at com.carrotsearch.randomizedtesting.rules.NoShadowingOrOverridesOnMethodsRule$1.evaluate(NoShadowingOrOverridesOnMethodsRule.java:40)
	at com.carrotsearch.randomizedtesting.rules.NoShadowingOrOverridesOnMethodsRule$1.evaluate(NoShadowingOrOverridesOnMethodsRule.java:40)
	at com.carrotsearch.randomizedtesting.rules.StatementAdapter.evaluate(StatementAdapter.java:36)
	at com.carrotsearch.randomizedtesting.rules.StatementAdapter.evaluate(StatementAdapter.java:36)
	at com.carrotsearch.randomizedtesting.rules.StatementAdapter.evaluate(StatementAdapter.java:36)
	at org.apache.lucene.util.TestRuleAssertionsRequired$1.evaluate(TestRuleAssertionsRequired.java:53)
	at org.apache.lucene.util.TestRuleMarkFailure$1.evaluate(TestRuleMarkFailure.java:47)
	at org.apache.lucene.util.TestRuleIgnoreAfterMaxFailures$1.evaluate(TestRuleIgnoreAfterMaxFailures.java:64)
	at org.apache.lucene.util.TestRuleIgnoreTestSuites$1.evaluate(TestRuleIgnoreTestSuites.java:54)
	at com.carrotsearch.randomizedtesting.rules.StatementAdapter.evaluate(StatementAdapter.java:36)
	at com.carrotsearch.randomizedtesting.ThreadLeakControl$StatementRunner.run(ThreadLeakControl.java:368)
	at java.lang.Thread.run(Thread.java:748)
Caused by: java.lang.RuntimeException: REQUEST FAILED: xpath=//result/doc[1]/str[@name='id'][.='13']
	xml response was: <?xml version="1.0" encoding="UTF-8"?>
<response>
<lst name="responseHeader"><int name="status">0</int><int name="QTime">0</int></lst><result name="response" numFound="16" start="0"><doc><str name="id">16</str><arr name="range_facet_l"><long>16</long></arr><int name="id_i1">16</int><arr name="range_facet_l_dv"><long>16</long></arr><arr name="range_facet_i_dv"><int>16</int></arr><arr name="lowerfilt"><str>The slim red fox jumped over the lazy brown dogs.</str></arr><arr name="lowerfilt1and2"><str>The slim red fox jumped over the lazy brown dogs.</str></arr><arr name="multiDefault"><str>muLti-Default</str></arr><int name="intDefault">42</int><date name="timestamp">2018-09-29T07:55:28.731Z</date><long name="_version_">1612927707361837056</long><int name="intDvoDefault">42</int></doc><doc><str name="id">32</str><arr name="range_facet_l"><long>32</long></arr><int name="id_i1">32</int><arr name="range_facet_l_dv"><long>32</long></arr><arr name="range_facet_i_dv"><int>32</int></arr><arr name="lowerfilt"><str>The slim red fox jumped over the lazy brown dogs.</str></arr><arr name="lowerfilt1and2"><str>The slim red fox jumped over the lazy brown dogs.</str><str>yellow white black</str></arr><arr name="lowerfilt1"><str>yellow white black</str></arr><arr name="multiDefault"><str>muLti-Default</str></arr><int name="intDefault">42</int><date name="timestamp">2018-09-29T07:55:28.757Z</date><long name="_version_">1612927707390148608</long><int name="intDvoDefault">42</int></doc><doc><str name="id">20</str><arr name="range_facet_l"><long>20</long></arr><int name="id_i1">20</int><arr name="range_facet_l_dv"><long>20</long></arr><arr name="range_facet_i_dv"><int>20</int></arr><arr name="lowerfilt"><str>The quote red fox jumped over the lazy brown dogs.</str></arr><arr name="lowerfilt1and2"><str>The quote red fox jumped over the lazy brown dogs.</str></arr><arr name="multiDefault"><str>muLti-Default</str></arr><int name="intDefault">42</int><date name="timestamp">2018-09-29T07:55:28.741Z</date><long name="_version_">1612927707372322816</long><int name="intDvoDefault">42</int></doc><doc><str name="id">21</str><arr name="range_facet_l"><long>21</long></arr><int name="id_i1">21</int><arr name="range_facet_l_dv"><long>21</long></arr><arr name="range_facet_i_dv"><int>21</int></arr><arr name="lowerfilt"><str>The court red fox jumped over the lazy brown dogs.</str></arr><arr name="lowerfilt1and2"><str>The court red fox jumped over the lazy brown dogs.</str></arr><arr name="multiDefault"><str>muLti-Default</str></arr><int name="intDefault">42</int><date name="timestamp">2018-09-29T07:55:28.742Z</date><long name="_version_">1612927707373371392</long><int name="intDvoDefault">42</int></doc><doc><str name="id">18</str><arr name="range_facet_l"><long>18</long></arr><int name="id_i1">18</int><arr name="range_facet_l_dv"><long>18</long></arr><arr name="range_facet_i_dv"><int>18</int></arr><arr name="lowerfilt"><str>The quote red fox jumped over the lazy brown dogs.</str></arr><arr name="lowerfilt1and2"><str>The quote red fox jumped over the lazy brown dogs.</str></arr><arr name="multiDefault"><str>muLti-Default</str></arr><int name="intDefault">42</int><date name="timestamp">2018-09-29T07:55:28.736Z</date><long name="_version_">1612927707367079936</long><int name="intDvoDefault">42</int></doc><doc><str name="id">19</str><arr name="range_facet_l"><long>19</long></arr><int name="id_i1">19</int><arr name="range_facet_l_dv"><long>19</long></arr><arr name="range_facet_i_dv"><int>19</int></arr><arr name="lowerfilt"><str>The hose red fox jumped over the lazy brown dogs.</str></arr><arr name="lowerfilt1and2"><str>The hose red fox jumped over the lazy brown dogs.</str></arr><arr name="multiDefault"><str>muLti-Default</str></arr><int name="intDefault">42</int><date name="timestamp">2018-09-29T07:55:28.737Z</date><long name="_version_">1612927707368128512</long><int name="intDvoDefault">42</int></doc><doc><str name="id">14</str><arr name="range_facet_l"><long>14</long></arr><int name="id_i1">14</int><arr name="range_facet_l_dv"><long>14</long></arr><arr name="range_facet_i_dv"><int>14</int></arr><arr name="lowerfilt"><str>The quote red fox jumped over the lazy brown dogs.</str></arr><arr name="lowerfilt1and2"><str>The quote red fox jumped over the lazy brown dogs.</str></arr><arr name="multiDefault"><str>muLti-Default</str></arr><int name="intDefault">42</int><date name="timestamp">2018-09-29T07:55:28.722Z</date><long name="_version_">1612927707352399872</long><int name="intDvoDefault">42</int></doc><doc><str name="id">15</str><arr name="range_facet_l"><long>15</long></arr><int name="id_i1">15</int><arr name="range_facet_l_dv"><long>15</long></arr><arr name="range_facet_i_dv"><int>15</int></arr><arr name="lowerfilt"><str>The fat red fox jumped over the lazy brown dogs.</str></arr><arr name="lowerfilt1and2"><str>The fat red fox jumped over the lazy brown dogs.</str></arr><arr name="multiDefault"><str>muLti-Default</str></arr><int name="intDefault">42</int><date name="timestamp">2018-09-29T07:55:28.722Z</date><long name="_version_">1612927707352399873</long><int name="intDvoDefault">42</int></doc><doc><str name="id">24</str><arr name="range_facet_l"><long>24</long></arr><int name="id_i1">24</int><arr name="range_facet_l_dv"><long>24</long></arr><arr name="range_facet_i_dv"><int>24</int></arr><arr name="lowerfilt"><str>The file red fox jumped over the lazy brown dogs.</str></arr><arr name="lowerfilt1and2"><str>The file red fox jumped over the lazy brown dogs.</str></arr><arr name="multiDefault"><str>muLti-Default</str></arr><int name="intDefault">42</int><date name="timestamp">2018-09-29T07:55:28.746Z</date><long name="_version_">1612927707377565696</long><int name="intDvoDefault">42</int></doc><doc><str name="id">22</str><arr name="range_facet_l"><long>22</long></arr><int name="id_i1">22</int><arr name="range_facet_l_dv"><long>22</long></arr><arr name="range_facet_i_dv"><int>22</int></arr><arr name="lowerfilt"><str>The quote red fox jumped over the lazy brown dogs.</str></arr><arr name="lowerfilt1and2"><str>The quote red fox jumped over the lazy brown dogs.</str></arr><arr name="multiDefault"><str>muLti-Default</str></arr><int name="intDefault">42</int><date name="timestamp">2018-09-29T07:55:28.744Z</date><long name="_version_">1612927707375468544</long><int name="intDvoDefault">42</int></doc></result>
</response>

	request was:q={!mlt+qf%3Dlowerfilt}17
	at org.apache.solr.SolrTestCaseJ4.assertQ(SolrTestCaseJ4.java:910)
	... 41 more




Build Log:
[...truncated 15510 lines...]
   [junit4] Suite: org.apache.solr.search.mlt.SimpleMLTQParserTest
   [junit4]   2> Creating dataDir: /x1/jenkins/jenkins-slave/workspace/Lucene-Solr-NightlyTests-7.x/checkout/solr/build/solr-core/test/J2/temp/solr.search.mlt.SimpleMLTQParserTest_A894B8BA0A775547-001/init-core-data-001
   [junit4]   2> 4627530 INFO  (SUITE-SimpleMLTQParserTest-seed#[A894B8BA0A775547]-worker) [    ] o.a.s.c.SolrResourceLoader [null] Added 2 libs to classloader, from paths: [/x1/jenkins/jenkins-slave/workspace/Lucene-Solr-NightlyTests-7.x/checkout/solr/core/src/test-files/solr/collection1/lib, /x1/jenkins/jenkins-slave/workspace/Lucene-Solr-NightlyTests-7.x/checkout/solr/core/src/test-files/solr/collection1/lib/classes]
   [junit4]   2> 4627560 INFO  (SUITE-SimpleMLTQParserTest-seed#[A894B8BA0A775547]-worker) [    ] o.a.s.c.SolrConfig Using Lucene MatchVersion: 7.6.0
   [junit4]   2> 4627584 INFO  (SUITE-SimpleMLTQParserTest-seed#[A894B8BA0A775547]-worker) [    ] o.a.s.s.IndexSchema [null] Schema name=test
   [junit4]   2> 4627715 INFO  (SUITE-SimpleMLTQParserTest-seed#[A894B8BA0A775547]-worker) [    ] o.a.s.s.IndexSchema Loaded schema test/1.0 with uniqueid field id
   [junit4]   2> 4627833 INFO  (SUITE-SimpleMLTQParserTest-seed#[A894B8BA0A775547]-worker) [    ] o.a.s.c.TransientSolrCoreCacheDefault Allocating transient cache for 2147483647 transient cores
   [junit4]   2> 4627833 INFO  (SUITE-SimpleMLTQParserTest-seed#[A894B8BA0A775547]-worker) [    ] o.a.s.h.a.MetricsHistoryHandler No .system collection, keeping metrics history in memory.
   [junit4]   2> 4627848 INFO  (SUITE-SimpleMLTQParserTest-seed#[A894B8BA0A775547]-worker) [    ] o.a.s.m.r.SolrJmxReporter JMX monitoring for 'solr.node' (registry 'solr.node') enabled at server: com.sun.jmx.mbeanserver.JmxMBeanServer@653fdb3
   [junit4]   2> 4627856 INFO  (SUITE-SimpleMLTQParserTest-seed#[A894B8BA0A775547]-worker) [    ] o.a.s.m.r.SolrJmxReporter JMX monitoring for 'solr.jvm' (registry 'solr.jvm') enabled at server: com.sun.jmx.mbeanserver.JmxMBeanServer@653fdb3
   [junit4]   2> 4627856 INFO  (SUITE-SimpleMLTQParserTest-seed#[A894B8BA0A775547]-worker) [    ] o.a.s.m.r.SolrJmxReporter JMX monitoring for 'solr.jetty' (registry 'solr.jetty') enabled at server: com.sun.jmx.mbeanserver.JmxMBeanServer@653fdb3
   [junit4]   2> 4627858 INFO  (coreLoadExecutor-16320-thread-1) [    x:collection1] o.a.s.c.SolrResourceLoader [null] Added 2 libs to classloader, from paths: [/x1/jenkins/jenkins-slave/workspace/Lucene-Solr-NightlyTests-7.x/checkout/solr/core/src/test-files/solr/collection1/lib, /x1/jenkins/jenkins-slave/workspace/Lucene-Solr-NightlyTests-7.x/checkout/solr/core/src/test-files/solr/collection1/lib/classes]
   [junit4]   2> 4627893 INFO  (coreLoadExecutor-16320-thread-1) [    x:collection1] o.a.s.c.SolrConfig Using Lucene MatchVersion: 7.6.0
   [junit4]   2> 4627916 INFO  (coreLoadExecutor-16320-thread-1) [    x:collection1] o.a.s.s.IndexSchema [collection1] Schema name=test
   [junit4]   2> 4628041 INFO  (coreLoadExecutor-16320-thread-1) [    x:collection1] o.a.s.s.IndexSchema Loaded schema test/1.0 with uniqueid field id
   [junit4]   2> 4628048 INFO  (coreLoadExecutor-16320-thread-1) [    x:collection1] o.a.s.c.CoreContainer Creating SolrCore 'collection1' using configuration from instancedir /x1/jenkins/jenkins-slave/workspace/Lucene-Solr-NightlyTests-7.x/checkout/solr/core/src/test-files/solr/collection1, trusted=true
   [junit4]   2> 4628048 INFO  (coreLoadExecutor-16320-thread-1) [    x:collection1] o.a.s.m.r.SolrJmxReporter JMX monitoring for 'solr.core.collection1' (registry 'solr.core.collection1') enabled at server: com.sun.jmx.mbeanserver.JmxMBeanServer@653fdb3
   [junit4]   2> 4628048 INFO  (coreLoadExecutor-16320-thread-1) [    x:collection1] o.a.s.c.SolrCore [[collection1] ] Opening new SolrCore at [/x1/jenkins/jenkins-slave/workspace/Lucene-Solr-NightlyTests-7.x/checkout/solr/core/src/test-files/solr/collection1], dataDir=[/x1/jenkins/jenkins-slave/workspace/Lucene-Solr-NightlyTests-7.x/checkout/solr/build/solr-core/test/J2/temp/solr.search.mlt.SimpleMLTQParserTest_A894B8BA0A775547-001/init-core-data-001/]
   [junit4]   2> 4628049 INFO  (coreLoadExecutor-16320-thread-1) [    x:collection1] o.a.s.u.RandomMergePolicy RandomMergePolicy wrapping class org.apache.lucene.index.TieredMergePolicy: [TieredMergePolicy: maxMergeAtOnce=49, maxMergeAtOnceExplicit=27, maxMergedSegmentMB=39.494140625, floorSegmentMB=1.18359375, forceMergeDeletesPctAllowed=25.40326176928312, segmentsPerTier=34.0, maxCFSSegmentSizeMB=8.796093022207999E12, noCFSRatio=1.0, deletesPctAllowed=26.321101037926276
   [junit4]   2> 4628100 INFO  (coreLoadExecutor-16320-thread-1) [    x:collection1] o.a.s.u.UpdateHandler Using UpdateLog implementation: org.apache.solr.update.UpdateLog
   [junit4]   2> 4628100 INFO  (coreLoadExecutor-16320-thread-1) [    x:collection1] o.a.s.u.UpdateLog Initializing UpdateLog: dataDir= defaultSyncLevel=FLUSH numRecordsToKeep=100 maxNumLogsToKeep=10 numVersionBuckets=65536
   [junit4]   2> 4628101 INFO  (coreLoadExecutor-16320-thread-1) [    x:collection1] o.a.s.u.CommitTracker Hard AutoCommit: disabled
   [junit4]   2> 4628101 INFO  (coreLoadExecutor-16320-thread-1) [    x:collection1] o.a.s.u.CommitTracker Soft AutoCommit: disabled
   [junit4]   2> 4628102 INFO  (coreLoadExecutor-16320-thread-1) [    x:collection1] o.a.s.u.RandomMergePolicy RandomMergePolicy wrapping class org.apache.lucene.index.TieredMergePolicy: [TieredMergePolicy: maxMergeAtOnce=29, maxMergeAtOnceExplicit=42, maxMergedSegmentMB=89.1962890625, floorSegmentMB=1.56640625, forceMergeDeletesPctAllowed=16.52531687029669, segmentsPerTier=15.0, maxCFSSegmentSizeMB=8.796093022207999E12, noCFSRatio=0.22110304106647238, deletesPctAllowed=41.454608915622586
   [junit4]   2> 4628102 INFO  (coreLoadExecutor-16320-thread-1) [    x:collection1] o.a.s.s.SolrIndexSearcher Opening [Searcher@66fe9507[collection1] main]
   [junit4]   2> 4628103 INFO  (coreLoadExecutor-16320-thread-1) [    x:collection1] o.a.s.h.c.SpellCheckComponent Initializing spell checkers
   [junit4]   2> 4628110 INFO  (coreLoadExecutor-16320-thread-1) [    x:collection1] o.a.s.s.DirectSolrSpellChecker init: {name=direct,classname=DirectSolrSpellChecker,field=lowerfilt,minQueryLength=3}
   [junit4]   2> 4628147 INFO  (coreLoadExecutor-16320-thread-1) [    x:collection1] o.a.s.h.ReplicationHandler Commits will be reserved for 10000ms.
   [junit4]   2> 4628147 INFO  (searcherExecutor-16321-thread-1-processing-x:collection1) [    x:collection1] o.a.s.h.c.SpellCheckComponent Loading spell index for spellchecker: default
   [junit4]   2> 4628147 INFO  (coreLoadExecutor-16320-thread-1) [    x:collection1] o.a.s.u.UpdateLog Could not find max version in index or recent updates, using new clock 1612927707240202240
   [junit4]   2> 4628147 INFO  (searcherExecutor-16321-thread-1-processing-x:collection1) [    x:collection1] o.a.s.h.c.SpellCheckComponent Loading spell index for spellchecker: direct
   [junit4]   2> 4628147 INFO  (searcherExecutor-16321-thread-1-processing-x:collection1) [    x:collection1] o.a.s.h.c.SpellCheckComponent Loading spell index for spellchecker: wordbreak
   [junit4]   2> 4628147 INFO  (searcherExecutor-16321-thread-1-processing-x:collection1) [    x:collection1] o.a.s.h.c.SpellCheckComponent Loading spell index for spellchecker: multipleFields
   [junit4]   2> 4628147 INFO  (searcherExecutor-16321-thread-1-processing-x:collection1) [    x:collection1] o.a.s.h.c.SpellCheckComponent Loading spell index for spellchecker: jarowinkler
   [junit4]   2> 4628147 INFO  (searcherExecutor-16321-thread-1-processing-x:collection1) [    x:collection1] o.a.s.h.c.SpellCheckComponent Loading spell index for spellchecker: external
   [junit4]   2> 4628148 INFO  (searcherExecutor-16321-thread-1-processing-x:collection1) [    x:collection1] o.a.s.h.c.SpellCheckComponent Loading spell index for spellchecker: freq
   [junit4]   2> 4628148 INFO  (searcherExecutor-16321-thread-1-processing-x:collection1) [    x:collection1] o.a.s.h.c.SpellCheckComponent Loading spell index for spellchecker: fqcn
   [junit4]   2> 4628148 INFO  (searcherExecutor-16321-thread-1-processing-x:collection1) [    x:collection1] o.a.s.h.c.SpellCheckComponent Loading spell index for spellchecker: perDict
   [junit4]   2> 4628149 INFO  (searcherExecutor-16321-thread-1-processing-x:collection1) [    x:collection1] o.a.s.c.SolrCore [collection1] Registered new searcher Searcher@66fe9507[collection1] main{ExitableDirectoryReader(UninvertingDirectoryReader())}
   [junit4]   2> 4628181 INFO  (TEST-SimpleMLTQParserTest.doTest-seed#[A894B8BA0A775547]) [    ] o.a.s.u.p.LogUpdateProcessorFactory [collection1]  webapp=null path=null params={}{add=[1 (1612927707274805248)]} 0 1
   [junit4]   2> 4628185 INFO  (TEST-SimpleMLTQParserTest.doTest-seed#[A894B8BA0A775547]) [    ] o.a.s.u.p.LogUpdateProcessorFactory [collection1]  webapp=null path=null params={}{add=[2 (1612927707278999552)]} 0 1
   [junit4]   2> 4628186 INFO  (TEST-SimpleMLTQParserTest.doTest-seed#[A894B8BA0A775547]) [    ] o.a.s.u.p.LogUpdateProcessorFactory [collection1]  webapp=null path=null params={}{add=[3 (1612927707280048128)]} 0 1
   [junit4]   2> 4628188 INFO  (TEST-SimpleMLTQParserTest.doTest-seed#[A894B8BA0A775547]) [    ] o.a.s.u.p.LogUpdateProcessorFactory [collection1]  webapp=null path=null params={}{add=[4 (1612927707281096704)]} 0 1
   [junit4]   2> 4628189 INFO  (TEST-SimpleMLTQParserTest.doTest-seed#[A894B8BA0A775547]) [    ] o.a.s.u.p.LogUpdateProcessorFactory [collection1]  webapp=null path=null params={}{add=[5 (1612927707284242432)]} 0 0
   [junit4]   2> 4628241 INFO  (TEST-SimpleMLTQParserTest.doTest-seed#[A894B8BA0A775547]) [    ] o.a.s.u.p.LogUpdateProcessorFactory [collection1]  webapp=null path=null params={}{add=[6 (1612927707284242433)]} 0 51
   [junit4]   2> 4628242 INFO  (TEST-SimpleMLTQParserTest.doTest-seed#[A894B8BA0A775547]) [    ] o.a.s.u.p.LogUpdateProcessorFactory [collection1]  webapp=null path=null params={}{add=[7 (1612927707338768384)]} 0 0
   [junit4]   2> 4628247 INFO  (TEST-SimpleMLTQParserTest.doTest-seed#[A894B8BA0A775547]) [    ] o.a.s.u.p.LogUpdateProcessorFactory [collection1]  webapp=null path=null params={}{add=[8 (1612927707339816960)]} 0 5
   [junit4]   2> 4628248 INFO  (TEST-SimpleMLTQParserTest.doTest-seed#[A894B8BA0A775547]) [    ] o.a.s.u.p.LogUpdateProcessorFactory [collection1]  webapp=null path=null params={}{add=[9 (1612927707346108416)]} 0 0
   [junit4]   2> 4628251 INFO  (TEST-SimpleMLTQParserTest.doTest-seed#[A894B8BA0A775547]) [    ] o.a.s.u.p.LogUpdateProcessorFactory [collection1]  webapp=null path=null params={}{add=[10 (1612927707346108417)]} 0 2
   [junit4]   2> 4628251 INFO  (TEST-SimpleMLTQParserTest.doTest-seed#[A894B8BA0A775547]) [    ] o.a.s.u.p.LogUpdateProcessorFactory [collection1]  webapp=null path=null params={}{add=[12 (1612927707349254144)]} 0 0
   [junit4]   2> 4628253 INFO  (TEST-SimpleMLTQParserTest.doTest-seed#[A894B8BA0A775547]) [    ] o.a.s.u.p.LogUpdateProcessorFactory [collection1]  webapp=null path=null params={}{add=[13 (1612927707350302720)]} 0 1
   [junit4]   2> 4628254 INFO  (TEST-SimpleMLTQParserTest.doTest-seed#[A894B8BA0A775547]) [    ] o.a.s.u.p.LogUpdateProcessorFactory [collection1]  webapp=null path=null params={}{add=[14 (1612927707352399872)]} 0 0
   [junit4]   2> 4628263 INFO  (TEST-SimpleMLTQParserTest.doTest-seed#[A894B8BA0A775547]) [    ] o.a.s.u.p.LogUpdateProcessorFactory [collection1]  webapp=null path=null params={}{add=[15 (1612927707352399873)]} 0 8
   [junit4]   2> 4628263 INFO  (TEST-SimpleMLTQParserTest.doTest-seed#[A894B8BA0A775547]) [    ] o.a.s.u.p.LogUpdateProcessorFactory [collection1]  webapp=null path=null params={}{add=[16 (1612927707361837056)]} 0 0
   [junit4]   2> 4628267 INFO  (TEST-SimpleMLTQParserTest.doTest-seed#[A894B8BA0A775547]) [    ] o.a.s.u.p.LogUpdateProcessorFactory [collection1]  webapp=null path=null params={}{add=[17 (1612927707361837057)]} 0 3
   [junit4]   2> 4628268 INFO  (TEST-SimpleMLTQParserTest.doTest-seed#[A894B8BA0A775547]) [    ] o.a.s.u.p.LogUpdateProcessorFactory [collection1]  webapp=null path=null params={}{add=[18 (1612927707367079936)]} 0 0
   [junit4]   2> 4628273 INFO  (TEST-SimpleMLTQParserTest.doTest-seed#[A894B8BA0A775547]) [    ] o.a.s.u.p.LogUpdateProcessorFactory [collection1]  webapp=null path=null params={}{add=[19 (1612927707368128512)]} 0 4
   [junit4]   2> 4628273 INFO  (TEST-SimpleMLTQParserTest.doTest-seed#[A894B8BA0A775547]) [    ] o.a.s.u.p.LogUpdateProcessorFactory [collection1]  webapp=null path=null params={}{add=[20 (1612927707372322816)]} 0 0
   [junit4]   2> 4628276 INFO  (TEST-SimpleMLTQParserTest.doTest-seed#[A894B8BA0A775547]) [    ] o.a.s.u.p.LogUpdateProcessorFactory [collection1]  webapp=null path=null params={}{add=[21 (1612927707373371392)]} 0 1
   [junit4]   2> 4628276 INFO  (TEST-SimpleMLTQParserTest.doTest-seed#[A894B8BA0A775547]) [    ] o.a.s.u.p.LogUpdateProcessorFactory [collection1]  webapp=null path=null params={}{add=[22 (1612927707375468544)]} 0 0
   [junit4]   2> 4628278 INFO  (TEST-SimpleMLTQParserTest.doTest-seed#[A894B8BA0A775547]) [    ] o.a.s.u.p.LogUpdateProcessorFactory [collection1]  webapp=null path=null params={}{add=[23 (1612927707375468545)]} 0 1
   [junit4]   2> 4628278 INFO  (TEST-SimpleMLTQParserTest.doTest-seed#[A894B8BA0A775547]) [    ] o.a.s.u.p.LogUpdateProcessorFactory [collection1]  webapp=null path=null params={}{add=[24 (1612927707377565696)]} 0 0
   [junit4]   2> 4628281 INFO  (TEST-SimpleMLTQParserTest.doTest-seed#[A894B8BA0A775547]) [    ] o.a.s.u.p.LogUpdateProcessorFactory [collection1]  webapp=null path=null params={}{add=[25 (1612927707378614272)]} 0 2
   [junit4]   2> 4628281 INFO  (TEST-SimpleMLTQParserTest.doTest-seed#[A894B8BA0A775547]) [    ] o.a.s.u.p.LogUpdateProcessorFactory [collection1]  webapp=null path=null params={}{add=[26 (1612927707380711424)]} 0 0
   [junit4]   2> 4628284 INFO  (TEST-SimpleMLTQParserTest.doTest-seed#[A894B8BA0A775547]) [    ] o.a.s.u.p.LogUpdateProcessorFactory [collection1]  webapp=null path=null params={}{add=[27 (1612927707381760000)]} 0 2
   [junit4]   2> 4628284 INFO  (TEST-SimpleMLTQParserTest.doTest-seed#[A894B8BA0A775547]) [    ] o.a.s.u.p.LogUpdateProcessorFactory [collection1]  webapp=null path=null params={}{add=[28 (1612927707383857152)]} 0 0
   [junit4]   2> 4628286 INFO  (TEST-SimpleMLTQParserTest.doTest-seed#[A894B8BA0A775547]) [    ] o.a.s.u.p.LogUpdateProcessorFactory [collection1]  webapp=null path=null params={}{add=[29 (1612927707383857153)]} 0 2
   [junit4]   2> 4628287 INFO  (TEST-SimpleMLTQParserTest.doTest-seed#[A894B8BA0A775547]) [    ] o.a.s.u.p.LogUpdateProcessorFactory [collection1]  webapp=null path=null params={}{add=[30 (1612927707387002880)]} 0 0
   [junit4]   2> 4628289 INFO  (TEST-SimpleMLTQParserTest.doTest-seed#[A894B8BA0A775547]) [    ] o.a.s.u.p.LogUpdateProcessorFactory [collection1]  webapp=null path=null params={}{add=[31 (1612927707387002881)]} 0 2
   [junit4]   2> 4628290 INFO  (TEST-SimpleMLTQParserTest.doTest-seed#[A894B8BA0A775547]) [    ] o.a.s.u.p.LogUpdateProcessorFactory [collection1]  webapp=null path=null params={}{add=[32 (1612927707390148608)]} 0 0
   [junit4]   2> 4628290 INFO  (TEST-SimpleMLTQParserTest.doTest-seed#[A894B8BA0A775547]) [    ] o.a.s.u.DirectUpdateHandler2 start commit{_version_=1612927707390148609,optimize=false,openSearcher=true,waitSearcher=true,expungeDeletes=false,softCommit=false,prepareCommit=false}
   [junit4]   2> 4628290 INFO  (TEST-SimpleMLTQParserTest.doTest-seed#[A894B8BA0A775547]) [    ] o.a.s.u.SolrIndexWriter Calling setCommitData with IW:org.apache.solr.update.SolrIndexWriter@979fc2a commitCommandVersion:1612927707390148609
   [junit4]   2> 4628340 INFO  (TEST-SimpleMLTQParserTest.doTest-seed#[A894B8BA0A775547]) [    ] o.a.s.s.SolrIndexSearcher Opening [Searcher@1bb253e9[collection1] main]
   [junit4]   2> 4628342 INFO  (searcherExecutor-16321-thread-1) [    ] o.a.s.c.SolrCore [collection1] Registered new searcher Searcher@1bb253e9[collection1] main{ExitableDirectoryReader(UninvertingDirectoryReader(Uninverting(_g(7.6.0):c29) Uninverting(_e(7.6.0):C2)))}
   [junit4]   2> 4628342 INFO  (TEST-SimpleMLTQParserTest.doTest-seed#[A894B8BA0A775547]) [    ] o.a.s.u.DirectUpdateHandler2 end_commit_flush
   [junit4]   2> 4628342 INFO  (TEST-SimpleMLTQParserTest.doTest-seed#[A894B8BA0A775547]) [    ] o.a.s.u.p.LogUpdateProcessorFactory [collection1]  webapp=null path=null params={}{commit=} 0 52
   [junit4]   2> 4628343 INFO  (TEST-SimpleMLTQParserTest.doTest-seed#[A894B8BA0A775547]) [    ] o.a.s.c.S.Request [collection1]  webapp=null path=null params={q={!mlt+qf%3Dlowerfilt}17} hits=16 status=0 QTime=0
   [junit4]   2> NOTE: download the large Jenkins line-docs file by running 'ant get-jenkins-line-docs' in the lucene directory.
   [junit4]   2> NOTE: reproduce with: ant test  -Dtestcase=SimpleMLTQParserTest -Dtests.method=doTest -Dtests.seed=A894B8BA0A775547 -Dtests.multiplier=2 -Dtests.nightly=true -Dtests.slow=true -Dtests.linedocsfile=/home/jenkins/jenkins-slave/workspace/Lucene-Solr-NightlyTests-7.x/test-data/enwiki.random.lines.txt -Dtests.locale=de-AT -Dtests.timezone=Europe/Istanbul -Dtests.asserts=true -Dtests.file.encoding=ISO-8859-1
   [junit4] ERROR   0.20s J2 | SimpleMLTQParserTest.doTest <<<
   [junit4]    > Throwable #1: java.lang.RuntimeException: Exception during query
   [junit4]    > 	at __randomizedtesting.SeedInfo.seed([A894B8BA0A775547:FD0001E67CC46FE]:0)
   [junit4]    > 	at org.apache.solr.SolrTestCaseJ4.assertQ(SolrTestCaseJ4.java:917)
   [junit4]    > 	at org.apache.solr.SolrTestCaseJ4.assertQ(SolrTestCaseJ4.java:877)
   [junit4]    > 	at org.apache.solr.search.mlt.SimpleMLTQParserTest.doTest(SimpleMLTQParserTest.java:82)
   [junit4]    > 	at java.lang.Thread.run(Thread.java:748)
   [junit4]    > Caused by: java.lang.RuntimeException: REQUEST FAILED: xpath=//result/doc[1]/str[@name='id'][.='13']
   [junit4]    > 	xml response was: <?xml version="1.0" encoding="UTF-8"?>
   [junit4]    > <response>
   [junit4]    > <lst name="responseHeader"><int name="status">0</int><int name="QTime">0</int></lst><result name="response" numFound="16" start="0"><doc><str name="id">16</str><arr name="range_facet_l"><long>16</long></arr><int name="id_i1">16</int><arr name="range_facet_l_dv"><long>16</long></arr><arr name="range_facet_i_dv"><int>16</int></arr><arr name="lowerfilt"><str>The slim red fox jumped over the lazy brown dogs.</str></arr><arr name="lowerfilt1and2"><str>The slim red fox jumped over the lazy brown dogs.</str></arr><arr name="multiDefault"><str>muLti-Default</str></arr><int name="intDefault">42</int><date name="timestamp">2018-09-29T07:55:28.731Z</date><long name="_version_">1612927707361837056</long><int name="intDvoDefault">42</int></doc><doc><str name="id">32</str><arr name="range_facet_l"><long>32</long></arr><int name="id_i1">32</int><arr name="range_facet_l_dv"><long>32</long></arr><arr name="range_facet_i_dv"><int>32</int></arr><arr name="lowerfilt"><str>The slim red fox jumped over the lazy brown dogs.</str></arr><arr name="lowerfilt1and2"><str>The slim red fox jumped over the lazy brown dogs.</str><str>yellow white black</str></arr><arr name="lowerfilt1"><str>yellow white black</str></arr><arr name="multiDefault"><str>muLti-Default</str></arr><int name="intDefault">42</int><date name="timestamp">2018-09-29T07:55:28.757Z</date><long name="_version_">1612927707390148608</long><int name="intDvoDefault">42</int></doc><doc><str name="id">20</str><arr name="range_facet_l"><long>20</long></arr><int name="id_i1">20</int><arr name="range_facet_l_dv"><long>20</long></arr><arr name="range_facet_i_dv"><int>20</int></arr><arr name="lowerfilt"><str>The quote red fox jumped over the lazy brown dogs.</str></arr><arr name="lowerfilt1and2"><str>The quote red fox jumped over the lazy brown dogs.</str></arr><arr name="multiDefault"><str>muLti-Default</str></arr><int name="intDefault">42</int><date name="timestamp">2018-09-29T07:55:28.741Z</date><long name="_version_">1612927707372322816</long><int name="intDvoDefault">42</int></doc><doc><str name="id">21</str><arr name="range_facet_l"><long>21</long></arr><int name="id_i1">21</int><arr name="range_facet_l_dv"><long>21</long></arr><arr name="range_facet_i_dv"><int>21</int></arr><arr name="lowerfilt"><str>The court red fox jumped over the lazy brown dogs.</str></arr><arr name="lowerfilt1and2"><str>The court red fox jumped over the lazy brown dogs.</str></arr><arr name="multiDefault"><str>muLti-Default</str></arr><int name="intDefault">42</int><date name="timestamp">2018-09-29T07:55:28.742Z</date><long name="_version_">1612927707373371392</long><int name="intDvoDefault">42</int></doc><doc><str name="id">18</str><arr name="range_facet_l"><long>18</long></arr><int name="id_i1">18</int><arr name="range_facet_l_dv"><long>18</long></arr><arr name="range_facet_i_dv"><int>18</int></arr><arr name="lowerfilt"><str>The quote red fox jumped over the lazy brown dogs.</str></arr><arr name="lowerfilt1and2"><str>The quote red fox jumped over the lazy brown dogs.</str></arr><arr name="multiDefault"><str>muLti-Default</str></arr><int name="intDefault">42</int><date name="timestamp">2018-09-29T07:55:28.736Z</date><long name="_version_">1612927707367079936</long><int name="intDvoDefault">42</int></doc><doc><str name="id">19</str><arr name="range_facet_l"><long>19</long></arr><int name="id_i1">19</int><arr name="range_facet_l_dv"><long>19</long></arr><arr name="range_facet_i_dv"><int>19</int></arr><arr name="lowerfilt"><str>The hose red fox jumped over the lazy brown dogs.</str></arr><arr name="lowerfilt1and2"><str>The hose red fox jumped over the lazy brown dogs.</str></arr><arr name="multiDefault"><str>muLti-Default</str></arr><int name="intDefault">42</int><date name="timestamp">2018-09-29T07:55:28.737Z</date><long name="_version_">1612927707368128512</long><int name="intDvoDefault">42</int></doc><doc><str name="id">14</str><arr name="range_facet_l"><long>14</long></arr><int name="id_i1">14</int><arr name="range_facet_l_dv"><long>14</long></arr><arr name="range_facet_i_dv"><int>14</int></arr><arr name="lowerfilt"><str>The quote red fox jumped over the lazy brown dogs.</str></arr><arr name="lowerfilt1and2"><str>The quote red fox jumped over the lazy brown dogs.</str></arr><arr name="multiDefault"><str>muLti-Default</str></arr><int name="intDefault">42</int><date name="timestamp">2018-09-29T07:55:28.722Z</date><long name="_version_">1612927707352399872</long><int name="intDvoDefault">42</int></doc><doc><str name="id">15</str><arr name="range_facet_l"><long>15</long></arr><int name="id_i1">15</int><arr name="range_facet_l_dv"><long>15</long></arr><arr name="range_facet_i_dv"><int>15</int></arr><arr name="lowerfilt"><str>The fat red fox jumped over the lazy brown dogs.</str></arr><arr name="lowerfilt1and2"><str>The fat red fox jumped over the lazy brown dogs.</str></arr><arr name="multiDefault"><str>muLti-Default</str></arr><int name="intDefault">42</int><date name="timestamp">2018-09-29T07:55:28.722Z</date><long name="_version_">1612927707352399873</long><int name="intDvoDefault">42</int></doc><doc><str name="id">24</str><arr name="range_facet_l"><long>24</long></arr><int name="id_i1">24</int><arr name="range_facet_l_dv"><long>24</long></arr><arr name="range_facet_i_dv"><int>24</int></arr><arr name="lowerfilt"><str>The file red fox jumped over the lazy brown dogs.</str></arr><arr name="lowerfilt1and2"><str>The file red fox jumped over the lazy brown dogs.</str></arr><arr name="multiDefault"><str>muLti-Default</str></arr><int name="intDefault">42</int><date name="timestamp">2018-09-29T07:55:28.746Z</date><long name="_version_">1612927707377565696</long><int name="intDvoDefault">42</int></doc><doc><str name="id">22</str><arr name="range_facet_l"><long>22</long></arr><int name="id_i1">22</int><arr name="range_facet_l_dv"><long>22</long></arr><arr name="range_facet_i_dv"><int>22</int></arr><arr name="lowerfilt"><str>The quote red fox jumped over the lazy brown dogs.</str></arr><arr name="lowerfilt1and2"><str>The quote red fox jumped over the lazy brown dogs.</str></arr><arr name="multiDefault"><str>muLti-Default</str></arr><int name="intDefault">42</int><date name="timestamp">2018-09-29T07:55:28.744Z</date><long name="_version_">1612927707375468544</long><int name="intDvoDefault">42</int></doc></result>
   [junit4]    > </response>
   [junit4]    > 	request was:q={!mlt+qf%3Dlowerfilt}17
   [junit4]    > 	at org.apache.solr.SolrTestCaseJ4.assertQ(SolrTestCaseJ4.java:910)
   [junit4]    > 	... 41 more
   [junit4]   2> 4628351 INFO  (SUITE-SimpleMLTQParserTest-seed#[A894B8BA0A775547]-worker) [    ] o.a.s.c.CoreContainer Shutting down CoreContainer instance=323779018
   [junit4]   2> 4628351 INFO  (SUITE-SimpleMLTQParserTest-seed#[A894B8BA0A775547]-worker) [    ] o.a.s.m.SolrMetricManager Closing metric reporters for registry=solr.node, tag=null
   [junit4]   2> 4628351 INFO  (SUITE-SimpleMLTQParserTest-seed#[A894B8BA0A775547]-worker) [    ] o.a.s.m.r.SolrJmxReporter Closing reporter [org.apache.solr.metrics.reporters.SolrJmxReporter@72ba4470: rootName = null, domain = solr.node, service url = null, agent id = null] for registry solr.node / com.codahale.metrics.MetricRegistry@7eb4b427
   [junit4]   2> 4628356 INFO  (SUITE-SimpleMLTQParserTest-seed#[A894B8BA0A775547]-worker) [    ] o.a.s.m.SolrMetricManager Closing metric reporters for registry=solr.jvm, tag=null
   [junit4]   2> 4628356 INFO  (SUITE-SimpleMLTQParserTest-seed#[A894B8BA0A775547]-worker) [    ] o.a.s.m.r.SolrJmxReporter Closing reporter [org.apache.solr.metrics.reporters.SolrJmxReporter@50ceb4e2: rootName = null, domain = solr.jvm, service url = null, agent id = null] for registry solr.jvm / com.codahale.metrics.MetricRegistry@16044e38
   [junit4]   2> 4628358 INFO  (SUITE-SimpleMLTQParserTest-seed#[A894B8BA0A775547]-worker) [    ] o.a.s.m.SolrMetricManager Closing metric reporters for registry=solr.jetty, tag=null
   [junit4]   2> 4628358 INFO  (SUITE-SimpleMLTQParserTest-seed#[A894B8BA0A775547]-worker) [    ] o.a.s.m.r.SolrJmxReporter Closing reporter [org.apache.solr.metrics.reporters.SolrJmxReporter@fa88b6b: rootName = null, domain = solr.jetty, service url = null, agent id = null] for registry solr.jetty / com.codahale.metrics.MetricRegistry@2c567797
   [junit4]   2> 4628359 INFO  (coreCloseExecutor-16326-thread-1) [    x:collection1] o.a.s.c.SolrCore [collection1]  CLOSING SolrCore org.apache.solr.core.SolrCore@1e82ef64
   [junit4]   2> 4628359 INFO  (coreCloseExecutor-16326-thread-1) [    x:collection1] o.a.s.m.SolrMetricManager Closing metric reporters for registry=solr.core.collection1, tag=1e82ef64
   [junit4]   2> 4628359 INFO  (coreCloseExecutor-16326-thread-1) [    x:collection1] o.a.s.m.r.SolrJmxReporter Closing reporter [org.apache.solr.metrics.reporters.SolrJmxReporter@7ff0aed: rootName = null, domain = solr.core.collection1, service url = null, agent id = null] for registry solr.core.collection1 / com.codahale.metrics.MetricRegistry@75611a51
   [junit4]   2> NOTE: leaving temporary files on disk at: /x1/jenkins/jenkins-slave/workspace/Lucene-Solr-NightlyTests-7.x/checkout/solr/build/solr-core/test/J2/temp/solr.search.mlt.SimpleMLTQParserTest_A894B8BA0A775547-001
   [junit4]   2> NOTE: test params are: codec=Asserting(Lucene70), sim=RandomSimilarity(queryNorm=true): {}, locale=de-AT, timezone=Europe/Istanbul
   [junit4]   2> NOTE: Linux 4.4.0-130-generic amd64/Oracle Corporation 1.8.0_172 (64-bit)/cpus=4,threads=1,free=165309280,total=528482304
   [junit4]   2> NOTE: All tests run in this JVM: [V2ApiIntegrationTest, QueryResultKeyTest, ConjunctionSolrSpellCheckerTest, HdfsTlogReplayBufferedWhileIndexingTest, TestSweetSpotSimilarityFactory, TestLockTree, SearchHandlerTest, DataDrivenBlockJoinTest, DocExpirationUpdateProcessorFactoryTest, TestLegacyNumericRangeQueryBuilder, ShardRoutingCustomTest, RegexBoostProcessorTest, TestUseDocValuesAsStored, SolrJmxReporterCloudTest, TestStressUserVersions, ZkStateWriterTest, TestRandomFlRTGCloud, TestManagedStopFilterFactory, ResponseLogComponentTest, TestRestoreCore, TestInitQParser, SolrXmlInZkTest, ConnectionManagerTest, TestDeleteCollectionOnDownNodes, RegexBytesRefFilterTest, DistributedMLTComponentTest, SolrCoreTest, CdcrReplicationHandlerTest, TriggerIntegrationTest, TestCloudJSONFacetJoinDomain, TestPhraseSuggestions, TestConfigReload, ConcurrentDeleteAndCreateCollectionTest, NodeLostTriggerTest, TermsComponentTest, AsyncCallRequestStatusResponseTest, SpatialHeatmapFacetsTest, TestPrepRecovery, MaxSizeAutoCommitTest, LeaderFailoverAfterPartitionTest, PrimUtilsTest, DocValuesMultiTest, TestSchemaNameResource, ZookeeperStatusHandlerTest, UpdateLogTest, IndexSizeTriggerTest, TestUtilizeNode, NumericFieldsTest, TestReplicaProperties, TestMergePolicyConfig, TestCloudSearcherWarming, TestCoreContainer, TestQueryTypes, IndexBasedSpellCheckerTest, TestCloudConsistency, ManagedSchemaRoundRobinCloudTest, SpellCheckComponentTest, TestExtendedDismaxParser, CoreAdminRequestStatusTest, TestCollectionAPIs, TestSearchPerf, TestDownShardTolerantSearch, TestJoin, CleanupOldIndexTest, MoveReplicaHDFSTest, NodeAddedTriggerIntegrationTest, TestJettySolrRunner, TestQuerySenderNoQuery, TestXmlQParserPlugin, TestChildDocTransformerHierarchy, TestCustomSort, TestRuleBasedAuthorizationPlugin, TestFilteredDocIdSet, ConvertedLegacyTest, TestHalfAndHalfDocValues, TestInitParams, TaggingAttributeTest, DateFieldTest, TestCollectionsAPIViaSolrCloudCluster, SecurityConfHandlerTest, OutputWriterTest, MetricUtilsTest, CursorMarkTest, DistributedFacetPivotSmallAdvancedTest, BitVectorTest, ResourceLoaderTest, TestSchemaManager, TestTlogReplica, TestTrie, TestRTimerTree, TestComplexPhraseLeadingWildcard, BufferStoreTest, GraphQueryTest, TestCustomStream, JSONWriterTest, TestImpersonationWithHadoopAuth, TestShortCircuitedRequests, ReplaceNodeTest, TestLeaderElectionWithEmptyReplica, BinaryUpdateRequestHandlerTest, BadCopyFieldTest, LeaderElectionContextKeyTest, AddBlockUpdateTest, BasicZkTest, ClassificationUpdateProcessorFactoryTest, SoftAutoCommitTest, TestNonDefinedSimilarityFactory, HdfsNNFailoverTest, TestInPlaceUpdatesDistrib, AddSchemaFieldsUpdateProcessorFactoryTest, TestWriterPerf, TestSimLargeCluster, ReturnFieldsTest, DistributedFacetExistsSmallTest, ExecutePlanActionTest, TestFreeTextSuggestions, RequiredFieldsTest, ZkFailoverTest, DebugComponentTest, ClusterStateUpdateTest, SpellPossibilityIteratorTest, TestRequestForwarding, XsltUpdateRequestHandlerTest, TestFastOutputStream, MigrateRouteKeyTest, ChangedSchemaMergeTest, TestStressLucene, TestGraphTermsQParserPlugin, TestGraphMLResponseWriter, TestSortByMinMaxFunction, TestPayloadCheckQParserPlugin, TestNestedUpdateProcessor, CoreSorterTest, TestLegacyNumericUtils, CursorPagingTest, DisMaxRequestHandlerTest, DistributedIntervalFacetingTest, TestDistributedMissingSort, TestDocumentBuilder, TestRandomDVFaceting, TestRandomFaceting, TestSimpleTrackingShardHandler, PathHierarchyTokenizerFactoryTest, ProtectedTermFilterFactoryTest, TestCharFilters, TestLuceneMatchVersion, TestReversedWildcardFilterFactory, TestWordDelimiterFilterFactory, TokenizerChainTest, TestLuceneIndexBackCompat, TestEmbeddedSolrServerAdminHandler, ConnectionReuseTest, ActionThrottleTest, AddReplicaTest, ChaosMonkeySafeLeaderTest, CollectionStateFormat2Test, CreateCollectionCleanupTest, CreateRoutedAliasTest, DeleteInactiveReplicaTest, DeleteLastCustomShardedReplicaTest, DeleteNodeTest, DeleteReplicaTest, DistributedQueueTest, DocValuesNotIndexedTest, ForceLeaderTest, FullSolrCloudDistribCmdsTest, HttpPartitionTest, LeaderFailureAfterFreshStartTest, LeaderVoteWaitTimeoutTest, MoveReplicaTest, NodeMutatorTest, OutOfBoxZkACLAndCredentialsProvidersTest, OverriddenZkACLAndCredentialsProvidersTest, OverseerCollectionConfigSetProcessorTest, OverseerModifyCollectionTest, OverseerRolesTest, OverseerStatusTest, OverseerTaskQueueTest, PeerSyncReplicationTest, RecoveryAfterSoftCommitTest, ShardRoutingTest, SharedFSAutoReplicaFailoverTest, SliceStateTest, TestCloudJSONFacetSKG, TestCloudPhrasesIdentificationComponent, TestCloudPivotFacet, TestClusterProperties, TestConfigSetsAPI, TestConfigSetsAPIExclusivity, TestSizeLimitedDistributedMap, TestSkipOverseerOperations, TestSolrCloudWithDelegationTokens, TestSolrCloudWithKerberosAlt, TestSolrCloudWithSecureImpersonation, TestStressCloudBlindAtomicUpdates, TestZkChroot, TlogReplayBufferedWhileIndexingTest, ZkNodePropsTest, ZkShardTermsTest, AssignTest, CustomCollectionTest, ShardSplitTest, HdfsRecoverLeaseTest, HdfsRecoveryZkTest, HdfsRestartWhileUpdatingTest, HdfsUnloadDistributedZkTest, HdfsWriteToMultipleCollectionsTest, StressHdfsTest, ImplicitSnitchTest, RuleEngineTest, RulesTest, DirectoryFactoryTest, ExitableDirectoryReaderTest, HdfsDirectoryFactoryTest, TestBackupRepositoryFactory, TestBadConfig, TestCodecSupport, TestConfig, TestConfigOverlay, TestConfigSetImmutable, TestDirectoryFactory, TestDynamicLoading, TestDynamicURP, TestReloadAndDeleteDocs, TestShardHandlerFactory, TestSimpleTextCodec, TestSolrConfigHandler, TestSolrDeletionPolicy1, TestSolrDeletionPolicy2, TestSolrIndexConfig, TestSolrXml, TestXIncludeConfig, CSVRequestHandlerTest, DocumentAnalysisRequestHandlerTest, FieldAnalysisRequestHandlerTest, JsonLoaderTest, MoreLikeThisHandlerTest, PingRequestHandlerTest, TestReplicationHandler, TestSQLHandler, TestSQLHandlerNonCloud, TestSolrConfigHandlerCloud, CoreAdminCreateDiscoverTest, CoreMergeIndexesAdminHandlerTest, InfoHandlerTest, LoggingHandlerTest, LukeRequestHandlerTest, MBeansHandlerTest, DistributedQueryComponentCustomSortTest, DistributedQueryElevationComponentTest, DistributedSuggestComponentTest, FacetPivotSmallTest, InfixSuggestersTest, PhrasesIdentificationComponentTest, StatsComponentTest, TestExpandComponent, TestHttpShardHandlerFactory, TestPivotHelperCode, TestTrackingShardHandlerFactory, TestExportWriter, JavabinLoaderTest, EmbeddedSolrNoSerializeTest, RandomizedTaggerTest, XmlInterpolationTest, FastVectorHighlighterTest, HighlighterConfigTest, HighlighterMaxOffsetTest, HighlighterTest, TestPostingsSolrHighlighter, TestUnifiedSolrHighlighter, TestSlowCompositeReaderWrapper, UninvertDocValuesMergePolicyTest, WrapperMergePolicyFactoryTest, CheckHdfsIndexTest, TestLegacyTerms, TestMultiValuedNumericRangeQuery, TestNumericRangeQuery32, TestNumericRangeQuery64, TestNumericTokenStream, JvmMetricsTest, MetricsConfigTest, SolrCoreMetricManagerTest, SolrMetricManagerTest, SolrMetricReporterTest, SolrMetricsIntegrationTest, SolrJmxReporterTest, SolrSlf4jReporterTest, TestFaceting, TestIntervalFaceting, TestCloudSchemaless, LargeFieldTest, MergeStrategyTest, QueryEqualityTest, TestMaxScoreQueryParser, TestMultiWordSynonyms, TestQueryUtils, TestRTGBase, TestRandomCollapseQParserPlugin, TestReRankQParserPlugin, TestRealTimeGet, TestRecovery, TestRecoveryHdfs, TestSearcherReuse, TestSimpleQParserPlugin, TestSmileRequest, TestSolr4Spatial, TestSolr4Spatial2, TestSolrCoreParser, TestSolrFieldCacheBean, TestSolrJ, TestSolrQueryParser, TestStressVersions, TestSurroundQueryParser, TestTrieFacet, TestJsonFacetRefinement, TestJsonFacets, TestJsonFacetsStatsParsing, TestJsonFacetsWithNestedObjects, SortByFunctionTest, TestFunctionQuery, DistanceFunctionTest, BJQParserTest, BlockJoinFacetDistribTest, TestCloudNestedDocsSort, TestNestedDocsSort, TestScoreJoinQPNoScore, TestScoreJoinQPScore, TestJsonRequest, CloudMLTQParserTest, SimpleMLTQParserTest]
   [junit4] Completed [746/834 (1!)] on J2 in 0.91s, 1 test, 1 error <<< FAILURES!

[...truncated 49031 lines...]
[asciidoctor:convert] asciidoctor: ERROR: about-this-guide.adoc: line 1: invalid part, must have at least one section (e.g., chapter, appendix, etc.)
[asciidoctor:convert] asciidoctor: ERROR: solr-glossary.adoc: line 1: invalid part, must have at least one section (e.g., chapter, appendix, etc.)
     [java] Processed 2430 links (1982 relative) to 3170 anchors in 245 files
     [echo] Validated Links & Anchors via: /x1/jenkins/jenkins-slave/workspace/Lucene-Solr-NightlyTests-7.x/checkout/solr/build/solr-ref-guide/bare-bones-html/

-documentation-lint:
    [jtidy] Checking for broken html (such as invalid tags)...
   [delete] Deleting directory /x1/jenkins/jenkins-slave/workspace/Lucene-Solr-NightlyTests-7.x/checkout/lucene/build/jtidy_tmp
     [echo] Checking for broken links...
     [exec] 
     [exec] Crawl/parse...
     [exec] 
     [exec] Verify...
     [echo] Checking for malformed docs...

jar-checksums:

resolve:

ivy-availability-check:
[loadresource] Do not set property disallowed.ivy.jars.list as its length is 0.

-ivy-fail-disallowed-ivy-version:

ivy-fail:

ivy-configure:
[ivy:configure] :: loading settings :: file = /x1/jenkins/jenkins-slave/workspace/Lucene-Solr-NightlyTests-7.x/checkout/lucene/top-level-ivy-settings.xml

resolve:

ivy-availability-check:
[loadresource] Do not set property disallowed.ivy.jars.list as its length is 0.

-ivy-fail-disallowed-ivy-version:

ivy-fail:

ivy-configure:
[ivy:configure] :: loading settings :: file = /x1/jenkins/jenkins-slave/workspace/Lucene-Solr-NightlyTests-7.x/checkout/lucene/top-level-ivy-settings.xml

resolve:

resolve:

ivy-availability-check:
[loadresource] Do not set property disallowed.ivy.jars.list as its length is 0.

-ivy-fail-disallowed-ivy-version:

ivy-fail:

ivy-configure:
[ivy:configure] :: loading settings :: file = /x1/jenkins/jenkins-slave/workspace/Lucene-Solr-NightlyTests-7.x/checkout/lucene/top-level-ivy-settings.xml

resolve:

ivy-availability-check:
[loadresource] Do not set property disallowed.ivy.jars.list as its length is 0.

-ivy-fail-disallowed-ivy-version:

ivy-fail:

ivy-configure:
[ivy:configure] :: loading settings :: file = /x1/jenkins/jenkins-slave/workspace/Lucene-Solr-NightlyTests-7.x/checkout/lucene/top-level-ivy-settings.xml

resolve:

ivy-availability-check:
[loadresource] Do not set property disallowed.ivy.jars.list as its length is 0.

-ivy-fail-disallowed-ivy-version:

ivy-fail:

ivy-configure:
[ivy:configure] :: loading settings :: file = /x1/jenkins/jenkins-slave/workspace/Lucene-Solr-NightlyTests-7.x/checkout/lucene/top-level-ivy-settings.xml

resolve:

ivy-availability-check:
[loadresource] Do not set property disallowed.ivy.jars.list as its length is 0.

-ivy-fail-disallowed-ivy-version:

ivy-fail:

ivy-configure:
[ivy:configure] :: loading settings :: file = /x1/jenkins/jenkins-slave/workspace/Lucene-Solr-NightlyTests-7.x/checkout/lucene/top-level-ivy-settings.xml

resolve:

ivy-availability-check:
[loadresource] Do not set property disallowed.ivy.jars.list as its length is 0.

-ivy-fail-disallowed-ivy-version:

ivy-fail:

ivy-configure:
[ivy:configure] :: loading settings :: file = /x1/jenkins/jenkins-slave/workspace/Lucene-Solr-NightlyTests-7.x/checkout/lucene/top-level-ivy-settings.xml

resolve:

ivy-availability-check:
[loadresource] Do not set property disallowed.ivy.jars.list as its length is 0.

-ivy-fail-disallowed-ivy-version:

ivy-fail:

ivy-configure:
[ivy:configure] :: loading settings :: file = /x1/jenkins/jenkins-slave/workspace/Lucene-Solr-NightlyTests-7.x/checkout/lucene/top-level-ivy-settings.xml

resolve:

ivy-availability-check:
[loadresource] Do not set property disallowed.ivy.jars.list as its length is 0.

-ivy-fail-disallowed-ivy-version:

ivy-fail:

ivy-configure:
[ivy:configure] :: loading settings :: file = /x1/jenkins/jenkins-slave/workspace/Lucene-Solr-NightlyTests-7.x/checkout/lucene/top-level-ivy-settings.xml

resolve:

ivy-availability-check:
[loadresource] Do not set property disallowed.ivy.jars.list as its length is 0.

-ivy-fail-disallowed-ivy-version:

ivy-fail:

ivy-configure:
[ivy:configure] :: loading settings :: file = /x1/jenkins/jenkins-slave/workspace/Lucene-Solr-NightlyTests-7.x/checkout/lucene/top-level-ivy-settings.xml

resolve:

ivy-availability-check:
[loadresource] Do not set property disallowed.ivy.jars.list as its length is 0.

-ivy-fail-disallowed-ivy-version:

ivy-fail:

ivy-configure:
[ivy:configure] :: loading settings :: file = /x1/jenkins/jenkins-slave/workspace/Lucene-Solr-NightlyTests-7.x/checkout/lucene/top-level-ivy-settings.xml

resolve:

ivy-availability-check:
[loadresource] Do not set property disallowed.ivy.jars.list as its length is 0.

-ivy-fail-disallowed-ivy-version:

ivy-fail:

ivy-configure:
[ivy:configure] :: loading settings :: file = /x1/jenkins/jenkins-slave/workspace/Lucene-Solr-NightlyTests-7.x/checkout/lucene/top-level-ivy-settings.xml

resolve:

ivy-availability-check:
[loadresource] Do not set property disallowed.ivy.jars.list as its length is 0.

-ivy-fail-disallowed-ivy-version:

ivy-fail:

ivy-configure:
[ivy:configure] :: loading settings :: file = /x1/jenkins/jenkins-slave/workspace/Lucene-Solr-NightlyTests-7.x/checkout/lucene/top-level-ivy-settings.xml

resolve:

ivy-availability-check:
[loadresource] Do not set property disallowed.ivy.jars.list as its length is 0.

-ivy-fail-disallowed-ivy-version:

ivy-fail:

ivy-configure:
[ivy:configure] :: loading settings :: file = /x1/jenkins/jenkins-slave/workspace/Lucene-Solr-NightlyTests-7.x/checkout/lucene/top-level-ivy-settings.xml

resolve:

ivy-availability-check:
[loadresource] Do not set property disallowed.ivy.jars.list as its length is 0.

-ivy-fail-disallowed-ivy-version:

ivy-fail:

ivy-configure:
[ivy:configure] :: loading settings :: file = /x1/jenkins/jenkins-slave/workspace/Lucene-Solr-NightlyTests-7.x/checkout/lucene/top-level-ivy-settings.xml

resolve:

ivy-availability-check:
[loadresource] Do not set property disallowed.ivy.jars.list as its length is 0.

-ivy-fail-disallowed-ivy-version:

ivy-fail:

ivy-configure:
[ivy:configure] :: loading settings :: file = /x1/jenkins/jenkins-slave/workspace/Lucene-Solr-NightlyTests-7.x/checkout/lucene/top-level-ivy-settings.xml

resolve:

ivy-availability-check:
[loadresource] Do not set property disallowed.ivy.jars.list as its length is 0.

-ivy-fail-disallowed-ivy-version:

ivy-fail:

ivy-configure:
[ivy:configure] :: loading settings :: file = /x1/jenkins/jenkins-slave/workspace/Lucene-Solr-NightlyTests-7.x/checkout/lucene/top-level-ivy-settings.xml

resolve:

ivy-availability-check:
[loadresource] Do not set property disallowed.ivy.jars.list as its length is 0.

-ivy-fail-disallowed-ivy-version:

ivy-fail:

ivy-configure:
[ivy:configure] :: loading settings :: file = /x1/jenkins/jenkins-slave/workspace/Lucene-Solr-NightlyTests-7.x/checkout/lucene/top-level-ivy-settings.xml

resolve:

ivy-availability-check:
[loadresource] Do not set property disallowed.ivy.jars.list as its length is 0.

-ivy-fail-disallowed-ivy-version:

ivy-fail:

ivy-configure:
[ivy:configure] :: loading settings :: file = /x1/jenkins/jenkins-slave/workspace/Lucene-Solr-NightlyTests-7.x/checkout/lucene/top-level-ivy-settings.xml

resolve:

ivy-availability-check:
[loadresource] Do not set property disallowed.ivy.jars.list as its length is 0.

-ivy-fail-disallowed-ivy-version:

ivy-fail:

ivy-configure:
[ivy:configure] :: loading settings :: file = /x1/jenkins/jenkins-slave/workspace/Lucene-Solr-NightlyTests-7.x/checkout/lucene/top-level-ivy-settings.xml

resolve:

ivy-availability-check:
[loadresource] Do not set property disallowed.ivy.jars.list as its length is 0.

-ivy-fail-disallowed-ivy-version:

ivy-fail:

ivy-configure:
[ivy:configure] :: loading settings :: file = /x1/jenkins/jenkins-slave/workspace/Lucene-Solr-NightlyTests-7.x/checkout/lucene/top-level-ivy-settings.xml

resolve:

ivy-availability-check:
[loadresource] Do not set property disallowed.ivy.jars.list as its length is 0.

-ivy-fail-disallowed-ivy-version:

ivy-fail:

ivy-configure:
[ivy:configure] :: loading settings :: file = /x1/jenkins/jenkins-slave/workspace/Lucene-Solr-NightlyTests-7.x/checkout/lucene/top-level-ivy-settings.xml

resolve:

ivy-availability-check:
[loadresource] Do not set property disallowed.ivy.jars.list as its length is 0.

-ivy-fail-disallowed-ivy-version:

ivy-fail:

ivy-configure:
[ivy:configure] :: loading settings :: file = /x1/jenkins/jenkins-slave/workspace/Lucene-Solr-NightlyTests-7.x/checkout/lucene/top-level-ivy-settings.xml

resolve:

ivy-availability-check:
[loadresource] Do not set property disallowed.ivy.jars.list as its length is 0.

-ivy-fail-disallowed-ivy-version:

ivy-fail:

ivy-configure:
[ivy:configure] :: loading settings :: file = /x1/jenkins/jenkins-slave/workspace/Lucene-Solr-NightlyTests-7.x/checkout/lucene/top-level-ivy-settings.xml

resolve:

ivy-availability-check:
[loadresource] Do not set property disallowed.ivy.jars.list as its length is 0.

-ivy-fail-disallowed-ivy-version:

ivy-fail:

ivy-configure:
[ivy:configure] :: loading settings :: file = /x1/jenkins/jenkins-slave/workspace/Lucene-Solr-NightlyTests-7.x/checkout/lucene/top-level-ivy-settings.xml

resolve:

ivy-availability-check:
[loadresource] Do not set property disallowed.ivy.jars.list as its length is 0.

-ivy-fail-disallowed-ivy-version:

ivy-fail:

ivy-configure:
[ivy:configure] :: loading settings :: file = /x1/jenkins/jenkins-slave/workspace/Lucene-Solr-NightlyTests-7.x/checkout/lucene/top-level-ivy-settings.xml

common.resolve:

resolve:

ivy-availability-check:
[loadresource] Do not set property disallowed.ivy.jars.list as its length is 0.

-ivy-fail-disallowed-ivy-version:

ivy-fail:

ivy-configure:
[ivy:configure] :: loading settings :: file = /x1/jenkins/jenkins-slave/workspace/Lucene-Solr-NightlyTests-7.x/checkout/lucene/top-level-ivy-settings.xml

resolve:

ivy-availability-check:
[loadresource] Do not set property disallowed.ivy.jars.list as its length is 0.

-ivy-fail-disallowed-ivy-version:

ivy-fail:

ivy-configure:
[ivy:configure] :: loading settings :: file = /x1/jenkins/jenkins-slave/workspace/Lucene-Solr-NightlyTests-7.x/checkout/lucene/top-level-ivy-settings.xml

resolve:

ivy-availability-check:
[loadresource] Do not set property disallowed.ivy.jars.list as its length is 0.

-ivy-fail-disallowed-ivy-version:

ivy-fail:

ivy-configure:
[ivy:configure] :: loading settings :: file = /x1/jenkins/jenkins-slave/workspace/Lucene-Solr-NightlyTests-7.x/checkout/lucene/top-level-ivy-settings.xml

resolve:

ivy-availability-check:
[loadresource] Do not set property disallowed.ivy.jars.list as its length is 0.

-ivy-fail-disallowed-ivy-version:

ivy-fail:

ivy-configure:
[ivy:configure] :: loading settings :: file = /x1/jenkins/jenkins-slave/workspace/Lucene-Solr-NightlyTests-7.x/checkout/lucene/top-level-ivy-settings.xml

resolve:

ivy-availability-check:
[loadresource] Do not set property disallowed.ivy.jars.list as its length is 0.

-ivy-fail-disallowed-ivy-version:

ivy-fail:

ivy-configure:
[ivy:configure] :: loading settings :: file = /x1/jenkins/jenkins-slave/workspace/Lucene-Solr-NightlyTests-7.x/checkout/lucene/top-level-ivy-settings.xml

resolve:

jar-checksums:
    [mkdir] Created dir: /x1/jenkins/jenkins-slave/workspace/Lucene-Solr-NightlyTests-7.x/checkout/lucene/null384835867
     [copy] Copying 35 files to /x1/jenkins/jenkins-slave/workspace/Lucene-Solr-NightlyTests-7.x/checkout/lucene/null384835867
   [delete] Deleting directory /x1/jenkins/jenkins-slave/workspace/Lucene-Solr-NightlyTests-7.x/checkout/lucene/null384835867

resolve-example:

ivy-availability-check:
[loadresource] Do not set property disallowed.ivy.jars.list as its length is 0.

-ivy-fail-disallowed-ivy-version:

ivy-fail:

ivy-configure:
[ivy:configure] :: loading settings :: file = /x1/jenkins/jenkins-slave/workspace/Lucene-Solr-NightlyTests-7.x/checkout/lucene/top-level-ivy-settings.xml

resolve:

resolve-server:

ivy-availability-check:
[loadresource] Do not set property disallowed.ivy.jars.list as its length is 0.

-ivy-fail-disallowed-ivy-version:

ivy-fail:

ivy-fail:

ivy-configure:
[ivy:configure] :: loading settings :: file = /x1/jenkins/jenkins-slave/workspace/Lucene-Solr-NightlyTests-7.x/checkout/lucene/top-level-ivy-settings.xml

resolve:

resolve:

ivy-availability-check:
[loadresource] Do not set property disallowed.ivy.jars.list as its length is 0.

-ivy-fail-disallowed-ivy-version:

ivy-fail:

ivy-fail:

ivy-configure:
[ivy:configure] :: loading settings :: file = /x1/jenkins/jenkins-slave/workspace/Lucene-Solr-NightlyTests-7.x/checkout/lucene/top-level-ivy-settings.xml

resolve:

ivy-availability-check:
[loadresource] Do not set property disallowed.ivy.jars.list as its length is 0.

-ivy-fail-disallowed-ivy-version:

ivy-fail:

ivy-fail:

ivy-configure:
[ivy:configure] :: loading settings :: file = /x1/jenkins/jenkins-slave/workspace/Lucene-Solr-NightlyTests-7.x/checkout/lucene/top-level-ivy-settings.xml

resolve:

ivy-availability-check:
[loadresource] Do not set property disallowed.ivy.jars.list as its length is 0.

-ivy-fail-disallowed-ivy-version:

ivy-fail:

ivy-configure:
[ivy:configure] :: loading settings :: file = /x1/jenkins/jenkins-slave/workspace/Lucene-Solr-NightlyTests-7.x/checkout/lucene/top-level-ivy-settings.xml

resolve:

ivy-availability-check:
[loadresource] Do not set property disallowed.ivy.jars.list as its length is 0.

-ivy-fail-disallowed-ivy-version:

ivy-fail:

ivy-fail:

ivy-configure:
[ivy:configure] :: loading settings :: file = /x1/jenkins/jenkins-slave/workspace/Lucene-Solr-NightlyTests-7.x/checkout/lucene/top-level-ivy-settings.xml

resolve:

ivy-availability-check:
[loadresource] Do not set property disallowed.ivy.jars.list as its length is 0.

-ivy-fail-disallowed-ivy-version:

ivy-fail:

ivy-configure:
[ivy:configure] :: loading settings :: file = /x1/jenkins/jenkins-slave/workspace/Lucene-Solr-NightlyTests-7.x/checkout/lucene/top-level-ivy-settings.xml

resolve:

ivy-availability-check:
[loadresource] Do not set property disallowed.ivy.jars.list as its length is 0.

-ivy-fail-disallowed-ivy-version:

ivy-fail:

ivy-fail:

ivy-configure:
[ivy:configure] :: loading settings :: file = /x1/jenkins/jenkins-slave/workspace/Lucene-Solr-NightlyTests-7.x/checkout/lucene/top-level-ivy-settings.xml

resolve:

ivy-availability-check:
[loadresource] Do not set property disallowed.ivy.jars.list as its length is 0.

-ivy-fail-disallowed-ivy-version:

ivy-fail:

ivy-fail:

ivy-configure:
[ivy:configure] :: loading settings :: file = /x1/jenkins/jenkins-slave/workspace/Lucene-Solr-NightlyTests-7.x/checkout/lucene/top-level-ivy-settings.xml

resolve:

ivy-availability-check:
[loadresource] Do not set property disallowed.ivy.jars.list as its length is 0.

-ivy-fail-disallowed-ivy-version:

ivy-fail:

ivy-fail:

ivy-configure:
[ivy:configure] :: loading settings :: file = /x1/jenkins/jenkins-slave/workspace/Lucene-Solr-NightlyTests-7.x/checkout/lucene/top-level-ivy-settings.xml

resolve:

ivy-availability-check:
[loadresource] Do not set property disallowed.ivy.jars.list as its length is 0.

-ivy-fail-disallowed-ivy-version:

ivy-fail:

ivy-fail:

ivy-configure:
[ivy:configure] :: loading settings :: file = /x1/jenkins/jenkins-slave/workspace/Lucene-Solr-NightlyTests-7.x/checkout/lucene/top-level-ivy-settings.xml

resolve:

ivy-availability-check:
[loadresource] Do not set property disallowed.ivy.jars.list as its length is 0.

-ivy-fail-disallowed-ivy-version:

ivy-fail:

ivy-fail:

ivy-configure:
[ivy:configure] :: loading settings :: file = /x1/jenkins/jenkins-slave/workspace/Lucene-Solr-NightlyTests-7.x/checkout/lucene/top-level-ivy-settings.xml

resolve:

ivy-availability-check:
[loadresource] Do not set property disallowed.ivy.jars.list as its length is 0.

-ivy-fail-disallowed-ivy-version:

ivy-fail:

ivy-fail:

ivy-configure:
[ivy:configure] :: loading settings :: file = /x1/jenkins/jenkins-slave/workspace/Lucene-Solr-NightlyTests-7.x/checkout/lucene/top-level-ivy-settings.xml

resolve:

ivy-availability-check:
[loadresource] Do not set property disallowed.ivy.jars.list as its length is 0.

-ivy-fail-disallowed-ivy-version:

ivy-fail:

ivy-fail:

ivy-configure:
[ivy:configure] :: loading settings :: file = /x1/jenkins/jenkins-slave/workspace/Lucene-Solr-NightlyTests-7.x/checkout/lucene/top-level-ivy-settings.xml

resolve:

ivy-availability-check:
[loadresource] Do not set property disallowed.ivy.jars.list as its length is 0.

-ivy-fail-disallowed-ivy-version:

ivy-fail:

ivy-fail:

ivy-configure:
[ivy:configure] :: loading settings :: file = /x1/jenkins/jenkins-slave/workspace/Lucene-Solr-NightlyTests-7.x/checkout/lucene/top-level-ivy-settings.xml

resolve:

ivy-availability-check:
[loadresource] Do not set property disallowed.ivy.jars.list as its length is 0.

-ivy-fail-disallowed-ivy-version:

ivy-fail:

ivy-fail:

ivy-configure:
[ivy:configure] :: loading settings :: file = /x1/jenkins/jenkins-slave/workspace/Lucene-Solr-NightlyTests-7.x/checkout/lucene/top-level-ivy-settings.xml

resolve:

ivy-availability-check:
[loadresource] Do not set property disallowed.ivy.jars.list as its length is 0.

-ivy-fail-disallowed-ivy-version:

ivy-fail:

ivy-fail:

ivy-configure:
[ivy:configure] :: loading settings :: file = /x1/jenkins/jenkins-slave/workspace/Lucene-Solr-NightlyTests-7.x/checkout/lucene/top-level-ivy-settings.xml

resolve:

jar-checksums:
    [mkdir] Created dir: /x1/jenkins/jenkins-slave/workspace/Lucene-Solr-NightlyTests-7.x/checkout/solr/null1475200091
     [copy] Copying 239 files to /x1/jenkins/jenkins-slave/workspace/Lucene-Solr-NightlyTests-7.x/checkout/solr/null1475200091
   [delete] Deleting directory /x1/jenkins/jenkins-slave/workspace/Lucene-Solr-NightlyTests-7.x/checkout/solr/null1475200091

check-working-copy:
[ivy:cachepath] :: resolving dependencies :: org.eclipse.jgit#org.eclipse.jgit-caller;working
[ivy:cachepath] 	confs: [default]
[ivy:cachepath] 	found org.eclipse.jgit#org.eclipse.jgit;4.6.0.201612231935-r in public
[ivy:cachepath] 	found com.jcraft#jsch;0.1.53 in public
[ivy:cachepath] 	found com.googlecode.javaewah#JavaEWAH;1.1.6 in public
[ivy:cachepath] 	found org.apache.httpcomponents#httpclient;4.3.6 in public
[ivy:cachepath] 	found org.apache.httpcomponents#httpcore;4.3.3 in public
[ivy:cachepath] 	found commons-logging#commons-logging;1.1.3 in public
[ivy:cachepath] 	found commons-codec#commons-codec;1.6 in public
[ivy:cachepath] 	found org.slf4j#slf4j-api;1.7.2 in public
[ivy:cachepath] :: resolution report :: resolve 40ms :: artifacts dl 7ms
	---------------------------------------------------------------------
	|                  |            modules            ||   artifacts   |
	|       conf       | number| search|dwnlded|evicted|| number|dwnlded|
	---------------------------------------------------------------------
	|      default     |   8   |   0   |   0   |   0   ||   8   |   0   |
	---------------------------------------------------------------------
[wc-checker] Initializing working copy...
[wc-checker] SLF4J: Failed to load class "org.slf4j.impl.StaticLoggerBinder".
[wc-checker] SLF4J: Defaulting to no-operation (NOP) logger implementation
[wc-checker] SLF4J: See http://www.slf4j.org/codes.html#StaticLoggerBinder for further details.
[wc-checker] Checking working copy status...

-jenkins-base:

BUILD SUCCESSFUL
Total time: 278 minutes 7 seconds
Archiving artifacts
java.lang.InterruptedException: no matches found within 10000
	at hudson.FilePath$34.hasMatch(FilePath.java:2678)
	at hudson.FilePath$34.invoke(FilePath.java:2557)
	at hudson.FilePath$34.invoke(FilePath.java:2547)
	at hudson.FilePath$FileCallableWrapper.call(FilePath.java:2918)
Also:   hudson.remoting.Channel$CallSiteStackTrace: Remote call to lucene
		at hudson.remoting.Channel.attachCallSiteStackTrace(Channel.java:1741)
		at hudson.remoting.UserRequest$ExceptionResponse.retrieve(UserRequest.java:357)
		at hudson.remoting.Channel.call(Channel.java:955)
		at hudson.FilePath.act(FilePath.java:1036)
		at hudson.FilePath.act(FilePath.java:1025)
		at hudson.FilePath.validateAntFileMask(FilePath.java:2547)
		at hudson.tasks.ArtifactArchiver.perform(ArtifactArchiver.java:243)
		at hudson.tasks.BuildStepCompatibilityLayer.perform(BuildStepCompatibilityLayer.java:81)
		at hudson.tasks.BuildStepMonitor$1.perform(BuildStepMonitor.java:20)
		at hudson.model.AbstractBuild$AbstractBuildExecution.perform(AbstractBuild.java:744)
		at hudson.model.AbstractBuild$AbstractBuildExecution.performAllBuildSteps(AbstractBuild.java:690)
		at hudson.model.Build$BuildExecution.post2(Build.java:186)
		at hudson.model.AbstractBuild$AbstractBuildExecution.post(AbstractBuild.java:635)
		at hudson.model.Run.execute(Run.java:1819)
		at hudson.model.FreeStyleBuild.run(FreeStyleBuild.java:43)
		at hudson.model.ResourceController.execute(ResourceController.java:97)
		at hudson.model.Executor.run(Executor.java:429)
Caused: hudson.FilePath$TunneledInterruptedException
	at hudson.FilePath$FileCallableWrapper.call(FilePath.java:2920)
	at hudson.remoting.UserRequest.perform(UserRequest.java:212)
	at hudson.remoting.UserRequest.perform(UserRequest.java:54)
	at hudson.remoting.Request$2.run(Request.java:369)
	at hudson.remoting.InterceptingExecutorService$1.call(InterceptingExecutorService.java:72)
	at java.util.concurrent.FutureTask.run(FutureTask.java:266)
	at java.util.concurrent.ThreadPoolExecutor.runWorker(ThreadPoolExecutor.java:1142)
	at java.util.concurrent.ThreadPoolExecutor$Worker.run(ThreadPoolExecutor.java:617)
	at java.lang.Thread.run(Thread.java:748)
Caused: java.lang.InterruptedException: java.lang.InterruptedException: no matches found within 10000
	at hudson.FilePath.act(FilePath.java:1038)
	at hudson.FilePath.act(FilePath.java:1025)
	at hudson.FilePath.validateAntFileMask(FilePath.java:2547)
	at hudson.tasks.ArtifactArchiver.perform(ArtifactArchiver.java:243)
	at hudson.tasks.BuildStepCompatibilityLayer.perform(BuildStepCompatibilityLayer.java:81)
	at hudson.tasks.BuildStepMonitor$1.perform(BuildStepMonitor.java:20)
	at hudson.model.AbstractBuild$AbstractBuildExecution.perform(AbstractBuild.java:744)
	at hudson.model.AbstractBuild$AbstractBuildExecution.performAllBuildSteps(AbstractBuild.java:690)
	at hudson.model.Build$BuildExecution.post2(Build.java:186)
	at hudson.model.AbstractBuild$AbstractBuildExecution.post(AbstractBuild.java:635)
	at hudson.model.Run.execute(Run.java:1819)
	at hudson.model.FreeStyleBuild.run(FreeStyleBuild.java:43)
	at hudson.model.ResourceController.execute(ResourceController.java:97)
	at hudson.model.Executor.run(Executor.java:429)
No artifacts found that match the file pattern "**/*.events,heapdumps/**,**/hs_err_pid*". Configuration error?
Recording test results
Build step 'Publish JUnit test result report' changed build result to UNSTABLE
Email was triggered for: Unstable (Test Failures)
Sending email for trigger: Unstable (Test Failures)

Mime
View raw message