lucene-dev mailing list archives

Site index · List index
Message view « Date » · « Thread »
Top « Date » · « Thread »
From Policeman Jenkins Server <jenk...@thetaphi.de>
Subject [JENKINS] Lucene-Solr-master-Linux (64bit/jdk1.8.0_172) - Build # 22951 - Unstable!
Date Sun, 30 Sep 2018 20:30:39 GMT
Build: https://jenkins.thetaphi.de/job/Lucene-Solr-master-Linux/22951/
Java: 64bit/jdk1.8.0_172 -XX:-UseCompressedOops -XX:+UseConcMarkSweepGC

1 tests failed.
FAILED:  org.apache.solr.cloud.MoveReplicaHDFSTest.testFailedMove

Error Message:
No live SolrServers available to handle this request:[https://127.0.0.1:37443/solr/MoveReplicaHDFSTest_failed_coll_true, https://127.0.0.1:39713/solr/MoveReplicaHDFSTest_failed_coll_true]

Stack Trace:
org.apache.solr.client.solrj.SolrServerException: No live SolrServers available to handle this request:[https://127.0.0.1:37443/solr/MoveReplicaHDFSTest_failed_coll_true, https://127.0.0.1:39713/solr/MoveReplicaHDFSTest_failed_coll_true]
	at __randomizedtesting.SeedInfo.seed([3595E06E3BCFD858:9F58339C8C1C0D88]:0)
	at org.apache.solr.client.solrj.impl.LBHttpSolrClient.request(LBHttpSolrClient.java:462)
	at org.apache.solr.client.solrj.impl.CloudSolrClient.sendRequest(CloudSolrClient.java:1107)
	at org.apache.solr.client.solrj.impl.CloudSolrClient.requestWithRetryOnStaleState(CloudSolrClient.java:884)
	at org.apache.solr.client.solrj.impl.CloudSolrClient.requestWithRetryOnStaleState(CloudSolrClient.java:994)
	at org.apache.solr.client.solrj.impl.CloudSolrClient.request(CloudSolrClient.java:817)
	at org.apache.solr.client.solrj.SolrRequest.process(SolrRequest.java:194)
	at org.apache.solr.client.solrj.SolrClient.query(SolrClient.java:942)
	at org.apache.solr.cloud.MoveReplicaTest.testFailedMove(MoveReplicaTest.java:301)
	at sun.reflect.NativeMethodAccessorImpl.invoke0(Native Method)
	at sun.reflect.NativeMethodAccessorImpl.invoke(NativeMethodAccessorImpl.java:62)
	at sun.reflect.DelegatingMethodAccessorImpl.invoke(DelegatingMethodAccessorImpl.java:43)
	at java.lang.reflect.Method.invoke(Method.java:498)
	at com.carrotsearch.randomizedtesting.RandomizedRunner.invoke(RandomizedRunner.java:1742)
	at com.carrotsearch.randomizedtesting.RandomizedRunner$8.evaluate(RandomizedRunner.java:935)
	at com.carrotsearch.randomizedtesting.RandomizedRunner$9.evaluate(RandomizedRunner.java:971)
	at com.carrotsearch.randomizedtesting.RandomizedRunner$10.evaluate(RandomizedRunner.java:985)
	at com.carrotsearch.randomizedtesting.rules.SystemPropertiesRestoreRule$1.evaluate(SystemPropertiesRestoreRule.java:57)
	at org.apache.lucene.util.TestRuleSetupTeardownChained$1.evaluate(TestRuleSetupTeardownChained.java:49)
	at org.apache.lucene.util.AbstractBeforeAfterRule$1.evaluate(AbstractBeforeAfterRule.java:45)
	at org.apache.lucene.util.TestRuleThreadAndTestName$1.evaluate(TestRuleThreadAndTestName.java:48)
	at org.apache.lucene.util.TestRuleIgnoreAfterMaxFailures$1.evaluate(TestRuleIgnoreAfterMaxFailures.java:64)
	at org.apache.lucene.util.TestRuleMarkFailure$1.evaluate(TestRuleMarkFailure.java:47)
	at com.carrotsearch.randomizedtesting.rules.StatementAdapter.evaluate(StatementAdapter.java:36)
	at com.carrotsearch.randomizedtesting.ThreadLeakControl$StatementRunner.run(ThreadLeakControl.java:368)
	at com.carrotsearch.randomizedtesting.ThreadLeakControl.forkTimeoutingTask(ThreadLeakControl.java:817)
	at com.carrotsearch.randomizedtesting.ThreadLeakControl$3.evaluate(ThreadLeakControl.java:468)
	at com.carrotsearch.randomizedtesting.RandomizedRunner.runSingleTest(RandomizedRunner.java:944)
	at com.carrotsearch.randomizedtesting.RandomizedRunner$5.evaluate(RandomizedRunner.java:830)
	at com.carrotsearch.randomizedtesting.RandomizedRunner$6.evaluate(RandomizedRunner.java:880)
	at com.carrotsearch.randomizedtesting.RandomizedRunner$7.evaluate(RandomizedRunner.java:891)
	at com.carrotsearch.randomizedtesting.rules.StatementAdapter.evaluate(StatementAdapter.java:36)
	at com.carrotsearch.randomizedtesting.rules.SystemPropertiesRestoreRule$1.evaluate(SystemPropertiesRestoreRule.java:57)
	at org.apache.lucene.util.AbstractBeforeAfterRule$1.evaluate(AbstractBeforeAfterRule.java:45)
	at com.carrotsearch.randomizedtesting.rules.StatementAdapter.evaluate(StatementAdapter.java:36)
	at org.apache.lucene.util.TestRuleStoreClassName$1.evaluate(TestRuleStoreClassName.java:41)
	at com.carrotsearch.randomizedtesting.rules.NoShadowingOrOverridesOnMethodsRule$1.evaluate(NoShadowingOrOverridesOnMethodsRule.java:40)
	at com.carrotsearch.randomizedtesting.rules.NoShadowingOrOverridesOnMethodsRule$1.evaluate(NoShadowingOrOverridesOnMethodsRule.java:40)
	at com.carrotsearch.randomizedtesting.rules.StatementAdapter.evaluate(StatementAdapter.java:36)
	at com.carrotsearch.randomizedtesting.rules.StatementAdapter.evaluate(StatementAdapter.java:36)
	at com.carrotsearch.randomizedtesting.rules.StatementAdapter.evaluate(StatementAdapter.java:36)
	at org.apache.lucene.util.TestRuleAssertionsRequired$1.evaluate(TestRuleAssertionsRequired.java:53)
	at org.apache.lucene.util.TestRuleMarkFailure$1.evaluate(TestRuleMarkFailure.java:47)
	at org.apache.lucene.util.TestRuleIgnoreAfterMaxFailures$1.evaluate(TestRuleIgnoreAfterMaxFailures.java:64)
	at org.apache.lucene.util.TestRuleIgnoreTestSuites$1.evaluate(TestRuleIgnoreTestSuites.java:54)
	at com.carrotsearch.randomizedtesting.rules.StatementAdapter.evaluate(StatementAdapter.java:36)
	at com.carrotsearch.randomizedtesting.ThreadLeakControl$StatementRunner.run(ThreadLeakControl.java:368)
	at java.lang.Thread.run(Thread.java:748)
Caused by: org.apache.solr.client.solrj.impl.HttpSolrClient$RemoteSolrException: Error from server at https://127.0.0.1:39713/solr/MoveReplicaHDFSTest_failed_coll_true: no servers hosting shard: shard2
	at org.apache.solr.client.solrj.impl.HttpSolrClient.executeMethod(HttpSolrClient.java:643)
	at org.apache.solr.client.solrj.impl.HttpSolrClient.request(HttpSolrClient.java:255)
	at org.apache.solr.client.solrj.impl.HttpSolrClient.request(HttpSolrClient.java:244)
	at org.apache.solr.client.solrj.impl.LBHttpSolrClient.doRequest(LBHttpSolrClient.java:483)
	at org.apache.solr.client.solrj.impl.LBHttpSolrClient.request(LBHttpSolrClient.java:436)
	... 46 more




Build Log:
[...truncated 12570 lines...]
   [junit4] Suite: org.apache.solr.cloud.MoveReplicaHDFSTest
   [junit4]   2> Creating dataDir: /home/jenkins/workspace/Lucene-Solr-master-Linux/solr/build/solr-core/test/J0/temp/solr.cloud.MoveReplicaHDFSTest_3595E06E3BCFD858-001/init-core-data-001
   [junit4]   2> 33145 WARN  (SUITE-MoveReplicaHDFSTest-seed#[3595E06E3BCFD858]-worker) [    ] o.a.s.SolrTestCaseJ4 startTrackingSearchers: numOpens=11 numCloses=11
   [junit4]   2> 33159 INFO  (SUITE-MoveReplicaHDFSTest-seed#[3595E06E3BCFD858]-worker) [    ] o.a.s.SolrTestCaseJ4 Using PointFields (NUMERIC_POINTS_SYSPROP=true) w/NUMERIC_DOCVALUES_SYSPROP=true
   [junit4]   2> 33161 INFO  (SUITE-MoveReplicaHDFSTest-seed#[3595E06E3BCFD858]-worker) [    ] o.a.s.SolrTestCaseJ4 Randomized ssl (true) and clientAuth (false) via: @org.apache.solr.util.RandomizeSSL(reason=, ssl=NaN, value=NaN, clientAuth=NaN)
   [junit4]   2> 33161 INFO  (SUITE-MoveReplicaHDFSTest-seed#[3595E06E3BCFD858]-worker) [    ] o.a.s.SolrTestCaseJ4 SecureRandom sanity checks: test.solr.allowed.securerandom=null & java.security.egd=file:/dev/./urandom
   [junit4]   2> 33164 INFO  (SUITE-MoveReplicaHDFSTest-seed#[3595E06E3BCFD858]-worker) [    ] o.a.s.c.MiniSolrCloudCluster Starting cluster of 4 servers in /home/jenkins/workspace/Lucene-Solr-master-Linux/solr/build/solr-core/test/J0/temp/solr.cloud.MoveReplicaHDFSTest_3595E06E3BCFD858-001/tempDir-001
   [junit4]   2> 33172 INFO  (SUITE-MoveReplicaHDFSTest-seed#[3595E06E3BCFD858]-worker) [    ] o.a.s.c.ZkTestServer STARTING ZK TEST SERVER
   [junit4]   2> 33174 INFO  (Thread-63) [    ] o.a.s.c.ZkTestServer client port:0.0.0.0/0.0.0.0:0
   [junit4]   2> 33174 INFO  (Thread-63) [    ] o.a.s.c.ZkTestServer Starting server
   [junit4]   2> 33273 INFO  (SUITE-MoveReplicaHDFSTest-seed#[3595E06E3BCFD858]-worker) [    ] o.a.s.c.ZkTestServer start zk server on port:37761
   [junit4]   2> 33291 ERROR (Thread-63) [    ] o.a.z.s.ZooKeeperServer ZKShutdownHandler is not registered, so ZooKeeper server won't take any action on ERROR or SHUTDOWN server state changes
   [junit4]   2> 33353 INFO  (zkConnectionManagerCallback-29-thread-1) [    ] o.a.s.c.c.ConnectionManager zkClient has connected
   [junit4]   2> 33398 INFO  (jetty-launcher-26-thread-3) [    ] o.e.j.s.Server jetty-9.4.11.v20180605; built: 2018-06-05T18:24:03.829Z; git: d5fc0523cfa96bfebfbda19606cad384d772f04c; jvm 1.8.0_172-b11
   [junit4]   2> 33398 INFO  (jetty-launcher-26-thread-1) [    ] o.e.j.s.Server jetty-9.4.11.v20180605; built: 2018-06-05T18:24:03.829Z; git: d5fc0523cfa96bfebfbda19606cad384d772f04c; jvm 1.8.0_172-b11
   [junit4]   2> 33405 INFO  (jetty-launcher-26-thread-2) [    ] o.e.j.s.Server jetty-9.4.11.v20180605; built: 2018-06-05T18:24:03.829Z; git: d5fc0523cfa96bfebfbda19606cad384d772f04c; jvm 1.8.0_172-b11
   [junit4]   2> 33410 INFO  (jetty-launcher-26-thread-4) [    ] o.e.j.s.Server jetty-9.4.11.v20180605; built: 2018-06-05T18:24:03.829Z; git: d5fc0523cfa96bfebfbda19606cad384d772f04c; jvm 1.8.0_172-b11
   [junit4]   2> 33420 INFO  (jetty-launcher-26-thread-4) [    ] o.e.j.s.session DefaultSessionIdManager workerName=node0
   [junit4]   2> 33420 INFO  (jetty-launcher-26-thread-3) [    ] o.e.j.s.session DefaultSessionIdManager workerName=node0
   [junit4]   2> 33420 INFO  (jetty-launcher-26-thread-4) [    ] o.e.j.s.session No SessionScavenger set, using defaults
   [junit4]   2> 33420 INFO  (jetty-launcher-26-thread-3) [    ] o.e.j.s.session No SessionScavenger set, using defaults
   [junit4]   2> 33420 INFO  (jetty-launcher-26-thread-4) [    ] o.e.j.s.session node0 Scavenging every 600000ms
   [junit4]   2> 33420 INFO  (jetty-launcher-26-thread-3) [    ] o.e.j.s.session node0 Scavenging every 600000ms
   [junit4]   2> 33421 INFO  (jetty-launcher-26-thread-1) [    ] o.e.j.s.session DefaultSessionIdManager workerName=node0
   [junit4]   2> 33421 INFO  (jetty-launcher-26-thread-1) [    ] o.e.j.s.session No SessionScavenger set, using defaults
   [junit4]   2> 33421 INFO  (jetty-launcher-26-thread-1) [    ] o.e.j.s.session node0 Scavenging every 660000ms
   [junit4]   2> 33421 INFO  (jetty-launcher-26-thread-4) [    ] o.e.j.s.h.ContextHandler Started o.e.j.s.ServletContextHandler@76a0c0d6{/solr,null,AVAILABLE}
   [junit4]   2> 33421 INFO  (jetty-launcher-26-thread-3) [    ] o.e.j.s.h.ContextHandler Started o.e.j.s.ServletContextHandler@164b4a50{/solr,null,AVAILABLE}
   [junit4]   2> 33422 INFO  (jetty-launcher-26-thread-2) [    ] o.e.j.s.session DefaultSessionIdManager workerName=node0
   [junit4]   2> 33422 INFO  (jetty-launcher-26-thread-2) [    ] o.e.j.s.session No SessionScavenger set, using defaults
   [junit4]   2> 33422 INFO  (jetty-launcher-26-thread-2) [    ] o.e.j.s.session node0 Scavenging every 600000ms
   [junit4]   2> 33429 INFO  (jetty-launcher-26-thread-1) [    ] o.e.j.s.h.ContextHandler Started o.e.j.s.ServletContextHandler@555a7b00{/solr,null,AVAILABLE}
   [junit4]   2> 33430 INFO  (jetty-launcher-26-thread-2) [    ] o.e.j.s.h.ContextHandler Started o.e.j.s.ServletContextHandler@6e7768eb{/solr,null,AVAILABLE}
   [junit4]   2> 33431 INFO  (jetty-launcher-26-thread-2) [    ] o.e.j.s.AbstractConnector Started ServerConnector@13c36cf8{SSL,[ssl, http/1.1]}{127.0.0.1:44801}
   [junit4]   2> 33431 INFO  (jetty-launcher-26-thread-2) [    ] o.e.j.s.Server Started @33466ms
   [junit4]   2> 33431 INFO  (jetty-launcher-26-thread-2) [    ] o.a.s.c.s.e.JettySolrRunner Jetty properties: {hostContext=/solr, hostPort=44801}
   [junit4]   2> 33432 ERROR (jetty-launcher-26-thread-2) [    ] o.a.s.u.StartupLoggingUtils Missing Java Option solr.log.dir. Logging may be missing or incomplete.
   [junit4]   2> 33432 INFO  (jetty-launcher-26-thread-2) [    ] o.a.s.s.SolrDispatchFilter Using logger factory org.apache.logging.slf4j.Log4jLoggerFactory
   [junit4]   2> 33432 INFO  (jetty-launcher-26-thread-2) [    ] o.a.s.s.SolrDispatchFilter  ___      _       Welcome to Apache Solr? version 8.0.0
   [junit4]   2> 33432 INFO  (jetty-launcher-26-thread-2) [    ] o.a.s.s.SolrDispatchFilter / __| ___| |_ _   Starting in cloud mode on port null
   [junit4]   2> 33432 INFO  (jetty-launcher-26-thread-2) [    ] o.a.s.s.SolrDispatchFilter \__ \/ _ \ | '_|  Install dir: null
   [junit4]   2> 33432 INFO  (jetty-launcher-26-thread-2) [    ] o.a.s.s.SolrDispatchFilter |___/\___/_|_|    Start time: 2018-09-30T19:00:07.735Z
   [junit4]   2> 33437 INFO  (jetty-launcher-26-thread-4) [    ] o.e.j.s.AbstractConnector Started ServerConnector@3ee7b9d1{SSL,[ssl, http/1.1]}{127.0.0.1:37443}
   [junit4]   2> 33437 INFO  (jetty-launcher-26-thread-3) [    ] o.e.j.s.AbstractConnector Started ServerConnector@4ed012e6{SSL,[ssl, http/1.1]}{127.0.0.1:39713}
   [junit4]   2> 33437 INFO  (jetty-launcher-26-thread-1) [    ] o.e.j.s.AbstractConnector Started ServerConnector@24f2b7d1{SSL,[ssl, http/1.1]}{127.0.0.1:37161}
   [junit4]   2> 33437 INFO  (jetty-launcher-26-thread-3) [    ] o.e.j.s.Server Started @33472ms
   [junit4]   2> 33437 INFO  (jetty-launcher-26-thread-4) [    ] o.e.j.s.Server Started @33472ms
   [junit4]   2> 33437 INFO  (jetty-launcher-26-thread-1) [    ] o.e.j.s.Server Started @33472ms
   [junit4]   2> 33437 INFO  (jetty-launcher-26-thread-3) [    ] o.a.s.c.s.e.JettySolrRunner Jetty properties: {hostContext=/solr, hostPort=39713}
   [junit4]   2> 33437 INFO  (jetty-launcher-26-thread-4) [    ] o.a.s.c.s.e.JettySolrRunner Jetty properties: {hostContext=/solr, hostPort=37443}
   [junit4]   2> 33437 INFO  (jetty-launcher-26-thread-1) [    ] o.a.s.c.s.e.JettySolrRunner Jetty properties: {hostContext=/solr, hostPort=37161}
   [junit4]   2> 33437 ERROR (jetty-launcher-26-thread-3) [    ] o.a.s.u.StartupLoggingUtils Missing Java Option solr.log.dir. Logging may be missing or incomplete.
   [junit4]   2> 33437 ERROR (jetty-launcher-26-thread-1) [    ] o.a.s.u.StartupLoggingUtils Missing Java Option solr.log.dir. Logging may be missing or incomplete.
   [junit4]   2> 33437 ERROR (jetty-launcher-26-thread-4) [    ] o.a.s.u.StartupLoggingUtils Missing Java Option solr.log.dir. Logging may be missing or incomplete.
   [junit4]   2> 33437 INFO  (jetty-launcher-26-thread-3) [    ] o.a.s.s.SolrDispatchFilter Using logger factory org.apache.logging.slf4j.Log4jLoggerFactory
   [junit4]   2> 33437 INFO  (jetty-launcher-26-thread-1) [    ] o.a.s.s.SolrDispatchFilter Using logger factory org.apache.logging.slf4j.Log4jLoggerFactory
   [junit4]   2> 33437 INFO  (jetty-launcher-26-thread-4) [    ] o.a.s.s.SolrDispatchFilter Using logger factory org.apache.logging.slf4j.Log4jLoggerFactory
   [junit4]   2> 33437 INFO  (jetty-launcher-26-thread-4) [    ] o.a.s.s.SolrDispatchFilter  ___      _       Welcome to Apache Solr? version 8.0.0
   [junit4]   2> 33437 INFO  (jetty-launcher-26-thread-3) [    ] o.a.s.s.SolrDispatchFilter  ___      _       Welcome to Apache Solr? version 8.0.0
   [junit4]   2> 33437 INFO  (jetty-launcher-26-thread-4) [    ] o.a.s.s.SolrDispatchFilter / __| ___| |_ _   Starting in cloud mode on port null
   [junit4]   2> 33437 INFO  (jetty-launcher-26-thread-3) [    ] o.a.s.s.SolrDispatchFilter / __| ___| |_ _   Starting in cloud mode on port null
   [junit4]   2> 33437 INFO  (jetty-launcher-26-thread-4) [    ] o.a.s.s.SolrDispatchFilter \__ \/ _ \ | '_|  Install dir: null
   [junit4]   2> 33437 INFO  (jetty-launcher-26-thread-1) [    ] o.a.s.s.SolrDispatchFilter  ___      _       Welcome to Apache Solr? version 8.0.0
   [junit4]   2> 33437 INFO  (jetty-launcher-26-thread-3) [    ] o.a.s.s.SolrDispatchFilter \__ \/ _ \ | '_|  Install dir: null
   [junit4]   2> 33438 INFO  (jetty-launcher-26-thread-1) [    ] o.a.s.s.SolrDispatchFilter / __| ___| |_ _   Starting in cloud mode on port null
   [junit4]   2> 33438 INFO  (jetty-launcher-26-thread-4) [    ] o.a.s.s.SolrDispatchFilter |___/\___/_|_|    Start time: 2018-09-30T19:00:07.740Z
   [junit4]   2> 33438 INFO  (jetty-launcher-26-thread-1) [    ] o.a.s.s.SolrDispatchFilter \__ \/ _ \ | '_|  Install dir: null
   [junit4]   2> 33438 INFO  (jetty-launcher-26-thread-3) [    ] o.a.s.s.SolrDispatchFilter |___/\___/_|_|    Start time: 2018-09-30T19:00:07.741Z
   [junit4]   2> 33438 INFO  (jetty-launcher-26-thread-1) [    ] o.a.s.s.SolrDispatchFilter |___/\___/_|_|    Start time: 2018-09-30T19:00:07.741Z
   [junit4]   2> 33440 INFO  (zkConnectionManagerCallback-35-thread-1) [    ] o.a.s.c.c.ConnectionManager zkClient has connected
   [junit4]   2> 33440 INFO  (zkConnectionManagerCallback-31-thread-1) [    ] o.a.s.c.c.ConnectionManager zkClient has connected
   [junit4]   2> 33442 INFO  (jetty-launcher-26-thread-3) [    ] o.a.s.s.SolrDispatchFilter solr.xml found in ZooKeeper. Loading...
   [junit4]   2> 33442 INFO  (zkConnectionManagerCallback-34-thread-1) [    ] o.a.s.c.c.ConnectionManager zkClient has connected
   [junit4]   2> 33443 INFO  (jetty-launcher-26-thread-2) [    ] o.a.s.s.SolrDispatchFilter solr.xml found in ZooKeeper. Loading...
   [junit4]   2> 33443 INFO  (zkConnectionManagerCallback-37-thread-1) [    ] o.a.s.c.c.ConnectionManager zkClient has connected
   [junit4]   2> 33444 INFO  (jetty-launcher-26-thread-1) [    ] o.a.s.s.SolrDispatchFilter solr.xml found in ZooKeeper. Loading...
   [junit4]   2> 33444 INFO  (jetty-launcher-26-thread-4) [    ] o.a.s.s.SolrDispatchFilter solr.xml found in ZooKeeper. Loading...
   [junit4]   2> 33553 INFO  (jetty-launcher-26-thread-2) [    ] o.a.s.c.ZkContainer Zookeeper client=127.0.0.1:37761/solr
   [junit4]   2> 33567 INFO  (jetty-launcher-26-thread-1) [    ] o.a.s.c.ZkContainer Zookeeper client=127.0.0.1:37761/solr
   [junit4]   2> 33568 INFO  (jetty-launcher-26-thread-3) [    ] o.a.s.c.ZkContainer Zookeeper client=127.0.0.1:37761/solr
   [junit4]   2> 33569 INFO  (jetty-launcher-26-thread-4) [    ] o.a.s.c.ZkContainer Zookeeper client=127.0.0.1:37761/solr
   [junit4]   2> 33641 INFO  (zkConnectionManagerCallback-49-thread-1) [    ] o.a.s.c.c.ConnectionManager zkClient has connected
   [junit4]   2> 33653 INFO  (zkConnectionManagerCallback-53-thread-1) [    ] o.a.s.c.c.ConnectionManager zkClient has connected
   [junit4]   2> 33672 INFO  (zkConnectionManagerCallback-50-thread-1) [    ] o.a.s.c.c.ConnectionManager zkClient has connected
   [junit4]   2> 33676 INFO  (zkConnectionManagerCallback-51-thread-1) [    ] o.a.s.c.c.ConnectionManager zkClient has connected
   [junit4]   2> 33682 DEBUG (jetty-launcher-26-thread-1) [n:127.0.0.1:37161_solr    ] o.a.s.c.ZkController Added new OnReconnect listener org.apache.solr.cloud.ZkController$$Lambda$360/915898995@7c2f5c36
   [junit4]   2> 33682 DEBUG (jetty-launcher-26-thread-3) [n:127.0.0.1:39713_solr    ] o.a.s.c.ZkController Added new OnReconnect listener org.apache.solr.cloud.ZkController$$Lambda$360/915898995@7f9bd6a
   [junit4]   2> 33682 WARN  (NIOServerCxn.Factory:0.0.0.0/0.0.0.0:0) [    ] o.a.z.s.NIOServerCnxn Unable to read additional data from client sessionid 0x100ea3a3cb30008, likely client has closed socket
   [junit4]   2> 33682 DEBUG (jetty-launcher-26-thread-2) [n:127.0.0.1:44801_solr    ] o.a.s.c.ZkController Added new OnReconnect listener org.apache.solr.cloud.ZkController$$Lambda$360/915898995@217b4913
   [junit4]   2> 33684 DEBUG (jetty-launcher-26-thread-4) [n:127.0.0.1:37443_solr    ] o.a.s.c.ZkController Added new OnReconnect listener org.apache.solr.cloud.ZkController$$Lambda$360/915898995@69bfab72
   [junit4]   2> 33732 INFO  (zkConnectionManagerCallback-61-thread-1) [    ] o.a.s.c.c.ConnectionManager zkClient has connected
   [junit4]   2> 33754 INFO  (zkConnectionManagerCallback-55-thread-1) [    ] o.a.s.c.c.ConnectionManager zkClient has connected
   [junit4]   2> 33754 INFO  (zkConnectionManagerCallback-57-thread-1) [    ] o.a.s.c.c.ConnectionManager zkClient has connected
   [junit4]   2> 33785 INFO  (zkConnectionManagerCallback-59-thread-1) [    ] o.a.s.c.c.ConnectionManager zkClient has connected
   [junit4]   2> 34084 DEBUG (SyncThread:0) [    ] o.a.s.c.ZkTestServer Watch added: data: /solr/clusterprops.json
   [junit4]   2> 34087 DEBUG (SyncThread:0) [    ] o.a.s.c.ZkTestServer Watch added: data: /solr/clusterprops.json
   [junit4]   2> 34101 DEBUG (SyncThread:0) [    ] o.a.s.c.ZkTestServer Watch added: children: /solr/live_nodes
   [junit4]   2> 34101 DEBUG (SyncThread:0) [    ] o.a.s.c.ZkTestServer Watch added: children: /solr/live_nodes
   [junit4]   2> 34103 DEBUG (SyncThread:0) [    ] o.a.s.c.ZkTestServer Watch added: data: /solr/clusterprops.json
   [junit4]   2> 34103 DEBUG (SyncThread:0) [    ] o.a.s.c.ZkTestServer Watch added: data: /solr/clusterstate.json
   [junit4]   2> 34103 DEBUG (SyncThread:0) [    ] o.a.s.c.ZkTestServer Watch added: data: /solr/clusterstate.json
   [junit4]   2> 34103 DEBUG (SyncThread:0) [    ] o.a.s.c.ZkTestServer Watch added: children: /solr/live_nodes
   [junit4]   2> 34104 DEBUG (SyncThread:0) [    ] o.a.s.c.ZkTestServer Watch added: data: /solr/clusterstate.json
   [junit4]   2> 34107 DEBUG (SyncThread:0) [    ] o.a.s.c.ZkTestServer Watch added: children: /solr/collections
   [junit4]   2> 34108 DEBUG (SyncThread:0) [    ] o.a.s.c.ZkTestServer Watch added: children: /solr/collections
   [junit4]   2> 34108 DEBUG (SyncThread:0) [    ] o.a.s.c.ZkTestServer Watch added: children: /solr/collections
   [junit4]   2> 34109 DEBUG (SyncThread:0) [    ] o.a.s.c.ZkTestServer Watch added: create/delete: /solr/aliases.json
   [junit4]   2> 34110 DEBUG (SyncThread:0) [    ] o.a.s.c.ZkTestServer Watch added: create/delete: /solr/aliases.json
   [junit4]   2> 34110 DEBUG (SyncThread:0) [    ] o.a.s.c.ZkTestServer Watch added: create/delete: /solr/aliases.json
   [junit4]   2> 34114 DEBUG (SyncThread:0) [    ] o.a.s.c.ZkTestServer Watch added: data: /solr/clusterprops.json
   [junit4]   2> 34115 DEBUG (SyncThread:0) [    ] o.a.s.c.ZkTestServer Watch added: children: /solr/live_nodes
   [junit4]   2> 34115 DEBUG (SyncThread:0) [    ] o.a.s.c.ZkTestServer Watch added: data: /solr/clusterstate.json
   [junit4]   2> 34117 DEBUG (SyncThread:0) [    ] o.a.s.c.ZkTestServer Watch added: create/delete: /solr/security.json
   [junit4]   2> 34117 DEBUG (SyncThread:0) [    ] o.a.s.c.ZkTestServer Watch added: create/delete: /solr/security.json
   [junit4]   2> 34117 DEBUG (SyncThread:0) [    ] o.a.s.c.ZkTestServer Watch added: children: /solr/collections
   [junit4]   2> 34117 DEBUG (SyncThread:0) [    ] o.a.s.c.ZkTestServer Watch added: create/delete: /solr/security.json
   [junit4]   2> 34118 DEBUG (SyncThread:0) [    ] o.a.s.c.ZkTestServer Watch added: create/delete: /solr/aliases.json
   [junit4]   2> 34119 DEBUG (SyncThread:0) [    ] o.a.s.c.ZkTestServer Watch added: create/delete: /solr/security.json
   [junit4]   2> 34130 DEBUG (jetty-launcher-26-thread-2) [n:127.0.0.1:44801_solr    ] o.a.s.c.LeaderElector Joined leadership election with path: /overseer_elect/election/72315129885294601-127.0.0.1:44801_solr-n_0000000000
   [junit4]   2> 34131 INFO  (jetty-launcher-26-thread-2) [n:127.0.0.1:44801_solr    ] o.a.s.c.OverseerElectionContext I am going to be the leader 127.0.0.1:44801_solr
   [junit4]   2> 34132 DEBUG (jetty-launcher-26-thread-4) [n:127.0.0.1:37443_solr    ] o.a.s.c.LeaderElector Joined leadership election with path: /overseer_elect/election/72315129885294602-127.0.0.1:37443_solr-n_0000000001
   [junit4]   2> 34134 DEBUG (jetty-launcher-26-thread-1) [n:127.0.0.1:37161_solr    ] o.a.s.c.LeaderElector Joined leadership election with path: /overseer_elect/election/72315129885294604-127.0.0.1:37161_solr-n_0000000002
   [junit4]   2> 34134 DEBUG (SyncThread:0) [    ] o.a.s.c.ZkTestServer Watch added: data: /solr/overseer_elect/election/72315129885294601-127.0.0.1:44801_solr-n_0000000000
   [junit4]   2> 34134 DEBUG (jetty-launcher-26-thread-4) [n:127.0.0.1:37443_solr    ] o.a.s.c.LeaderElector Watching path /overseer_elect/election/72315129885294601-127.0.0.1:44801_solr-n_0000000000 to know if I could be the leader
   [junit4]   2> 34135 DEBUG (SyncThread:0) [    ] o.a.s.c.ZkTestServer Watch added: data: /solr/overseer_elect/election/72315129885294602-127.0.0.1:37443_solr-n_0000000001
   [junit4]   2> 34135 DEBUG (jetty-launcher-26-thread-1) [n:127.0.0.1:37161_solr    ] o.a.s.c.LeaderElector Watching path /overseer_elect/election/72315129885294602-127.0.0.1:37443_solr-n_0000000001 to know if I could be the leader
   [junit4]   2> 34135 DEBUG (jetty-launcher-26-thread-3) [n:127.0.0.1:39713_solr    ] o.a.s.c.LeaderElector Joined leadership election with path: /overseer_elect/election/72315129885294603-127.0.0.1:39713_solr-n_0000000003
   [junit4]   2> 34135 INFO  (jetty-launcher-26-thread-2) [n:127.0.0.1:44801_solr    ] o.a.s.c.Overseer Overseer (id=72315129885294601-127.0.0.1:44801_solr-n_0000000000) starting
   [junit4]   2> 34135 INFO  (jetty-launcher-26-thread-4) [n:127.0.0.1:37443_solr    ] o.a.s.c.ZkController Register node as live in ZooKeeper:/live_nodes/127.0.0.1:37443_solr
   [junit4]   2> 34135 INFO  (jetty-launcher-26-thread-1) [n:127.0.0.1:37161_solr    ] o.a.s.c.ZkController Register node as live in ZooKeeper:/live_nodes/127.0.0.1:37161_solr
   [junit4]   2> 34137 DEBUG (SyncThread:0) [    ] o.a.s.c.ZkTestServer Watch added: data: /solr/overseer_elect/election/72315129885294604-127.0.0.1:37161_solr-n_0000000002
   [junit4]   2> 34138 DEBUG (jetty-launcher-26-thread-3) [n:127.0.0.1:39713_solr    ] o.a.s.c.LeaderElector Watching path /overseer_elect/election/72315129885294604-127.0.0.1:37161_solr-n_0000000002 to know if I could be the leader
   [junit4]   2> 34139 INFO  (jetty-launcher-26-thread-3) [n:127.0.0.1:39713_solr    ] o.a.s.c.ZkController Register node as live in ZooKeeper:/live_nodes/127.0.0.1:39713_solr
   [junit4]   2> 34154 DEBUG (SyncThread:0) [    ] o.a.s.c.ZkTestServer Watch fired: children: /solr/live_nodes
   [junit4]   2> 34155 DEBUG (SyncThread:0) [    ] o.a.s.c.ZkTestServer Watch fired: children: /solr/live_nodes
   [junit4]   2> 34155 DEBUG (SyncThread:0) [    ] o.a.s.c.ZkTestServer Watch fired: children: /solr/live_nodes
   [junit4]   2> 34155 DEBUG (SyncThread:0) [    ] o.a.s.c.ZkTestServer Watch fired: children: /solr/live_nodes
   [junit4]   2> 34166 DEBUG (SyncThread:0) [    ] o.a.s.c.ZkTestServer Watch added: children: /solr/live_nodes
   [junit4]   2> 34188 INFO  (zkCallback-60-thread-1) [    ] o.a.s.c.c.ZkStateReader Updated live nodes from ZooKeeper... (0) -> (3)
   [junit4]   2> 34189 DEBUG (SyncThread:0) [    ] o.a.s.c.ZkTestServer Watch added: children: /solr/live_nodes
   [junit4]   2> 34192 INFO  (zkCallback-54-thread-1) [    ] o.a.s.c.c.ZkStateReader Updated live nodes from ZooKeeper... (0) -> (3)
   [junit4]   2> 34192 DEBUG (SyncThread:0) [    ] o.a.s.c.ZkTestServer Watch added: children: /solr/live_nodes
   [junit4]   2> 34198 INFO  (zkCallback-58-thread-1) [    ] o.a.s.c.c.ZkStateReader Updated live nodes from ZooKeeper... (0) -> (3)
   [junit4]   2> 34238 DEBUG (SyncThread:0) [    ] o.a.s.c.ZkTestServer Watch added: children: /solr/live_nodes
   [junit4]   2> 34241 INFO  (zkCallback-56-thread-1) [    ] o.a.s.c.c.ZkStateReader Updated live nodes from ZooKeeper... (0) -> (3)
   [junit4]   2> 34347 INFO  (zkConnectionManagerCallback-85-thread-1) [    ] o.a.s.c.c.ConnectionManager zkClient has connected
   [junit4]   2> 34347 INFO  (zkConnectionManagerCallback-81-thread-1) [    ] o.a.s.c.c.ConnectionManager zkClient has connected
   [junit4]   2> 34348 INFO  (zkConnectionManagerCallback-89-thread-1) [    ] o.a.s.c.c.ConnectionManager zkClient has connected
   [junit4]   2> 34348 DEBUG (SyncThread:0) [    ] o.a.s.c.ZkTestServer Watch added: data: /solr/clusterprops.json
   [junit4]   2> 34349 DEBUG (SyncThread:0) [    ] o.a.s.c.ZkTestServer Watch added: children: /solr/live_nodes
   [junit4]   2> 34349 INFO  (jetty-launcher-26-thread-4) [n:127.0.0.1:37443_solr    ] o.a.s.c.c.ZkStateReader Updated live nodes from ZooKeeper... (0) -> (3)
   [junit4]   2> 34349 DEBUG (SyncThread:0) [    ] o.a.s.c.ZkTestServer Watch added: data: /solr/clusterstate.json
   [junit4]   2> 34349 DEBUG (SyncThread:0) [    ] o.a.s.c.ZkTestServer Watch added: children: /solr/collections
   [junit4]   2> 34349 DEBUG (SyncThread:0) [    ] o.a.s.c.ZkTestServer Watch added: create/delete: /solr/aliases.json
   [junit4]   2> 34350 INFO  (zkConnectionManagerCallback-77-thread-1) [    ] o.a.s.c.c.ConnectionManager zkClient has connected
   [junit4]   2> 34351 INFO  (jetty-launcher-26-thread-4) [n:127.0.0.1:37443_solr    ] o.a.s.c.s.i.ZkClientClusterStateProvider Cluster at 127.0.0.1:37761/solr ready
   [junit4]   2> 34351 DEBUG (SyncThread:0) [    ] o.a.s.c.ZkTestServer Watch added: data: /solr/clusterprops.json
   [junit4]   2> 34352 DEBUG (SyncThread:0) [    ] o.a.s.c.ZkTestServer Watch added: children: /solr/live_nodes
   [junit4]   2> 34354 INFO  (jetty-launcher-26-thread-3) [n:127.0.0.1:39713_solr    ] o.a.s.c.c.ZkStateReader Updated live nodes from ZooKeeper... (0) -> (3)
   [junit4]   2> 34354 DEBUG (SyncThread:0) [    ] o.a.s.c.ZkTestServer Watch added: data: /solr/clusterprops.json
   [junit4]   2> 34354 DEBUG (SyncThread:0) [    ] o.a.s.c.ZkTestServer Watch added: data: /solr/clusterprops.json
   [junit4]   2> 34354 DEBUG (SyncThread:0) [    ] o.a.s.c.ZkTestServer Watch added: children: /solr/live_nodes
   [junit4]   2> 34354 INFO  (jetty-launcher-26-thread-1) [n:127.0.0.1:37161_solr    ] o.a.s.c.c.ZkStateReader Updated live nodes from ZooKeeper... (0) -> (3)
   [junit4]   2> 34355 DEBUG (SyncThread:0) [    ] o.a.s.c.ZkTestServer Watch added: data: /solr/clusterstate.json
   [junit4]   2> 34355 DEBUG (SyncThread:0) [    ] o.a.s.c.ZkTestServer Watch added: children: /solr/live_nodes
   [junit4]   2> 34355 INFO  (jetty-launcher-26-thread-2) [n:127.0.0.1:44801_solr    ] o.a.s.c.c.ZkStateReader Updated live nodes from ZooKeeper... (0) -> (3)
   [junit4]   2> 34355 DEBUG (SyncThread:0) [    ] o.a.s.c.ZkTestServer Watch added: data: /solr/clusterstate.json
   [junit4]   2> 34355 DEBUG (SyncThread:0) [    ] o.a.s.c.ZkTestServer Watch added: children: /solr/collections
   [junit4]   2> 34356 DEBUG (SyncThread:0) [    ] o.a.s.c.ZkTestServer Watch added: children: /solr/collections
   [junit4]   2> 34356 DEBUG (SyncThread:0) [    ] o.a.s.c.ZkTestServer Watch added: create/delete: /solr/aliases.json
   [junit4]   2> 34356 INFO  (jetty-launcher-26-thread-1) [n:127.0.0.1:37161_solr    ] o.a.s.c.s.i.ZkClientClusterStateProvider Cluster at 127.0.0.1:37761/solr ready
   [junit4]   2> 34356 DEBUG (SyncThread:0) [    ] o.a.s.c.ZkTestServer Watch added: data: /solr/clusterstate.json
   [junit4]   2> 34356 DEBUG (SyncThread:0) [    ] o.a.s.c.ZkTestServer Watch added: create/delete: /solr/aliases.json
   [junit4]   2> 34356 DEBUG (SyncThread:0) [    ] o.a.s.c.ZkTestServer Watch added: children: /solr/collections
   [junit4]   2> 34357 DEBUG (SyncThread:0) [    ] o.a.s.c.ZkTestServer Watch added: create/delete: /solr/aliases.json
   [junit4]   2> 34357 INFO  (jetty-launcher-26-thread-2) [n:127.0.0.1:44801_solr    ] o.a.s.c.s.i.ZkClientClusterStateProvider Cluster at 127.0.0.1:37761/solr ready
   [junit4]   2> 34357 INFO  (jetty-launcher-26-thread-1) [n:127.0.0.1:37161_solr    ] o.a.s.h.a.MetricsHistoryHandler No .system collection, keeping metrics history in memory.
   [junit4]   2> 34358 INFO  (jetty-launcher-26-thread-3) [n:127.0.0.1:39713_solr    ] o.a.s.c.s.i.ZkClientClusterStateProvider Cluster at 127.0.0.1:37761/solr ready
   [junit4]   2> 34380 INFO  (jetty-launcher-26-thread-3) [n:127.0.0.1:39713_solr    ] o.a.s.h.a.MetricsHistoryHandler No .system collection, keeping metrics history in memory.
   [junit4]   2> 34392 INFO  (jetty-launcher-26-thread-4) [n:127.0.0.1:37443_solr    ] o.a.s.h.a.MetricsHistoryHandler No .system collection, keeping metrics history in memory.
   [junit4]   2> 34401 INFO  (jetty-launcher-26-thread-1) [n:127.0.0.1:37161_solr    ] o.a.s.m.r.SolrJmxReporter JMX monitoring for 'solr_37161.solr.node' (registry 'solr.node') enabled at server: com.sun.jmx.mbeanserver.JmxMBeanServer@61fbb11d
   [junit4]   2> 34428 INFO  (jetty-launcher-26-thread-3) [n:127.0.0.1:39713_solr    ] o.a.s.m.r.SolrJmxReporter JMX monitoring for 'solr_39713.solr.node' (registry 'solr.node') enabled at server: com.sun.jmx.mbeanserver.JmxMBeanServer@61fbb11d
   [junit4]   2> 34437 INFO  (jetty-launcher-26-thread-3) [n:127.0.0.1:39713_solr    ] o.a.s.m.r.SolrJmxReporter JMX monitoring for 'solr_39713.solr.jvm' (registry 'solr.jvm') enabled at server: com.sun.jmx.mbeanserver.JmxMBeanServer@61fbb11d
   [junit4]   2> 34437 INFO  (jetty-launcher-26-thread-3) [n:127.0.0.1:39713_solr    ] o.a.s.m.r.SolrJmxReporter JMX monitoring for 'solr_39713.solr.jetty' (registry 'solr.jetty') enabled at server: com.sun.jmx.mbeanserver.JmxMBeanServer@61fbb11d
   [junit4]   2> 34439 INFO  (jetty-launcher-26-thread-3) [n:127.0.0.1:39713_solr    ] o.a.s.c.CorePropertiesLocator Found 0 core definitions underneath /home/jenkins/workspace/Lucene-Solr-master-Linux/solr/build/solr-core/test/J0/temp/solr.cloud.MoveReplicaHDFSTest_3595E06E3BCFD858-001/tempDir-001/node3/.
   [junit4]   2> 34441 INFO  (jetty-launcher-26-thread-4) [n:127.0.0.1:37443_solr    ] o.a.s.m.r.SolrJmxReporter JMX monitoring for 'solr_37443.solr.node' (registry 'solr.node') enabled at server: com.sun.jmx.mbeanserver.JmxMBeanServer@61fbb11d
   [junit4]   2> 34457 INFO  (jetty-launcher-26-thread-1) [n:127.0.0.1:37161_solr    ] o.a.s.m.r.SolrJmxReporter JMX monitoring for 'solr_37161.solr.jvm' (registry 'solr.jvm') enabled at server: com.sun.jmx.mbeanserver.JmxMBeanServer@61fbb11d
   [junit4]   2> 34457 INFO  (jetty-launcher-26-thread-1) [n:127.0.0.1:37161_solr    ] o.a.s.m.r.SolrJmxReporter JMX monitoring for 'solr_37161.solr.jetty' (registry 'solr.jetty') enabled at server: com.sun.jmx.mbeanserver.JmxMBeanServer@61fbb11d
   [junit4]   2> 34460 INFO  (jetty-launcher-26-thread-1) [n:127.0.0.1:37161_solr    ] o.a.s.c.CorePropertiesLocator Found 0 core definitions underneath /home/jenkins/workspace/Lucene-Solr-master-Linux/solr/build/solr-core/test/J0/temp/solr.cloud.MoveReplicaHDFSTest_3595E06E3BCFD858-001/tempDir-001/node1/.
   [junit4]   2> 34463 INFO  (jetty-launcher-26-thread-4) [n:127.0.0.1:37443_solr    ] o.a.s.m.r.SolrJmxReporter JMX monitoring for 'solr_37443.solr.jvm' (registry 'solr.jvm') enabled at server: com.sun.jmx.mbeanserver.JmxMBeanServer@61fbb11d
   [junit4]   2> 34463 INFO  (jetty-launcher-26-thread-4) [n:127.0.0.1:37443_solr    ] o.a.s.m.r.SolrJmxReporter JMX monitoring for 'solr_37443.solr.jetty' (registry 'solr.jetty') enabled at server: com.sun.jmx.mbeanserver.JmxMBeanServer@61fbb11d
   [junit4]   2> 34464 INFO  (jetty-launcher-26-thread-4) [n:127.0.0.1:37443_solr    ] o.a.s.c.CorePropertiesLocator Found 0 core definitions underneath /home/jenkins/workspace/Lucene-Solr-master-Linux/solr/build/solr-core/test/J0/temp/solr.cloud.MoveReplicaHDFSTest_3595E06E3BCFD858-001/tempDir-001/node4/.
   [junit4]   2> 34519 INFO  (OverseerStateUpdate-72315129885294601-127.0.0.1:44801_solr-n_0000000000) [n:127.0.0.1:44801_solr    ] o.a.s.c.Overseer Starting to work on the main queue : 127.0.0.1:44801_solr
   [junit4]   2> 34524 DEBUG (SyncThread:0) [    ] o.a.s.c.ZkTestServer Watch added: children: /solr/overseer/queue-work
   [junit4]   2> 34525 DEBUG (SyncThread:0) [    ] o.a.s.c.ZkTestServer Watch added: children: /solr/overseer/queue
   [junit4]   2> 34532 DEBUG (OverseerCollectionConfigSetProcessor-72315129885294601-127.0.0.1:44801_solr-n_0000000000) [n:127.0.0.1:44801_solr    ] o.a.s.c.OverseerTaskProcessor Process current queue of overseer operations
   [junit4]   2> 34536 DEBUG (OverseerCollectionConfigSetProcessor-72315129885294601-127.0.0.1:44801_solr-n_0000000000) [n:127.0.0.1:44801_solr    ] o.a.s.c.OverseerTaskProcessor Cleaning up work-queue. #Running tasks: 0
   [junit4]   2> 34536 DEBUG (OverseerCollectionConfigSetProcessor-72315129885294601-127.0.0.1:44801_solr-n_0000000000) [n:127.0.0.1:44801_solr    ] o.a.s.c.OverseerTaskProcessor RunningTasks: []
   [junit4]   2> 34536 DEBUG (OverseerCollectionConfigSetProcessor-72315129885294601-127.0.0.1:44801_solr-n_0000000000) [n:127.0.0.1:44801_solr    ] o.a.s.c.OverseerTaskProcessor BlockedTasks: []
   [junit4]   2> 34536 DEBUG (OverseerCollectionConfigSetProcessor-72315129885294601-127.0.0.1:44801_solr-n_0000000000) [n:127.0.0.1:44801_solr    ] o.a.s.c.OverseerTaskProcessor CompletedTasks: []
   [junit4]   2> 34536 DEBUG (OverseerCollectionConfigSetProcessor-72315129885294601-127.0.0.1:44801_solr-n_0000000000) [n:127.0.0.1:44801_solr    ] o.a.s.c.OverseerTaskProcessor RunningZKTasks: []
   [junit4]   2> 34536 DEBUG (OverseerCollectionConfigSetProcessor-72315129885294601-127.0.0.1:44801_solr-n_0000000000) [n:127.0.0.1:44801_solr    ] o.a.s.c.OverseerTaskQueue Peeking for top 100 elements. ExcludeSet: []
   [junit4]   2> 34538 DEBUG (SyncThread:0) [    ] o.a.s.c.ZkTestServer Watch added: children: /solr/overseer/collection-queue-work
   [junit4]   2> 34549 DEBUG (jetty-launcher-26-thread-2) [n:127.0.0.1:44801_solr    ] o.a.s.c.ZkController Publish node=127.0.0.1:44801_solr as DOWN
   [junit4]   2> 34557 DEBUG (SyncThread:0) [    ] o.a.s.c.ZkTestServer Watch fired: children: /solr/overseer/queue
   [junit4]   2> 34557 INFO  (jetty-launcher-26-thread-2) [n:127.0.0.1:44801_solr    ] o.a.s.c.TransientSolrCoreCacheDefault Allocating transient cache for 2147483647 transient cores
   [junit4]   2> 34557 INFO  (jetty-launcher-26-thread-2) [n:127.0.0.1:44801_solr    ] o.a.s.c.ZkController Register node as live in ZooKeeper:/live_nodes/127.0.0.1:44801_solr
   [junit4]   2> 34559 DEBUG (SyncThread:0) [    ] o.a.s.c.ZkTestServer Watch added: children: /solr/overseer/queue
   [junit4]   2> 34560 DEBUG (SyncThread:0) [    ] o.a.s.c.ZkTestServer Watch fired: children: /solr/live_nodes
   [junit4]   2> 34560 DEBUG (SyncThread:0) [    ] o.a.s.c.ZkTestServer Watch fired: children: /solr/live_nodes
   [junit4]   2> 34560 DEBUG (SyncThread:0) [    ] o.a.s.c.ZkTestServer Watch fired: children: /solr/live_nodes
   [junit4]   2> 34560 DEBUG (SyncThread:0) [    ] o.a.s.c.ZkTestServer Watch fired: children: /solr/live_nodes
   [junit4]   2> 34560 DEBUG (SyncThread:0) [    ] o.a.s.c.ZkTestServer Watch fired: children: /solr/live_nodes
   [junit4]   2> 34560 DEBUG (SyncThread:0) [    ] o.a.s.c.ZkTestServer Watch fired: children: /solr/live_nodes
   [junit4]   2> 34560 DEBUG (SyncThread:0) [    ] o.a.s.c.ZkTestServer Watch fired: children: /solr/live_nodes
   [junit4]   2> 34560 DEBUG (SyncThread:0) [    ] o.a.s.c.ZkTestServer Watch fired: children: /solr/live_nodes
   [junit4]   2> 34560 DEBUG (SyncThread:0) [    ] o.a.s.c.ZkTestServer Watch added: children: /solr/live_nodes
   [junit4]   2> 34560 DEBUG (SyncThread:0) [    ] o.a.s.c.ZkTestServer Watch added: children: /solr/live_nodes
   [junit4]   2> 34560 INFO  (zkCallback-60-thread-1) [    ] o.a.s.c.c.ZkStateReader Updated live nodes from ZooKeeper... (3) -> (4)
   [junit4]   2> 34561 DEBUG (OverseerStateUpdate-72315129885294601-127.0.0.1:44801_solr-n_0000000000) [n:127.0.0.1:44801_solr    ] o.a.s.c.Overseer processMessage: queueSize: 1, message = {
   [junit4]   2>   "operation":"downnode",
   [junit4]   2>   "node_name":"127.0.0.1:44801_solr"} current state version: 0
   [junit4]   2> 34561 INFO  (zkCallback-54-thread-1) [    ] o.a.s.c.c.ZkStateReader Updated live nodes from ZooKeeper... (3) -> (4)
   [junit4]   2> 34569 DEBUG (SyncThread:0) [    ] o.a.s.c.ZkTestServer Watch added: children: /solr/live_nodes
   [junit4]   2> 34569 INFO  (zkCallback-58-thread-1) [    ] o.a.s.c.c.ZkStateReader Updated live nodes from ZooKeeper... (3) -> (4)
   [junit4]   2> 34571 DEBUG (OverseerStateUpdate-72315129885294601-127.0.0.1:44801_solr-n_0000000000) [n:127.0.0.1:44801_solr    ] o.a.s.c.o.NodeMutator DownNode state invoked for node: 127.0.0.1:44801_solr
   [junit4]   2> 34581 DEBUG (SyncThread:0) [    ] o.a.s.c.ZkTestServer Watch added: children: /solr/live_nodes
   [junit4]   2> 34581 DEBUG (SyncThread:0) [    ] o.a.s.c.ZkTestServer Watch added: children: /solr/live_nodes
   [junit4]   2> 34581 DEBUG (SyncThread:0) [    ] o.a.s.c.ZkTestServer Watch added: children: /solr/live_nodes
   [junit4]   2> 34635 INFO  (zkCallback-84-thread-1) [    ] o.a.s.c.c.ZkStateReader Updated live nodes from ZooKeeper... (3) -> (4)
   [junit4]   2> 34635 INFO  (zkCallback-80-thread-1) [    ] o.a.s.c.c.ZkStateReader Updated live nodes from ZooKeeper... (3) -> (4)
   [junit4]   2> 34635 DEBUG (SyncThread:0) [    ] o.a.s.c.ZkTestServer Watch added: children: /solr/live_nodes
   [junit4]   2> 34636 DEBUG (SyncThread:0) [    ] o.a.s.c.ZkTestServer Watch added: children: /solr/live_nodes
   [junit4]   2> 34636 INFO  (zkCallback-76-thread-1) [    ] o.a.s.c.c.ZkStateReader Updated live nodes from ZooKeeper... (3) -> (4)
   [junit4]   2> 34636 INFO  (zkCallback-88-thread-1) [    ] o.a.s.c.c.ZkStateReader Updated live nodes from ZooKeeper... (3) -> (4)
   [junit4]   2> 34646 INFO  (zkCallback-56-thread-1) [    ] o.a.s.c.c.ZkStateReader Updated live nodes from ZooKeeper... (3) -> (4)
   [junit4]   2> 34652 INFO  (jetty-launcher-26-thread-2) [n:127.0.0.1:44801_solr    ] o.a.s.h.a.MetricsHistoryHandler No .system collection, keeping metrics history in memory.
   [junit4]   2> 34671 INFO  (jetty-launcher-26-thread-2) [n:127.0.0.1:44801_solr    ] o.a.s.m.r.SolrJmxReporter JMX monitoring for 'solr_44801.solr.node' (registry 'solr.node') enabled at server: com.sun.jmx.mbeanserver.JmxMBeanServer@61fbb11d
   [junit4]   2> 34676 DEBUG (SyncThread:0) [    ] o.a.s.c.ZkTestServer Watch fired: children: /solr/overseer/queue
   [junit4]   2> 34677 DEBUG (SyncThread:0) [    ] o.a.s.c.ZkTestServer Watch added: children: /solr/overseer/queue
   [junit4]   2> 34683 INFO  (jetty-launcher-26-thread-2) [n:127.0.0.1:44801_solr    ] o.a.s.m.r.SolrJmxReporter JMX monitoring for 'solr_44801.solr.jvm' (registry 'solr.jvm') enabled at server: com.sun.jmx.mbeanserver.JmxMBeanServer@61fbb11d
   [junit4]   2> 34683 INFO  (jetty-launcher-26-thread-2) [n:127.0.0.1:44801_solr    ] o.a.s.m.r.SolrJmxReporter JMX monitoring for 'solr_44801.solr.jetty' (registry 'solr.jetty') enabled at server: com.sun.jmx.mbeanserver.JmxMBeanServer@61fbb11d
   [junit4]   2> 34684 INFO  (jetty-launcher-26-thread-2) [n:127.0.0.1:44801_solr    ] o.a.s.c.CorePropertiesLocator Found 0 core definitions underneath /home/jenkins/workspace/Lucene-Solr-master-Linux/solr/build/solr-core/test/J0/temp/solr.cloud.MoveReplicaHDFSTest_3595E06E3BCFD858-001/tempDir-001/node2/.
   [junit4]   2> 34711 DEBUG (OverseerAutoScalingTriggerThread-72315129885294601-127.0.0.1:44801_solr-n_0000000000) [    ] o.a.s.c.a.OverseerTriggerThread Adding .auto_add_replicas and .scheduled_maintenance triggers
   [junit4]   2> 34724 DEBUG (SyncThread:0) [    ] o.a.s.c.ZkTestServer Watch added: data: /solr/autoscaling.json
   [junit4]   2> 34724 DEBUG (OverseerAutoScalingTriggerThread-72315129885294601-127.0.0.1:44801_solr-n_0000000000) [    ] o.a.s.c.a.OverseerTriggerThread Refreshing /autoscaling.json with znode version 1
   [junit4]   2> 34776 INFO  (zkConnectionManagerCallback-95-thread-1) [    ] o.a.s.c.c.ConnectionManager zkClient has connected
   [junit4]   2> 34803 INFO  (zkConnectionManagerCallback-100-thread-1) [    ] o.a.s.c.c.ConnectionManager zkClient has connected
   [junit4]   2> 34805 DEBUG (SyncThread:0) [    ] o.a.s.c.ZkTestServer Watch added: data: /solr/clusterprops.json
   [junit4]   2> 34805 DEBUG (SyncThread:0) [    ] o.a.s.c.ZkTestServer Watch added: children: /solr/live_nodes
   [junit4]   2> 34806 INFO  (SUITE-MoveReplicaHDFSTest-seed#[3595E06E3BCFD858]-worker) [    ] o.a.s.c.c.ZkStateReader Updated live nodes from ZooKeeper... (0) -> (4)
   [junit4]   2> 34806 DEBUG (SyncThread:0) [    ] o.a.s.c.ZkTestServer Watch added: data: /solr/clusterstate.json
   [junit4]   2> 34807 DEBUG (SyncThread:0) [    ] o.a.s.c.ZkTestServer Watch added: children: /solr/collections
   [junit4]   2> 34807 DEBUG (SyncThread:0) [    ] o.a.s.c.ZkTestServer Watch added: create/delete: /solr/aliases.json
   [junit4]   2> 34808 INFO  (SUITE-MoveReplicaHDFSTest-seed#[3595E06E3BCFD858]-worker) [    ] o.a.s.c.s.i.ZkClientClusterStateProvider Cluster at 127.0.0.1:37761/solr ready
   [junit4]   2> 34844 INFO  (qtp548616201-317) [n:127.0.0.1:44801_solr    ] o.a.s.h.a.CollectionsHandler Invoked Collection Action :overseerstatus with params action=OVERSEERSTATUS&wt=javabin&version=2 and sendToOCPQueue=true
   [junit4]   2> 34844 DEBUG (SyncThread:0) [    ] o.a.s.c.ZkTestServer Watch fired: children: /solr/overseer/collection-queue-work
   [junit4]   2> 34846 DEBUG (SyncThread:0) [    ] o.a.s.c.ZkTestServer Watch added: children: /solr/overseer/collection-queue-work
   [junit4]   2> 34846 DEBUG (SyncThread:0) [    ] o.a.s.c.ZkTestServer Watch added: create/delete: /solr/overseer/collection-queue-work/qnr-0000000000
   [junit4]   2> 34846 DEBUG (OverseerCollectionConfigSetProcessor-72315129885294601-127.0.0.1:44801_solr-n_0000000000) [n:127.0.0.1:44801_solr    ] o.a.s.c.ZkDistributedQueue Found child node with improper name: qnr-0000000000
   [junit4]   2> 34846 DEBUG (SyncThread:0) [    ] o.a.s.c.ZkTestServer Watch fired: children: /solr/overseer/collection-queue-work
   [junit4]   2> 34846 DEBUG (SyncThread:0) [    ] o.a.s.c.ZkTestServer Watch added: children: /solr/overseer/collection-queue-work
   [junit4]   2> 34847 DEBUG (OverseerCollectionConfigSetProcessor-72315129885294601-127.0.0.1:44801_solr-n_0000000000) [n:127.0.0.1:44801_solr    ] o.a.s.c.ZkDistributedQueue Found child node with improper name: qnr-0000000000
   [junit4]   2> 34848 DEBUG (OverseerCollectionConfigSetProcessor-72315129885294601-127.0.0.1:44801_solr-n_0000000000) [n:127.0.0.1:44801_solr    ] o.a.s.c.OverseerTaskQueue Returning topN elements: [/overseer/collection-queue-work/qn-0000000000, ]
   [junit4]   2> 34848 DEBUG (OverseerCollectionConfigSetProcessor-72315129885294601-127.0.0.1:44801_solr-n_0000000000) [n:127.0.0.1:44801_solr    ] o.a.s.c.OverseerTaskProcessor Got 1 tasks from work-queue : [[org.apache.solr.cloud.OverseerTaskQueue$QueueEvent@2e684ecf]]
   [junit4]   2> 34850 DEBUG (OverseerCollectionConfigSetProcessor-72315129885294601-127.0.0.1:44801_solr-n_0000000000) [n:127.0.0.1:44801_solr    ] o.a.s.c.OverseerTaskProcessor Marked task [/overseer/collection-queue-work/qn-0000000000] as running
   [junit4]   2> 34850 DEBUG (OverseerCollectionConfigSetProcessor-72315129885294601-127.0.0.1:44801_solr-n_0000000000) [n:127.0.0.1:44801_solr    ] o.a.s.c.OverseerTaskProcessor Overseer Collection Message Handler: Get the message id:/overseer/collection-queue-work/qn-0000000000 message:{"operation":"overseerstatus"}
   [junit4]   2> 34852 DEBUG (OverseerThreadFactory-208-thread-1-processing-n:127.0.0.1:44801_solr) [n:127.0.0.1:44801_solr    ] o.a.s.c.OverseerTaskProcessor Runner processing /overseer/collection-queue-work/qn-0000000000
   [junit4]   2> 34852 DEBUG (OverseerThreadFactory-208-thread-1-processing-n:127.0.0.1:44801_solr) [n:127.0.0.1:44801_solr    ] o.a.s.c.a.c.OverseerCollectionMessageHandler OverseerCollectionMessageHandler.processMessage : overseerstatus , {"operation":"overseerstatus"}
   [junit4]   2> 34852 DEBUG (OverseerCollectionConfigSetProcessor-72315129885294601-127.0.0.1:44801_solr-n_0000000000) [n:127.0.0.1:44801_solr    ] o.a.s.c.OverseerTaskProcessor Cleaning up work-queue. #Running tasks: 1
   [junit4]   2> 34852 DEBUG (OverseerCollectionConfigSetProcessor-72315129885294601-127.0.0.1:44801_solr-n_0000000000) [n:127.0.0.1:44801_solr    ] o.a.s.c.OverseerTaskProcessor RunningTasks: [/overseer/collection-queue-work/qn-0000000000]
   [junit4]   2> 34852 DEBUG (OverseerCollectionConfigSetProcessor-72315129885294601-127.0.0.1:44801_solr-n_0000000000) [n:127.0.0.1:44801_solr    ] o.a.s.c.OverseerTaskProcessor BlockedTasks: []
   [junit4]   2> 34852 DEBUG (OverseerCollectionConfigSetProcessor-72315129885294601-127.0.0.1:44801_solr-n_0000000000) [n:127.0.0.1:44801_solr    ] o.a.s.c.OverseerTaskProcessor CompletedTasks: []
   [junit4]   2> 34852 DEBUG (OverseerCollectionConfigSetProcessor-72315129885294601-127.0.0.1:44801_solr-n_0000000000) [n:127.0.0.1:44801_solr    ] o.a.s.c.OverseerTaskProcessor RunningZKTasks: [/overseer/collection-queue-work/qn-0000000000]
   [junit4]   2> 34852 DEBUG (OverseerCollectionConfigSetProcessor-72315129885294601-127.0.0.1:44801_solr-n_0000000000) [n:127.0.0.1:44801_solr    ] o.a.s.c.OverseerTaskQueue Peeking for top 99 elements. ExcludeSet: [/overseer/collection-queue-work/qn-0000000000],[]
   [junit4]   2> 34857 DEBUG (OverseerAutoScalingTriggerThread-72315129885294601-127.0.0.1:44801_solr-n_0000000000) [    ] o.a.s.c.a.OverseerTriggerThread Current znodeVersion 1, lastZnodeVersion -1
   [junit4]   2> 34857 DEBUG (OverseerAutoScalingTriggerThread-72315129885294601-127.0.0.1:44801_solr-n_0000000000) [    ] o.a.s.c.a.OverseerTriggerThread Processed trigger updates upto znodeVersion 1
   [junit4]   2> 34869 DEBUG (OverseerThreadFactory-208-thread-1-processing-n:127.0.0.1:44801_solr) [n:127.0.0.1:44801_solr    ] o.a.s.c.OverseerTaskProcessor Completed task:[/overseer/collection-queue-work/qn-0000000000]
   [junit4]   2> 34870 DEBUG (SyncThread:0) [    ] o.a.s.c.ZkTestServer Watch added: children: /solr/autoscaling/events/.scheduled_maintenance
   [junit4]   2> 34870 DEBUG (SyncThread:0) [    ] o.a.s.c.ZkTestServer Watch fired: data: /solr/overseer/collection-queue-work/qnr-0000000000
   [junit4]   2> 34870 DEBUG (zkCallback-54-thread-1) [    ] o.a.s.c.OverseerTaskQueue NodeDataChanged fired on path /overseer/collection-queue-work/qnr-0000000000 state SyncConnected latchEventType null
   [junit4]   2> 34872 DEBUG (SyncThread:0) [    ] o.a.s.c.ZkTestServer Watch fired: children: /solr/overseer/collection-queue-work
   [junit4]   2> 34872 DEBUG (OverseerThreadFactory-208-thread-1-processing-n:127.0.0.1:44801_solr) [n:127.0.0.1:44801_solr    ] o.a.s.c.OverseerTaskProcessor Marked task [/overseer/collection-queue-work/qn-0000000000] as completed.
   [junit4]   2> 34872 DEBUG (OverseerThreadFactory-208-thread-1-processing-n:127.0.0.1:44801_solr) [n:127.0.0.1:44801_solr    ] o.a.s.c.OverseerTaskProcessor RunningTasks: []
   [junit4]   2> 34872 DEBUG (OverseerThreadFactory-208-thread-1-processing-n:127.0.0.1:44801_solr) [n:127.0.0.1:44801_solr    ] o.a.s.c.OverseerTaskProcessor BlockedTasks: []
   [junit4]   2> 34872 DEBUG (OverseerThreadFactory-208-thread-1-processing-n:127.0.0.1:44801_solr) [n:127.0.0.1:44801_solr    ] o.a.s.c.OverseerTaskProcessor CompletedTasks: [/overseer/collection-queue-work/qn-0000000000]
   [junit4]   2> 34873 DEBUG (OverseerThreadFactory-208-thread-1-processing-n:127.0.0.1:44801_solr) [n:127.0.0.1:44801_solr    ] o.a.s.c.OverseerTaskProcessor RunningZKTasks: [/overseer/collection-queue-work/qn-0000000000]
   [junit4]   2> 34873 DEBUG (OverseerThreadFactory-208-thread-1-processing-n:127.0.0.1:44801_solr) [n:127.0.0.1:44801_solr    ] o.a.s.c.OverseerTaskProcessor Overseer Collection Message Handler: Message id:/overseer/collection-queue-work/qn-0000000000 complete, response:{leader=127.0.0.1:44801_solr,overseer_queue_size=0,overseer_work_queue_size=0,overseer_collection_queue_size=2,overseer_operations={am_i_leader={requests=3,errors=0,avgRequestsPerSecond=8.86532296916794,5minRateRequestsPerSecond=0.0,15minRateRequestsPerSecond=0.0,avgTimePerRequest=0.8268693333333332,medianRequestTime=0.461195,75thPcRequestTime=1.637331,95thPcRequestTime=1.637331,99thPcRequestTime=1.637331,999thPcRequestTime=1.637331},downnode={requests=1,errors=0,avgRequestsPerSecond=3.416459995890955,5minRateRequestsPerSecond=0.0,15minRateRequestsPerSecond=0.0,avgTimePerRequest=8.598694,medianRequestTime=8.598694,75thPcRequestTime=8.598694,95thPcRequestTime=8.598694,99thPcRequestTime=8.598694,999thPcRequestTime=8.598694}},collection_operations={am_i_leader={requests=3,errors=0,avgRequestsPerSecond=9.290616063414475,5minRateRequestsPerSecond=0.0,15minRateRequestsPerSecond=0.0,avgTimePerRequest=0.43254818538705964,medianRequestTime=0.389245,75thPcRequestTime=0.628631,95thPcRequestTime=0.628631,99thPcRequestTime=0.628631,999thPcRequestTime=0.628631},overseerstatus={requests=0,errors=0,avgRequestsPerSecond=0.0,5minRateRequestsPerSecond=0.0,15minRateRequestsPerSecond=0.0,avgTimePerRequest=0.0,medianRequestTime=0.0,75thPcRequestTime=0.0,95thPcRequestTime=0.0,99thPcRequestTime=0.0,999thPcRequestTime=0.0}},overseer_queue={},overseer_internal_queue={peek={avgRequestsPerSecond=3.0080864885027174,5minRateRequestsPerSecond=0.0,15minRateRequestsPerSecond=0.0,avgTimePerRequest=1.149759,medianRequestTime=1.149759,75thPcRequestTime=1.149759,95thPcRequestTime=1.149759,99thPcRequestTime=1.149759,999thPcRequestTime=1.149759}},collection_queue={peektopn_wait2000={avgRequestsPerSecond=3.1306165217034687,5minRateRequestsPerSecond=0.0,15minRateRequestsPerSecond=0.0,avgTimePerRequest=311.857173,medianRequestTime=311.857173,75thPcRequestTime=311.857173,95thPcRequestTime=311.857173,99thPcRequestTime=311.857173,999thPcRequestTime=311.857173}}}
   [junit4]   2> 34873 DEBUG (SyncThread:0) [    ] o.a.s.c.ZkTestServer Watch added: children: /solr/overseer/collection-queue-work
   [junit4]   2> 34877 DEBUG (OverseerAutoScalingTriggerThread-72315129885294601-127.0.0.1:44801_solr-n_0000000000) [    ] o.a.s.c.a.NodeLostTrigger NodeLostTrigger .auto_add_replicas - Initial livenodes: [127.0.0.1:44801_solr, 127.0.0.1:37161_solr, 127.0.0.1:39713_solr, 127.0.0.1:37443_solr]
   [junit4]   2> 34877 INFO  (qtp548616201-317) [n:127.0.0.1:44801_solr    ] o.a.s.s.HttpSolrCall [admin] webapp=null path=/admin/collections params={action=OVERSEERSTATUS&wt=javabin&version=2} status=0 QTime=33
   [junit4]   2> 34879 DEBUG (SyncThread:0) [    ] o.a.s.c.ZkTestServer Watch added: children: /solr/autoscaling/events/.auto_add_replicas
   [junit4]   2> 34879 DEBUG (ScheduledTrigger-206-thread-1) [    ] o.a.s.c.a.NodeLostTrigger Running NodeLostTrigger: .auto_add_replicas with currently live nodes: 4
   [junit4]   2> 34880 DEBUG (OverseerAutoScalingTriggerThread-72315129885294601-127.0.0.1:44801_solr-n_0000000000) [    ] o.a.s.c.a.OverseerTriggerThread -- clean old nodeAdded markers
   [junit4]   2> 34881 DEBUG (OverseerAutoScalingTriggerThread-72315129885294601-127.0.0.1:44801_solr-n_0000000000) [    ] o.a.s.c.a.OverseerTriggerThread Current znodeVersion 1, lastZnodeVersion 1
   [junit4]   2> 35444 WARN  (SUITE-MoveReplicaHDFSTest-seed#[3595E06E3BCFD858]-worker) [    ] o.a.h.u.NativeCodeLoader Unable to load native-hadoop library for your platform... using builtin-java classes where applicable
   [junit4]   1> Formatting using clusterid: testClusterID
   [junit4]   2> 35881 DEBUG (ScheduledTrigger-206-thread-3) [    ] o.a.s.c.a.NodeLostTrigger Running NodeLostTrigger: .auto_add_replicas with currently live nodes: 4
   [junit4]   2> 36288 WARN  (SUITE-MoveReplicaHDFSTest-seed#[3595E06E3BCFD858]-worker) [    ] o.a.h.m.i.MetricsConfig Cannot locate configuration: tried hadoop-metrics2-namenode.properties,hadoop-metrics2.properties
   [junit4]   2> 36465 INFO  (SUITE-MoveReplicaHDFSTest-seed#[3595E06E3BCFD858]-worker) [    ] o.m.log Logging to org.apache.logging.slf4j.Log4jLogger@15d732c0 via org.mortbay.log.Slf4jLog
   [junit4]   2> 36493 WARN  (SUITE-MoveReplicaHDFSTest-seed#[3595E06E3BCFD858]-worker) [    ] o.a.h.h.HttpRequestLog Jetty request log can only be enabled using Log4j
   [junit4]   2> 36787 INFO  (SUITE-MoveReplicaHDFSTest-seed#[3595E06E3BCFD858]-worker) [    ] o.m.log jetty-6.1.26
   [junit4]   2> 36818 INFO  (SUITE-MoveReplicaHDFSTest-seed#[3595E06E3BCFD858]-worker) [    ] o.m.log Extract jar:file:/home/jenkins/.ivy2/cache/org.apache.hadoop/hadoop-hdfs/tests/hadoop-hdfs-2.7.4-tests.jar!/webapps/hdfs to ./temp/Jetty_localhost_localdomain_44353_hdfs____1ockmj/webapp
   [junit4]   2> 36854 DEBUG (OverseerCollectionConfigSetProcessor-72315129885294601-127.0.0.1:44801_solr-n_0000000000) [n:127.0.0.1:44801_solr    ] o.a.s.c.OverseerTaskProcessor Got 0 tasks from work-queue : [[]]
   [junit4]   2> 36855 DEBUG (OverseerCollectionConfigSetProcessor-72315129885294601-127.0.0.1:44801_solr-n_0000000000) [n:127.0.0.1:44801_solr    ] o.a.s.c.OverseerTaskProcessor Cleaning up work-queue. #Running tasks: 0
   [junit4]   2> 36855 INFO  (OverseerCollectionConfigSetProcessor-72315129885294601-127.0.0.1:44801_solr-n_0000000000) [n:127.0.0.1:44801_solr    ] o.a.s.c.OverseerTaskQueue Response ZK path: /overseer/collection-queue-work/qnr-0000000000 doesn't exist.  Requestor may have disconnected from ZooKeeper
   [junit4]   2> 36855 DEBUG (OverseerCollectionConfigSetProcessor-72315129885294601-127.0.0.1:44801_solr-n_0000000000) [n:127.0.0.1:44801_solr    ] o.a.s.c.OverseerTaskProcessor RunningTasks: []
   [junit4]   2> 36855 DEBUG (OverseerCollectionConfigSetProcessor-72315129885294601-127.0.0.1:44801_solr-n_0000000000) [n:127.0.0.1:44801_solr    ] o.a.s.c.OverseerTaskProcessor BlockedTasks: []
   [junit4]   2> 36855 DEBUG (OverseerCollectionConfigSetProcessor-72315129885294601-127.0.0.1:44801_solr-n_0000000000) [n:127.0.0.1:44801_solr    ] o.a.s.c.OverseerTaskProcessor CompletedTasks: []
   [junit4]   2> 36855 DEBUG (OverseerCollectionConfigSetProcessor-72315129885294601-127.0.0.1:44801_solr-n_0000000000) [n:127.0.0.1:44801_solr    ] o.a.s.c.OverseerTaskProcessor RunningZKTasks: []
   [junit4]   2> 36855 DEBUG (OverseerCollectionConfigSetProcessor-72315129885294601-127.0.0.1:44801_solr-n_0000000000) [n:127.0.0.1:44801_solr    ] o.a.s.c.OverseerTaskQueue Peeking for top 100 elements. ExcludeSet: []
   [junit4]   2> 36881 DEBUG (ScheduledTrigger-206-thread-4) [    ] o.a.s.c.a.NodeLostTrigger Running NodeLostTrigger: .auto_add_replicas with currently live nodes: 4
   [junit4]   2> 37525 INFO  (SUITE-MoveReplicaHDFSTest-seed#[3595E06E3BCFD858]-worker) [    ] o.m.log Started HttpServer2$SelectChannelConnectorWithSafeStartup@localhost.localdomain:44353
   [junit4]   2> 37881 DEBUG (ScheduledTrigger-206-thread-3) [    ] o.a.s.c.a.NodeLostTrigger Running NodeLostTrigger: .auto_add_replicas with currently live nodes: 4
   [junit4]   2> 38182 WARN  (SUITE-MoveReplicaHDFSTest-seed#[3595E06E3BCFD858]-worker) [    ] o.a.h.h.HttpRequestLog Jetty request log can only be enabled using Log4j
   [junit4]   2> 38185 INFO  (SUITE-MoveReplicaHDFSTest-seed#[3595E06E3BCFD858]-worker) [    ] o.m.log jetty-6.1.26
   [junit4]   2> 38193 INFO  (SUITE-MoveReplicaHDFSTest-seed#[3595E06E3BCFD858]-worker) [    ] o.m.log Extract jar:file:/home/jenkins/.ivy2/cache/org.apache.hadoop/hadoop-hdfs/tests/hadoop-hdfs-2.7.4-tests.jar!/webapps/datanode to ./temp/Jetty_localhost_38319_datanode____h0998d/webapp
   [junit4]   2> 38695 INFO  (SUITE-MoveReplicaHDFSTest-seed#[3595E06E3BCFD858]-worker) [    ] o.m.log Started HttpServer2$SelectChannelConnectorWithSafeStartup@localhost:38319
   [junit4]   2> 38856 DEBUG (OverseerCollectionConfigSetProcessor-72315129885294601-127.0.0.1:44801_solr-n_0000000000) [n:127.0.0.1:44801_solr    ] o.a.s.c.OverseerTaskProcessor Got 0 tasks from work-queue : [[]]
   [junit4]   2> 38856 DEBUG (OverseerCollectionConfigSetProcessor-72315129885294601-127.0.0.1:44801_solr-n_0000000000) [n:127.0.0.1:44801_solr    ] o.a.s.c.OverseerTaskProcessor Cleaning up work-queue. #Running tasks: 0
   [junit4]   2> 38856 DEBUG (OverseerCollectionConfigSetProcessor-72315129885294601-127.0.0.1:44801_solr-n_0000000000) [n:127.0.0.1:44801_solr    ] o.a.s.c.OverseerTaskProcessor RunningTasks: []
   [junit4]   2> 38856 DEBUG (OverseerCollectionConfigSetProcessor-72315129885294601-127.0.0.1:44801_solr-n_0000000000) [n:127.0.0.1:44801_solr    ] o.a.s.c.OverseerTaskProcessor BlockedTasks: []
   [junit4]   2> 38856 DEBUG (OverseerCollectionConfigSetProcessor-72315129885294601-127.0.0.1:44801_solr-n_0000000000) [n:127.0.0.1:44801_solr    ] o.a.s.c.OverseerTaskProcessor CompletedTasks: []
   [junit4]   2> 38856 DEBUG (OverseerCollectionConfigSetProcessor-72315129885294601-127.0.0.1:44801_solr-n_0000000000) [n:127.0.0.1:44801_solr    ] o.a.s.c.OverseerTaskProcessor RunningZKTasks: []
   [junit4]   2> 38856 DEBUG (OverseerCollectionConfigSetProcessor-72315129885294601-127.0.0.1:44801_solr-n_0000000000) [n:127.0.0.1:44801_solr    ] o.a.s.c.OverseerTaskQueue Peeking for top 100 elements. ExcludeSet: []
   [junit4]   2> 38882 DEBUG (ScheduledTrigger-206-thread-4) [    ] o.a.s.c.a.NodeLostTrigger Running NodeLostTrigger: .auto_add_replicas with currently live nodes: 4
   [junit4]   2> 38967 WARN  (SUITE-MoveReplicaHDFSTest-seed#[3595E06E3BCFD858]-worker) [    ] o.a.h.h.HttpRequestLog Jetty request log can only be enabled using Log4j
   [junit4]   2> 38968 INFO  (SUITE-MoveReplicaHDFSTest-seed#[3595E06E3BCFD858]-worker) [    ] o.m.log jetty-6.1.26
   [junit4]   2> 38977 INFO  (SUITE-MoveReplicaHDFSTest-seed#[3595E06E3BCFD858]-worker) [    ] o.m.log Extract jar:file:/home/jenkins/.ivy2/cache/org.apache.hadoop/hadoop-hdfs/tests/hadoop-hdfs-2.7.4-tests.jar!/webapps/datanode to ./temp/Jetty_localhost_40573_datanode____.6bbttw/webapp
   [junit4]   2> 39429 ERROR (DataNode: [[[DISK]file:/home/jenkins/workspace/Lucene-Solr-master-Linux/solr/build/solr-core/test/J0/temp/solr.cloud.MoveReplicaHDFSTest_3595E06E3BCFD858-001/tempDir-002/hdfsBaseDir/data/data1/, [DISK]file:/home/jenkins/workspace/Lucene-Solr-master-Linux/solr/build/solr-core/test/J0/temp/solr.cloud.MoveReplicaHDFSTest_3595E06E3BCFD858-001/tempDir-002/hdfsBaseDir/data/data2/]]  heartbeating to localhost.localdomain/127.0.0.1:36547) [    ] o.a.h.h.s.d.DirectoryScanner dfs.datanode.directoryscan.throttle.limit.ms.per.sec set to value below 1 ms/sec. Assuming default value of 1000
   [junit4]   2> 39464 INFO  (SUITE-MoveReplicaHDFSTest-seed#[3595E06E3BCFD858]-worker) [    ] o.m.log Started HttpServer2$SelectChannelConnectorWithSafeStartup@localhost:40573
   [junit4]   2> 39585 INFO  (Block report processor) [    ] BlockStateChange BLOCK* processReport 0xdf608992af1b0: from storage DS-df19d04b-91fb-4117-83da-ce93c2eb5d99 node DatanodeRegistration(127.0.0.1:38185, datanodeUuid=112adfec-5468-468c-9083-0c3ccfcac52f, infoPort=32917, infoSecurePort=0, ipcPort=44835, storageInfo=lv=-56;cid=testClusterID;nsid=1014399182;c=0), blocks: 0, hasStaleStorage: true, processing time: 13 msecs
   [junit4]   2> 39585 INFO  (Block report processor) [    ] BlockStateChange BLOCK* processReport 0xdf608992af1b0: from storage DS-f931ab80-a8e2-476f-865c-a6737ca14a49 node DatanodeRegistration(127.0.0.1:38185, datanodeUuid=112adfec-5468-468c-9083-0c3ccfcac52f, infoPort=32917, infoSecurePort=0, ipcPort=44835, storageInfo=lv=-56;cid=testClusterID;nsid=1014399182;c=0), blocks: 0, hasStaleStorage: false, processing time: 0 msecs
   [junit4]   2> 39793 ERROR (DataNode: [[[DISK]file:/home/jenkins/workspace/Lucene-Solr-master-Linux/solr/build/solr-core/test/J0/temp/solr.cloud.MoveReplicaHDFSTest_3595E06E3BCFD858-001/tempDir-002/hdfsBaseDir/data/data3/, [DISK]file:/home/jenkins/workspace/Lucene-Solr-master-Linux/solr/build/solr-core/test/J0/temp/solr.cloud.MoveReplicaHDFSTest_3595E06E3BCFD858-001/tempDir-002/hdfsBaseDir/data/data4/]]  heartbeating to localhost.localdomain/127.0.0.1:36547) [    ] o.a.h.h.s.d.DirectoryScanner dfs.datanode.directoryscan.throttle.limit.ms.per.sec set to value below 1 ms/sec. Assuming default value of 1000
   [junit4]   2> 39816 INFO  (Block report processor) [    ] BlockStateChange BLOCK* processReport 0xdf608a8a370de: from storage DS-7a9ec965-38e2-4f49-8d56-d18d13f0f578 node DatanodeRegistration(127.0.0.1:34705, datanodeUuid=69ee655d-42e8-44f7-901a-044b2faa4c6d, infoPort=33621, infoSecurePort=0, ipcPort=37291, storageInfo=lv=-56;cid=testClusterID;nsid=1014399182;c=0), blocks: 0, hasStaleStorage: true, processing time: 0 msecs
   [junit4]   2> 39816 INFO  (Block report processor) [    ] BlockStateChange BLOCK* processReport 0xdf608a8a370de: from storage DS-c68bf7d9-2262-41fb-bdce-d8d750eb4c2a node DatanodeRegistration(127.0.0.1:34705, datanodeUuid=69ee655d-42e8-44f7-901a-044b2faa4c6d, infoPort=33621, infoSecurePort=0, ipcPort=37291, storageInfo=lv=-56;cid=testClusterID;nsid=1014399182;c=0), blocks: 0, hasStaleStorage: false, processing time: 0 msecs
   [junit4]   2> 39882 DEBUG (ScheduledTrigger-206-thread-3) [    ] o.a.s.c.a.NodeLostTrigger Running NodeLostTrigger: .auto_add_replicas with currently live nodes: 4
   [junit4]   2> 40371 INFO  (TEST-MoveReplicaHDFSTest.testNormalMove-seed#[3595E06E3BCFD858]) [    ] o.a.s.SolrTestCaseJ4 ###Starting testNormalMove
   [junit4]   2> 40372 DEBUG (SyncThread:0) [    ] o.a.s.c.ZkTestServer Watch added: data: /solr/clusterprops.json
   [junit4]   2> 40372 DEBUG (SyncThread:0) [    ] o.a.s.c.ZkTestServer Watch added: children: /solr/live_nodes
   [junit4]   2> 40372 INFO  (TEST-MoveReplicaHDFSTest.testNormalMove-seed#[3595E06E3BCFD858]) [    ] o.a.s.c.c.ZkStateReader Updated live nodes from ZooKeeper... (0) -> (4)
   [junit4]   2> 40372 DEBUG (SyncThread:0) [    ] o.a.s.c.ZkTestServer Watch added: data: /solr/clusterstate.json
   [junit4]   2> 40373 DEBUG (SyncThread:0) [    ] o.a.s.c.ZkTestServer Watch added: children: /solr/collections
   [junit4]   2> 40373 DEBUG (SyncThread:0) [    ] o.a.s.c.ZkTestServer Watch added: create/delete: /solr/aliases.json
   [junit4]   2> 40374 DEBUG (SyncThread:0) [    ] o.a.s.c.ZkTestServer Watch fired: data: /solr/aliases.json
   [junit4]   2> 40374 DEBUG (SyncThread:0) [    ] o.a.s.c.ZkTestServer Watch fired: data: /solr/aliases.json
   [junit4]   2> 40374 DEBUG (SyncThread:0) [    ] o.a.s.c.ZkTestServer Watch fired: data: /solr/aliases.json
   [junit4]   2> 40374 DEBUG (SyncThread:0) [    ] o.a.s.c.ZkTestServer Watch fired: data: /solr/aliases.json
   [junit4]   2> 40374 DEBUG (SyncThread:0) [    ] o.a.s.c.ZkTestServer Watch fired: data: /solr/aliases.json
   [junit4]   2> 40374 DEBUG (SyncThread:0) [    ] o.a.s.c.ZkTestServer Watch fired: data: /solr/aliases.json
   [junit4]   2> 40374 DEBUG (SyncThread:0) [    ] o.a.s.c.ZkTestServer Watch fired: data: /solr/aliases.json
   [junit4]   2> 40374 DEBUG (SyncThread:0) [    ] o.a.s.c.ZkTestServer Watch fired: data: /solr/aliases.json
   [junit4]   2> 40374 DEBUG (SyncThread:0) [    ] o.a.s.c.ZkTestServer Watch fired: data: /solr/aliases.json
   [junit4]   2> 40374 DEBUG (SyncThread:0) [    ] o.a.s.c.ZkTestServer Watch added: data: /solr/aliases.json
   [junit4]   2> 40374 DEBUG (SyncThread:0) [    ] o.a.s.c.ZkTestServer Watch added: data: /solr/aliases.json
   [junit4]   2> 40374 DEBUG (SyncThread:0) [    ] o.a.s.c.ZkTestServer Watch added: data: /solr/aliases.json
   [junit4]   2> 40375 DEBUG (SyncThread:0) [    ] o.a.s.c.ZkTestServer Watch added: data: /solr/aliases.json
   [junit4]   2> 40375 DEBUG (SyncThread:0) [    ] o.a.s.c.ZkTestServer Watch added: data: /solr/aliases.json
   [junit4]   2> 40375 DEBUG (SyncThread:0) [    ] o.a.s.c.ZkTestServer Watch added: data: /solr/aliases.json
   [junit4]   2> 40375 DEBUG (SyncThread:0) [    ] o.a.s.c.ZkTestServer Watch added: data: /solr/aliases.json
   [junit4]   2> 40375 DEBUG (SyncThread:0) [    ] o.a.s.c.ZkTestServer Watch added: data: /solr/aliases.json
   [junit4]   2> 40376 INFO  (TEST-MoveReplicaHDFSTest.testNormalMove-seed#[3595E06E3BCFD858]) [    ] o.e.j.s.Server jetty-9.4.11.v20180605; built: 2018-06-05T18:24:03.829Z; git: d5fc0523cfa96bfebfbda19606cad384d772f04c; jvm 1.8.0_172-b11
   [junit4]   2> 40377 INFO  (TEST-MoveReplicaHDFSTest.testNormalMove-seed#[3595E06E3BCFD858]) [    ] o.e.j.s.session DefaultSessionIdManager workerName=node0
   [junit4]   2> 40377 INFO  (TEST-MoveReplicaHDFSTest.testNormalMove-seed#[3595E06E3BCFD858]) [    ] o.e.j.s.session No SessionScavenger set, using defaults
   [junit4]   2> 40377 INFO  (TEST-MoveReplicaHDFSTest.testNormalMove-seed#[3595E06E3BCFD858]) [    ] o.e.j.s.session node0 Scavenging every 660000ms
   [junit4]   2> 40377 INFO  (TEST-MoveReplicaHDFSTest.testNormalMove-seed#[3595E06E3BCFD858]) [    ] o.e.j.s.h.ContextHandler Started o.e.j.s.ServletContextHandler@9eb69de{/solr,null,AVAILABLE}
   [junit4]   2> 40379 INFO  (TEST-MoveReplicaHDFSTest.testNormalMove-seed#[3595E06E3BCFD858]) [    ] o.e.j.s.AbstractConnector Started ServerConnector@1b032eb6{SSL,[ssl, http/1.1]}{127.0.0.1:40409}
   [junit4]   2> 40379 INFO  (TEST-MoveReplicaHDFSTest.testNormalMove-seed#[3595E06E3BCFD858]) [    ] o.e.j.s.Server Started @40414ms
   [junit4]   2> 40379 INFO  (TEST-MoveReplicaHDFSTest.testNormalMove-seed#[3595E06E3BCFD858]) [    ] o.a.s.c.s.e.JettySolrRunner Jetty properties: {hostContext=/solr, hostPort=40409}
   [junit4]   2> 40380 ERROR (TEST-MoveReplicaHDFSTest.testNormalMove-seed#[3595E06E3BCFD858]) [    ] o.a.s.u.StartupLoggingUtils Missing Java Option solr.log.dir. Logging may be missing or incomplete.
   [junit4]   2> 40380 INFO  (TEST-MoveReplicaHDFSTest.testNormalMove-seed#[3595E06E3BCFD858]) [    ] o.a.s.s.SolrDispatchFilter Using logger factory org.apache.logging.slf4j.Log4jLoggerFactory
   [junit4]   2> 40380 INFO  (TEST-MoveReplicaHDFSTest.testNormalMove-seed#[3595E06E3BCFD858]) [    ] o.a.s.s.SolrDispatchFilter  ___      _       Welcome to Apache Solr? version 8.0.0
   [junit4]   2> 40380 INFO  (TEST-MoveReplicaHDFSTest.testNormalMove-seed#[3595E06E3BCFD858]) [    ] o.a.s.s.SolrDispatchFilter / __| ___| |_ _   Starting in cloud mode on port null
   [junit4]   2> 40380 INFO  (TEST-MoveReplicaHDFSTest.testNormalMove-seed#[3595E06E3BCFD858]) [    ] o.a.s.s.SolrDispatchFilter \__ \/ _ \ | '_|  Install dir: null
   [junit4]   2> 40380 INFO  (TEST-MoveReplicaHDFSTest.testNormalMove-seed#[3595E06E3BCFD858]) [    ] o.a.s.s.SolrDispatchFilter |___/\___/_|_|    Start time: 2018-09-30T19:00:14.683Z
   [junit4]   2> 40381 DEBUG (SyncThread:0) [    ] o.a.s.c.ZkTestServer Watch added: data: /solr/aliases.json
   [junit4]   2> 40385 DEBUG (SyncThread:0) [    ] o.a.s.c.ZkTestServer Watch added: data: /solr/aliases.json
   [junit4]   2> 40387 INFO  (zkConnectionManagerCallback-104-thread-1) [    ] o.a.s.c.c.ConnectionManager zkClient has connected
   [junit4]   2> 40389 INFO  (TEST-MoveReplicaHDFSTest.testNormalMove-seed#[3595E06E3BCFD858]) [    ] o.a.s.s.SolrDispatchFilter solr.xml found in ZooKeeper. Loading...
   [junit4]   2> 40538 INFO  (TEST-MoveReplicaHDFSTest.testNormalMove-seed#[3595E06E3BCFD858]) [    ] o.a.s.c.ZkContainer Zookeeper client=127.0.0.1:37761/solr
   [junit4]   2> 40540 INFO  (zkConnectionManagerCallback-108-thread-1) [    ] o.a.s.c.c.ConnectionManager zkClient has connected
   [junit4]   2> 40542 DEBUG (TEST-MoveReplicaHDFSTest.testNormalMove-seed#[3595E06E3BCFD858]) [n:127.0.0.1:40409_solr    ] o.a.s.c.ZkController Added new OnReconnect listener org.apache.solr.cloud.ZkController$$Lambda$360/915898995@2ad43255
   [junit4]   2> 40543 INFO  (zkConnectionManagerCallback-110-thread-1) [    ] o.a.s.c.c.ConnectionManager zkClient has connected
   [junit4]   2> 40549 DEBUG (SyncThread:0) [    ] o.a.s.c.ZkTestServer Watch added: data: /solr/clusterprops.json
   [junit4]   2> 40549 DEBUG (SyncThread:0) [    ] o.a.s.c.ZkTestServer Watch added: children: /solr/live_nodes
   [junit4]   2> 40549 INFO  (TEST-MoveReplicaHDFSTest.testNormalMove-seed#[3595E06E3BCFD858]) [n:127.0.0.1:40409_solr    ] o.a.s.c.c.ZkStateReader Updated live nodes from ZooKeeper... (0) -> (4)
   [junit4]   2> 40549 DEBUG (SyncThread:0) [    ] o.a.s.c.ZkTestServer Watch added: data: /solr/clusterstate.json
   [junit4]   2> 40549 DEBUG (SyncThread:0) [    ] o.a.s.c.ZkTestServer Watch added: children: /solr/collections
   [junit4]   2> 40550 DEBUG (SyncThread:0) [    ] o.a.s.c.ZkTestServer Watch added: create/delete: /solr/aliases.json
   [junit4]   2> 40550 DEBUG (SyncThread:0) [    ] o.a.s.c.ZkTestServer Watch added: create/delete: /solr/security.json
   [junit4]   2> 40551 DEBUG (TEST-MoveReplicaHDFSTest.testNormalMove-seed#[3595E06E3BCFD858]) [n:127.0.0.1:40409_solr    ] o.a.s.c.LeaderElector Joined leadership election with path: /overseer_elect/election/72315129885294613-127.0.0.1:40409_solr-n_0000000004
   [junit4]   2> 40552 DEBUG (SyncThread:0) [    ] o.a.s.c.ZkTestServer Watch added: data: /solr/overseer_elect/election/72315129885294603-127.0.0.1:39713_solr-n_0000000003
   [junit4]   2> 40552 DEBUG (TEST-MoveReplicaHDFSTest.testNormalMove-seed#[3595E06E3BCFD858]) [n:127.0.0.1:40409_solr    ] o.a.s.c.LeaderElector Watching path /overseer_elect/election/72315129885294603-127.0.0.1:39713_solr-n_0000000003 to know if I could be the leader
   [junit4]   2> 40552 DEBUG (TEST-MoveReplicaHDFSTest.testNormalMove-seed#[3595E06E3BCFD858]) [n:127.0.0.1:40409_solr    ] o.a.s.c.ZkController Publish node=127.0.0.1:40409_solr as DOWN
   [junit4]   2> 40553 DEBUG (SyncThread:0) [    ] o.a.s.c.ZkTestServer Watch fired: children: /solr/overseer/queue
   [junit4]   2> 40553 INFO  (TEST-MoveReplicaHDFSTest.testNormalMove-seed#[3595E06E3BCFD858]) [n:127.0.0.1:40409_solr    ] o.a.s.c.TransientSolrCoreCacheDefault Allocating transient cache for 2147483647 transient cores
   [junit4]   2> 40553 INFO  (TEST-MoveReplicaHDFSTest.testNormalMove-seed#[3595E06E3BCFD858]) [n:127.0.0.1:40409_solr    ] o.a.s.c.ZkController Register node as live in ZooKeeper:/live_nodes/127.0.0.1:40409_solr
   [junit4]   2> 40553 DEBUG (SyncThread:0) [    ] o.a.s.c.ZkTestServer Watch added: children: /solr/overseer/queue
   [junit4]   2> 40554 DEBUG (OverseerStateUpdate-72315129885294601-127.0.0.1:44801_solr-n_0000000000) [n:127.0.0.1:44801_solr    ] o.a.s.c.Overseer processMessage: queueSize: 1, message = {
   [junit4]   2>   "operation":"downnode",
   [junit4]   2>   "node_name":"127.0.0.1:40409_solr"} current state version: 0
   [junit4]   2> 40554 DEBUG (OverseerStateUpdate-72315129885294601-127.0.0.1:44801_solr-n_0000000000) [n:127.0.0.1:44801_solr    ] o.a.s.c.o.NodeMutator DownNode state invoked for node: 127.0.0.1:40409_solr
   [junit4]   2> 40554 DEBUG (SyncThread:0) [    ] o.a.s.c.ZkTestServer Watch fired: children: /solr/live_nodes
   [junit4]   2> 40554 DEBUG (SyncThread:0) [    ] o.a.s.c.ZkTestServer Watch fired: children: /solr/live_nodes
   [junit4]   2> 40554 DEBUG (SyncThread:0) [    ] o.a.s.c.ZkTestServer Watch fired: children: /solr/live_nodes
   [junit4]   2> 40554 DEBUG (SyncThread:0) [    ] o.a.s.c.ZkTestServer Watch fired: children: /solr/live_nodes
   [junit4]   2> 40554 DEBUG (SyncThread:0) [    ] o.a.s.c.ZkTestServer Watch fired: children: /solr/live_nodes
   [junit4]   2> 40554 DEBUG (SyncThread:0) [    ] o.a.s.c.ZkTestServer Watch fired: children: /solr/live_nodes
   [junit4]   2> 40554 DEBUG (SyncThread:0) [    ] o.a.s.c.ZkTestServer Watch fired: children: /solr/live_nodes
   [junit4]   2> 40555 DEBUG (SyncThread:0) [    ] o.a.s.c.ZkTestServer Watch fired: children: /solr/live_nodes
   [junit4]   2> 40555 DEBUG (SyncThread:0) [    ] o.a.s.c.ZkTestServer Watch fired: children: /solr/live_nodes
   [junit4]   2> 40555 DEBUG (SyncThread:0) [    ] o.a.s.c.ZkTestServer Watch fired: children: /solr/live_nodes
   [junit4]   2> 40555 DEBUG (SyncThread:0) [    ] o.a.s.c.ZkTestServer Watch added: children: /solr/live_nodes
   [junit4]   2> 40555 DEBUG (SyncThread:0) [    ] o.a.s.c.ZkTestServer Watch added: children: /solr/live_nodes
   [junit4]   2> 40555 DEBUG (SyncThread:0) [    ] o.a.s.c.ZkTestServer Watch added: children: /solr/live_nodes
   [junit4]   2> 40555 INFO  (zkCallback-84-thread-1) [    ] o.a.s.c.c.ZkStateReader Updated live nodes from ZooKeeper... (4) -> (5)
   [junit4]   2> 40555 DEBUG (SyncThread:0) [    ] o.a.s.c.ZkTestServer Watch added: children: /solr/live_nodes
   [junit4]   2> 40555 INFO  (zkCallback-60-thread-1) [    ] o.a.s.c.c.ZkStateReader Updated live nodes from ZooKeeper... (4) -> (5)
   [junit4]   2> 40555 DEBUG (SyncThread:0) [    ] o.a.s.c.ZkTestServer Watch added: children: /solr/live_nodes
   [junit4]   2> 40555 INFO  (zkCallback-88-thread-1) [    ] o.a.s.c.c.ZkStateReader Updated live nodes from ZooKeeper... (4) -> (5)
   [junit4]   2> 40555 DEBUG (SyncThread:0) [    ] o.a.s.c.ZkTestServer Watch added: children: /solr/live_nodes
   [junit4]   2> 40555 INFO  (zkCallback-54-thread-1) [    ] o.a.s.c.c.ZkStateReader Updated live nodes from ZooKeeper... (4) -> (5)
   [junit4]   2> 40555 INFO  (zkCallback-56-thread-1) [    ] o.a.s.c.c.ZkStateReader Updated live nodes from ZooKeeper... (4) -> (5)
   [junit4]   2> 40555 INFO  (zkCallback-80-thread-1) [    ] o.a.s.c.c.ZkStateReader Updated live nodes from ZooKeeper... (4) -> (5)
   [junit4]   2> 40555 DEBUG (SyncThread:0) [    ] o.a.s.c.ZkTestServer Watch added: children: /solr/live_nodes
   [junit4]   2> 40555 DEBUG (SyncThread:0) [    ] o.a.s.c.ZkTestServer Watch added: children: /solr/live_nodes
   [junit4]   2> 40555 INFO  (zkCallback-76-thread-1) [    ] o.a.s.c.c.ZkStateReader Updated live nodes from ZooKeeper... (4) -> (5)
   [junit4]   2> 40556 INFO  (zkCallback-58-thread-1) [    ] o.a.s.c.c.ZkStateReader Updated live nodes from ZooKeeper... (4) -> (5)
   [junit4]   2> 40556 DEBUG (SyncThread:0) [    ] o.a.s.c.ZkTestServer Watch added: children: /solr/live_nodes
   [junit4]   2> 40556 DEBUG (SyncThread:0) [    ] o.a.s.c.ZkTestServer Watch added: children: /solr/live_nodes
   [junit4]   2> 40556 DEBUG (SyncThread:0) [    ] o.a.s.c.ZkTestServer Watch added: children: /solr/live_nodes
   [junit4]   2> 40556 INFO  (zkCallback-99-thread-1) [    ] o.a.s.c.c.ZkStateReader Updated live nodes from ZooKeeper... (4) -> (5)
   [junit4]   2> 40556 INFO  (zkCallback-99-thread-2) [    ] o.a.s.c.c.ZkStateReader Updated live nodes from ZooKeeper... (4) -> (5)
   [junit4]   2> 40557 INFO  (zkCallback-109-thread-1) [    ] o.a.s.c.c.ZkStateReader Updated live nodes from ZooKeeper... (4) -> (5)
   [junit4]   2> 40573 INFO  (zkConnectionManagerCallback-117-thread-1) [    ] o.a.s.c.c.ConnectionManager zkClient has connected
   [junit4]   2> 40574 DEBUG (SyncThread:0) [    ] o.a.s.c.ZkTestServer Watch added: data: /solr/clusterprops.json
   [junit4]   2> 40574 DEBUG (SyncThread:0) [    ] o.a.s.c.ZkTestServer Watch added: children: /solr/live_nodes
   [junit4]   2> 40575 INFO  (TEST-MoveReplicaHDFSTest.testNormalMove-seed#[3595E06E3BCFD858]) [n:127.0.0.1:40409_solr    ] o.a.s.c.c.ZkStateReader Updated live nodes from ZooKeeper... (0) -> (5)
   [junit4]   2> 40575 DEBUG (SyncThread:0) [    ] o.a.s.c.ZkTestServer Watch added: data: /solr/clusterstate.json
   [junit4]   2> 40575 DEBUG (SyncThread:0) [    ] o.a.s.c.ZkTestServer Watch added: children: /solr/collections
   [junit4]   2> 40575 DEBUG (SyncThread:0) [    ] o.a.s.c.ZkTestServer Watch added: create/delete: /solr/aliases.json
   [junit4]   2> 40575 INFO  (TEST-MoveReplicaHDFSTest.testNormalMove-seed#[3595E06E3BCFD858]) [n:127.0.0.1:40409_solr    ] o.a.s.c.s.i.ZkClientClusterStateProvider Cluster at 127.0.0.1:37761/solr ready
   [junit4]   2> 40576 INFO  (TEST-MoveReplicaHDFSTest.testNormalMove-seed#[3595E06E3BCFD858]) [n:127.0.0.1:40409_solr    ] o.a.s.h.a.MetricsHistoryHandler No .system collection, keeping metrics history in memory.
   [junit4]   2> 40593 INFO  (TEST-MoveReplicaHDFSTest.testNormalMove-seed#[3595E06E3BCFD858]) [n:127.0.0.1:40409_solr    ] o.a.s.m.r.SolrJmxReporter JMX monitoring for 'solr_40409.solr.node' (registry 'solr.node') enabled at server: com.sun.jmx.mbeanserver.JmxMBeanServer@61fbb11d
   [junit4]   2> 40599 INFO  (TEST-MoveReplicaHDFSTest.testNormalMove-seed#[3595E06E3BCFD858]) [n:127.0.0.1:40409_solr    ] o.a.s.m.r.SolrJmxReporter JMX monitoring for 'solr_40409.solr.jvm' (registry 'solr.jvm') enabled at server: com.sun.jmx.mbeanserver.JmxMBeanServer@61fbb11d
   [junit4]   2> 40599 INFO  (TEST-MoveReplicaHDFSTest.testNormalMove-seed#[3595E06E3BCFD858]) [n:127.0.0.1:40409_solr    ] o.a.s.m.r.SolrJmxReporter JMX monitoring for 'solr_40409.solr.jetty' (registry 'solr.jetty') enabled at server: com.sun.jmx.mbeanserver.JmxMBeanServer@61fbb11d
   [junit4]   2> 40600 INFO  (TEST-MoveReplicaHDFSTest.testNormalMove-seed#[3595E06E3BCFD858]) [n:127.0.0.1:40409_solr    ] o.a.s.c.CorePropertiesLocator Found 0 core definitions underneath /home/jenkins/workspace/Lucene-Solr-master-Linux/solr/build/solr-core/test/J0/temp/solr.cloud.MoveReplicaHDFSTest_3595E06E3BCFD858-001/tempDir-001/node5/.
   [junit4]   2> 40638 INFO  (zkConnectionManagerCallback-120-thread-1) [    ] o.a.s.c.c.ConnectionManager zkClient has connected
   [junit4]   2> 40640 INFO  (TEST-MoveReplicaHDFSTest.testNormalMove-seed#[3595E06E3BCFD858]) [    ] o.a.s.c.MoveReplicaTest total_jettys: 5
   [junit4]   2> 40654 DEBUG (SyncThread:0) [    ] o.a.s.c.ZkTestServer Watch fired: children: /solr/overseer/queue
   [junit4]   2> 40655 DEBUG (SyncThread:0) [    ] o.a.s.c.ZkTestServer Watch added: children: /solr/overseer/queue
   [junit4]   2> 40659 INFO  (qtp1808844560-321) [n:127.0.0.1:37161_solr    ] o.a.s.h.a.CollectionsHandler Invoked Collection Action :create with params collection.configName=conf1&maxShardsPerNode=2&autoAddReplicas=false&name=MoveReplicaHDFSTest_coll_false&nrtReplicas=2&action=CREATE&numShards=2&wt=javabin&version=2 and sendToOCPQueue=true
   [junit4]   2> 40666 DEBUG (SyncThread:0) [    ] o.a.s.c.ZkTestServer Watch fired: children: /solr/overseer/collection-queue-work
   [junit4]   2> 40666 DEBUG (SyncThread:0) [    ] o.a.s.c.ZkTestServer Watch added: create/delete: /solr/overseer/collection-queue-work/qnr-0000000002
   [junit4]   2> 40666 DEBUG (SyncThread:0) [    ] o.a.s.c.ZkTestServer Watch added: children: /solr/overseer/collection-queue-work
   [junit4]   2> 40667 DEBUG (OverseerCollectionConfigSetProcessor-72315129885294601-127.0.0.1:44801_solr-n_0000000000) [n:127.0.0.1:44801_solr    ] o.a.s.c.ZkDistributedQueue Found child node with improper name: qnr-0000000002
   [junit4]   2> 40667 DEBUG (SyncThread:0) [    ] o.a.s.c.ZkTestServer Watch fired: children: /solr/overseer/collection-queue-work
   [junit4]   2> 40667 DEBUG (SyncThread:0) [    ] o.a.s.c.ZkTestServer Watch added: children: /solr/overseer/collection-queue-work
   [junit4]   2> 40667 DEBUG (OverseerCollectionConfigSetProcessor-72315129885294601-127.0.0.1:44801_solr-n_0000000000) [n:127.0.0.1:44801_solr    ] o.a.s.c.ZkDistributedQueue Found child node with improper name: qnr-0000000002
   [junit4]   2> 40667 DEBUG (OverseerCollectionConfigSetProcessor-72315129885294601-127.0.0.1:44801_solr-n_0000000000) [n:127.0.0.1:44801_solr    ] o.a.s.c.OverseerTaskQueue Returning topN elements: [/overseer/collection-queue-work/qn-0000000002, ]
   [junit4]   2> 40667 DEBUG (OverseerCollectionConfigSetProcessor-72315129885294601-127.0.0.1:44801_solr-n_0000000000) [n:127.0.0.1:44801_solr    ] o.a.s.c.OverseerTaskProcessor Got 1 tasks from work-queue : [[org.apache.solr.cloud.OverseerTaskQueue$QueueEvent@2e684ed1]]
   [junit4]   2> 40668 DEBUG (OverseerCollectionConfigSetProcessor-72315129885294601-127.0.0.1:44801_solr-n_0000000000) [n:127.0.0.1:44801_solr    ] o.a.s.c.OverseerTaskProcessor Marked task [/overseer/collection-queue-work/qn-0000000002] as running
   [junit4]   2> 40668 DEBUG (OverseerCollectionConfigSetProcessor-72315129885294601-127.0.0.1:44801_solr-n_0000000000) [n:127.0.0.1:44801_solr    ] o.a.s.c.OverseerTaskProcessor Overseer Collection Message Handler: Get the message id:/overseer/collection-queue-work/qn-0000000002 message:{
   [junit4]   2>   "name":"MoveReplicaHDFSTest_coll_false",
   [junit4]   2>   "fromApi":"true",
   [junit4]   2>   "collection.configName":"conf1",
   [junit4]   2>   "numShards":"2",
   [junit4]   2>   "maxShardsPerNode":"2",
   [junit4]   2>   "autoAddReplicas":"false",
   [junit4]   2>   "nrtReplicas":"2",
   [junit4]   2>   "stateFormat":"2",
   [junit4]   2>   "replicationFactor":"2",
   [junit4]   2>   "operation":"create"}
   [junit4]   2> 40668 DEBUG (OverseerThreadFactory-208-thread-2-processing-n:127.0.0.1:44801_solr) [n:127.0.0.1:44801_solr    ] o.a.s.c.OverseerTaskProcessor Runner processing /overseer/collection-queue-work/qn-0000000002
   [junit4]   2> 40668 DEBUG (OverseerThreadFactory-208-thread-2-processing-n:127.0.0.1:44801_solr) [n:127.0.0.1:44801_solr    ] o.a.s.c.a.c.OverseerCollectionMessageHandler OverseerCollectionMessageHandler.processMessage : create , {
   [junit4]   2>   "name":"MoveReplicaHDFSTest_coll_false",
   [junit4]   2>   "fromApi":"true",
   [junit4]   2>   "collection.configName":"conf1",
   [junit4]   2>   "numShards":"2",
   [junit4]   2>   "maxShardsPerNode":"2",
   [junit4]   2>   "autoAddReplicas":"false",
   [junit4]   2>   "nrtReplicas":"2",
   [junit4]   2>   "stateFormat":"2",
   [junit4]   2>   "replicationFactor":"2",
   [junit4]   2>   "operation":"create"}
   [junit4]   2> 40668 DEBUG (OverseerCollectionConfigSetProcessor-72315129885294601-127.0.0.1:44801_solr-n_0000000000) [n:127.0.0.1:44801_solr    ] o.a.s.c.OverseerTaskProcessor Cleaning up work-queue. #Running tasks: 1
   [junit4]   2> 40668 INFO  (OverseerThreadFactory-208-thread-2-processing-n:127.0.0.1:44801_solr) [n:127.0.0.1:44801_solr    ] o.a.s.c.a.c.CreateCollectionCmd Create collection MoveReplicaHDFSTest_coll_false
   [junit4]   2> 40668 DEBUG (OverseerCollectionConfigSetProcessor-72315129885294601-127.0.0.1:44801_solr-n_0000000000) [n:127.0.0.1:44801_solr    ] o.a.s.c.OverseerTaskProcessor RunningTasks: [/overseer/collection-queue-work/qn-0000000002]
   [junit4]   2> 40668 DEBUG (OverseerCollectionConfigSetProcessor-72315129885294601-127.0.0.1:44801_solr-n_0000000000) [n:127.0.0.1:44801_solr    ] o.a.s.c.OverseerTaskProcessor BlockedTasks: []
   [junit4]   2> 40668 DEBUG (OverseerCollectionConfigSetProcessor-72315129885294601-127.0.0.1:44801_solr-n_0000000000) [n:127.0.0.1:44801_solr    ] o.a.s.c.OverseerTaskProcessor CompletedTasks: []
   [junit4]   2> 40669 DEBUG (OverseerCollectionConfigSetProcessor-72315129885294601-127.0.0.1:44801_solr-n_0000000000) [n:127.0.0.1:44801_solr    ] o.a.s.c.OverseerTaskProcessor RunningZKTasks: [/overseer/collection-queue-work/qn-0000000002]
   [junit4]   2> 40669 DEBUG (OverseerCollectionConfigSetProcessor-72315129885294601-127.0.0.1:44801_solr-n_0000000000) [n:127.0.0.1:44801_solr    ] o.a.s.c.OverseerTaskQueue Peeking for top 99 elements. ExcludeSet: [/overseer/collection-queue-work/qn-0000000002],[]
   [junit4]   2> 40671 DEBUG (OverseerThreadFactory-208-thread-2-processing-n:127.0.0.1:44801_solr) [n:127.0.0.1:44801_solr    ] o.a.s.c.a.c.OverseerCollectionMessageHandler creating collections conf node /collections/MoveReplicaHDFSTest_coll_false 
   [junit4]   2> 40671 DEBUG (SyncThread:0) [    ] o.a.s.c.ZkTestServer Watch fired: children: /solr/collections
   [junit4]   2> 40671 DEBUG (SyncThread:0) [    ] o.a.s.c.ZkTestServer Watch fired: children: /solr/collections
   [junit4]   2> 40671 DEBUG (SyncThread:0) [    ] o.a.s.c.ZkTestServer Watch fired: children: /solr/collections
   [junit4]   2> 40671 DEBUG (SyncThread:0) [    ] o.a.s.c.ZkTestServer Watch fired: children: /solr/collections
   [junit4]   2> 40671 DEBUG (SyncThread:0) [    ] o.a.s.c.ZkTestServer Watch fired: children: /solr/collections
   [junit4]   2> 40671 DEBUG (SyncThread:0) [    ] o.a.s.c.ZkTestServer Watch fired: children: /solr/collections
   [junit4]   2> 40672 DEBUG (SyncThread:0) [    ] o.a.s.c.ZkTestServer Watch fired: children: /solr/collections
   [junit4]   2> 40672 DEBUG (SyncThread:0) [    ] o.a.s.c.ZkTestServer Watch fired: children: /solr/collections
   [junit4]   2> 40672 DEBUG (SyncThread:0) [    ] o.a.s.c.ZkTestServer Watch fired: children: /solr/collections
   [junit4]   2> 40672 DEBUG (SyncThread:0) [    ] o.a.s.c.ZkTestServer Watch fired: children: /solr/collections
   [junit4]   2> 40672 DEBUG (SyncThread:0) [    ] o.a.s.c.ZkTestServer Watch fired: children: /solr/collections
   [junit4]   2> 40672 DEBUG (SyncThread:0) [    ] o.a.s.c.ZkTestServer Watch added: children: /solr/collections
   [junit4]   2> 40672 DEBUG (SyncThread:0) [    ] o.a.s.c.ZkTestServer Watch added: children: /solr/collections
   [junit4]   2> 40672 DEBUG (SyncThread:0) [    ] o.a.s.c.ZkTestServer Watch added: children: /solr/collections
   [junit4]   2> 40672 DEBUG (SyncThread:0) [    ] o.a.s.c.ZkTestServer Watch added: children: /solr/collections
   [junit4]   2> 40672 DEBUG (SyncThread:0) [    ] o.a.s.c.ZkTestServer Watch added: children: /solr/collections
   [junit4]   2> 40672 DEBUG (SyncThread:0) [    ] o.a.s.c.ZkTestServer Watch added: children: /solr/collections
   [junit4]   2> 40672 DEBUG (SyncThread:0) [    ] o.a.s.c.ZkTestServer Watch added: children: /solr/collections
   [junit4]   2> 40672 DEBUG (SyncThread:0) [    ] o.a.s.c.ZkTestServer Watch added: children: /solr/collections
   [junit4]   2> 40672 DEBUG (SyncThread:0) [    ] o.a.s.c.ZkTestServer Watch added: children: /solr/collections
   [junit4]   2> 40672 DEBUG (SyncThread:0) [    ] o.a.s.c.ZkTestServer Watch added: children: /solr/collections
   [junit4]   2> 40672 DEBUG (SyncThread:0) [    ] o.a.s.c.ZkTestServer Watch added: children: /solr/collections
   [junit4]   2> 40673 DEBUG (OverseerThreadFactory-208-thread-2-processing-n:127.0.0.1:44801_solr) [n:127.0.0.1:44801_solr    ] o.a.s.c.a.c.CreateCollectionCmd Check for collection zkNode:MoveReplicaHDFSTest_coll_false
   [junit4]   2> 40673 DEBUG (SyncThread:0) [    ] o.a.s.c.ZkTestServer Watch added: children: /solr/collections
   [junit4]   2> 40673 DEBUG (OverseerThreadFactory-208-thread-2-processing-n:127.0.0.1:44801_solr) [n:127.0.0.1:44801_solr    ] o.a.s.c.a.c.CreateCollectionCmd Collection zkNode exists
   [junit4]   2> 40674 DEBUG (SyncThread:0) [    ] o.a.s.c.ZkTestServer Watch fired: children: /solr/overseer/queue
   [junit4]   2> 40675 DEBUG (SyncThread:0) [    ] o.a.s.c.ZkTestServer Watch added: children: /solr/overseer/queue
   [junit4]   2> 40675 DEBUG (OverseerStateUpdate-72315129885294601-127.0.0.1:44801_solr-n_0000000000) [n:127.0.0.1:44801_solr    ] o.a.s.c.Overseer processMessage: queueSize: 1, message = {
   [junit4]   2>   "name":"MoveReplicaHDFSTest_coll_false",
   [junit4]   2>   "fromApi":"true",
   [junit4]   2>   "collection.configName":"conf1",
   [junit4]   2>   "numShards":"2",
   [junit4]   2>   "maxShardsPerNode":"2",
   [junit4]   2>   "autoAddReplicas":"false",
   [junit4]   2>   "nrtReplicas":"2",
   [junit4]   2>   "stateFormat":"2",
   [junit4]   2>   "replicationFactor":"2",
   [junit4]   2>   "operation":"create"} current state version: 0
   [junit4]   2> 40675 DE

[...truncated too long message...]

 127.0.0.1:35203 35203
   [junit4]   2> 92604 INFO  (Thread-1) [    ] o.a.s.c.ZkTestServer connecting to 127.0.0.1:35203 35203
   [junit4]   2> 92605 WARN  (Thread-1) [    ] o.a.s.c.ZkTestServer Watch limit violations: 
   [junit4]   2> Maximum concurrent create/delete watches above limit:
   [junit4]   2> 
   [junit4]   2> 	35	/solr/collections/MoveReplicaHDFSTest_coll_false/terms/shard1
   [junit4]   2> 	25	/solr/collections/MoveReplicaHDFSTest_coll_true/terms/shard1
   [junit4]   2> 	19	/solr/aliases.json
   [junit4]   2> 	19	/solr/configs/conf1
   [junit4]   2> 	10	/solr/collections/MoveReplicaHDFSTest_failed_coll_true/terms/shard2
   [junit4]   2> 	10	/solr/collections/MoveReplicaHDFSTest_failed_coll_false/terms/shard1
   [junit4]   2> 	9	/solr/collections/MoveReplicaHDFSTest_failed_coll_true/terms/shard1
   [junit4]   2> 	9	/solr/collections/MoveReplicaHDFSTest_coll_false/terms/shard2
   [junit4]   2> 	8	/solr/collections/MoveReplicaHDFSTest_failed_coll_false/terms/shard2
   [junit4]   2> 	7	/solr/security.json
   [junit4]   2> 	7	/solr/collections/MoveReplicaHDFSTest_coll_true/terms/shard2
   [junit4]   2> 
   [junit4]   2> Maximum concurrent data watches above limit:
   [junit4]   2> 
   [junit4]   2> 	19	/solr/clusterprops.json
   [junit4]   2> 	19	/solr/clusterstate.json
   [junit4]   2> 	11	/solr/collections/MoveReplicaHDFSTest_coll_true/state.json
   [junit4]   2> 	10	/solr/aliases.json
   [junit4]   2> 	8	/solr/collections/MoveReplicaHDFSTest_coll_false/state.json
   [junit4]   2> 	4	/solr/overseer_elect/election/72315447470850057-127.0.0.1:43743_solr-n_0000000001
   [junit4]   2> 	4	/solr/collections/MoveReplicaHDFSTest_failed_coll_false/state.json
   [junit4]   2> 	4	/solr/collections/MoveReplicaHDFSTest_failed_coll_true/state.json
   [junit4]   2> 	3	/solr/collections/MoveReplicaHDFSTest_coll_true/leader_elect/shard1/election/72315447470850057-core_node5-n_0000000000
   [junit4]   2> 	2	/solr/collections/MoveReplicaHDFSTest_coll_false/leader_elect/shard1/election/72315447470850058-core_node4-n_0000000001
   [junit4]   2> 
   [junit4]   2> Maximum concurrent children watches above limit:
   [junit4]   2> 
   [junit4]   2> 	35	/solr/collections
   [junit4]   2> 	32	/solr/live_nodes
   [junit4]   2> 
   [junit4]   2> 92606 WARN  (SUITE-MoveReplicaHDFSTest-seed#[3595E06E3BCFD858]-worker) [    ] o.a.h.h.s.d.DirectoryScanner DirectoryScanner: shutdown has been called
   [junit4]   2> 92626 INFO  (SUITE-MoveReplicaHDFSTest-seed#[3595E06E3BCFD858]-worker) [    ] o.m.log Stopped HttpServer2$SelectChannelConnectorWithSafeStartup@localhost:0
   [junit4]   2> 92728 WARN  (DataNode: [[[DISK]file:/home/jenkins/workspace/Lucene-Solr-master-Linux/solr/build/solr-core/test/J2/temp/solr.cloud.MoveReplicaHDFSTest_3595E06E3BCFD858-001/tempDir-002/hdfsBaseDir/data/data3/, [DISK]file:/home/jenkins/workspace/Lucene-Solr-master-Linux/solr/build/solr-core/test/J2/temp/solr.cloud.MoveReplicaHDFSTest_3595E06E3BCFD858-001/tempDir-002/hdfsBaseDir/data/data4/]]  heartbeating to localhost.localdomain/127.0.0.1:37903) [    ] o.a.h.h.s.d.IncrementalBlockReportManager IncrementalBlockReportManager interrupted
   [junit4]   2> 92728 WARN  (DataNode: [[[DISK]file:/home/jenkins/workspace/Lucene-Solr-master-Linux/solr/build/solr-core/test/J2/temp/solr.cloud.MoveReplicaHDFSTest_3595E06E3BCFD858-001/tempDir-002/hdfsBaseDir/data/data3/, [DISK]file:/home/jenkins/workspace/Lucene-Solr-master-Linux/solr/build/solr-core/test/J2/temp/solr.cloud.MoveReplicaHDFSTest_3595E06E3BCFD858-001/tempDir-002/hdfsBaseDir/data/data4/]]  heartbeating to localhost.localdomain/127.0.0.1:37903) [    ] o.a.h.h.s.d.DataNode Ending block pool service for: Block pool BP-1809494320-88.99.242.108-1538338861460 (Datanode Uuid 28578686-37ca-4fde-a556-236bcc76356e) service to localhost.localdomain/127.0.0.1:37903
   [junit4]   2> 92731 WARN  (SUITE-MoveReplicaHDFSTest-seed#[3595E06E3BCFD858]-worker) [    ] o.a.h.h.s.d.DirectoryScanner DirectoryScanner: shutdown has been called
   [junit4]   2> 92866 INFO  (SUITE-MoveReplicaHDFSTest-seed#[3595E06E3BCFD858]-worker) [    ] o.m.log Stopped HttpServer2$SelectChannelConnectorWithSafeStartup@localhost:0
   [junit4]   2> 92968 WARN  (DataNode: [[[DISK]file:/home/jenkins/workspace/Lucene-Solr-master-Linux/solr/build/solr-core/test/J2/temp/solr.cloud.MoveReplicaHDFSTest_3595E06E3BCFD858-001/tempDir-002/hdfsBaseDir/data/data1/, [DISK]file:/home/jenkins/workspace/Lucene-Solr-master-Linux/solr/build/solr-core/test/J2/temp/solr.cloud.MoveReplicaHDFSTest_3595E06E3BCFD858-001/tempDir-002/hdfsBaseDir/data/data2/]]  heartbeating to localhost.localdomain/127.0.0.1:37903) [    ] o.a.h.h.s.d.IncrementalBlockReportManager IncrementalBlockReportManager interrupted
   [junit4]   2> 92968 WARN  (DataNode: [[[DISK]file:/home/jenkins/workspace/Lucene-Solr-master-Linux/solr/build/solr-core/test/J2/temp/solr.cloud.MoveReplicaHDFSTest_3595E06E3BCFD858-001/tempDir-002/hdfsBaseDir/data/data1/, [DISK]file:/home/jenkins/workspace/Lucene-Solr-master-Linux/solr/build/solr-core/test/J2/temp/solr.cloud.MoveReplicaHDFSTest_3595E06E3BCFD858-001/tempDir-002/hdfsBaseDir/data/data2/]]  heartbeating to localhost.localdomain/127.0.0.1:37903) [    ] o.a.h.h.s.d.DataNode Ending block pool service for: Block pool BP-1809494320-88.99.242.108-1538338861460 (Datanode Uuid 6deaacc1-d8d6-40b2-ae6c-5d0005bb13b6) service to localhost.localdomain/127.0.0.1:37903
   [junit4]   2> 92980 INFO  (SUITE-MoveReplicaHDFSTest-seed#[3595E06E3BCFD858]-worker) [    ] o.m.log Stopped HttpServer2$SelectChannelConnectorWithSafeStartup@localhost.localdomain:0
   [junit4]   2> 93097 INFO  (SUITE-MoveReplicaHDFSTest-seed#[3595E06E3BCFD858]-worker) [    ] o.a.s.c.ZkTestServer connecting to 127.0.0.1:35203 35203
   [junit4]   2> NOTE: leaving temporary files on disk at: /home/jenkins/workspace/Lucene-Solr-master-Linux/solr/build/solr-core/test/J2/temp/solr.cloud.MoveReplicaHDFSTest_3595E06E3BCFD858-001
   [junit4]   2> Sep 30, 2018 8:22:23 PM com.carrotsearch.randomizedtesting.ThreadLeakControl checkThreadLeaks
   [junit4]   2> WARNING: Will linger awaiting termination of 66 leaked thread(s).
   [junit4]   2> NOTE: test params are: codec=Asserting(Lucene80): {id=BlockTreeOrds(blocksize=128)}, docValues:{_version_=DocValuesFormat(name=Lucene70)}, maxPointsInLeafNode=302, maxMBSortInHeap=7.909831273832705, sim=Asserting(org.apache.lucene.search.similarities.AssertingSimilarity@6d107ff4), locale=sr-Latn-BA, timezone=America/Sitka
   [junit4]   2> NOTE: Linux 4.15.0-32-generic amd64/Oracle Corporation 1.8.0_172 (64-bit)/cpus=8,threads=6,free=276789864,total=518979584
   [junit4]   2> NOTE: All tests run in this JVM: [MoveReplicaHDFSTest]
   [junit4] Completed [3/5 (2!)] on J2 in 101.98s, 4 tests, 1 error <<< FAILURES!
   [junit4] 
   [junit4] Suite: org.apache.solr.cloud.MoveReplicaHDFSTest
   [junit4] OK      15.2s J0 | MoveReplicaHDFSTest.testNormalMove
   [junit4] OK      10.6s J0 | MoveReplicaHDFSTest.testNormalFailedMove
   [junit4] OK      14.4s J0 | MoveReplicaHDFSTest.testFailedMove
   [junit4] OK      21.6s J0 | MoveReplicaHDFSTest.test
   [junit4] Completed [4/5 (2!)] on J0 in 76.44s, 4 tests
   [junit4] 
   [junit4] Suite: org.apache.solr.cloud.MoveReplicaHDFSTest
   [junit4] OK      18.9s J1 | MoveReplicaHDFSTest.testNormalMove
   [junit4] OK      11.0s J1 | MoveReplicaHDFSTest.testNormalFailedMove
   [junit4] OK      12.9s J1 | MoveReplicaHDFSTest.testFailedMove
   [junit4] OK      22.4s J1 | MoveReplicaHDFSTest.test
   [junit4] Completed [5/5 (2!)] on J1 in 80.18s, 4 tests
   [junit4] 
   [junit4] 
   [junit4] Tests with failures [seed: 3595E06E3BCFD858]:
   [junit4]   - org.apache.solr.cloud.MoveReplicaHDFSTest.testFailedMove
   [junit4]   - org.apache.solr.cloud.MoveReplicaHDFSTest.testFailedMove
   [junit4] 
   [junit4] 
   [junit4] JVM J0:     0.40 ..   177.73 =   177.33s
   [junit4] JVM J1:     0.40 ..   183.05 =   182.65s
   [junit4] JVM J2:     0.40 ..   103.29 =   102.89s
   [junit4] Execution time total: 3 minutes 3 seconds
   [junit4] Tests summary: 5 suites, 20 tests, 2 errors

BUILD FAILED
/home/jenkins/workspace/Lucene-Solr-master-Linux/lucene/common-build.xml:1567: The following error occurred while executing this line:
/home/jenkins/workspace/Lucene-Solr-master-Linux/lucene/common-build.xml:1092: There were test failures: 5 suites, 20 tests, 2 errors [seed: 3595E06E3BCFD858]

Total time: 3 minutes 4 seconds

[repro] Setting last failure code to 256

[repro] Failures:
[repro]   2/5 failed: org.apache.solr.cloud.MoveReplicaHDFSTest
[repro] Exiting with code 256
+ mv lucene/build lucene/build.repro
+ mv solr/build solr/build.repro
+ mv lucene/build.orig lucene/build
+ mv solr/build.orig solr/build
Archiving artifacts
Setting ANT_1_8_2_HOME=/var/lib/jenkins/tools/hudson.tasks.Ant_AntInstallation/ANT_1.8.2
[WARNINGS] Parsing warnings in console log with parser Java Compiler (javac)
Setting ANT_1_8_2_HOME=/var/lib/jenkins/tools/hudson.tasks.Ant_AntInstallation/ANT_1.8.2
Setting ANT_1_8_2_HOME=/var/lib/jenkins/tools/hudson.tasks.Ant_AntInstallation/ANT_1.8.2
<Git Blamer> Using GitBlamer to create author and commit information for all warnings.
<Git Blamer> GIT_COMMIT=964cc88cee7d62edf03a923e3217809d630af5d5, workspace=/var/lib/jenkins/workspace/Lucene-Solr-master-Linux
[WARNINGS] Computing warning deltas based on reference build #22950
Recording test results
Setting ANT_1_8_2_HOME=/var/lib/jenkins/tools/hudson.tasks.Ant_AntInstallation/ANT_1.8.2
Build step 'Publish JUnit test result report' changed build result to UNSTABLE
Email was triggered for: Unstable (Test Failures)
Sending email for trigger: Unstable (Test Failures)
Setting ANT_1_8_2_HOME=/var/lib/jenkins/tools/hudson.tasks.Ant_AntInstallation/ANT_1.8.2
Setting ANT_1_8_2_HOME=/var/lib/jenkins/tools/hudson.tasks.Ant_AntInstallation/ANT_1.8.2
Setting ANT_1_8_2_HOME=/var/lib/jenkins/tools/hudson.tasks.Ant_AntInstallation/ANT_1.8.2
Setting ANT_1_8_2_HOME=/var/lib/jenkins/tools/hudson.tasks.Ant_AntInstallation/ANT_1.8.2

Mime
View raw message