lucene-dev mailing list archives

Site index · List index
Message view « Date » · « Thread »
Top « Date » · « Thread »
From Apache Jenkins Server <jenk...@builds.apache.org>
Subject [JENKINS] Lucene-Solr-Tests-master - Build # 2827 - Still Unstable
Date Fri, 28 Sep 2018 14:37:38 GMT
Build: https://builds.apache.org/job/Lucene-Solr-Tests-master/2827/

5 tests failed.
FAILED:  org.apache.solr.cloud.MultiThreadedOCPTest.test

Error Message:


Stack Trace:
java.lang.AssertionError
	at __randomizedtesting.SeedInfo.seed([885FDC6C04856435:BE3B6AA7909CD]:0)
	at org.junit.Assert.fail(Assert.java:92)
	at org.junit.Assert.assertTrue(Assert.java:43)
	at org.junit.Assert.assertTrue(Assert.java:54)
	at org.apache.solr.cloud.MultiThreadedOCPTest.testFillWorkQueue(MultiThreadedOCPTest.java:114)
	at org.apache.solr.cloud.MultiThreadedOCPTest.test(MultiThreadedOCPTest.java:69)
	at sun.reflect.NativeMethodAccessorImpl.invoke0(Native Method)
	at sun.reflect.NativeMethodAccessorImpl.invoke(NativeMethodAccessorImpl.java:62)
	at sun.reflect.DelegatingMethodAccessorImpl.invoke(DelegatingMethodAccessorImpl.java:43)
	at java.lang.reflect.Method.invoke(Method.java:498)
	at com.carrotsearch.randomizedtesting.RandomizedRunner.invoke(RandomizedRunner.java:1742)
	at com.carrotsearch.randomizedtesting.RandomizedRunner$8.evaluate(RandomizedRunner.java:935)
	at com.carrotsearch.randomizedtesting.RandomizedRunner$9.evaluate(RandomizedRunner.java:971)
	at com.carrotsearch.randomizedtesting.RandomizedRunner$10.evaluate(RandomizedRunner.java:985)
	at org.apache.solr.BaseDistributedSearchTestCase$ShardsRepeatRule$ShardsFixedStatement.callStatement(BaseDistributedSearchTestCase.java:1008)
	at org.apache.solr.BaseDistributedSearchTestCase$ShardsRepeatRule$ShardsStatement.evaluate(BaseDistributedSearchTestCase.java:983)
	at com.carrotsearch.randomizedtesting.rules.SystemPropertiesRestoreRule$1.evaluate(SystemPropertiesRestoreRule.java:57)
	at org.apache.lucene.util.TestRuleSetupTeardownChained$1.evaluate(TestRuleSetupTeardownChained.java:49)
	at org.apache.lucene.util.AbstractBeforeAfterRule$1.evaluate(AbstractBeforeAfterRule.java:45)
	at org.apache.lucene.util.TestRuleThreadAndTestName$1.evaluate(TestRuleThreadAndTestName.java:48)
	at org.apache.lucene.util.TestRuleIgnoreAfterMaxFailures$1.evaluate(TestRuleIgnoreAfterMaxFailures.java:64)
	at org.apache.lucene.util.TestRuleMarkFailure$1.evaluate(TestRuleMarkFailure.java:47)
	at com.carrotsearch.randomizedtesting.rules.StatementAdapter.evaluate(StatementAdapter.java:36)
	at com.carrotsearch.randomizedtesting.ThreadLeakControl$StatementRunner.run(ThreadLeakControl.java:368)
	at com.carrotsearch.randomizedtesting.ThreadLeakControl.forkTimeoutingTask(ThreadLeakControl.java:817)
	at com.carrotsearch.randomizedtesting.ThreadLeakControl$3.evaluate(ThreadLeakControl.java:468)
	at com.carrotsearch.randomizedtesting.RandomizedRunner.runSingleTest(RandomizedRunner.java:944)
	at com.carrotsearch.randomizedtesting.RandomizedRunner$5.evaluate(RandomizedRunner.java:830)
	at com.carrotsearch.randomizedtesting.RandomizedRunner$6.evaluate(RandomizedRunner.java:880)
	at com.carrotsearch.randomizedtesting.RandomizedRunner$7.evaluate(RandomizedRunner.java:891)
	at com.carrotsearch.randomizedtesting.rules.StatementAdapter.evaluate(StatementAdapter.java:36)
	at com.carrotsearch.randomizedtesting.rules.SystemPropertiesRestoreRule$1.evaluate(SystemPropertiesRestoreRule.java:57)
	at org.apache.lucene.util.AbstractBeforeAfterRule$1.evaluate(AbstractBeforeAfterRule.java:45)
	at com.carrotsearch.randomizedtesting.rules.StatementAdapter.evaluate(StatementAdapter.java:36)
	at org.apache.lucene.util.TestRuleStoreClassName$1.evaluate(TestRuleStoreClassName.java:41)
	at com.carrotsearch.randomizedtesting.rules.NoShadowingOrOverridesOnMethodsRule$1.evaluate(NoShadowingOrOverridesOnMethodsRule.java:40)
	at com.carrotsearch.randomizedtesting.rules.NoShadowingOrOverridesOnMethodsRule$1.evaluate(NoShadowingOrOverridesOnMethodsRule.java:40)
	at com.carrotsearch.randomizedtesting.rules.StatementAdapter.evaluate(StatementAdapter.java:36)
	at com.carrotsearch.randomizedtesting.rules.StatementAdapter.evaluate(StatementAdapter.java:36)
	at com.carrotsearch.randomizedtesting.rules.StatementAdapter.evaluate(StatementAdapter.java:36)
	at org.apache.lucene.util.TestRuleAssertionsRequired$1.evaluate(TestRuleAssertionsRequired.java:53)
	at org.apache.lucene.util.TestRuleMarkFailure$1.evaluate(TestRuleMarkFailure.java:47)
	at org.apache.lucene.util.TestRuleIgnoreAfterMaxFailures$1.evaluate(TestRuleIgnoreAfterMaxFailures.java:64)
	at org.apache.lucene.util.TestRuleIgnoreTestSuites$1.evaluate(TestRuleIgnoreTestSuites.java:54)
	at com.carrotsearch.randomizedtesting.rules.StatementAdapter.evaluate(StatementAdapter.java:36)
	at com.carrotsearch.randomizedtesting.ThreadLeakControl$StatementRunner.run(ThreadLeakControl.java:368)
	at java.lang.Thread.run(Thread.java:748)


FAILED:  org.apache.solr.cloud.autoscaling.TestPolicyCloud.testCreateCollection

Error Message:
Error from server at https://127.0.0.1:34440/solr: org.apache.zookeeper.KeeperException$SessionExpiredException: KeeperErrorCode = Session expired for /autoscaling.json

Stack Trace:
org.apache.solr.client.solrj.impl.HttpSolrClient$RemoteExecutionException: Error from server at https://127.0.0.1:34440/solr: org.apache.zookeeper.KeeperException$SessionExpiredException: KeeperErrorCode = Session expired for /autoscaling.json
	at __randomizedtesting.SeedInfo.seed([885FDC6C04856435:7E3CC09D30702BB4]:0)
	at org.apache.solr.client.solrj.impl.HttpSolrClient$RemoteExecutionException.create(HttpSolrClient.java:829)
	at org.apache.solr.client.solrj.impl.HttpSolrClient.executeMethod(HttpSolrClient.java:620)
	at org.apache.solr.client.solrj.impl.HttpSolrClient.request(HttpSolrClient.java:255)
	at org.apache.solr.client.solrj.impl.HttpSolrClient.request(HttpSolrClient.java:244)
	at org.apache.solr.client.solrj.impl.LBHttpSolrClient.doRequest(LBHttpSolrClient.java:483)
	at org.apache.solr.client.solrj.impl.LBHttpSolrClient.request(LBHttpSolrClient.java:413)
	at org.apache.solr.client.solrj.impl.CloudSolrClient.sendRequest(CloudSolrClient.java:1107)
	at org.apache.solr.client.solrj.impl.CloudSolrClient.requestWithRetryOnStaleState(CloudSolrClient.java:884)
	at org.apache.solr.client.solrj.impl.CloudSolrClient.request(CloudSolrClient.java:817)
	at org.apache.solr.client.solrj.SolrClient.request(SolrClient.java:1219)
	at org.apache.solr.cloud.autoscaling.TestPolicyCloud.testCreateCollection(TestPolicyCloud.java:94)
	at sun.reflect.NativeMethodAccessorImpl.invoke0(Native Method)
	at sun.reflect.NativeMethodAccessorImpl.invoke(NativeMethodAccessorImpl.java:62)
	at sun.reflect.DelegatingMethodAccessorImpl.invoke(DelegatingMethodAccessorImpl.java:43)
	at java.lang.reflect.Method.invoke(Method.java:498)
	at com.carrotsearch.randomizedtesting.RandomizedRunner.invoke(RandomizedRunner.java:1742)
	at com.carrotsearch.randomizedtesting.RandomizedRunner$8.evaluate(RandomizedRunner.java:935)
	at com.carrotsearch.randomizedtesting.RandomizedRunner$9.evaluate(RandomizedRunner.java:971)
	at com.carrotsearch.randomizedtesting.RandomizedRunner$10.evaluate(RandomizedRunner.java:985)
	at org.junit.rules.ExpectedException$ExpectedExceptionStatement.evaluate(ExpectedException.java:110)
	at com.carrotsearch.randomizedtesting.rules.SystemPropertiesRestoreRule$1.evaluate(SystemPropertiesRestoreRule.java:57)
	at org.apache.lucene.util.TestRuleSetupTeardownChained$1.evaluate(TestRuleSetupTeardownChained.java:49)
	at org.apache.lucene.util.AbstractBeforeAfterRule$1.evaluate(AbstractBeforeAfterRule.java:45)
	at org.apache.lucene.util.TestRuleThreadAndTestName$1.evaluate(TestRuleThreadAndTestName.java:48)
	at org.apache.lucene.util.TestRuleIgnoreAfterMaxFailures$1.evaluate(TestRuleIgnoreAfterMaxFailures.java:64)
	at org.apache.lucene.util.TestRuleMarkFailure$1.evaluate(TestRuleMarkFailure.java:47)
	at com.carrotsearch.randomizedtesting.rules.StatementAdapter.evaluate(StatementAdapter.java:36)
	at com.carrotsearch.randomizedtesting.ThreadLeakControl$StatementRunner.run(ThreadLeakControl.java:368)
	at com.carrotsearch.randomizedtesting.ThreadLeakControl.forkTimeoutingTask(ThreadLeakControl.java:817)
	at com.carrotsearch.randomizedtesting.ThreadLeakControl$3.evaluate(ThreadLeakControl.java:468)
	at com.carrotsearch.randomizedtesting.RandomizedRunner.runSingleTest(RandomizedRunner.java:944)
	at com.carrotsearch.randomizedtesting.RandomizedRunner$5.evaluate(RandomizedRunner.java:830)
	at com.carrotsearch.randomizedtesting.RandomizedRunner$6.evaluate(RandomizedRunner.java:880)
	at com.carrotsearch.randomizedtesting.RandomizedRunner$7.evaluate(RandomizedRunner.java:891)
	at com.carrotsearch.randomizedtesting.rules.StatementAdapter.evaluate(StatementAdapter.java:36)
	at com.carrotsearch.randomizedtesting.rules.SystemPropertiesRestoreRule$1.evaluate(SystemPropertiesRestoreRule.java:57)
	at org.apache.lucene.util.AbstractBeforeAfterRule$1.evaluate(AbstractBeforeAfterRule.java:45)
	at com.carrotsearch.randomizedtesting.rules.StatementAdapter.evaluate(StatementAdapter.java:36)
	at org.apache.lucene.util.TestRuleStoreClassName$1.evaluate(TestRuleStoreClassName.java:41)
	at com.carrotsearch.randomizedtesting.rules.NoShadowingOrOverridesOnMethodsRule$1.evaluate(NoShadowingOrOverridesOnMethodsRule.java:40)
	at com.carrotsearch.randomizedtesting.rules.NoShadowingOrOverridesOnMethodsRule$1.evaluate(NoShadowingOrOverridesOnMethodsRule.java:40)
	at com.carrotsearch.randomizedtesting.rules.StatementAdapter.evaluate(StatementAdapter.java:36)
	at com.carrotsearch.randomizedtesting.rules.StatementAdapter.evaluate(StatementAdapter.java:36)
	at com.carrotsearch.randomizedtesting.rules.StatementAdapter.evaluate(StatementAdapter.java:36)
	at org.apache.lucene.util.TestRuleAssertionsRequired$1.evaluate(TestRuleAssertionsRequired.java:53)
	at org.apache.lucene.util.TestRuleMarkFailure$1.evaluate(TestRuleMarkFailure.java:47)
	at org.apache.lucene.util.TestRuleIgnoreAfterMaxFailures$1.evaluate(TestRuleIgnoreAfterMaxFailures.java:64)
	at org.apache.lucene.util.TestRuleIgnoreTestSuites$1.evaluate(TestRuleIgnoreTestSuites.java:54)
	at com.carrotsearch.randomizedtesting.rules.StatementAdapter.evaluate(StatementAdapter.java:36)
	at com.carrotsearch.randomizedtesting.ThreadLeakControl$StatementRunner.run(ThreadLeakControl.java:368)
	at java.lang.Thread.run(Thread.java:748)


FAILED:  org.apache.solr.cloud.autoscaling.TestPolicyCloud.testCreateCollectionAddReplica

Error Message:
Error from server at https://127.0.0.1:46291/solr: KeeperErrorCode = NoNode for /overseer/collection-queue-work/qnr-0000000012

Stack Trace:
org.apache.solr.client.solrj.impl.HttpSolrClient$RemoteSolrException: Error from server at https://127.0.0.1:46291/solr: KeeperErrorCode = NoNode for /overseer/collection-queue-work/qnr-0000000012
	at __randomizedtesting.SeedInfo.seed([885FDC6C04856435:87FB94215C68C93]:0)
	at org.apache.solr.client.solrj.impl.HttpSolrClient.executeMethod(HttpSolrClient.java:643)
	at org.apache.solr.client.solrj.impl.HttpSolrClient.request(HttpSolrClient.java:255)
	at org.apache.solr.client.solrj.impl.HttpSolrClient.request(HttpSolrClient.java:244)
	at org.apache.solr.client.solrj.impl.LBHttpSolrClient.doRequest(LBHttpSolrClient.java:483)
	at org.apache.solr.client.solrj.impl.LBHttpSolrClient.request(LBHttpSolrClient.java:413)
	at org.apache.solr.client.solrj.impl.CloudSolrClient.sendRequest(CloudSolrClient.java:1107)
	at org.apache.solr.client.solrj.impl.CloudSolrClient.requestWithRetryOnStaleState(CloudSolrClient.java:884)
	at org.apache.solr.client.solrj.impl.CloudSolrClient.request(CloudSolrClient.java:817)
	at org.apache.solr.client.solrj.SolrRequest.process(SolrRequest.java:194)
	at org.apache.solr.client.solrj.SolrRequest.process(SolrRequest.java:211)
	at org.apache.solr.cloud.autoscaling.TestPolicyCloud.testCreateCollectionAddReplica(TestPolicyCloud.java:197)
	at sun.reflect.NativeMethodAccessorImpl.invoke0(Native Method)
	at sun.reflect.NativeMethodAccessorImpl.invoke(NativeMethodAccessorImpl.java:62)
	at sun.reflect.DelegatingMethodAccessorImpl.invoke(DelegatingMethodAccessorImpl.java:43)
	at java.lang.reflect.Method.invoke(Method.java:498)
	at com.carrotsearch.randomizedtesting.RandomizedRunner.invoke(RandomizedRunner.java:1742)
	at com.carrotsearch.randomizedtesting.RandomizedRunner$8.evaluate(RandomizedRunner.java:935)
	at com.carrotsearch.randomizedtesting.RandomizedRunner$9.evaluate(RandomizedRunner.java:971)
	at com.carrotsearch.randomizedtesting.RandomizedRunner$10.evaluate(RandomizedRunner.java:985)
	at org.junit.rules.ExpectedException$ExpectedExceptionStatement.evaluate(ExpectedException.java:110)
	at com.carrotsearch.randomizedtesting.rules.SystemPropertiesRestoreRule$1.evaluate(SystemPropertiesRestoreRule.java:57)
	at org.apache.lucene.util.TestRuleSetupTeardownChained$1.evaluate(TestRuleSetupTeardownChained.java:49)
	at org.apache.lucene.util.AbstractBeforeAfterRule$1.evaluate(AbstractBeforeAfterRule.java:45)
	at org.apache.lucene.util.TestRuleThreadAndTestName$1.evaluate(TestRuleThreadAndTestName.java:48)
	at org.apache.lucene.util.TestRuleIgnoreAfterMaxFailures$1.evaluate(TestRuleIgnoreAfterMaxFailures.java:64)
	at org.apache.lucene.util.TestRuleMarkFailure$1.evaluate(TestRuleMarkFailure.java:47)
	at com.carrotsearch.randomizedtesting.rules.StatementAdapter.evaluate(StatementAdapter.java:36)
	at com.carrotsearch.randomizedtesting.ThreadLeakControl$StatementRunner.run(ThreadLeakControl.java:368)
	at com.carrotsearch.randomizedtesting.ThreadLeakControl.forkTimeoutingTask(ThreadLeakControl.java:817)
	at com.carrotsearch.randomizedtesting.ThreadLeakControl$3.evaluate(ThreadLeakControl.java:468)
	at com.carrotsearch.randomizedtesting.RandomizedRunner.runSingleTest(RandomizedRunner.java:944)
	at com.carrotsearch.randomizedtesting.RandomizedRunner$5.evaluate(RandomizedRunner.java:830)
	at com.carrotsearch.randomizedtesting.RandomizedRunner$6.evaluate(RandomizedRunner.java:880)
	at com.carrotsearch.randomizedtesting.RandomizedRunner$7.evaluate(RandomizedRunner.java:891)
	at com.carrotsearch.randomizedtesting.rules.StatementAdapter.evaluate(StatementAdapter.java:36)
	at com.carrotsearch.randomizedtesting.rules.SystemPropertiesRestoreRule$1.evaluate(SystemPropertiesRestoreRule.java:57)
	at org.apache.lucene.util.AbstractBeforeAfterRule$1.evaluate(AbstractBeforeAfterRule.java:45)
	at com.carrotsearch.randomizedtesting.rules.StatementAdapter.evaluate(StatementAdapter.java:36)
	at org.apache.lucene.util.TestRuleStoreClassName$1.evaluate(TestRuleStoreClassName.java:41)
	at com.carrotsearch.randomizedtesting.rules.NoShadowingOrOverridesOnMethodsRule$1.evaluate(NoShadowingOrOverridesOnMethodsRule.java:40)
	at com.carrotsearch.randomizedtesting.rules.NoShadowingOrOverridesOnMethodsRule$1.evaluate(NoShadowingOrOverridesOnMethodsRule.java:40)
	at com.carrotsearch.randomizedtesting.rules.StatementAdapter.evaluate(StatementAdapter.java:36)
	at com.carrotsearch.randomizedtesting.rules.StatementAdapter.evaluate(StatementAdapter.java:36)
	at com.carrotsearch.randomizedtesting.rules.StatementAdapter.evaluate(StatementAdapter.java:36)
	at org.apache.lucene.util.TestRuleAssertionsRequired$1.evaluate(TestRuleAssertionsRequired.java:53)
	at org.apache.lucene.util.TestRuleMarkFailure$1.evaluate(TestRuleMarkFailure.java:47)
	at org.apache.lucene.util.TestRuleIgnoreAfterMaxFailures$1.evaluate(TestRuleIgnoreAfterMaxFailures.java:64)
	at org.apache.lucene.util.TestRuleIgnoreTestSuites$1.evaluate(TestRuleIgnoreTestSuites.java:54)
	at com.carrotsearch.randomizedtesting.rules.StatementAdapter.evaluate(StatementAdapter.java:36)
	at com.carrotsearch.randomizedtesting.ThreadLeakControl$StatementRunner.run(ThreadLeakControl.java:368)
	at java.lang.Thread.run(Thread.java:748)


FAILED:  org.apache.solr.cloud.autoscaling.sim.TestSimComputePlanAction.testNodeAdded

Error Message:
ComputePlanAction should have computed exactly 1 operation, but was: [{   "class":"org.apache.solr.client.solrj.request.CollectionAdminRequest$MoveReplica",   "method":"GET",   "params.action":"MOVEREPLICA",   "params.collection":"testNodeAdded",   "params.targetNode":"127.0.0.1:10006_solr",   "params.inPlaceMove":"true",   "params.replica":"core_node1"}, {   "class":"org.apache.solr.client.solrj.request.CollectionAdminRequest$MoveReplica",   "method":"GET",   "params.action":"MOVEREPLICA",   "params.collection":"testNodeAdded",   "params.targetNode":"127.0.0.1:10006_solr",   "params.inPlaceMove":"true",   "params.replica":"core_node2"}] expected:<1> but was:<2>

Stack Trace:
java.lang.AssertionError: ComputePlanAction should have computed exactly 1 operation, but was: [{
  "class":"org.apache.solr.client.solrj.request.CollectionAdminRequest$MoveReplica",
  "method":"GET",
  "params.action":"MOVEREPLICA",
  "params.collection":"testNodeAdded",
  "params.targetNode":"127.0.0.1:10006_solr",
  "params.inPlaceMove":"true",
  "params.replica":"core_node1"}, {
  "class":"org.apache.solr.client.solrj.request.CollectionAdminRequest$MoveReplica",
  "method":"GET",
  "params.action":"MOVEREPLICA",
  "params.collection":"testNodeAdded",
  "params.targetNode":"127.0.0.1:10006_solr",
  "params.inPlaceMove":"true",
  "params.replica":"core_node2"}] expected:<1> but was:<2>
	at __randomizedtesting.SeedInfo.seed([885FDC6C04856435:ED9C8A1BA626CC36]:0)
	at org.junit.Assert.fail(Assert.java:93)
	at org.junit.Assert.failNotEquals(Assert.java:647)
	at org.junit.Assert.assertEquals(Assert.java:128)
	at org.junit.Assert.assertEquals(Assert.java:472)
	at org.apache.solr.cloud.autoscaling.sim.TestSimComputePlanAction.testNodeAdded(TestSimComputePlanAction.java:314)
	at sun.reflect.NativeMethodAccessorImpl.invoke0(Native Method)
	at sun.reflect.NativeMethodAccessorImpl.invoke(NativeMethodAccessorImpl.java:62)
	at sun.reflect.DelegatingMethodAccessorImpl.invoke(DelegatingMethodAccessorImpl.java:43)
	at java.lang.reflect.Method.invoke(Method.java:498)
	at com.carrotsearch.randomizedtesting.RandomizedRunner.invoke(RandomizedRunner.java:1742)
	at com.carrotsearch.randomizedtesting.RandomizedRunner$8.evaluate(RandomizedRunner.java:935)
	at com.carrotsearch.randomizedtesting.RandomizedRunner$9.evaluate(RandomizedRunner.java:971)
	at com.carrotsearch.randomizedtesting.RandomizedRunner$10.evaluate(RandomizedRunner.java:985)
	at com.carrotsearch.randomizedtesting.rules.SystemPropertiesRestoreRule$1.evaluate(SystemPropertiesRestoreRule.java:57)
	at org.apache.lucene.util.TestRuleSetupTeardownChained$1.evaluate(TestRuleSetupTeardownChained.java:49)
	at org.apache.lucene.util.AbstractBeforeAfterRule$1.evaluate(AbstractBeforeAfterRule.java:45)
	at org.apache.lucene.util.TestRuleThreadAndTestName$1.evaluate(TestRuleThreadAndTestName.java:48)
	at org.apache.lucene.util.TestRuleIgnoreAfterMaxFailures$1.evaluate(TestRuleIgnoreAfterMaxFailures.java:64)
	at org.apache.lucene.util.TestRuleMarkFailure$1.evaluate(TestRuleMarkFailure.java:47)
	at com.carrotsearch.randomizedtesting.rules.StatementAdapter.evaluate(StatementAdapter.java:36)
	at com.carrotsearch.randomizedtesting.ThreadLeakControl$StatementRunner.run(ThreadLeakControl.java:368)
	at com.carrotsearch.randomizedtesting.ThreadLeakControl.forkTimeoutingTask(ThreadLeakControl.java:817)
	at com.carrotsearch.randomizedtesting.ThreadLeakControl$3.evaluate(ThreadLeakControl.java:468)
	at com.carrotsearch.randomizedtesting.RandomizedRunner.runSingleTest(RandomizedRunner.java:944)
	at com.carrotsearch.randomizedtesting.RandomizedRunner$5.evaluate(RandomizedRunner.java:830)
	at com.carrotsearch.randomizedtesting.RandomizedRunner$6.evaluate(RandomizedRunner.java:880)
	at com.carrotsearch.randomizedtesting.RandomizedRunner$7.evaluate(RandomizedRunner.java:891)
	at com.carrotsearch.randomizedtesting.rules.StatementAdapter.evaluate(StatementAdapter.java:36)
	at com.carrotsearch.randomizedtesting.rules.SystemPropertiesRestoreRule$1.evaluate(SystemPropertiesRestoreRule.java:57)
	at org.apache.lucene.util.AbstractBeforeAfterRule$1.evaluate(AbstractBeforeAfterRule.java:45)
	at com.carrotsearch.randomizedtesting.rules.StatementAdapter.evaluate(StatementAdapter.java:36)
	at org.apache.lucene.util.TestRuleStoreClassName$1.evaluate(TestRuleStoreClassName.java:41)
	at com.carrotsearch.randomizedtesting.rules.NoShadowingOrOverridesOnMethodsRule$1.evaluate(NoShadowingOrOverridesOnMethodsRule.java:40)
	at com.carrotsearch.randomizedtesting.rules.NoShadowingOrOverridesOnMethodsRule$1.evaluate(NoShadowingOrOverridesOnMethodsRule.java:40)
	at com.carrotsearch.randomizedtesting.rules.StatementAdapter.evaluate(StatementAdapter.java:36)
	at com.carrotsearch.randomizedtesting.rules.StatementAdapter.evaluate(StatementAdapter.java:36)
	at com.carrotsearch.randomizedtesting.rules.StatementAdapter.evaluate(StatementAdapter.java:36)
	at org.apache.lucene.util.TestRuleAssertionsRequired$1.evaluate(TestRuleAssertionsRequired.java:53)
	at org.apache.lucene.util.TestRuleMarkFailure$1.evaluate(TestRuleMarkFailure.java:47)
	at org.apache.lucene.util.TestRuleIgnoreAfterMaxFailures$1.evaluate(TestRuleIgnoreAfterMaxFailures.java:64)
	at org.apache.lucene.util.TestRuleIgnoreTestSuites$1.evaluate(TestRuleIgnoreTestSuites.java:54)
	at com.carrotsearch.randomizedtesting.rules.StatementAdapter.evaluate(StatementAdapter.java:36)
	at com.carrotsearch.randomizedtesting.ThreadLeakControl$StatementRunner.run(ThreadLeakControl.java:368)
	at java.lang.Thread.run(Thread.java:748)


FAILED:  org.apache.solr.cloud.autoscaling.sim.TestSimTriggerIntegration.testNodeLostTriggerRestoreState

Error Message:
The trigger did not fire at all

Stack Trace:
java.lang.AssertionError: The trigger did not fire at all
	at __randomizedtesting.SeedInfo.seed([885FDC6C04856435:A3A009379EFD71E5]:0)
	at org.junit.Assert.fail(Assert.java:93)
	at org.junit.Assert.assertTrue(Assert.java:43)
	at org.apache.solr.cloud.autoscaling.sim.TestSimTriggerIntegration.testNodeLostTriggerRestoreState(TestSimTriggerIntegration.java:344)
	at sun.reflect.NativeMethodAccessorImpl.invoke0(Native Method)
	at sun.reflect.NativeMethodAccessorImpl.invoke(NativeMethodAccessorImpl.java:62)
	at sun.reflect.DelegatingMethodAccessorImpl.invoke(DelegatingMethodAccessorImpl.java:43)
	at java.lang.reflect.Method.invoke(Method.java:498)
	at com.carrotsearch.randomizedtesting.RandomizedRunner.invoke(RandomizedRunner.java:1742)
	at com.carrotsearch.randomizedtesting.RandomizedRunner$8.evaluate(RandomizedRunner.java:935)
	at com.carrotsearch.randomizedtesting.RandomizedRunner$9.evaluate(RandomizedRunner.java:971)
	at com.carrotsearch.randomizedtesting.RandomizedRunner$10.evaluate(RandomizedRunner.java:985)
	at com.carrotsearch.randomizedtesting.rules.SystemPropertiesRestoreRule$1.evaluate(SystemPropertiesRestoreRule.java:57)
	at org.apache.lucene.util.TestRuleSetupTeardownChained$1.evaluate(TestRuleSetupTeardownChained.java:49)
	at org.apache.lucene.util.AbstractBeforeAfterRule$1.evaluate(AbstractBeforeAfterRule.java:45)
	at org.apache.lucene.util.TestRuleThreadAndTestName$1.evaluate(TestRuleThreadAndTestName.java:48)
	at org.apache.lucene.util.TestRuleIgnoreAfterMaxFailures$1.evaluate(TestRuleIgnoreAfterMaxFailures.java:64)
	at org.apache.lucene.util.TestRuleMarkFailure$1.evaluate(TestRuleMarkFailure.java:47)
	at com.carrotsearch.randomizedtesting.rules.StatementAdapter.evaluate(StatementAdapter.java:36)
	at com.carrotsearch.randomizedtesting.ThreadLeakControl$StatementRunner.run(ThreadLeakControl.java:368)
	at com.carrotsearch.randomizedtesting.ThreadLeakControl.forkTimeoutingTask(ThreadLeakControl.java:817)
	at com.carrotsearch.randomizedtesting.ThreadLeakControl$3.evaluate(ThreadLeakControl.java:468)
	at com.carrotsearch.randomizedtesting.RandomizedRunner.runSingleTest(RandomizedRunner.java:944)
	at com.carrotsearch.randomizedtesting.RandomizedRunner$5.evaluate(RandomizedRunner.java:830)
	at com.carrotsearch.randomizedtesting.RandomizedRunner$6.evaluate(RandomizedRunner.java:880)
	at com.carrotsearch.randomizedtesting.RandomizedRunner$7.evaluate(RandomizedRunner.java:891)
	at com.carrotsearch.randomizedtesting.rules.StatementAdapter.evaluate(StatementAdapter.java:36)
	at com.carrotsearch.randomizedtesting.rules.SystemPropertiesRestoreRule$1.evaluate(SystemPropertiesRestoreRule.java:57)
	at org.apache.lucene.util.AbstractBeforeAfterRule$1.evaluate(AbstractBeforeAfterRule.java:45)
	at com.carrotsearch.randomizedtesting.rules.StatementAdapter.evaluate(StatementAdapter.java:36)
	at org.apache.lucene.util.TestRuleStoreClassName$1.evaluate(TestRuleStoreClassName.java:41)
	at com.carrotsearch.randomizedtesting.rules.NoShadowingOrOverridesOnMethodsRule$1.evaluate(NoShadowingOrOverridesOnMethodsRule.java:40)
	at com.carrotsearch.randomizedtesting.rules.NoShadowingOrOverridesOnMethodsRule$1.evaluate(NoShadowingOrOverridesOnMethodsRule.java:40)
	at com.carrotsearch.randomizedtesting.rules.StatementAdapter.evaluate(StatementAdapter.java:36)
	at com.carrotsearch.randomizedtesting.rules.StatementAdapter.evaluate(StatementAdapter.java:36)
	at com.carrotsearch.randomizedtesting.rules.StatementAdapter.evaluate(StatementAdapter.java:36)
	at org.apache.lucene.util.TestRuleAssertionsRequired$1.evaluate(TestRuleAssertionsRequired.java:53)
	at org.apache.lucene.util.TestRuleMarkFailure$1.evaluate(TestRuleMarkFailure.java:47)
	at org.apache.lucene.util.TestRuleIgnoreAfterMaxFailures$1.evaluate(TestRuleIgnoreAfterMaxFailures.java:64)
	at org.apache.lucene.util.TestRuleIgnoreTestSuites$1.evaluate(TestRuleIgnoreTestSuites.java:54)
	at com.carrotsearch.randomizedtesting.rules.StatementAdapter.evaluate(StatementAdapter.java:36)
	at com.carrotsearch.randomizedtesting.ThreadLeakControl$StatementRunner.run(ThreadLeakControl.java:368)
	at java.lang.Thread.run(Thread.java:748)




Build Log:
[...truncated 12757 lines...]
   [junit4] Suite: org.apache.solr.cloud.autoscaling.sim.TestSimTriggerIntegration
   [junit4]   2> 776472 INFO  (SUITE-TestSimTriggerIntegration-seed#[885FDC6C04856435]-worker) [    ] o.a.s.SolrTestCaseJ4 SecureRandom sanity checks: test.solr.allowed.securerandom=null & java.security.egd=file:/dev/./urandom
   [junit4]   2> Creating dataDir: /home/jenkins/jenkins-slave/workspace/Lucene-Solr-Tests-master/solr/build/solr-core/test/J1/temp/solr.cloud.autoscaling.sim.TestSimTriggerIntegration_885FDC6C04856435-001/init-core-data-001
   [junit4]   2> 776474 WARN  (SUITE-TestSimTriggerIntegration-seed#[885FDC6C04856435]-worker) [    ] o.a.s.SolrTestCaseJ4 startTrackingSearchers: numOpens=5 numCloses=5
   [junit4]   2> 776474 INFO  (SUITE-TestSimTriggerIntegration-seed#[885FDC6C04856435]-worker) [    ] o.a.s.SolrTestCaseJ4 Using TrieFields (NUMERIC_POINTS_SYSPROP=false) w/NUMERIC_DOCVALUES_SYSPROP=true
   [junit4]   2> 776494 INFO  (SUITE-TestSimTriggerIntegration-seed#[885FDC6C04856435]-worker) [    ] o.a.s.SolrTestCaseJ4 Randomized ssl (true) and clientAuth (true) via: @org.apache.solr.util.RandomizeSSL(reason=, ssl=NaN, value=NaN, clientAuth=NaN)
   [junit4]   2> 776642 DEBUG (Simulated OverseerAutoScalingTriggerThread) [    ] o.a.s.c.a.OverseerTriggerThread Adding .auto_add_replicas and .scheduled_maintenance triggers
   [junit4]   2> 776642 DEBUG (Simulated OverseerAutoScalingTriggerThread) [    ] o.a.s.c.a.OverseerTriggerThread Refreshing /autoscaling.json with znode version 0
   [junit4]   2> 776643 DEBUG (Simulated OverseerAutoScalingTriggerThread) [    ] o.a.s.c.a.OverseerTriggerThread Current znodeVersion 0, lastZnodeVersion -1
   [junit4]   2> 776643 DEBUG (Simulated OverseerAutoScalingTriggerThread) [    ] o.a.s.c.a.OverseerTriggerThread Processed trigger updates upto znodeVersion 0
   [junit4]   2> 776662 DEBUG (Simulated OverseerAutoScalingTriggerThread) [    ] o.a.s.c.a.NodeLostTrigger NodeLostTrigger .auto_add_replicas - Initial livenodes: []
   [junit4]   2> 776663 DEBUG (SUITE-TestSimTriggerIntegration-seed#[885FDC6C04856435]-worker) [    ] o.a.s.c.a.s.SimClusterStateProvider --- new Overseer leader: 127.0.0.1:10000_solr
   [junit4]   2> 776674 DEBUG (Simulated OverseerAutoScalingTriggerThread) [    ] o.a.s.c.a.OverseerTriggerThread -- clean old nodeAdded markers
   [junit4]   2> 776674 DEBUG (Simulated OverseerAutoScalingTriggerThread) [    ] o.a.s.c.a.OverseerTriggerThread Current znodeVersion 0, lastZnodeVersion 0
   [junit4]   2> 776675 DEBUG (SUITE-TestSimTriggerIntegration-seed#[885FDC6C04856435]-worker) [    ] o.a.s.c.a.s.SimClusterStateProvider ** creating new collection states
   [junit4]   2> 776675 DEBUG (ScheduledTrigger-1721-thread-2) [    ] o.a.s.c.a.NodeLostTrigger Running NodeLostTrigger: .auto_add_replicas with currently live nodes: 1
   [junit4]   2> 776709 DEBUG (SUITE-TestSimTriggerIntegration-seed#[885FDC6C04856435]-worker) [    ] o.a.s.c.a.s.SimClusterStateProvider ** saved cluster state version -1
   [junit4]   2> 776709 INFO  (SUITE-TestSimTriggerIntegration-seed#[885FDC6C04856435]-worker) [    ] o.a.s.h.a.MetricsHistoryHandler No .system collection, keeping metrics history in memory.
   [junit4] IGNOR/A 0.00s J1 | TestSimTriggerIntegration.testCooldown
   [junit4]    > Assumption #1: 'badapple' test group is disabled (@BadApple(bugUrl=https://issues.apache.org/jira/browse/SOLR-12028))
   [junit4]   2> 776822 DEBUG (ScheduledTrigger-1721-thread-1) [    ] o.a.s.c.a.NodeLostTrigger Running NodeLostTrigger: .auto_add_replicas with currently live nodes: 2
   [junit4]   2> 776858 DEBUG (ScheduledTrigger-1721-thread-1) [    ] o.a.s.c.a.NodeLostTrigger Running NodeLostTrigger: .auto_add_replicas with currently live nodes: 2
   [junit4]   2> 776860 INFO  (TEST-TestSimTriggerIntegration.testNodeLostTriggerRestoreState-seed#[885FDC6C04856435]) [    ] o.a.s.SolrTestCaseJ4 ###Starting testNodeLostTriggerRestoreState
   [junit4]   2> 776860 DEBUG (TEST-TestSimTriggerIntegration.testNodeLostTriggerRestoreState-seed#[885FDC6C04856435]) [    ] o.a.s.c.a.OverseerTriggerThread Refreshing /autoscaling.json with znode version 1
   [junit4]   2> 776861 DEBUG (Simulated OverseerAutoScalingTriggerThread) [    ] o.a.s.c.a.OverseerTriggerThread Processed trigger updates upto znodeVersion 1
   [junit4]   2> 776861 DEBUG (Simulated OverseerAutoScalingTriggerThread) [    ] o.a.s.c.a.OverseerTriggerThread -- clean old nodeLost markers
   [junit4]   2> 776862 INFO  (TEST-TestSimTriggerIntegration.testNodeLostTriggerRestoreState-seed#[885FDC6C04856435]) [    ] o.a.s.c.a.s.SimCloudManager === Restarting OverseerTriggerThread and clearing object cache...
   [junit4]   2> 776931 DEBUG (Simulated OverseerAutoScalingTriggerThread) [    ] o.a.s.c.a.OverseerTriggerThread -- clean old nodeAdded markers
   [junit4]   2> 776931 WARN  (Simulated OverseerAutoScalingTriggerThread) [    ] o.a.s.c.a.OverseerTriggerThread Interrupted
   [junit4]   2> java.lang.InterruptedException: null
   [junit4]   2> 	at java.util.concurrent.locks.AbstractQueuedSynchronizer.acquireInterruptibly(AbstractQueuedSynchronizer.java:1220) ~[?:1.8.0_172]
   [junit4]   2> 	at java.util.concurrent.locks.ReentrantLock.lockInterruptibly(ReentrantLock.java:335) ~[?:1.8.0_172]
   [junit4]   2> 	at org.apache.solr.cloud.autoscaling.OverseerTriggerThread.run(OverseerTriggerThread.java:177) [java/:?]
   [junit4]   2> 	at java.lang.Thread.run(Thread.java:748) [?:1.8.0_172]
   [junit4]   2> 776931 DEBUG (TEST-TestSimTriggerIntegration.testNodeLostTriggerRestoreState-seed#[885FDC6C04856435]) [    ] o.a.s.c.a.ScheduledTriggers Shutting down scheduled thread pool executor now
   [junit4]   2> 776932 DEBUG (TEST-TestSimTriggerIntegration.testNodeLostTriggerRestoreState-seed#[885FDC6C04856435]) [    ] o.a.s.c.a.ScheduledTriggers Shutting down action executor now
   [junit4]   2> 776932 DEBUG (TEST-TestSimTriggerIntegration.testNodeLostTriggerRestoreState-seed#[885FDC6C04856435]) [    ] o.a.s.c.a.ScheduledTriggers Awaiting termination for action executor
   [junit4]   2> 776932 DEBUG (TEST-TestSimTriggerIntegration.testNodeLostTriggerRestoreState-seed#[885FDC6C04856435]) [    ] o.a.s.c.a.ScheduledTriggers Awaiting termination for scheduled thread pool executor
   [junit4]   2> 776932 DEBUG (TEST-TestSimTriggerIntegration.testNodeLostTriggerRestoreState-seed#[885FDC6C04856435]) [    ] o.a.s.c.a.ScheduledTriggers ScheduledTriggers closed completely
   [junit4]   2> 776932 DEBUG (TEST-TestSimTriggerIntegration.testNodeLostTriggerRestoreState-seed#[885FDC6C04856435]) [    ] o.a.s.c.a.OverseerTriggerThread OverseerTriggerThread has been closed explicitly
   [junit4]   2> 776951 DEBUG (Simulated OverseerAutoScalingTriggerThread) [    ] o.a.s.c.a.OverseerTriggerThread Adding .auto_add_replicas and .scheduled_maintenance triggers
   [junit4]   2> 776952 DEBUG (Simulated OverseerAutoScalingTriggerThread) [    ] o.a.s.c.a.OverseerTriggerThread Refreshing /autoscaling.json with znode version 2
   [junit4]   2> 776952 DEBUG (Simulated OverseerAutoScalingTriggerThread) [    ] o.a.s.c.a.OverseerTriggerThread Current znodeVersion 2, lastZnodeVersion -1
   [junit4]   2> 776952 DEBUG (Simulated OverseerAutoScalingTriggerThread) [    ] o.a.s.c.a.OverseerTriggerThread Processed trigger updates upto znodeVersion 2
   [junit4]   2> 776977 DEBUG (Simulated OverseerAutoScalingTriggerThread) [    ] o.a.s.c.a.NodeLostTrigger NodeLostTrigger .auto_add_replicas - Initial livenodes: [127.0.0.1:10001_solr, 127.0.0.1:10000_solr]
   [junit4]   2> 776979 DEBUG (Simulated OverseerAutoScalingTriggerThread) [    ] o.a.s.c.a.OverseerTriggerThread -- clean old nodeAdded markers
   [junit4]   2> 776979 DEBUG (Simulated OverseerAutoScalingTriggerThread) [    ] o.a.s.c.a.OverseerTriggerThread Current znodeVersion 2, lastZnodeVersion 2
   [junit4]   2> 776979 DEBUG (ScheduledTrigger-1726-thread-2) [    ] o.a.s.c.a.NodeLostTrigger Running NodeLostTrigger: .auto_add_replicas with currently live nodes: 2
   [junit4]   2> 777024 DEBUG (ScheduledTrigger-1726-thread-1) [    ] o.a.s.c.a.NodeLostTrigger Running NodeLostTrigger: .auto_add_replicas with currently live nodes: 2
   [junit4]   2> 777056 DEBUG (ScheduledTrigger-1726-thread-4) [    ] o.a.s.c.a.NodeLostTrigger Running NodeLostTrigger: .auto_add_replicas with currently live nodes: 2
   [junit4]   2> 777077 DEBUG (ScheduledTrigger-1726-thread-1) [    ] o.a.s.c.a.NodeLostTrigger Running NodeLostTrigger: .auto_add_replicas with currently live nodes: 2
   [junit4]   2> 777083 DEBUG (simCloudManagerPool-1725-thread-1) [    ] o.a.s.c.a.s.SimClusterStateProvider ** creating new collection states
   [junit4]   2> 777150 DEBUG (ScheduledTrigger-1726-thread-1) [    ] o.a.s.c.a.NodeLostTrigger Running NodeLostTrigger: .auto_add_replicas with currently live nodes: 2
   [junit4]   2> 777150 DEBUG (simCloudManagerPool-1725-thread-1) [    ] o.a.s.c.a.s.SimClusterStateProvider ** saved cluster state version 0
   [junit4]   2> 777152 DEBUG (simCloudManagerPool-1725-thread-1) [    ] o.a.s.c.a.AutoScalingHandler Verified autoscaling configuration
   [junit4]   2> 777152 DEBUG (simCloudManagerPool-1725-thread-1) [    ] o.a.s.c.a.OverseerTriggerThread Refreshing /autoscaling.json with znode version 3
   [junit4]   2> 777153 DEBUG (Simulated OverseerAutoScalingTriggerThread) [    ] o.a.s.c.a.OverseerTriggerThread Processed trigger updates upto znodeVersion 3
   [junit4]   2> 777153 DEBUG (Simulated OverseerAutoScalingTriggerThread) [    ] o.a.s.c.a.OverseerTriggerThread -- clean old nodeAdded markers
   [junit4]   2> 777153 DEBUG (Simulated OverseerAutoScalingTriggerThread) [    ] o.a.s.c.a.OverseerTriggerThread Current znodeVersion 3, lastZnodeVersion 3
   [junit4]   2> 777170 DEBUG (ScheduledTrigger-1726-thread-1) [    ] o.a.s.c.a.NodeLostTrigger Running NodeLostTrigger: .auto_add_replicas with currently live nodes: 2
   [junit4]   2> 777170 DEBUG (TEST-TestSimTriggerIntegration.testNodeLostTriggerRestoreState-seed#[885FDC6C04856435]) [    ] o.a.s.c.a.s.SimClusterStateProvider ** creating new collection states
   [junit4]   2> 777171 DEBUG (TEST-TestSimTriggerIntegration.testNodeLostTriggerRestoreState-seed#[885FDC6C04856435]) [    ] o.a.s.c.a.s.SimClusterStateProvider ** saved cluster state version 1
   [junit4]   2> 777198 DEBUG (ScheduledTrigger-1726-thread-1) [    ] o.a.s.c.a.NodeLostTrigger Running NodeLostTrigger: .auto_add_replicas with currently live nodes: 2
   [junit4]   2> 777235 DEBUG (ScheduledTrigger-1726-thread-1) [    ] o.a.s.c.a.NodeLostTrigger Running NodeLostTrigger: .auto_add_replicas with currently live nodes: 2
   [junit4]   2> 777271 DEBUG (ScheduledTrigger-1726-thread-1) [    ] o.a.s.c.a.NodeLostTrigger Running NodeLostTrigger: .auto_add_replicas with currently live nodes: 2
   [junit4]   2> 777308 DEBUG (ScheduledTrigger-1726-thread-1) [    ] o.a.s.c.a.NodeLostTrigger Running NodeLostTrigger: .auto_add_replicas with currently live nodes: 2
   [junit4]   2> 777311 DEBUG (simCloudManagerPool-1725-thread-2) [    ] o.a.s.c.a.s.SimClusterStateProvider ** creating new collection states
   [junit4]   2> 777362 DEBUG (ScheduledTrigger-1726-thread-1) [    ] o.a.s.c.a.NodeLostTrigger Running NodeLostTrigger: .auto_add_replicas with currently live nodes: 2
   [junit4]   2> 777399 DEBUG (ScheduledTrigger-1726-thread-3) [    ] o.a.s.c.a.NodeLostTrigger Running NodeLostTrigger: .auto_add_replicas with currently live nodes: 2
   [junit4]   2> 777420 DEBUG (ScheduledTrigger-1726-thread-3) [    ] o.a.s.c.a.NodeLostTrigger Running NodeLostTrigger: .auto_add_replicas with currently live nodes: 2
   [junit4]   2> 777454 DEBUG (ScheduledTrigger-1726-thread-3) [    ] o.a.s.c.a.NodeLostTrigger Running NodeLostTrigger: .auto_add_replicas with currently live nodes: 2
   [junit4]   2> 777455 DEBUG (simCloudManagerPool-1725-thread-2) [    ] o.a.s.c.a.s.SimClusterStateProvider ** saved cluster state version 2
   [junit4]   2> 777536 DEBUG (ScheduledTrigger-1726-thread-3) [    ] o.a.s.c.a.NodeLostTrigger Running NodeLostTrigger: .auto_add_replicas with currently live nodes: 2
   [junit4]   2> 777556 DEBUG (ScheduledTrigger-1726-thread-3) [    ] o.a.s.c.a.NodeLostTrigger Running NodeLostTrigger: .auto_add_replicas with currently live nodes: 2
   [junit4]   2> 777593 DEBUG (ScheduledTrigger-1726-thread-3) [    ] o.a.s.c.a.NodeLostTrigger Running NodeLostTrigger: .auto_add_replicas with currently live nodes: 2
   [junit4]   2> 777642 DEBUG (simCloudManagerPool-1725-thread-3) [    ] o.a.s.c.a.s.SimClusterStateProvider -- elected new leader for .system / shard1: {"core_node1":{
   [junit4]   2>     "core":".system_shard1_replica_n1",
   [junit4]   2>     "shard":"shard1",
   [junit4]   2>     "collection":".system",
   [junit4]   2>     "node_name":"127.0.0.1:10001_solr",
   [junit4]   2>     "type":"NRT",
   [junit4]   2>     "leader":"true",
   [junit4]   2>     "SEARCHER.searcher.maxDoc":0,
   [junit4]   2>     "SEARCHER.searcher.deletedDocs":0,
   [junit4]   2>     "INDEX.sizeInBytes":10240,
   [junit4]   2>     "state":"active",
   [junit4]   2>     "INDEX.sizeInGB":9.5367431640625E-6,
   [junit4]   2>     "SEARCHER.searcher.numDocs":0}}
   [junit4]   2> 777645 DEBUG (TEST-TestSimTriggerIntegration.testNodeLostTriggerRestoreState-seed#[885FDC6C04856435]) [    ] o.a.s.c.a.s.SimClusterStateProvider ** creating new collection states
   [junit4]   2> 777645 DEBUG (TEST-TestSimTriggerIntegration.testNodeLostTriggerRestoreState-seed#[885FDC6C04856435]) [    ] o.a.s.c.a.s.SimClusterStateProvider ** saved cluster state version 3
   [junit4]   2> 777646 DEBUG (ScheduledTrigger-1726-thread-3) [    ] o.a.s.c.a.NodeLostTrigger Running NodeLostTrigger: .auto_add_replicas with currently live nodes: 3
   [junit4]   2> 777648 DEBUG (simCloudManagerPool-1725-thread-4) [    ] o.a.s.c.a.AutoScalingHandler Verified autoscaling configuration
   [junit4]   2> 777648 DEBUG (simCloudManagerPool-1725-thread-4) [    ] o.a.s.c.a.OverseerTriggerThread Refreshing /autoscaling.json with znode version 4
   [junit4]   2> 777666 DEBUG (Simulated OverseerAutoScalingTriggerThread) [    ] o.a.s.c.a.OverseerTriggerThread Processed trigger updates upto znodeVersion 4
   [junit4]   2> 777666 INFO  (Simulated OverseerAutoScalingTriggerThread) [    ] o.a.s.c.a.s.TestSimTriggerIntegration TestTriggerAction init
   [junit4]   2> 777666 DEBUG (Simulated OverseerAutoScalingTriggerThread) [    ] o.a.s.c.a.NodeLostTrigger NodeLostTrigger node_lost_restore_trigger - Initial livenodes: [127.0.0.1:10001_solr, 127.0.0.1:10000_solr]
   [junit4]   2> 777666 DEBUG (Simulated OverseerAutoScalingTriggerThread) [    ] o.a.s.c.a.OverseerTriggerThread -- clean old nodeAdded markers
   [junit4]   2> 777666 DEBUG (Simulated OverseerAutoScalingTriggerThread) [    ] o.a.s.c.a.OverseerTriggerThread Current znodeVersion 4, lastZnodeVersion 4
   [junit4]   2> 777666 DEBUG (ScheduledTrigger-1726-thread-2) [    ] o.a.s.c.a.NodeLostTrigger Running NodeLostTrigger: .auto_add_replicas with currently live nodes: 2
   [junit4]   2> 777666 DEBUG (ScheduledTrigger-1726-thread-2) [    ] o.a.s.c.a.NodeLostTrigger Tracking lost node: 127.0.0.1:10002_solr
   [junit4]   2> 777667 DEBUG (ScheduledTrigger-1726-thread-2) [    ] o.a.s.c.a.NodeLostTrigger Running NodeLostTrigger: node_lost_restore_trigger with currently live nodes: 2
   [junit4]   2> 777694 DEBUG (ScheduledTrigger-1726-thread-3) [    ] o.a.s.c.a.NodeLostTrigger Running NodeLostTrigger: .auto_add_replicas with currently live nodes: 2
   [junit4]   2> 777727 DEBUG (ScheduledTrigger-1726-thread-3) [    ] o.a.s.c.a.NodeLostTrigger Running NodeLostTrigger: node_lost_restore_trigger with currently live nodes: 2
   [junit4]   2> 777727 DEBUG (ScheduledTrigger-1726-thread-4) [    ] o.a.s.c.a.NodeLostTrigger Running NodeLostTrigger: .auto_add_replicas with currently live nodes: 2
   [junit4]   2> 777729 DEBUG (simCloudManagerPool-1725-thread-5) [    ] o.a.s.c.a.AutoScalingHandler Verified autoscaling configuration
   [junit4]   2> 777729 DEBUG (simCloudManagerPool-1725-thread-5) [    ] o.a.s.c.a.OverseerTriggerThread Refreshing /autoscaling.json with znode version 5
   [junit4]   2> 777730 DEBUG (Simulated OverseerAutoScalingTriggerThread) [    ] o.a.s.c.a.OverseerTriggerThread Processed trigger updates upto znodeVersion 5
   [junit4]   2> 777730 INFO  (Simulated OverseerAutoScalingTriggerThread) [    ] o.a.s.c.a.s.TestSimTriggerIntegration TestTriggerAction init
   [junit4]   2> 777730 DEBUG (Simulated OverseerAutoScalingTriggerThread) [    ] o.a.s.c.a.NodeLostTrigger NodeLostTrigger node_lost_restore_trigger - Initial livenodes: [127.0.0.1:10001_solr, 127.0.0.1:10000_solr]
   [junit4]   2> 777730 DEBUG (Simulated OverseerAutoScalingTriggerThread) [    ] o.a.s.c.a.NodeLostTrigger Adding lost node from marker path: 127.0.0.1:10002_solr
   [junit4]   2> 777730 DEBUG (Simulated OverseerAutoScalingTriggerThread) [    ] o.a.s.c.a.OverseerTriggerThread -- clean old nodeAdded markers
   [junit4]   2> 777730 DEBUG (ScheduledTrigger-1726-thread-3) [    ] o.a.s.c.a.NodeLostTrigger Running NodeLostTrigger: node_lost_restore_trigger with currently live nodes: 2
   [junit4]   2> 777731 DEBUG (ScheduledTrigger-1726-thread-3) [    ] o.a.s.c.a.NodeLostTrigger NodeLostTrigger firing registered processor for lost nodes: [127.0.0.1:10002_solr]
   [junit4]   2> 777731 DEBUG (ScheduledTrigger-1726-thread-3) [    ] o.a.s.c.a.ScheduledTriggers ++++++++ Cooldown inactive - processing event: {
   [junit4]   2>   "id":"48be9d47d87d15Taqt0wl54f9eew5clnmitl6v7i",
   [junit4]   2>   "source":"node_lost_restore_trigger",
   [junit4]   2>   "eventTime":20475781047680277,
   [junit4]   2>   "eventType":"NODELOST",
   [junit4]   2>   "properties":{
   [junit4]   2>     "eventTimes":[20475781047680277],
   [junit4]   2>     "preferredOperation":"movereplica",
   [junit4]   2>     "nodeNames":["127.0.0.1:10002_solr"]}}
   [junit4]   2> 777753 DEBUG (Simulated OverseerAutoScalingTriggerThread) [    ] o.a.s.c.a.OverseerTriggerThread Current znodeVersion 5, lastZnodeVersion 5
   [junit4]   2> 777763 DEBUG (ScheduledTrigger-1726-thread-3) [    ] o.a.s.c.a.ScheduledTriggers Pausing all triggers: [.auto_add_replicas, node_lost_restore_trigger]
   [junit4]   2> 777841 DEBUG (AutoscalingActionExecutor-1727-thread-1) [    ] o.a.s.c.a.ScheduledTriggers -- processing actions for {
   [junit4]   2>   "id":"48be9d47d87d15Taqt0wl54f9eew5clnmitl6v7i",
   [junit4]   2>   "source":"node_lost_restore_trigger",
   [junit4]   2>   "eventTime":20475781047680277,
   [junit4]   2>   "eventType":"NODELOST",
   [junit4]   2>   "properties":{
   [junit4]   2>     "eventTimes":[20475781047680277],
   [junit4]   2>     "preferredOperation":"movereplica",
   [junit4]   2>     "_enqueue_time_":20475783496884027,
   [junit4]   2>     "nodeNames":["127.0.0.1:10002_solr"]}}
   [junit4]   2> 777841 INFO  (TEST-TestSimTriggerIntegration.testNodeLostTriggerRestoreState-seed#[885FDC6C04856435]) [    ] o.a.s.SolrTestCaseJ4 ###Ending testNodeLostTriggerRestoreState
   [junit4]   2> 777842 DEBUG (TEST-TestSimTriggerIntegration.testNodeLostTriggerRestoreState-seed#[885FDC6C04856435]) [    ] o.a.s.c.a.s.SimClusterStateProvider ** creating new collection states
   [junit4]   2> 777842 DEBUG (TEST-TestSimTriggerIntegration.testNodeLostTriggerRestoreState-seed#[885FDC6C04856435]) [    ] o.a.s.c.a.s.SimClusterStateProvider ** saved cluster state version 4
   [junit4]   2> 778144 DEBUG (AutoscalingActionExecutor-1727-thread-1) [    ] o.a.s.c.a.ScheduledTriggers Resuming trigger: .auto_add_replicas after 100ms
   [junit4]   2> 778145 DEBUG (AutoscalingActionExecutor-1727-thread-1) [    ] o.a.s.c.a.ScheduledTriggers Resuming trigger: node_lost_restore_trigger after 100ms
   [junit4]   2> 778145 DEBUG (AutoscalingActionExecutor-1727-thread-1) [    ] o.a.s.c.a.ScheduledTriggers -- processing took 15208 ms for event id=48be9d47d87d15Taqt0wl54f9eew5clnmitl6v7i
   [junit4]   2> 778159 INFO  (TEST-TestSimTriggerIntegration.testNodeLostTriggerRestoreState-seed#[885FDC6C04856435]) [    ] o.a.s.c.a.s.SimSolrCloudTestCase #######################################
   [junit4]   2> ############ CLUSTER STATE ############
   [junit4]   2> #######################################
   [junit4]   2> ## Live nodes:		2
   [junit4]   2> ## Empty nodes:	1
   [junit4]   2> ## Dead nodes:		1
   [junit4]   2> ##		127.0.0.1:10002_solr
   [junit4]   2> ## Collections:
   [junit4]   2> ##  * .system
   [junit4]   2> ##    shardsTotal	1
   [junit4]   2> ##    shardsState	{active=1}
   [junit4]   2> ##      shardsWithoutLeader	0
   [junit4]   2> ##    totalReplicas	1
   [junit4]   2> ##      activeReplicas	1
   [junit4]   2> ##      inactiveReplicas	0
   [junit4]   2> ##    totalActiveDocs	1
   [junit4]   2> ##      bufferedDocs	0
   [junit4]   2> ##      maxActiveSliceDocs	1
   [junit4]   2> ##      minActiveSliceDocs	1
   [junit4]   2> ##      avgActiveSliceDocs	1
   [junit4]   2> ##    totalInactiveDocs	0
   [junit4]   2> ##      maxInactiveSliceDocs	0
   [junit4]   2> ##      minInactiveSliceDocs	0
   [junit4]   2> ##      avgInactiveSliceDocs	NaN
   [junit4]   2> ##    totalActiveBytes	10,740
   [junit4]   2> ##      maxActiveSliceBytes	10,740
   [junit4]   2> ##      minActiveSliceBytes	10,740
   [junit4]   2> ##      avgActiveSliceBytes	10,740
   [junit4]   2> ##    totalInactiveBytes	0
   [junit4]   2> ##      maxInactiveSliceBytes	0
   [junit4]   2> ##      minInactiveSliceBytes	0
   [junit4]   2> ##      avgInactiveSliceBytes	NaN
   [junit4]   2> ##    totalActiveDeletedDocs	0
   [junit4]   2> ## Max replicas per node:	1
   [junit4]   2> ## Min replicas per node:	0
   [junit4]   2> ## Total replicas:		1
   [junit4]   2> ## * .system		1
   [junit4]   2> ##		- active           1
   [junit4]   2> ######### Solr op counts ##########
   [junit4]   2> ##		- autoscaling        3
   [junit4]   2> ##		- update             2
   [junit4]   2> ######### Autoscaling event counts ###########
   [junit4]   2> ## * Trigger: node_lost_restore_trigger
   [junit4]   2> ##		- STARTED         1
   [junit4]   2> ##		- SUCCEEDED       1
   [junit4]   2> 
   [junit4]   2> NOTE: reproduce with: ant test  -Dtestcase=TestSimTriggerIntegration -Dtests.method=testNodeLostTriggerRestoreState -Dtests.seed=885FDC6C04856435 -Dtests.multiplier=2 -Dtests.slow=true -Dtests.locale=hi-IN -Dtests.timezone=Chile/Continental -Dtests.asserts=true -Dtests.file.encoding=ISO-8859-1
   [junit4] FAILURE 1.46s J1 | TestSimTriggerIntegration.testNodeLostTriggerRestoreState <<<
   [junit4]    > Throwable #1: java.lang.AssertionError: The trigger did not fire at all
   [junit4]    > 	at __randomizedtesting.SeedInfo.seed([885FDC6C04856435:A3A009379EFD71E5]:0)
   [junit4]    > 	at org.apache.solr.cloud.autoscaling.sim.TestSimTriggerIntegration.testNodeLostTriggerRestoreState(TestSimTriggerIntegration.java:344)
   [junit4]    > 	at java.lang.Thread.run(Thread.java:748)
   [junit4]   2> 778196 INFO  (TEST-TestSimTriggerIntegration.testNodeLostTrigger-seed#[885FDC6C04856435]) [    ] o.a.s.SolrTestCaseJ4 ###Starting testNodeLostTrigger
   [junit4]   2> 778196 DEBUG (TEST-TestSimTriggerIntegration.testNodeLostTrigger-seed#[885FDC6C04856435]) [    ] o.a.s.c.a.OverseerTriggerThread Refreshing /autoscaling.json with znode version 6
   [junit4]   2> 778196 DEBUG (TEST-TestSimTriggerIntegration.testNodeLostTrigger-seed#[885FDC6C04856435]) [    ] o.a.s.c.a.s.SimNodeStateProvider - removing dead node values: 127.0.0.1:10002_solr
   [junit4]   2> 778197 INFO  (TEST-TestSimTriggerIntegration.testNodeLostTrigger-seed#[885FDC6C04856435]) [    ] o.a.s.c.a.s.SimCloudManager === Restarting OverseerTriggerThread and clearing object cache...
   [junit4]   2> 778197 DEBUG (TEST-TestSimTriggerIntegration.testNodeLostTrigger-seed#[885FDC6C04856435]) [    ] o.a.s.c.a.ScheduledTriggers Shutting down scheduled thread pool executor now
   [junit4]   2> 778197 DEBUG (TEST-TestSimTriggerIntegration.testNodeLostTrigger-seed#[885FDC6C04856435]) [    ] o.a.s.c.a.ScheduledTriggers Shutting down action executor now
   [junit4]   2> 778197 DEBUG (TEST-TestSimTriggerIntegration.testNodeLostTrigger-seed#[885FDC6C04856435]) [    ] o.a.s.c.a.ScheduledTriggers Awaiting termination for action executor
   [junit4]   2> 778197 DEBUG (TEST-TestSimTriggerIntegration.testNodeLostTrigger-seed#[885FDC6C04856435]) [    ] o.a.s.c.a.ScheduledTriggers Awaiting termination for scheduled thread pool executor
   [junit4]   2> 778197 DEBUG (TEST-TestSimTriggerIntegration.testNodeLostTrigger-seed#[885FDC6C04856435]) [    ] o.a.s.c.a.ScheduledTriggers ScheduledTriggers closed completely
   [junit4]   2> 778197 DEBUG (TEST-TestSimTriggerIntegration.testNodeLostTrigger-seed#[885FDC6C04856435]) [    ] o.a.s.c.a.OverseerTriggerThread OverseerTriggerThread has been closed explicitly
   [junit4]   2> 778210 WARN  (Simulated OverseerAutoScalingTriggerThread) [    ] o.a.s.c.a.OverseerTriggerThread OverseerTriggerThread woken up but we are closed, exiting.
   [junit4]   2> 778284 DEBUG (Simulated OverseerAutoScalingTriggerThread) [    ] o.a.s.c.a.OverseerTriggerThread Adding .auto_add_replicas and .scheduled_maintenance triggers
   [junit4]   2> 778284 DEBUG (Simulated OverseerAutoScalingTriggerThread) [    ] o.a.s.c.a.OverseerTriggerThread Refreshing /autoscaling.json with znode version 7
   [junit4]   2> 778285 DEBUG (Simulated OverseerAutoScalingTriggerThread) [    ] o.a.s.c.a.OverseerTriggerThread Current znodeVersion 7, lastZnodeVersion -1
   [junit4]   2> 778285 DEBUG (Simulated OverseerAutoScalingTriggerThread) [    ] o.a.s.c.a.OverseerTriggerThread Processed trigger updates upto znodeVersion 7
   [junit4]   2> 778299 DEBUG (Simulated OverseerAutoScalingTriggerThread) [    ] o.a.s.c.a.NodeLostTrigger NodeLostTrigger .auto_add_replicas - Initial livenodes: [127.0.0.1:10001_solr, 127.0.0.1:10000_solr]
   [junit4]   2> 778299 DEBUG (Simulated OverseerAutoScalingTriggerThread) [    ] o.a.s.c.a.OverseerTriggerThread -- clean old nodeAdded markers
   [junit4]   2> 778299 DEBUG (Simulated OverseerAutoScalingTriggerThread) [    ] o.a.s.c.a.OverseerTriggerThread Current znodeVersion 7, lastZnodeVersion 7
   [junit4]   2> 778324 DEBUG (ScheduledTrigger-1729-thread-2) [    ] o.a.s.c.a.NodeLostTrigger Running NodeLostTrigger: .auto_add_replicas with currently live nodes: 2
   [junit4]   2> 778325 DEBUG (simCloudManagerPool-1728-thread-1) [    ] o.a.s.c.a.s.SimClusterStateProvider ** creating new collection states
   [junit4]   2> 778325 DEBUG (simCloudManagerPool-1728-thread-1) [    ] o.a.s.c.a.s.SimClusterStateProvider ** saved cluster state version 5
   [junit4]   2> 778325 DEBUG (simCloudManagerPool-1728-thread-1) [    ] o.a.s.c.a.AutoScalingHandler Verified autoscaling configuration
   [junit4]   2> 778325 DEBUG (simCloudManagerPool-1728-thread-1) [    ] o.a.s.c.a.OverseerTriggerThread Refreshing /autoscaling.json with znode version 8
   [junit4]   2> 778349 DEBUG (ScheduledTrigger-1729-thread-1) [    ] o.a.s.c.a.NodeLostTrigger Running NodeLostTrigger: .auto_add_replicas with currently live nodes: 2
   [junit4]   2> 778349 DEBUG (Simulated OverseerAutoScalingTriggerThread) [    ] o.a.s.c.a.OverseerTriggerThread Processed trigger updates upto znodeVersion 8
   [junit4]   2> 778350 DEBUG (TEST-TestSimTriggerIntegration.testNodeLostTrigger-seed#[885FDC6C04856435]) [    ] o.a.s.c.a.s.SimClusterStateProvider ** creating new collection states
   [junit4]   2> 778350 DEBUG (TEST-TestSimTriggerIntegration.testNodeLostTrigger-seed#[885FDC6C04856435]) [    ] o.a.s.c.a.s.SimClusterStateProvider ** saved cluster state version 6
   [junit4]   2> 778350 DEBUG (Simulated OverseerAutoScalingTriggerThread) [    ] o.a.s.c.a.OverseerTriggerThread -- clean old nodeAdded markers
   [junit4]   2> 778350 DEBUG (Simulated OverseerAutoScalingTriggerThread) [    ] o.a.s.c.a.OverseerTriggerThread Current znodeVersion 8, lastZnodeVersion 8
   [junit4]   2> 778371 DEBUG (simCloudManagerPool-1728-thread-2) [    ] o.a.s.c.a.s.SimClusterStateProvider ** creating new collection states
   [junit4]   2> 778376 DEBUG (ScheduledTrigger-1729-thread-1) [    ] o.a.s.c.a.NodeLostTrigger Running NodeLostTrigger: .auto_add_replicas with currently live nodes: 2
   [junit4]   2> 778380 DEBUG (simCloudManagerPool-1728-thread-2) [    ] o.a.s.c.a.s.SimClusterStateProvider ** saved cluster state version 7
   [junit4]   2> 778397 DEBUG (ScheduledTrigger-1729-thread-1) [    ] o.a.s.c.a.NodeLostTrigger Running NodeLostTrigger: .auto_add_replicas with currently live nodes: 2
   [junit4]   2> 778470 DEBUG (ScheduledTrigger-1729-thread-1) [    ] o.a.s.c.a.NodeLostTrigger Running NodeLostTrigger: .auto_add_replicas with currently live nodes: 2
   [junit4]   2> 778478 DEBUG (simCloudManagerPool-1728-thread-3) [    ] o.a.s.c.a.s.SimClusterStateProvider -- elected new leader for .system / shard1: {"core_node2":{
   [junit4]   2>     "core":".system_shard1_replica_n1",
   [junit4]   2>     "shard":"shard1",
   [junit4]   2>     "collection":".system",
   [junit4]   2>     "node_name":"127.0.0.1:10001_solr",
   [junit4]   2>     "type":"NRT",
   [junit4]   2>     "leader":"true",
   [junit4]   2>     "SEARCHER.searcher.maxDoc":0,
   [junit4]   2>     "SEARCHER.searcher.deletedDocs":0,
   [junit4]   2>     "INDEX.sizeInBytes":10240,
   [junit4]   2>     "state":"active",
   [junit4]   2>     "INDEX.sizeInGB":9.5367431640625E-6,
   [junit4]   2>     "SEARCHER.searcher.numDocs":0}}
   [junit4]   2> 778479 DEBUG (TEST-TestSimTriggerIntegration.testNodeLostTrigger-seed#[885FDC6C04856435]) [    ] o.a.s.c.a.s.SimClusterStateProvider ** creating new collection states
   [junit4]   2> 778479 DEBUG (TEST-TestSimTriggerIntegration.testNodeLostTrigger-seed#[885FDC6C04856435]) [    ] o.a.s.c.a.s.SimClusterStateProvider ** saved cluster state version 8
   [junit4]   2> 778480 DEBUG (simCloudManagerPool-1728-thread-4) [    ] o.a.s.c.a.AutoScalingHandler Verified autoscaling configuration
   [junit4]   2> 778481 DEBUG (simCloudManagerPool-1728-thread-4) [    ] o.a.s.c.a.OverseerTriggerThread Refreshing /autoscaling.json with znode version 9
   [junit4]   2> 778484 DEBUG (Simulated OverseerAutoScalingTriggerThread) [    ] o.a.s.c.a.OverseerTriggerThread Processed trigger updates upto znodeVersion 9
   [junit4]   2> 778484 INFO  (Simulated OverseerAutoScalingTriggerThread) [    ] o.a.s.c.a.s.TestSimTriggerIntegration TestTriggerAction init
   [junit4]   2> 778484 DEBUG (Simulated OverseerAutoScalingTriggerThread) [    ] o.a.s.c.a.NodeLostTrigger NodeLostTrigger node_lost_trigger - Initial livenodes: [127.0.0.1:10001_solr, 127.0.0.1:10000_solr]
   [junit4]   2> 778484 DEBUG (Simulated OverseerAutoScalingTriggerThread) [    ] o.a.s.c.a.OverseerTriggerThread -- clean old nodeAdded markers
   [junit4]   2> 778484 DEBUG (Simulated OverseerAutoScalingTriggerThread) [    ] o.a.s.c.a.OverseerTriggerThread Current znodeVersion 9, lastZnodeVersion 9
   [junit4]   2> 778484 DEBUG (ScheduledTrigger-1729-thread-4) [    ] o.a.s.c.a.NodeLostTrigger Running NodeLostTrigger: node_lost_trigger with currently live nodes: 2
   [junit4]   2> 778484 DEBUG (TEST-TestSimTriggerIntegration.testNodeLostTrigger-seed#[885FDC6C04856435]) [    ] o.a.s.c.a.s.SimClusterStateProvider --- new Overseer leader: 127.0.0.1:10001_solr
   [junit4]   2> 778502 DEBUG (ScheduledTrigger-1729-thread-1) [    ] o.a.s.c.a.NodeLostTrigger Running NodeLostTrigger: .auto_add_replicas with currently live nodes: 1
   [junit4]   2> 778502 DEBUG (ScheduledTrigger-1729-thread-1) [    ] o.a.s.c.a.NodeLostTrigger Tracking lost node: 127.0.0.1:10000_solr
   [junit4]   2> 778608 DEBUG (ScheduledTrigger-1729-thread-3) [    ] o.a.s.c.a.NodeLostTrigger Running NodeLostTrigger: .auto_add_replicas with currently live nodes: 1
   [junit4]   2> 778625 DEBUG (ScheduledTrigger-1729-thread-2) [    ] o.a.s.c.a.NodeLostTrigger Running NodeLostTrigger: node_lost_trigger with currently live nodes: 1
   [junit4]   2> 778625 DEBUG (ScheduledTrigger-1729-thread-2) [    ] o.a.s.c.a.NodeLostTrigger Tracking lost node: 127.0.0.1:10000_solr
   [junit4]   2> 778628 DEBUG (ScheduledTrigger-1729-thread-3) [    ] o.a.s.c.a.NodeLostTrigger Running NodeLostTrigger: .auto_add_replicas with currently live nodes: 1
   [junit4]   2> 778645 DEBUG (ScheduledTrigger-1729-thread-3) [    ] o.a.s.c.a.NodeLostTrigger Running NodeLostTrigger: node_lost_trigger with currently live nodes: 1
   [junit4]   2> 778648 DEBUG (ScheduledTrigger-1729-thread-3) [    ] o.a.s.c.a.NodeLostTrigger Running NodeLostTrigger: .auto_add_replicas with currently live nodes: 1
   [junit4]   2> 778665 DEBUG (ScheduledTrigger-1729-thread-2) [    ] o.a.s.c.a.NodeLostTrigger Running NodeLostTrigger: node_lost_trigger with currently live nodes: 1
   [junit4]   2> 778665 DEBUG (ScheduledTrigger-1729-thread-2) [    ] o.a.s.c.a.NodeLostTrigger NodeLostTrigger firing registered processor for lost nodes: [127.0.0.1:10000_solr]
   [junit4]   2> 778665 DEBUG (ScheduledTrigger-1729-thread-2) [    ] o.a.s.c.a.ScheduledTriggers ++++++++ Cooldown inactive - processing event: {
   [junit4]   2>   "id":"48bea7b0d7fccdTaqt0wl54f9eew5clnmitl6v7l",
   [junit4]   2>   "source":"node_lost_trigger",
   [junit4]   2>   "eventTime":20475825758928077,
   [junit4]   2>   "eventType":"NODELOST",
   [junit4]   2>   "properties":{
   [junit4]   2>     "eventTimes":[20475825758928077],
   [junit4]   2>     "preferredOperation":"movereplica",
   [junit4]   2>     "nodeNames":["127.0.0.1:10000_solr"]}}
   [junit4]   2> 778740 DEBUG (ScheduledTrigger-1729-thread-2) [    ] o.a.s.c.a.ScheduledTriggers Pausing all triggers: [.auto_add_replicas, node_lost_trigger]
   [junit4]   2> 778771 DEBUG (AutoscalingActionExecutor-1730-thread-1) [    ] o.a.s.c.a.ScheduledTriggers -- processing actions for {
   [junit4]   2>   "id":"48bea7b0d7fccdTaqt0wl54f9eew5clnmitl6v7l",
   [junit4]   2>   "source":"node_lost_trigger",
   [junit4]   2>   "eventTime":20475825758928077,
   [junit4]   2>   "eventType":"NODELOST",
   [junit4]   2>   "properties":{
   [junit4]   2>     "eventTimes":[20475825758928077],
   [junit4]   2>     "preferredOperation":"movereplica",
   [junit4]   2>     "_enqueue_time_":20475831558653427,
   [junit4]   2>     "nodeNames":["127.0.0.1:10000_solr"]}}
   [junit4]   2> 778772 DEBUG (simCloudManagerPool-1728-thread-7) [    ] o.a.s.c.a.AutoScalingHandler Verified autoscaling configuration
   [junit4]   2> 778772 DEBUG (simCloudManagerPool-1728-thread-7) [    ] o.a.s.c.a.OverseerTriggerThread Refreshing /autoscaling.json with znode version 10
   [junit4]   2> 778777 DEBUG (Simulated OverseerAutoScalingTriggerThread) [    ] o.a.s.c.a.OverseerTriggerThread Processed trigger updates upto znodeVersion 10
   [junit4]   2> 778778 DEBUG (Simulated OverseerAutoScalingTriggerThread) [    ] o.a.s.c.a.OverseerTriggerThread -- clean old nodeAdded markers
   [junit4]   2> 778778 DEBUG (Simulated OverseerAutoScalingTriggerThread) [    ] o.a.s.c.a.OverseerTriggerThread Current znodeVersion 10, lastZnodeVersion 10
   [junit4]   2> 778787 DEBUG (AutoscalingActionExecutor-1730-thread-1) [    ] o.a.s.c.a.ScheduledTriggers Resuming trigger: .auto_add_replicas after 100ms
   [junit4]   2> 778787 DEBUG (AutoscalingActionExecutor-1730-thread-1) [    ] o.a.s.c.a.ScheduledTriggers Resuming trigger: node_lost_trigger after 100ms
   [junit4]   2> 778787 DEBUG (AutoscalingActionExecutor-1730-thread-1) [    ] o.a.s.c.a.ScheduledTriggers -- processing took 814 ms for event id=48bea7b0d7fccdTaqt0wl54f9eew5clnmitl6v7l
   [junit4]   2> 778820 INFO  (TEST-TestSimTriggerIntegration.testNodeLostTrigger-seed#[885FDC6C04856435]) [    ] o.a.s.SolrTestCaseJ4 ###Ending testNodeLostTrigger
   [junit4]   2> 778820 DEBUG (TEST-TestSimTriggerIntegration.testNodeLostTrigger-seed#[885FDC6C04856435]) [    ] o.a.s.c.a.s.SimClusterStateProvider ** creating new collection states
   [junit4]   2> 778820 DEBUG (TEST-TestSimTriggerIntegration.testNodeLostTrigger-seed#[885FDC6C04856435]) [    ] o.a.s.c.a.s.SimClusterStateProvider ** saved cluster state version 9
   [junit4]   2> 778821 INFO  (TEST-TestSimTriggerIntegration.testNodeLostTrigger-seed#[885FDC6C04856435]) [    ] o.a.s.c.a.s.SimSolrCloudTestCase #######################################
   [junit4]   2> ############ CLUSTER STATE ############
   [junit4]   2> #######################################
   [junit4]   2> ## Live nodes:		1
   [junit4]   2> ## Empty nodes:	0
   [junit4]   2> ## Dead nodes:		1
   [junit4]   2> ##		127.0.0.1:10000_solr
   [junit4]   2> ## Collections:
   [junit4]   2> ##  * .system
   [junit4]   2> ##    shardsTotal	1
   [junit4]   2> ##    shardsState	{active=1}
   [junit4]   2> ##      shardsWithoutLeader	0
   [junit4]   2> ##    totalReplicas	1
   [junit4]   2> ##      activeReplicas	1
   [junit4]   2> ##      inactiveReplicas	0
   [junit4]   2> ##    totalActiveDocs	2
   [junit4]   2> ##      bufferedDocs	0
   [junit4]   2> ##      maxActiveSliceDocs	2
   [junit4]   2> ##      minActiveSliceDocs	2
   [junit4]   2> ##      avgActiveSliceDocs	2
   [junit4]   2> ##    totalInactiveDocs	0
   [junit4]   2> ##      maxInactiveSliceDocs	0
   [junit4]   2> ##      minInactiveSliceDocs	0
   [junit4]   2> ##      avgInactiveSliceDocs	NaN
   [junit4]   2> ##    totalActiveBytes	11,240
   [junit4]   2> ##      maxActiveSliceBytes	11,240
   [junit4]   2> ##      minActiveSliceBytes	11,240
   [junit4]   2> ##      avgActiveSliceBytes	11,240
   [junit4]   2> ##    totalInactiveBytes	0
   [junit4]   2> ##      maxInactiveSliceBytes	0
   [junit4]   2> ##      minInactiveSliceBytes	0
   [junit4]   2> ##      avgInactiveSliceBytes	NaN
   [junit4]   2> ##    totalActiveDeletedDocs	0
   [junit4]   2> ## Max replicas per node:	1
   [junit4]   2> ## Min replicas per node:	1
   [junit4]   2> ## Total replicas:		1
   [junit4]   2> ## * .system		1
   [junit4]   2> ##		- active           1
   [junit4]   2> ######### Solr op counts ##########
   [junit4]   2> ##		- autoscaling        3
   [junit4]   2> ##		- update             2
   [junit4]   2> ######### Autoscaling event counts ###########
   [junit4]   2> ## * Trigger: node_lost_restore_trigger
   [junit4]   2> ##		- STARTED         1
   [junit4]   2> ##		- SUCCEEDED       1
   [junit4]   2> ## * Trigger: node_lost_trigger
   [junit4]   2> ##		- STARTED         1
   [junit4]   2> ##		- SUCCEEDED       1
   [junit4]   2> 
   [junit4]   2> 778941 DEBUG (ScheduledTrigger-1729-thread-4) [    ] o.a.s.c.a.NodeLostTrigger Running NodeLostTrigger: .auto_add_replicas with currently live nodes: 1
   [junit4]   2> 778941 DEBUG (ScheduledTrigger-1729-thread-4) [    ] o.a.s.c.a.NodeLostTrigger Running NodeLostTrigger: node_lost_trigger with currently live nodes: 1
   [junit4]   2> 778966 DEBUG (ScheduledTrigger-1729-thread-4) [    ] o.a.s.c.a.NodeLostTrigger Running NodeLostTrigger: .auto_add_replicas with currently live nodes: 1
   [junit4]   2> 778966 DEBUG (ScheduledTrigger-1729-thread-4) [    ] o.a.s.c.a.NodeLostTrigger Running NodeLostTrigger: node_lost_trigger with currently live nodes: 1
   [junit4]   2> 778966 INFO  (TEST-TestSimTriggerIntegration.testEventQueue-seed#[885FDC6C04856435]) [    ] o.a.s.SolrTestCaseJ4 ###Starting testEventQueue
   [junit4]   2> 778966 DEBUG (TEST-TestSimTriggerIntegration.testEventQueue-seed#[885FDC6C04856435]) [    ] o.a.s.c.a.OverseerTriggerThread Refreshing /autoscaling.json with znode version 11
   [junit4]   2> 778966 DEBUG (Simulated OverseerAutoScalingTriggerThread) [    ] o.a.s.c.a.OverseerTriggerThread Processed trigger updates upto znodeVersion 11
   [junit4]   2> 778966 DEBUG (Simulated OverseerAutoScalingTriggerThread) [    ] o.a.s.c.a.OverseerTriggerThread -- clean old nodeLost markers
   [junit4]   2> 778966 DEBUG (Simulated OverseerAutoScalingTriggerThread) [    ] o.a.s.c.a.OverseerTriggerThread -- clean old nodeAdded markers
   [junit4]   2> 778966 DEBUG (Simulated OverseerAutoScalingTriggerThread) [    ] o.a.s.c.a.OverseerTriggerThread Current znodeVersion 11, lastZnodeVersion 11
   [junit4]   2> 778978 DEBUG (TEST-TestSimTriggerIntegration.testEventQueue-seed#[885FDC6C04856435]) [    ] o.a.s.c.a.s.SimNodeStateProvider - removing dead node values: 127.0.0.1:10000_solr
   [junit4]   2> 778978 INFO  (TEST-TestSimTriggerIntegration.testEventQueue-seed#[885FDC6C04856435]) [    ] o.a.s.c.a.s.SimCloudManager === Restarting OverseerTriggerThread and clearing object cache...
   [junit4]   2> 778978 DEBUG (TEST-TestSimTriggerIntegration.testEventQueue-seed#[885FDC6C04856435]) [    ] o.a.s.c.a.ScheduledTriggers Shutting down scheduled thread pool executor now
   [junit4]   2> 778978 DEBUG (TEST-TestSimTriggerIntegration.testEventQueue-seed#[885FDC6C04856435]) [    ] o.a.s.c.a.ScheduledTriggers Shutting down action executor now
   [junit4]   2> 778978 DEBUG (TEST-TestSimTriggerIntegration.testEventQueue-seed#[885FDC6C04856435]) [    ] o.a.s.c.a.ScheduledTriggers Awaiting termination for action executor
   [junit4]   2> 778999 WARN  (Simulated OverseerAutoScalingTriggerThread) [    ] o.a.s.c.a.OverseerTriggerThread OverseerTriggerThread woken up but we are closed, exiting.
   [junit4]   2> 778999 DEBUG (TEST-TestSimTriggerIntegration.testEventQueue-seed#[885FDC6C04856435]) [    ] o.a.s.c.a.ScheduledTriggers Awaiting termination for scheduled thread pool executor
   [junit4]   2> 778999 DEBUG (TEST-TestSimTriggerIntegration.testEventQueue-seed#[885FDC6C04856435]) [    ] o.a.s.c.a.ScheduledTriggers ScheduledTriggers closed completely
   [junit4]   2> 778999 DEBUG (TEST-TestSimTriggerIntegration.testEventQueue-seed#[885FDC6C04856435]) [    ] o.a.s.c.a.OverseerTriggerThread OverseerTriggerThread has been closed explicitly
   [junit4]   2> 779038 DEBUG (Simulated OverseerAutoScalingTriggerThread) [    ] o.a.s.c.a.OverseerTriggerThread Adding .auto_add_replicas and .scheduled_maintenance triggers
   [junit4]   2> 779038 DEBUG (Simulated OverseerAutoScalingTriggerThread) [    ] o.a.s.c.a.OverseerTriggerThread Refreshing /autoscaling.json with znode version 12
   [junit4]   2> 779038 DEBUG (Simulated OverseerAutoScalingTriggerThread) [    ] o.a.s.c.a.OverseerTriggerThread Current znodeVersion 12, lastZnodeVersion -1
   [junit4]   2> 779038 DEBUG (Simulated OverseerAutoScalingTriggerThread) [    ] o.a.s.c.a.OverseerTriggerThread Processed trigger updates upto znodeVersion 12
   [junit4]   2> 779051 DEBUG (Simulated OverseerAutoScalingTriggerThread) [    ] o.a.s.c.a.NodeLostTrigger NodeLostTrigger .auto_add_replicas - Initial livenodes: [127.0.0.1:10001_solr, 127.0.0.1:10003_solr]
   [junit4]   2> 779067 DEBUG (Simulated OverseerAutoScalingTriggerThread) [    ] o.a.s.c.a.OverseerTriggerThread -- clean old nodeAdded markers
   [junit4]   2> 779067 DEBUG (Simulated OverseerAutoScalingTriggerThread) [    ] o.a.s.c.a.OverseerTriggerThread Current znodeVersion 12, lastZnodeVersion 12
   [junit4]   2> 779075 DEBUG (ScheduledTrigger-1732-thread-2) [    ] o.a.s.c.a.NodeLostTrigger Running NodeLostTrigger: .auto_add_replicas with currently live nodes: 2
   [junit4]   2> 779109 DEBUG (ScheduledTrigger-1732-thread-2) [    ] o.a.s.c.a.NodeLostTrigger Running NodeLostTrigger: .auto_add_replicas with currently live nodes: 2
   [junit4]   2> 779111 DEBUG (simCloudManagerPool-1731-thread-1) [    ] o.a.s.c.a.s.SimClusterStateProvider ** creating new collection states
   [junit4]   2> 779111 DEBUG (simCloudManagerPool-1731-thread-1) [    ] o.a.s.c.a.s.SimClusterStateProvider ** saved cluster state version 10
   [junit4]   2> 779115 DEBUG (simCloudManagerPool-1731-thread-2) [    ] o.a.s.c.a.AutoScalingHandler Verified autoscaling configuration
   [junit4]   2> 779115 DEBUG (simCloudManagerPool-1731-thread-2) [    ] o.a.s.c.a.OverseerTriggerThread Refreshing /autoscaling.json with znode version 13
   [junit4]   2> 779116 DEBUG (Simulated OverseerAutoScalingTriggerThread) [    ] o.a.s.c.a.OverseerTriggerThread Processed trigger updates upto znodeVersion 13
   [junit4]   2> 779116 DEBUG (Simulated OverseerAutoScalingTriggerThread) [    ] o.a.s.c.a.OverseerTriggerThread -- clean old nodeAdded markers
   [junit4]   2> 779116 DEBUG (Simulated OverseerAutoScalingTriggerThread) [    ] o.a.s.c.a.OverseerTriggerThread Current znodeVersion 13, lastZnodeVersion 13
   [junit4]   2> 779117 DEBUG (TEST-TestSimTriggerIntegration.testEventQueue-seed#[885FDC6C04856435]) [    ] o.a.s.c.a.s.SimClusterStateProvider ** creating new collection states
   [junit4]   2> 779117 DEBUG (TEST-TestSimTriggerIntegration.testEventQueue-seed#[885FDC6C04856435]) [    ] o.a.s.c.a.s.SimClusterStateProvider ** saved cluster state version 11
   [junit4]   2> 779132 DEBUG (ScheduledTrigger-1732-thread-2) [    ] o.a.s.c.a.NodeLostTrigger Running NodeLostTrigger: .auto_add_replicas with currently live nodes: 2
   [junit4]   2> 779143 DEBUG (simCloudManagerPool-1731-thread-3) [    ] o.a.s.c.a.s.SimClusterStateProvider ** creating new collection states
   [junit4]   2> 779144 DEBUG (simCloudManagerPool-1731-thread-3) [    ] o.a.s.c.a.s.SimClusterStateProvider ** saved cluster state version 12
   [junit4]   2> 779157 DEBUG (ScheduledTrigger-1732-thread-2) [    ] o.a.s.c.a.NodeLostTrigger Running NodeLostTrigger: .auto_add_replicas with currently live nodes: 2
   [junit4]   2> 779157 DEBUG (simCloudManagerPool-1731-thread-4) [    ] o.a.s.c.a.s.SimClusterStateProvider -- elected new leader for .system / shard1: {"core_node3":{
   [junit4]   2>     "core":".system_shard1_replica_n1",
   [junit4]   2>     "shard":"shard1",
   [junit4]   2>     "collection":".system",
   [junit4]   2>     "node_name":"127.0.0.1:10003_solr",
   [junit4]   2>     "type":"NRT",
   [junit4]   2>     "leader":"true",
   [junit4]   2>     "SEARCHER.searcher.maxDoc":0,
   [junit4]   2>     "SEARCHER.searcher.deletedDocs":0,
   [junit4]   2>     "INDEX.sizeInBytes":10240,
   [junit4]   2>     "state":"active",
   [junit4]   2>     "INDEX.sizeInGB":9.5367431640625E-6,
   [junit4]   2>     "SEARCHER.searcher.numDocs":0}}
   [junit4]   2> 779158 DEBUG (simCloudManagerPool-1731-thread-1) [    ] o.a.s.c.a.s.SimClusterStateProvider ** creating new collection states
   [junit4]   2> 779158 DEBUG (simCloudManagerPool-1731-thread-1) [    ] o.a.s.c.a.s.SimClusterStateProvider ** saved cluster state version 13
   [junit4]   2> 779159 DEBUG (TEST-TestSimTriggerIntegration.testEventQueue-seed#[885FDC6C04856435]) [    ] o.a.s.c.a.s.SimClusterStateProvider ** creating new collection states
   [junit4]   2> 779159 DEBUG (TEST-TestSimTriggerIntegration.testEventQueue-seed#[885FDC6C04856435]) [    ] o.a.s.c.a.s.SimClusterStateProvider ** saved cluster state version 14
   [junit4]   2> 779160 INFO  (simCloudManagerPool-1731-thread-6) [    ] o.a.s.c.a.s.TestSimTriggerIntegration TestEventQueueAction instantiated
   [junit4]   2> 779160 DEBUG (simCloudManagerPool-1731-thread-6) [    ] o.a.s.c.a.s.TestSimTriggerIntegration TestTriggerAction init
   [junit4]   2> 779160 DEBUG (simCloudManagerPool-1731-thread-6) [    ] o.a.s.c.a.AutoScalingHandler Verified autoscaling configuration
   [junit4]   2> 779169 DEBUG (simCloudManagerPool-1731-thread-6) [    ] o.a.s.c.a.OverseerTriggerThread Refreshing /autoscaling.json with znode version 14
   [junit4]   2> 779169 INFO  (simCloudManagerPool-1731-thread-6) [    ] o.a.s.c.a.s.TestSimTriggerIntegration TestEventQueueAction instantiated
   [junit4]   2> 779169 DEBUG (simCloudManagerPool-1731-thread-6) [    ] o.a.s.c.a.s.TestSimTriggerIntegration TestTriggerAction init
   [junit4]   2> 779169 DEBUG (Simulated OverseerAutoScalingTriggerThread) [    ] o.a.s.c.a.OverseerTriggerThread Processed trigger updates upto znodeVersion 14
   [junit4]   2> 779170 DEBUG (Simulated OverseerAutoScalingTriggerThread) [    ] o.a.s.c.a.NodeAddedTrigger NodeAddedTrigger node_added_trigger1 - Initial livenodes: [127.0.0.1:10001_solr, 127.0.0.1:10003_solr]
   [junit4]   2> 779170 DEBUG (Simulated OverseerAutoScalingTriggerThread) [    ] o.a.s.c.a.NodeAddedTrigger NodeAddedTrigger node_added_trigger1 instantiated with properties: {event=nodeAdded, waitFor=1, actions=[{name=test, class=org.apache.solr.cloud.autoscaling.sim.TestSimTriggerIntegration$TestEventQueueAction}], enabled=true}
   [junit4]   2> 779170 DEBUG (Simulated OverseerAutoScalingTriggerThread) [    ] o.a.s.c.a.OverseerTriggerThread Current znodeVersion 14, lastZnodeVersion 14
   [junit4]   2> 779170 DEBUG (ScheduledTrigger-1732-thread-3) [    ] o.a.s.c.a.NodeAddedTrigger Running NodeAddedTrigger node_added_trigger1
   [junit4]   2> 779170 DEBUG (ScheduledTrigger-1732-thread-3) [    ] o.a.s.c.a.NodeAddedTrigger Found livenodes: 2
   [junit4]   2> 779178 DEBUG (ScheduledTrigger-1732-thread-2) [    ] o.a.s.c.a.NodeLostTrigger Running NodeLostTrigger: .auto_add_replicas with currently live nodes: 3
   [junit4]   2> 779191 DEBUG (ScheduledTrigger-1732-thread-1) [    ] o.a.s.c.a.NodeAddedTrigger Running NodeAddedTrigger node_added_trigger1
   [junit4]   2> 779191 DEBUG (ScheduledTrigger-1732-thread-1) [    ] o.a.s.c.a.NodeAddedTrigger Found livenodes: 3
   [junit4]   2> 779191 DEBUG (ScheduledTrigger-1732-thread-1) [    ] o.a.s.c.a.NodeAddedTrigger Tracking new node: 127.0.0.1:10004_solr at time 20475854058670077
   [junit4]   2> 779210 DEBUG (ScheduledTrigger-1732-thread-4) [    ] o.a.s.c.a.NodeLostTrigger Running NodeLostTrigger: .auto_add_replicas with currently live nodes: 3
   [junit4]   2> 779211 DEBUG (ScheduledTrigger-1732-thread-3) [    ] o.a.s.c.a.NodeAddedTrigger Running NodeAddedTrigger node_added_trigger1
   [junit4]   2> 779211 DEBUG (ScheduledTrigger-1732-thread-3) [    ] o.a.s.c.a.NodeAddedTrigger Found livenodes: 3
   [junit4]   2> 779211 DEBUG (ScheduledTrigger-1732-thread-3) [    ] o.a.s.c.a.NodeAddedTrigger NodeAddedTrigger node_added_trigger1 firing registered processor for nodes: [127.0.0.1:10004_solr] added at times [20475854058670077], now=20475855073737227
   [junit4]   2> 779211 DEBUG (ScheduledTrigger-1732-thread-3) [    ] o.a.s.c.a.ScheduledTriggers ++++++++ Cooldown inactive - processing event: {
   [junit4]   2>   "id":"48beae47a3c7fdTaqt0wl54f9eew5clnmitl6v7o",
   [junit4]   2>   "source":"node_added_trigger1",
   [junit4]   2>   "eventTime":20475854058670077,
   [junit4]   2>   "eventType":"NODEADDED",
   [junit4]   2>   "properties":{
   [junit4]   2>     "eventTimes":[20475854058670077],
   [junit4]   2>     "preferredOperation":"movereplica",
   [junit4]   2>     "nodeNames":["127.0.0.1:10004_solr"]}}
   [junit4]   2> 779211 DEBUG (ScheduledTrigger-1732-thread-3) [    ] o.a.s.c.a.ScheduledTriggers Pausing all triggers: [.auto_add_replicas, node_added_trigger1]
   [junit4]   2> 779212 DEBUG (ScheduledTrigger-1732-thread-3) [    ] o.a.s.c.a.NodeAddedTrigger NodeAddedTrigger node_added_trigger1 - removing marker path: /autoscaling/nodeAdded/127.0.0.1:10004_solr
   [junit4]   2> 779212 DEBUG (AutoscalingActionExecutor-1733-thread-1) [    ] o.a.s.c.a.ScheduledTriggers -- processing actions for {
   [junit4]   2>   "id":"48beae47a3c7fdTaqt0wl54f9eew5clnmitl6v7o",
   [junit4]   2>   "source":"node_added_trigger1",
   [junit4]   2>   "eventTime":20475854058670077,
   [junit4]   2>   "eventType":"NODEADDED",
   [junit4]   2>   "properties":{
   [junit4]   2>     "eventTimes":[20475854058670077],
   [junit4]   2>     "preferredOperation":"movereplica",
   [junit4]   2>     "_enqueue_time_":20475855095650527,
   [junit4]   2>     "nodeNames":["127.0.0.1:10004_solr"]}}
   [junit4]   2> 779212 INFO  (AutoscalingActionExecutor-1733-thread-1) [    ] o.a.s.c.a.s.TestSimTriggerIntegration -- event: {
   [junit4]   2>   "id":"48beae47a3c7fdTaqt0wl54f9eew5clnmitl6v7o",
   [junit4]   2>   "source":"node_added_trigger1",
   [junit4]   2>   "eventTime":20475854058670077,
   [junit4]   2>   "eventType":"NODEADDED",
   [junit4]   2>   "properties":{
   [junit4]   2>     "eventTimes":[20475854058670077],
   [junit4]   2>     "preferredOperation":"movereplica",
   [junit4]   2>     "_enqueue_time_":20475855095650527,
   [junit4]   2>     "nodeNames":["127.0.0.1:10004_solr"]}}
   [junit4]   2> 779213 INFO  (TEST-TestSimTriggerIntegration.testEventQueue-seed#[885FDC6C04856435]) [    ] o.a.s.c.a.s.SimCloudManager === Restarting OverseerTriggerThread and clearing object cache...
   [junit4]   2> 779213 DEBUG (TEST-TestSimTriggerIntegration.testEventQueue-seed#[885FDC6C04856435]) [    ] o.a.s.c.a.ScheduledTriggers Shutting down scheduled thread pool executor now
   [junit4]   2> 779213 WARN  (Simulated OverseerAutoScalingTriggerThread) [    ] o.a.s.c.a.OverseerTriggerThread OverseerTriggerThread woken up but we are closed, exiting.
   [junit4]   2> 779213 DEBUG (TEST-TestSimTriggerIntegration.testEventQueue-seed#[885FDC6C04856435]) [    ] o.a.s.c.a.ScheduledTriggers Shutting down action executor now
   [junit4]   2> 779213 DEBUG (TEST-TestSimTriggerIntegration.testEventQueue-seed#[885FDC6C04856435]) [    ] o.a.s.c.a.ScheduledTriggers Awaiting termination for action executor
   [junit4]   2> 779226 WARN  (AutoscalingActionExecutor-1733-thread-1) [    ] o.a.s.c.a.ScheduledTriggers Unhandled exception executing actions
   [junit4]   2> org.apache.lucene.store.AlreadyClosedException: ScheduledTrigger node_added_trigger1 has been closed.
   [junit4]   2> 	at org.apache.solr.cloud.autoscaling.ScheduledTriggers$TriggerWrapper.dequeue(ScheduledTriggers.java:548) ~[java/:?]
   [junit4]   2> 	at org.apache.solr.cloud.autoscaling.ScheduledTriggers.lambda$null$3(ScheduledTriggers.java:318) ~[java/:?]
   [junit4]   2> 	at java.util.concurrent.Executors$RunnableAdapter.call(Executors.java:511) ~[?:1.8.0_172]
   [junit4]   2> 	at java.util.concurrent.FutureTask.run(FutureTask.java:266) ~[?:1.8.0_172]
   [junit4]   2> 	at org.apache.solr.common.util.ExecutorUtil$MDCAwareThreadPoolExecutor.lambda$execute$0(ExecutorUtil.java:209) ~[java/:?]
   [junit4]   2> 	at java.util.concurrent.ThreadPoolExecutor.runWorker(ThreadPoolExecutor.java:1149) [?:1.8.0_172]
   [junit4]   2> 	at java.util.concurrent.ThreadPoolExecutor$Worker.run(ThreadPoolExecutor.java:624) [?:1.8.0_172]
   [junit4]   2> 	at java.lang.Thread.run(Thread.java:748) [?:1.8.0_172]
   [junit4]   2> 779227 DEBUG (AutoscalingActionExecutor-1733-thread-1) [    ] o.a.s.c.a.ScheduledTriggers -- processing took 729 ms for event id=48beae47a3c7fdTaqt0wl54f9eew5clnmitl6v7o
   [junit4]   2> 779227 DEBUG (TEST-TestSimTriggerIntegration.testEventQueue-seed#[885FDC6C04856435]) [    ] o.a.s.c.a.ScheduledTriggers Awaiting termination for scheduled thread pool executor
   [junit4]   2> 779227 DEBUG (TEST-TestSimTriggerIntegration.testEventQueue-seed#[885FDC6C04856435]) [    ] o.a.s.c.a.ScheduledTriggers ScheduledTriggers closed completely
   [junit4]   2> 779227 DEBUG (TEST-TestSimTriggerIntegration.testEventQueue-seed#[885FDC6C04856435]) [    ] o.a.s.c.a.OverseerTriggerThread OverseerTriggerThread has been closed explicitly
   [junit4]   2> 779227 DEBUG (TEST-TestSimTriggerIntegration.testEventQueue-seed#[885FDC6C04856435]) [    ] o.a.s.c.a.s.SimClusterStateProvider --- new Overseer leader: 127.0.0.1:10004_solr
   [junit4]   2> 779229 DEBUG (Simulated OverseerAutoScalingTriggerThread) [    ] o.a.s.c.a.OverseerTriggerThread Refreshing /autoscaling.json with znode version 14
   [junit4]   2> 779230 INFO  (Simulated OverseerAutoScalingTriggerThread) [    ] o.a.s.c.a.s.TestSimTriggerIntegration TestEventQueueAction instantiated
   [junit4]   2> 779230 DEBUG (Simulated OverseerAutoScalingTriggerThread) [    ] o.a.s.c.a.s.TestSimTriggerIntegration TestTriggerAction init
   [junit4]   2> 779230 DEBUG (Simulated OverseerAutoScalingTriggerThread) [    ] o.a.s.c.a.OverseerTriggerThread Current znodeVersion 14, lastZnodeVersion -1
   [junit4]   2> 779230 DEBUG (Simulated OverseerAutoScalingTriggerThread) [    ] o.a.s.c.a.OverseerTriggerThread Processed trigger updates upto znodeVersion 14
   [junit4]   2> 779230 DEBUG (Simulated OverseerAutoScalingTriggerThread) [    ] o.a.s.c.a.NodeLostTrigger NodeLostTrigger .auto_add_replicas - Initial livenodes: [127.0.0.1:10004_solr, 127.0.0.1:10003_solr]
   [junit4]   2> 779230 DEBUG (Simulated OverseerAutoScalingTriggerThread) [    ] o.a.s.c.a.NodeLostTrigger Adding lost node from marker path: 127.0.0.1:10001_solr
   [junit4]   2> 779230 DEBUG (Simulated OverseerAutoScalingTriggerThread) [    ] o.a.s.c.a.NodeAddedTrigger NodeAddedTrigger node_added_trigger1 - Initial livenodes: [127.0.0.1:10004_solr, 127.0.0.1:10003_solr]
   [junit4]   2> 779230 DEBUG (Simulated OverseerAutoScalingTriggerThread) [    ] o.a.s.c.a.NodeAddedTrigger NodeAddedTrigger node_added_trigger1 instantiated with properties: {event=nodeAdded, waitFor=1, actions=[{name=test, class=org.apache.solr.cloud.autoscaling.sim.TestSimTriggerIntegration$TestEventQueueAction}], enabled=true}
   [junit4]   2> 779230 DEBUG (ScheduledTrigger-1735-thread-1) [    ] o.a.s.c.a.NodeLostTrigger Running NodeLostTrigger: .auto_add_replicas with currently live nodes: 2
   [junit4]   2> 779230 DEBUG (ScheduledTrigger-1735-thread-1) [    ] o.a.s.c.a.NodeLostTrigger Tracking lost node: 127.0.0.1:10001_solr
   [junit4]   2> 779231 DEBUG (Simulated OverseerAutoScalingTriggerThread) [    ] o.a.s.c.a.OverseerTriggerThread Current znodeVersion 14, lastZnodeVersion 14
   [junit4]   2> 779231 DEBUG (ScheduledTrigger-1735-thread-2) [    ] o.a.s.c.a.ScheduledTriggers ++++++++ Cooldown inactive - processing event: {
   [junit4]   2>   "id":"48beae47a3c7fdTaqt0wl54f9eew5clnmitl6v7o",
   [junit4]   2>   "source":"node_added_trigger1",
   [junit4]   2>   "eventTime":20475854058670077,
   [junit4]   2>   "eventType":"NODEADDED",
   [junit4]   2>   "properties":{
   [junit4]   2>     "eventTimes":[20475854058670077],
   [junit4]   2>     "_dequeue_time_":20475856065007877,
   [junit4]   2>     "preferredOperation":"movereplica",
   [junit4]   2>     "_enqueue_time_":20475855095650527,
   [junit4]   2>     "nodeNames":["127.0.0.1:10004_solr"],
   [junit4]   2>     "replaying":true}}
   [junit4]   2> 779228 WARN  (SolrRrdBackendFactory-1723-thread-1) [    ] o.a.s.m.r.SolrRrdBackendFactory Error updating RRD data for solr.jvm
   [junit4]   2> java.io.IOException: java.util.concurrent.ExecutionException: java.io.IOException: java.lang.InterruptedException
   [junit4]   2> 	at org.apache.solr.cloud.autoscaling.sim.SimCloudManager.request(SimCloudManager.java:653) ~[test/:?]
   [junit4]   2> 	at org.apache.solr.cloud.autoscaling.sim.SimCloudManager$1.request(SimCloudManager.java:224) ~[test/:?]
   [junit4]   2> 	at org.apache.solr.client.solrj.SolrRequest.process(SolrRequest.java:194) ~[java/:?]
   [junit4]   2> 	at org.apache.solr.client.solrj.SolrClient.add(SolrClient.java:173) ~[java/:?]
   [junit4]   2> 	at org.apache.solr.client.solrj.SolrClient.add(SolrClient.java:138) ~[java/:?]
   [junit4]   2> 	at org.apache.solr.metrics.rrd.SolrRrdBackendFactory.lambda$maybeSyncBackends$5(SolrRrdBackendFactory.java:357) ~[java/:?]
   [junit4]   2> 	at java.util.HashMap.forEach(HashMap.java:1289) ~[?:1.8.0_172]
   [junit4]   2> 	at org.apache.solr.metrics.rrd.SolrRrdBackendFactory.maybeSyncBackends(SolrRrdBackendFactory.java:350) ~[java/:?]
   [junit4]   2> 	at org.apache.solr.metrics.rrd.SolrRrdBackendFactory.lambda$new$0(SolrRrdBackendFactory.java:110) ~[java/:?]
   [junit4]   2> 	at java.util.concurrent.Executors$RunnableAdapter.call(Executors.java:511) [?:1.8.0_172]
   [junit4]   2> 	at java.util.concurrent.FutureTask.runAndReset(FutureTask.java:308) [?:1.8.0_172]
   [junit4]   2> 	at java.util.concurrent.ScheduledThreadPoolExecutor$ScheduledFutureTask.access$301(ScheduledThreadPoolExecutor.java:180) [?:1.8.0_172]
   [junit4]   2> 	at java.util.concurrent.ScheduledThreadPoolExecutor$ScheduledFutureTask.run(ScheduledThreadPoolExecutor.java:294) [?:1.8.0_172]
   [junit4]   2> 	at java.util.concurrent.ThreadPoolExecutor.runWorker(ThreadPoolExecutor.java:1149) [?:1.8.0_172]
   [junit4]   2> 	at java.util.concurrent.ThreadPoolExecutor$Worker.run(ThreadPoolExecutor.java:624) [?:1.8.0_172]
   [junit4]   2> 	at java.lang.Thread.run(Thread.java:748) [?:1.8.0_172]
   [junit4]   2> Caused by: java.util.concurrent.ExecutionException: java.io.IOException: java.lang.InterruptedException
   [junit4]   2> 	at java.util.concurrent.FutureTask.report(FutureTask.java:122) ~[?:1.8.0_172]
   [junit4]   2> 	at java.util.concurrent.FutureTask.get(FutureTask.java:192) ~[?:1.8.0_172]
   [junit4]   2> 	at org.apache.solr.cloud.autoscaling.sim.SimCloudManager.request(SimCloudManager.java:651) ~[test/:?]
   [junit4]   2> 	... 15 more
   [junit4]   2> Caused by: java.io.IOException: java.lang.InterruptedException
   [junit4]   2> 	at org.apache.solr.cloud.autoscaling.sim.SimClusterStateProvider.createSystemCollection(SimClusterStateProvider.java:1344) ~[test/:?]
   [junit4]   2> 	at org.apache.solr.cloud.autoscaling.sim.SimClusterStateProvider.simUpdate(SimClusterStateProvider.java:1375) ~[test/:?]
   [junit4]   2> 	at org.apache.solr.cloud.autoscaling.sim.SimCloudManager.simHandleSolrRequest(SimCloudManager.java:738) ~[test/:?]
   [junit4]   2> 	at org.apache.solr.cloud.autoscaling.sim.SimCloudManager.lambda$request$15(SimCloudManager.java:650) ~[test/:?]
   [junit4]   2> 	at java.util.concurrent.FutureTask.run(FutureTask.java:266) ~[?:1.8.0_172]
   [junit4]   2> 	at org.apache.solr.common.util.ExecutorUtil$MDCAwareThreadPoolExecutor.lambda$execute$0(ExecutorUtil.java:209) ~[java/:?]
   [junit4]   2> 	... 3 more
   [junit4]   2> Caused by: java.lang.InterruptedException
   [junit4]   2> 	at java.util.concurrent.locks.AbstractQueuedSynchronizer.doAcquireSharedNanos(AbstractQueuedSynchronizer.java:1039) ~[?:1.8.0_172]
   [junit4]   2> 	at java.util.concurrent.locks.AbstractQueuedSynchronizer.tryAcquireSharedNanos(AbstractQueuedSynchronizer.java:1328) ~[?:1.8.0_172]
   [junit4]   2> 	at java.util.concurrent.CountDownLatch.await(CountDownLatch.java:277) ~[?:1.8.0_172]
   [junit4]   2> 	at org.apache.solr.cloud.autoscaling.sim.SimClusterStateProvider.simCreateCollection(SimClusterStateProvider.java:913) ~[test/:?]
   [junit4]   2> 	at org.apache.solr.cloud.autoscaling.sim.SimClusterStateProvider.createSystemCollection(SimClusterStateProvider.java:1340) ~[test/:?]
   [junit4]   2> 	at org.apache.solr.cloud.autoscaling.sim.SimClusterStateProvider.simUpdate(SimClusterStateProvider.java:1375) ~[test/:?]
   [junit4]   2> 	at org.apache.solr.cloud.autoscaling.sim.SimCloudManager.simHandleSolrRequest(SimCloudManager.java:738) ~[test/:?]
   [junit4]   2> 	at org.apache.solr.cloud.autoscaling.sim.SimCloudManager.lambda$request$15(SimCloudManager.java:650) ~[test/:?]
   [junit4]   2> 	at java.util.concurrent.FutureTask.run(FutureTask.java:266) ~[?:1.8.0_172]
   [junit4]   2> 	at org.apache.solr.common.util.ExecutorUtil$MDCAwareThreadPoolExecutor.lambda$execute$0(ExecutorUtil.java:209) ~[java/:?]
   [junit4]   2> 	... 3 more
   [junit4]   2> 779251 DEBUG (ScheduledTrigger-1735-thread-2) [    ] o.a.s.c.a.ScheduledTriggers Pausing all triggers: [.auto_add_replicas, node_added_trigger1]
   [junit4]   2> 779251 DEBUG (AutoscalingActionExecutor-1736-thread-1) [    ] o.a.s.c.a.ScheduledTriggers -- processing actions for {
   [junit4]   2>   "id":"48beae47a3c7fdTaqt0wl54f9eew5clnmitl6v7o",
   [junit4]   2>   "source":"node_added_trigger1",
   [junit4]   2>   "eventTime":20475854058670077,
   [junit4]   2>   "eventType":"NODEADDED",
   [junit4]   2>   "properties":{
   [junit4]   2>     "eventTimes":[20475854058670077],
   [junit4]   2>     "_dequeue_time_":20475856065007877,
   [junit4]   2>     "preferredOperation":"movereplica",
   [junit4]   2>     "_enqueue_time_":20475855095650527,
   [junit4]   2>     "nodeNames":["127.0.0.1:10004_solr"],
   [junit4]   2>     "replaying":true}}
   [junit4]   2> 779251 DEBUG (ScheduledTrigger-1735-thread-2) [    ] o.a.s.c.a.NodeAddedTrigger Running NodeAddedTrigger node_added_trigger1
   [junit4]   2> 779251 DEBUG (ScheduledTrigger-1735-thread-2) [    ] o.a.s.c.a.NodeAddedTrigger Found livenodes: 2
   [junit4]   2> 779251 INFO  (AutoscalingActionExecutor-1736-thread-1) [    ] o.a.s.c.a.s.TestSimTriggerIntegration -- event: {
   [junit4]   2>   "id":"48beae47a3c7fdTaqt0wl54f9eew5clnmitl6v7o",
   [junit4]   2>   "source":"node_added_trigger1",
   [junit4]   2>   "eventTime":20475854058670077,
   [junit4]   2>   "eventType":"NODEADDED",
   [junit4]   2>   "properties":{
   [junit4]   2>     "eventTimes":[20475854058670077],
   [junit4]   2>     "_dequeue_time_":20475856065007877,
   [junit4]   2>     "preferredOperation":"movereplica",
   [junit4]   2>     "_enqueue_time_":20475855095650527,
   [junit4]   2>     "nodeNames":["127.0.0.1:10004_solr"],
   [junit4]   2>     "replaying":true}}
   [ju

[...truncated too long message...]

vy-fail-disallowed-ivy-version:

ivy-fail:

ivy-fail:

ivy-configure:
[ivy:configure] :: loading settings :: file = /home/jenkins/jenkins-slave/workspace/Lucene-Solr-Tests-master/lucene/top-level-ivy-settings.xml

resolve:

ivy-availability-check:
[loadresource] Do not set property disallowed.ivy.jars.list as its length is 0.

-ivy-fail-disallowed-ivy-version:

ivy-fail:

ivy-configure:
[ivy:configure] :: loading settings :: file = /home/jenkins/jenkins-slave/workspace/Lucene-Solr-Tests-master/lucene/top-level-ivy-settings.xml

resolve:

ivy-availability-check:
[loadresource] Do not set property disallowed.ivy.jars.list as its length is 0.

-ivy-fail-disallowed-ivy-version:

ivy-fail:

ivy-fail:

ivy-configure:
[ivy:configure] :: loading settings :: file = /home/jenkins/jenkins-slave/workspace/Lucene-Solr-Tests-master/lucene/top-level-ivy-settings.xml

resolve:

ivy-availability-check:
[loadresource] Do not set property disallowed.ivy.jars.list as its length is 0.

-ivy-fail-disallowed-ivy-version:

ivy-fail:

ivy-configure:
[ivy:configure] :: loading settings :: file = /home/jenkins/jenkins-slave/workspace/Lucene-Solr-Tests-master/lucene/top-level-ivy-settings.xml

resolve:

ivy-availability-check:
[loadresource] Do not set property disallowed.ivy.jars.list as its length is 0.

-ivy-fail-disallowed-ivy-version:

ivy-fail:

ivy-fail:

ivy-configure:
[ivy:configure] :: loading settings :: file = /home/jenkins/jenkins-slave/workspace/Lucene-Solr-Tests-master/lucene/top-level-ivy-settings.xml

resolve:

ivy-availability-check:
[loadresource] Do not set property disallowed.ivy.jars.list as its length is 0.

-ivy-fail-disallowed-ivy-version:

ivy-fail:

ivy-fail:

ivy-configure:
[ivy:configure] :: loading settings :: file = /home/jenkins/jenkins-slave/workspace/Lucene-Solr-Tests-master/lucene/top-level-ivy-settings.xml

resolve:

ivy-availability-check:
[loadresource] Do not set property disallowed.ivy.jars.list as its length is 0.

-ivy-fail-disallowed-ivy-version:

ivy-fail:

ivy-fail:

ivy-configure:
[ivy:configure] :: loading settings :: file = /home/jenkins/jenkins-slave/workspace/Lucene-Solr-Tests-master/lucene/top-level-ivy-settings.xml

resolve:

ivy-availability-check:
[loadresource] Do not set property disallowed.ivy.jars.list as its length is 0.

-ivy-fail-disallowed-ivy-version:

ivy-fail:

ivy-fail:

ivy-configure:
[ivy:configure] :: loading settings :: file = /home/jenkins/jenkins-slave/workspace/Lucene-Solr-Tests-master/lucene/top-level-ivy-settings.xml

resolve:

ivy-availability-check:
[loadresource] Do not set property disallowed.ivy.jars.list as its length is 0.

-ivy-fail-disallowed-ivy-version:

ivy-fail:

ivy-fail:

ivy-configure:
[ivy:configure] :: loading settings :: file = /home/jenkins/jenkins-slave/workspace/Lucene-Solr-Tests-master/lucene/top-level-ivy-settings.xml

resolve:

ivy-availability-check:
[loadresource] Do not set property disallowed.ivy.jars.list as its length is 0.

-ivy-fail-disallowed-ivy-version:

ivy-fail:

ivy-fail:

ivy-configure:
[ivy:configure] :: loading settings :: file = /home/jenkins/jenkins-slave/workspace/Lucene-Solr-Tests-master/lucene/top-level-ivy-settings.xml

resolve:

ivy-availability-check:
[loadresource] Do not set property disallowed.ivy.jars.list as its length is 0.

-ivy-fail-disallowed-ivy-version:

ivy-fail:

ivy-fail:

ivy-configure:
[ivy:configure] :: loading settings :: file = /home/jenkins/jenkins-slave/workspace/Lucene-Solr-Tests-master/lucene/top-level-ivy-settings.xml

resolve:

ivy-availability-check:
[loadresource] Do not set property disallowed.ivy.jars.list as its length is 0.

-ivy-fail-disallowed-ivy-version:

ivy-fail:

ivy-fail:

ivy-configure:
[ivy:configure] :: loading settings :: file = /home/jenkins/jenkins-slave/workspace/Lucene-Solr-Tests-master/lucene/top-level-ivy-settings.xml

resolve:

ivy-availability-check:
[loadresource] Do not set property disallowed.ivy.jars.list as its length is 0.

-ivy-fail-disallowed-ivy-version:

ivy-fail:

ivy-fail:

ivy-configure:
[ivy:configure] :: loading settings :: file = /home/jenkins/jenkins-slave/workspace/Lucene-Solr-Tests-master/lucene/top-level-ivy-settings.xml

resolve:

ivy-availability-check:
[loadresource] Do not set property disallowed.ivy.jars.list as its length is 0.

-ivy-fail-disallowed-ivy-version:

ivy-fail:

ivy-fail:

ivy-configure:
[ivy:configure] :: loading settings :: file = /home/jenkins/jenkins-slave/workspace/Lucene-Solr-Tests-master/lucene/top-level-ivy-settings.xml

resolve:

jar-checksums:
    [mkdir] Created dir: /home/jenkins/jenkins-slave/workspace/Lucene-Solr-Tests-master/solr/null1421167746
     [copy] Copying 238 files to /home/jenkins/jenkins-slave/workspace/Lucene-Solr-Tests-master/solr/null1421167746
   [delete] Deleting directory /home/jenkins/jenkins-slave/workspace/Lucene-Solr-Tests-master/solr/null1421167746

check-working-copy:
[ivy:cachepath] :: resolving dependencies :: org.eclipse.jgit#org.eclipse.jgit-caller;working
[ivy:cachepath] 	confs: [default]
[ivy:cachepath] 	found org.eclipse.jgit#org.eclipse.jgit;4.6.0.201612231935-r in public
[ivy:cachepath] 	found com.jcraft#jsch;0.1.53 in public
[ivy:cachepath] 	found com.googlecode.javaewah#JavaEWAH;1.1.6 in public
[ivy:cachepath] 	found org.apache.httpcomponents#httpclient;4.3.6 in public
[ivy:cachepath] 	found org.apache.httpcomponents#httpcore;4.3.3 in public
[ivy:cachepath] 	found commons-logging#commons-logging;1.1.3 in public
[ivy:cachepath] 	found commons-codec#commons-codec;1.6 in public
[ivy:cachepath] 	found org.slf4j#slf4j-api;1.7.2 in public
[ivy:cachepath] :: resolution report :: resolve 67ms :: artifacts dl 12ms
	---------------------------------------------------------------------
	|                  |            modules            ||   artifacts   |
	|       conf       | number| search|dwnlded|evicted|| number|dwnlded|
	---------------------------------------------------------------------
	|      default     |   8   |   0   |   0   |   0   ||   8   |   0   |
	---------------------------------------------------------------------
[wc-checker] Initializing working copy...
[wc-checker] SLF4J: Failed to load class "org.slf4j.impl.StaticLoggerBinder".
[wc-checker] SLF4J: Defaulting to no-operation (NOP) logger implementation
[wc-checker] SLF4J: See http://www.slf4j.org/codes.html#StaticLoggerBinder for further details.
[wc-checker] Checking working copy status...

-jenkins-base:

BUILD SUCCESSFUL
Total time: 216 minutes 11 seconds
Archiving artifacts
java.lang.InterruptedException: no matches found within 10000
	at hudson.FilePath$34.hasMatch(FilePath.java:2678)
	at hudson.FilePath$34.invoke(FilePath.java:2557)
	at hudson.FilePath$34.invoke(FilePath.java:2547)
	at hudson.FilePath$FileCallableWrapper.call(FilePath.java:2918)
Also:   hudson.remoting.Channel$CallSiteStackTrace: Remote call to lucene2
		at hudson.remoting.Channel.attachCallSiteStackTrace(Channel.java:1741)
		at hudson.remoting.UserRequest$ExceptionResponse.retrieve(UserRequest.java:357)
		at hudson.remoting.Channel.call(Channel.java:955)
		at hudson.FilePath.act(FilePath.java:1036)
		at hudson.FilePath.act(FilePath.java:1025)
		at hudson.FilePath.validateAntFileMask(FilePath.java:2547)
		at hudson.tasks.ArtifactArchiver.perform(ArtifactArchiver.java:243)
		at hudson.tasks.BuildStepCompatibilityLayer.perform(BuildStepCompatibilityLayer.java:81)
		at hudson.tasks.BuildStepMonitor$1.perform(BuildStepMonitor.java:20)
		at hudson.model.AbstractBuild$AbstractBuildExecution.perform(AbstractBuild.java:744)
		at hudson.model.AbstractBuild$AbstractBuildExecution.performAllBuildSteps(AbstractBuild.java:690)
		at hudson.model.Build$BuildExecution.post2(Build.java:186)
		at hudson.model.AbstractBuild$AbstractBuildExecution.post(AbstractBuild.java:635)
		at hudson.model.Run.execute(Run.java:1819)
		at hudson.model.FreeStyleBuild.run(FreeStyleBuild.java:43)
		at hudson.model.ResourceController.execute(ResourceController.java:97)
		at hudson.model.Executor.run(Executor.java:429)
Caused: hudson.FilePath$TunneledInterruptedException
	at hudson.FilePath$FileCallableWrapper.call(FilePath.java:2920)
	at hudson.remoting.UserRequest.perform(UserRequest.java:212)
	at hudson.remoting.UserRequest.perform(UserRequest.java:54)
	at hudson.remoting.Request$2.run(Request.java:369)
	at hudson.remoting.InterceptingExecutorService$1.call(InterceptingExecutorService.java:72)
	at java.util.concurrent.FutureTask.run(FutureTask.java:266)
	at java.util.concurrent.ThreadPoolExecutor.runWorker(ThreadPoolExecutor.java:1142)
	at java.util.concurrent.ThreadPoolExecutor$Worker.run(ThreadPoolExecutor.java:617)
	at java.lang.Thread.run(Thread.java:748)
Caused: java.lang.InterruptedException: java.lang.InterruptedException: no matches found within 10000
	at hudson.FilePath.act(FilePath.java:1038)
	at hudson.FilePath.act(FilePath.java:1025)
	at hudson.FilePath.validateAntFileMask(FilePath.java:2547)
	at hudson.tasks.ArtifactArchiver.perform(ArtifactArchiver.java:243)
	at hudson.tasks.BuildStepCompatibilityLayer.perform(BuildStepCompatibilityLayer.java:81)
	at hudson.tasks.BuildStepMonitor$1.perform(BuildStepMonitor.java:20)
	at hudson.model.AbstractBuild$AbstractBuildExecution.perform(AbstractBuild.java:744)
	at hudson.model.AbstractBuild$AbstractBuildExecution.performAllBuildSteps(AbstractBuild.java:690)
	at hudson.model.Build$BuildExecution.post2(Build.java:186)
	at hudson.model.AbstractBuild$AbstractBuildExecution.post(AbstractBuild.java:635)
	at hudson.model.Run.execute(Run.java:1819)
	at hudson.model.FreeStyleBuild.run(FreeStyleBuild.java:43)
	at hudson.model.ResourceController.execute(ResourceController.java:97)
	at hudson.model.Executor.run(Executor.java:429)
No artifacts found that match the file pattern "**/*.events,heapdumps/**,**/hs_err_pid*". Configuration error?
Recording test results
Build step 'Publish JUnit test result report' changed build result to UNSTABLE
Email was triggered for: Unstable (Test Failures)
Sending email for trigger: Unstable (Test Failures)

Mime
View raw message