lucene-dev mailing list archives

Site index · List index
Message view « Date » · « Thread »
Top « Date » · « Thread »
From Policeman Jenkins Server <jenk...@thetaphi.de>
Subject [JENKINS] Lucene-Solr-7.x-Linux (64bit/jdk1.8.0_172) - Build # 2753 - Unstable!
Date Sun, 16 Sep 2018 15:37:20 GMT
Build: https://jenkins.thetaphi.de/job/Lucene-Solr-7.x-Linux/2753/
Java: 64bit/jdk1.8.0_172 -XX:-UseCompressedOops -XX:+UseSerialGC

1 tests failed.
FAILED:  org.apache.solr.cloud.api.collections.CollectionsAPIAsyncDistributedZkTest.testAsyncRequests

Error Message:
DeleteCollection did not complete expected same:<COMPLETED> was not:<FAILED>

Stack Trace:
java.lang.AssertionError: DeleteCollection did not complete expected same:<COMPLETED> was not:<FAILED>
	at __randomizedtesting.SeedInfo.seed([D2C63D7AAC33D434:368201CD0A9B9AEB]:0)
	at org.junit.Assert.fail(Assert.java:93)
	at org.junit.Assert.failNotSame(Assert.java:641)
	at org.junit.Assert.assertSame(Assert.java:580)
	at org.apache.solr.cloud.api.collections.CollectionsAPIAsyncDistributedZkTest.testAsyncRequests(CollectionsAPIAsyncDistributedZkTest.java:191)
	at sun.reflect.NativeMethodAccessorImpl.invoke0(Native Method)
	at sun.reflect.NativeMethodAccessorImpl.invoke(NativeMethodAccessorImpl.java:62)
	at sun.reflect.DelegatingMethodAccessorImpl.invoke(DelegatingMethodAccessorImpl.java:43)
	at java.lang.reflect.Method.invoke(Method.java:498)
	at com.carrotsearch.randomizedtesting.RandomizedRunner.invoke(RandomizedRunner.java:1742)
	at com.carrotsearch.randomizedtesting.RandomizedRunner$8.evaluate(RandomizedRunner.java:935)
	at com.carrotsearch.randomizedtesting.RandomizedRunner$9.evaluate(RandomizedRunner.java:971)
	at com.carrotsearch.randomizedtesting.RandomizedRunner$10.evaluate(RandomizedRunner.java:985)
	at com.carrotsearch.randomizedtesting.rules.SystemPropertiesRestoreRule$1.evaluate(SystemPropertiesRestoreRule.java:57)
	at org.apache.lucene.util.TestRuleSetupTeardownChained$1.evaluate(TestRuleSetupTeardownChained.java:49)
	at org.apache.lucene.util.AbstractBeforeAfterRule$1.evaluate(AbstractBeforeAfterRule.java:45)
	at org.apache.lucene.util.TestRuleThreadAndTestName$1.evaluate(TestRuleThreadAndTestName.java:48)
	at org.apache.lucene.util.TestRuleIgnoreAfterMaxFailures$1.evaluate(TestRuleIgnoreAfterMaxFailures.java:64)
	at org.apache.lucene.util.TestRuleMarkFailure$1.evaluate(TestRuleMarkFailure.java:47)
	at com.carrotsearch.randomizedtesting.rules.StatementAdapter.evaluate(StatementAdapter.java:36)
	at com.carrotsearch.randomizedtesting.ThreadLeakControl$StatementRunner.run(ThreadLeakControl.java:368)
	at com.carrotsearch.randomizedtesting.ThreadLeakControl.forkTimeoutingTask(ThreadLeakControl.java:817)
	at com.carrotsearch.randomizedtesting.ThreadLeakControl$3.evaluate(ThreadLeakControl.java:468)
	at com.carrotsearch.randomizedtesting.RandomizedRunner.runSingleTest(RandomizedRunner.java:944)
	at com.carrotsearch.randomizedtesting.RandomizedRunner$5.evaluate(RandomizedRunner.java:830)
	at com.carrotsearch.randomizedtesting.RandomizedRunner$6.evaluate(RandomizedRunner.java:880)
	at com.carrotsearch.randomizedtesting.RandomizedRunner$7.evaluate(RandomizedRunner.java:891)
	at com.carrotsearch.randomizedtesting.rules.StatementAdapter.evaluate(StatementAdapter.java:36)
	at com.carrotsearch.randomizedtesting.rules.SystemPropertiesRestoreRule$1.evaluate(SystemPropertiesRestoreRule.java:57)
	at org.apache.lucene.util.AbstractBeforeAfterRule$1.evaluate(AbstractBeforeAfterRule.java:45)
	at com.carrotsearch.randomizedtesting.rules.StatementAdapter.evaluate(StatementAdapter.java:36)
	at org.apache.lucene.util.TestRuleStoreClassName$1.evaluate(TestRuleStoreClassName.java:41)
	at com.carrotsearch.randomizedtesting.rules.NoShadowingOrOverridesOnMethodsRule$1.evaluate(NoShadowingOrOverridesOnMethodsRule.java:40)
	at com.carrotsearch.randomizedtesting.rules.NoShadowingOrOverridesOnMethodsRule$1.evaluate(NoShadowingOrOverridesOnMethodsRule.java:40)
	at com.carrotsearch.randomizedtesting.rules.StatementAdapter.evaluate(StatementAdapter.java:36)
	at com.carrotsearch.randomizedtesting.rules.StatementAdapter.evaluate(StatementAdapter.java:36)
	at com.carrotsearch.randomizedtesting.rules.StatementAdapter.evaluate(StatementAdapter.java:36)
	at org.apache.lucene.util.TestRuleAssertionsRequired$1.evaluate(TestRuleAssertionsRequired.java:53)
	at org.apache.lucene.util.TestRuleMarkFailure$1.evaluate(TestRuleMarkFailure.java:47)
	at org.apache.lucene.util.TestRuleIgnoreAfterMaxFailures$1.evaluate(TestRuleIgnoreAfterMaxFailures.java:64)
	at org.apache.lucene.util.TestRuleIgnoreTestSuites$1.evaluate(TestRuleIgnoreTestSuites.java:54)
	at com.carrotsearch.randomizedtesting.rules.StatementAdapter.evaluate(StatementAdapter.java:36)
	at com.carrotsearch.randomizedtesting.ThreadLeakControl$StatementRunner.run(ThreadLeakControl.java:368)
	at java.lang.Thread.run(Thread.java:748)




Build Log:
[...truncated 14237 lines...]
   [junit4] Suite: org.apache.solr.cloud.api.collections.CollectionsAPIAsyncDistributedZkTest
   [junit4]   2> 2499206 INFO  (SUITE-CollectionsAPIAsyncDistributedZkTest-seed#[D2C63D7AAC33D434]-worker) [    ] o.a.s.SolrTestCaseJ4 SecureRandom sanity checks: test.solr.allowed.securerandom=null & java.security.egd=file:/dev/./urandom
   [junit4]   2> Creating dataDir: /home/jenkins/workspace/Lucene-Solr-7.x-Linux/solr/build/solr-core/test/J2/temp/solr.cloud.api.collections.CollectionsAPIAsyncDistributedZkTest_D2C63D7AAC33D434-001/init-core-data-001
   [junit4]   2> 2499206 WARN  (SUITE-CollectionsAPIAsyncDistributedZkTest-seed#[D2C63D7AAC33D434]-worker) [    ] o.a.s.SolrTestCaseJ4 startTrackingSearchers: numOpens=1 numCloses=1
   [junit4]   2> 2499206 INFO  (SUITE-CollectionsAPIAsyncDistributedZkTest-seed#[D2C63D7AAC33D434]-worker) [    ] o.a.s.SolrTestCaseJ4 Using PointFields (NUMERIC_POINTS_SYSPROP=true) w/NUMERIC_DOCVALUES_SYSPROP=false
   [junit4]   2> 2499207 INFO  (SUITE-CollectionsAPIAsyncDistributedZkTest-seed#[D2C63D7AAC33D434]-worker) [    ] o.a.s.SolrTestCaseJ4 Randomized ssl (false) and clientAuth (false) via: @org.apache.solr.util.RandomizeSSL(reason=, ssl=NaN, value=NaN, clientAuth=NaN)
   [junit4]   2> 2499207 INFO  (SUITE-CollectionsAPIAsyncDistributedZkTest-seed#[D2C63D7AAC33D434]-worker) [    ] o.a.s.c.MiniSolrCloudCluster Starting cluster of 2 servers in /home/jenkins/workspace/Lucene-Solr-7.x-Linux/solr/build/solr-core/test/J2/temp/solr.cloud.api.collections.CollectionsAPIAsyncDistributedZkTest_D2C63D7AAC33D434-001/tempDir-001
   [junit4]   2> 2499207 INFO  (SUITE-CollectionsAPIAsyncDistributedZkTest-seed#[D2C63D7AAC33D434]-worker) [    ] o.a.s.c.ZkTestServer STARTING ZK TEST SERVER
   [junit4]   2> 2499208 INFO  (Thread-7404) [    ] o.a.s.c.ZkTestServer client port:0.0.0.0/0.0.0.0:0
   [junit4]   2> 2499208 INFO  (Thread-7404) [    ] o.a.s.c.ZkTestServer Starting server
   [junit4]   2> 2499209 ERROR (Thread-7404) [    ] o.a.z.s.ZooKeeperServer ZKShutdownHandler is not registered, so ZooKeeper server won't take any action on ERROR or SHUTDOWN server state changes
   [junit4]   2> 2499308 INFO  (SUITE-CollectionsAPIAsyncDistributedZkTest-seed#[D2C63D7AAC33D434]-worker) [    ] o.a.s.c.ZkTestServer start zk server on port:43189
   [junit4]   2> 2499310 INFO  (zkConnectionManagerCallback-7256-thread-1) [    ] o.a.s.c.c.ConnectionManager zkClient has connected
   [junit4]   2> 2499313 INFO  (jetty-launcher-7253-thread-2) [    ] o.e.j.s.Server jetty-9.4.11.v20180605; built: 2018-06-05T18:24:03.829Z; git: d5fc0523cfa96bfebfbda19606cad384d772f04c; jvm 1.8.0_172-b11
   [junit4]   2> 2499313 INFO  (jetty-launcher-7253-thread-1) [    ] o.e.j.s.Server jetty-9.4.11.v20180605; built: 2018-06-05T18:24:03.829Z; git: d5fc0523cfa96bfebfbda19606cad384d772f04c; jvm 1.8.0_172-b11
   [junit4]   2> 2499318 INFO  (jetty-launcher-7253-thread-2) [    ] o.e.j.s.session DefaultSessionIdManager workerName=node0
   [junit4]   2> 2499318 INFO  (jetty-launcher-7253-thread-2) [    ] o.e.j.s.session No SessionScavenger set, using defaults
   [junit4]   2> 2499318 INFO  (jetty-launcher-7253-thread-2) [    ] o.e.j.s.session node0 Scavenging every 660000ms
   [junit4]   2> 2499321 INFO  (jetty-launcher-7253-thread-1) [    ] o.e.j.s.session DefaultSessionIdManager workerName=node0
   [junit4]   2> 2499321 INFO  (jetty-launcher-7253-thread-2) [    ] o.e.j.s.h.ContextHandler Started o.e.j.s.ServletContextHandler@62eb8272{/solr,null,AVAILABLE}
   [junit4]   2> 2499321 INFO  (jetty-launcher-7253-thread-1) [    ] o.e.j.s.session No SessionScavenger set, using defaults
   [junit4]   2> 2499321 INFO  (jetty-launcher-7253-thread-1) [    ] o.e.j.s.session node0 Scavenging every 600000ms
   [junit4]   2> 2499321 INFO  (jetty-launcher-7253-thread-1) [    ] o.e.j.s.h.ContextHandler Started o.e.j.s.ServletContextHandler@3ceaeb46{/solr,null,AVAILABLE}
   [junit4]   2> 2499321 INFO  (jetty-launcher-7253-thread-1) [    ] o.e.j.s.AbstractConnector Started ServerConnector@21492fa{HTTP/1.1,[http/1.1]}{127.0.0.1:42145}
   [junit4]   2> 2499321 INFO  (jetty-launcher-7253-thread-2) [    ] o.e.j.s.AbstractConnector Started ServerConnector@353c4435{HTTP/1.1,[http/1.1]}{127.0.0.1:40803}
   [junit4]   2> 2499321 INFO  (jetty-launcher-7253-thread-1) [    ] o.e.j.s.Server Started @2499354ms
   [junit4]   2> 2499321 INFO  (jetty-launcher-7253-thread-2) [    ] o.e.j.s.Server Started @2499354ms
   [junit4]   2> 2499321 INFO  (jetty-launcher-7253-thread-2) [    ] o.a.s.c.s.e.JettySolrRunner Jetty properties: {hostContext=/solr, hostPort=40803}
   [junit4]   2> 2499321 INFO  (jetty-launcher-7253-thread-1) [    ] o.a.s.c.s.e.JettySolrRunner Jetty properties: {hostContext=/solr, hostPort=42145}
   [junit4]   2> 2499322 ERROR (jetty-launcher-7253-thread-2) [    ] o.a.s.u.StartupLoggingUtils Missing Java Option solr.log.dir. Logging may be missing or incomplete.
   [junit4]   2> 2499322 ERROR (jetty-launcher-7253-thread-1) [    ] o.a.s.u.StartupLoggingUtils Missing Java Option solr.log.dir. Logging may be missing or incomplete.
   [junit4]   2> 2499322 INFO  (jetty-launcher-7253-thread-2) [    ] o.a.s.s.SolrDispatchFilter Using logger factory org.apache.logging.slf4j.Log4jLoggerFactory
   [junit4]   2> 2499322 INFO  (jetty-launcher-7253-thread-1) [    ] o.a.s.s.SolrDispatchFilter Using logger factory org.apache.logging.slf4j.Log4jLoggerFactory
   [junit4]   2> 2499322 INFO  (jetty-launcher-7253-thread-2) [    ] o.a.s.s.SolrDispatchFilter  ___      _       Welcome to Apache Solr? version 7.6.0
   [junit4]   2> 2499322 INFO  (jetty-launcher-7253-thread-1) [    ] o.a.s.s.SolrDispatchFilter  ___      _       Welcome to Apache Solr? version 7.6.0
   [junit4]   2> 2499322 INFO  (jetty-launcher-7253-thread-2) [    ] o.a.s.s.SolrDispatchFilter / __| ___| |_ _   Starting in cloud mode on port null
   [junit4]   2> 2499322 INFO  (jetty-launcher-7253-thread-1) [    ] o.a.s.s.SolrDispatchFilter / __| ___| |_ _   Starting in cloud mode on port null
   [junit4]   2> 2499322 INFO  (jetty-launcher-7253-thread-2) [    ] o.a.s.s.SolrDispatchFilter \__ \/ _ \ | '_|  Install dir: null
   [junit4]   2> 2499322 INFO  (jetty-launcher-7253-thread-1) [    ] o.a.s.s.SolrDispatchFilter \__ \/ _ \ | '_|  Install dir: null
   [junit4]   2> 2499322 INFO  (jetty-launcher-7253-thread-2) [    ] o.a.s.s.SolrDispatchFilter |___/\___/_|_|    Start time: 2018-09-16T15:03:45.892Z
   [junit4]   2> 2499322 INFO  (jetty-launcher-7253-thread-1) [    ] o.a.s.s.SolrDispatchFilter |___/\___/_|_|    Start time: 2018-09-16T15:03:45.892Z
   [junit4]   2> 2499323 INFO  (zkConnectionManagerCallback-7260-thread-1) [    ] o.a.s.c.c.ConnectionManager zkClient has connected
   [junit4]   2> 2499323 INFO  (zkConnectionManagerCallback-7259-thread-1) [    ] o.a.s.c.c.ConnectionManager zkClient has connected
   [junit4]   2> 2499323 INFO  (jetty-launcher-7253-thread-1) [    ] o.a.s.s.SolrDispatchFilter solr.xml found in ZooKeeper. Loading...
   [junit4]   2> 2499323 INFO  (jetty-launcher-7253-thread-2) [    ] o.a.s.s.SolrDispatchFilter solr.xml found in ZooKeeper. Loading...
   [junit4]   2> 2499410 INFO  (jetty-launcher-7253-thread-1) [    ] o.a.s.c.ZkContainer Zookeeper client=127.0.0.1:43189/solr
   [junit4]   2> 2499410 INFO  (zkConnectionManagerCallback-7264-thread-1) [    ] o.a.s.c.c.ConnectionManager zkClient has connected
   [junit4]   2> 2499412 INFO  (zkConnectionManagerCallback-7266-thread-1) [    ] o.a.s.c.c.ConnectionManager zkClient has connected
   [junit4]   2> 2499458 INFO  (jetty-launcher-7253-thread-1) [n:127.0.0.1:42145_solr    ] o.a.s.c.OverseerElectionContext I am going to be the leader 127.0.0.1:42145_solr
   [junit4]   2> 2499458 INFO  (jetty-launcher-7253-thread-1) [n:127.0.0.1:42145_solr    ] o.a.s.c.Overseer Overseer (id=72234928123609092-127.0.0.1:42145_solr-n_0000000000) starting
   [junit4]   2> 2499462 INFO  (zkConnectionManagerCallback-7273-thread-1) [    ] o.a.s.c.c.ConnectionManager zkClient has connected
   [junit4]   2> 2499463 INFO  (jetty-launcher-7253-thread-1) [n:127.0.0.1:42145_solr    ] o.a.s.c.s.i.ZkClientClusterStateProvider Cluster at 127.0.0.1:43189/solr ready
   [junit4]   2> 2499463 INFO  (OverseerStateUpdate-72234928123609092-127.0.0.1:42145_solr-n_0000000000) [n:127.0.0.1:42145_solr    ] o.a.s.c.Overseer Starting to work on the main queue : 127.0.0.1:42145_solr
   [junit4]   2> 2499463 INFO  (jetty-launcher-7253-thread-1) [n:127.0.0.1:42145_solr    ] o.a.s.c.ZkController Register node as live in ZooKeeper:/live_nodes/127.0.0.1:42145_solr
   [junit4]   2> 2499464 INFO  (zkCallback-7265-thread-1) [    ] o.a.s.c.c.ZkStateReader Updated live nodes from ZooKeeper... (0) -> (1)
   [junit4]   2> 2499464 INFO  (zkCallback-7272-thread-1) [    ] o.a.s.c.c.ZkStateReader Updated live nodes from ZooKeeper... (0) -> (1)
   [junit4]   2> 2499474 INFO  (jetty-launcher-7253-thread-1) [n:127.0.0.1:42145_solr    ] o.a.s.h.a.MetricsHistoryHandler No .system collection, keeping metrics history in memory.
   [junit4]   2> 2499488 INFO  (jetty-launcher-7253-thread-1) [n:127.0.0.1:42145_solr    ] o.a.s.m.r.SolrJmxReporter JMX monitoring for 'solr_42145.solr.node' (registry 'solr.node') enabled at server: com.sun.jmx.mbeanserver.JmxMBeanServer@525d2e77
   [junit4]   2> 2499492 INFO  (jetty-launcher-7253-thread-1) [n:127.0.0.1:42145_solr    ] o.a.s.m.r.SolrJmxReporter JMX monitoring for 'solr_42145.solr.jvm' (registry 'solr.jvm') enabled at server: com.sun.jmx.mbeanserver.JmxMBeanServer@525d2e77
   [junit4]   2> 2499492 INFO  (jetty-launcher-7253-thread-1) [n:127.0.0.1:42145_solr    ] o.a.s.m.r.SolrJmxReporter JMX monitoring for 'solr_42145.solr.jetty' (registry 'solr.jetty') enabled at server: com.sun.jmx.mbeanserver.JmxMBeanServer@525d2e77
   [junit4]   2> 2499493 INFO  (jetty-launcher-7253-thread-1) [n:127.0.0.1:42145_solr    ] o.a.s.c.CorePropertiesLocator Found 0 core definitions underneath /home/jenkins/workspace/Lucene-Solr-7.x-Linux/solr/build/solr-core/test/J2/temp/solr.cloud.api.collections.CollectionsAPIAsyncDistributedZkTest_D2C63D7AAC33D434-001/tempDir-001/node1/.
   [junit4]   2> 2499508 INFO  (jetty-launcher-7253-thread-2) [    ] o.a.s.c.ZkContainer Zookeeper client=127.0.0.1:43189/solr
   [junit4]   2> 2499509 INFO  (zkConnectionManagerCallback-7278-thread-1) [    ] o.a.s.c.c.ConnectionManager zkClient has connected
   [junit4]   2> 2499511 INFO  (zkConnectionManagerCallback-7280-thread-1) [    ] o.a.s.c.c.ConnectionManager zkClient has connected
   [junit4]   2> 2499514 INFO  (jetty-launcher-7253-thread-2) [n:127.0.0.1:40803_solr    ] o.a.s.c.c.ZkStateReader Updated live nodes from ZooKeeper... (0) -> (1)
   [junit4]   2> 2499516 INFO  (jetty-launcher-7253-thread-2) [n:127.0.0.1:40803_solr    ] o.a.s.c.TransientSolrCoreCacheDefault Allocating transient cache for 2147483647 transient cores
   [junit4]   2> 2499516 INFO  (jetty-launcher-7253-thread-2) [n:127.0.0.1:40803_solr    ] o.a.s.c.ZkController Register node as live in ZooKeeper:/live_nodes/127.0.0.1:40803_solr
   [junit4]   2> 2499516 INFO  (zkCallback-7265-thread-1) [    ] o.a.s.c.c.ZkStateReader Updated live nodes from ZooKeeper... (1) -> (2)
   [junit4]   2> 2499517 INFO  (zkCallback-7272-thread-1) [    ] o.a.s.c.c.ZkStateReader Updated live nodes from ZooKeeper... (1) -> (2)
   [junit4]   2> 2499517 INFO  (zkCallback-7279-thread-1) [    ] o.a.s.c.c.ZkStateReader Updated live nodes from ZooKeeper... (1) -> (2)
   [junit4]   2> 2499526 INFO  (zkConnectionManagerCallback-7287-thread-1) [    ] o.a.s.c.c.ConnectionManager zkClient has connected
   [junit4]   2> 2499527 INFO  (jetty-launcher-7253-thread-2) [n:127.0.0.1:40803_solr    ] o.a.s.c.c.ZkStateReader Updated live nodes from ZooKeeper... (0) -> (2)
   [junit4]   2> 2499527 INFO  (jetty-launcher-7253-thread-2) [n:127.0.0.1:40803_solr    ] o.a.s.c.s.i.ZkClientClusterStateProvider Cluster at 127.0.0.1:43189/solr ready
   [junit4]   2> 2499527 INFO  (jetty-launcher-7253-thread-2) [n:127.0.0.1:40803_solr    ] o.a.s.h.a.MetricsHistoryHandler No .system collection, keeping metrics history in memory.
   [junit4]   2> 2499535 INFO  (jetty-launcher-7253-thread-2) [n:127.0.0.1:40803_solr    ] o.a.s.m.r.SolrJmxReporter JMX monitoring for 'solr_40803.solr.node' (registry 'solr.node') enabled at server: com.sun.jmx.mbeanserver.JmxMBeanServer@525d2e77
   [junit4]   2> 2499539 INFO  (jetty-launcher-7253-thread-2) [n:127.0.0.1:40803_solr    ] o.a.s.m.r.SolrJmxReporter JMX monitoring for 'solr_40803.solr.jvm' (registry 'solr.jvm') enabled at server: com.sun.jmx.mbeanserver.JmxMBeanServer@525d2e77
   [junit4]   2> 2499539 INFO  (jetty-launcher-7253-thread-2) [n:127.0.0.1:40803_solr    ] o.a.s.m.r.SolrJmxReporter JMX monitoring for 'solr_40803.solr.jetty' (registry 'solr.jetty') enabled at server: com.sun.jmx.mbeanserver.JmxMBeanServer@525d2e77
   [junit4]   2> 2499540 INFO  (jetty-launcher-7253-thread-2) [n:127.0.0.1:40803_solr    ] o.a.s.c.CorePropertiesLocator Found 0 core definitions underneath /home/jenkins/workspace/Lucene-Solr-7.x-Linux/solr/build/solr-core/test/J2/temp/solr.cloud.api.collections.CollectionsAPIAsyncDistributedZkTest_D2C63D7AAC33D434-001/tempDir-001/node2/.
   [junit4]   2> 2499552 INFO  (zkConnectionManagerCallback-7290-thread-1) [    ] o.a.s.c.c.ConnectionManager zkClient has connected
   [junit4]   2> 2499554 INFO  (zkConnectionManagerCallback-7295-thread-1) [    ] o.a.s.c.c.ConnectionManager zkClient has connected
   [junit4]   2> 2499555 INFO  (SUITE-CollectionsAPIAsyncDistributedZkTest-seed#[D2C63D7AAC33D434]-worker) [    ] o.a.s.c.c.ZkStateReader Updated live nodes from ZooKeeper... (0) -> (2)
   [junit4]   2> 2499556 INFO  (SUITE-CollectionsAPIAsyncDistributedZkTest-seed#[D2C63D7AAC33D434]-worker) [    ] o.a.s.c.s.i.ZkClientClusterStateProvider Cluster at 127.0.0.1:43189/solr ready
   [junit4]   2> 2499571 INFO  (TEST-CollectionsAPIAsyncDistributedZkTest.testAsyncRequests-seed#[D2C63D7AAC33D434]) [    ] o.a.s.SolrTestCaseJ4 ###Starting testAsyncRequests
   [junit4]   2> 2499572 INFO  (qtp1563172504-28450) [n:127.0.0.1:40803_solr    ] o.a.s.h.a.CollectionsHandler Invoked Collection Action :create with params async=7bcc4812-86d3-4102-bb99-3792ba274b2d&shards=shard1&collection.configName=conf1&name=testAsyncOperations&router.name=implicit&nrtReplicas=1&action=CREATE&numShards=1&wt=javabin&version=2 and sendToOCPQueue=true
   [junit4]   2> 2499574 INFO  (qtp1563172504-28450) [n:127.0.0.1:40803_solr    ] o.a.s.s.HttpSolrCall [admin] webapp=null path=/admin/collections params={async=7bcc4812-86d3-4102-bb99-3792ba274b2d&shards=shard1&collection.configName=conf1&name=testAsyncOperations&router.name=implicit&nrtReplicas=1&action=CREATE&numShards=1&wt=javabin&version=2} status=0 QTime=1
   [junit4]   2> 2499574 INFO  (qtp1563172504-28442) [n:127.0.0.1:40803_solr    ] o.a.s.h.a.CollectionsHandler Invoked Collection Action :requeststatus with params requestid=7bcc4812-86d3-4102-bb99-3792ba274b2d&action=REQUESTSTATUS&wt=javabin&version=2 and sendToOCPQueue=true
   [junit4]   2> 2499575 INFO  (qtp1563172504-28442) [n:127.0.0.1:40803_solr    ] o.a.s.s.HttpSolrCall [admin] webapp=null path=/admin/collections params={requestid=7bcc4812-86d3-4102-bb99-3792ba274b2d&action=REQUESTSTATUS&wt=javabin&version=2} status=0 QTime=0
   [junit4]   2> 2499575 INFO  (OverseerThreadFactory-10473-thread-1-processing-n:127.0.0.1:42145_solr) [n:127.0.0.1:42145_solr    ] o.a.s.c.a.c.CreateCollectionCmd Create collection testAsyncOperations
   [junit4]   2> 2499679 INFO  (OverseerStateUpdate-72234928123609092-127.0.0.1:42145_solr-n_0000000000) [n:127.0.0.1:42145_solr    ] o.a.s.c.o.SliceMutator createReplica() {
   [junit4]   2>   "operation":"ADDREPLICA",
   [junit4]   2>   "collection":"testAsyncOperations",
   [junit4]   2>   "shard":"shard1",
   [junit4]   2>   "core":"testAsyncOperations_shard1_replica_n1",
   [junit4]   2>   "state":"down",
   [junit4]   2>   "base_url":"http://127.0.0.1:40803/solr",
   [junit4]   2>   "type":"NRT",
   [junit4]   2>   "waitForFinalState":"false"} 
   [junit4]   2> 2499882 INFO  (qtp1563172504-28444) [n:127.0.0.1:40803_solr    x:testAsyncOperations_shard1_replica_n1] o.a.s.s.HttpSolrCall [admin] webapp=null path=/admin/cores params={qt=/admin/cores&collection.configName=conf1&newCollection=true&collection=testAsyncOperations&version=2&replicaType=NRT&async=7bcc4812-86d3-4102-bb99-3792ba274b2d2705903877585990&coreNodeName=core_node2&name=testAsyncOperations_shard1_replica_n1&action=CREATE&numShards=1&shard=shard1&wt=javabin} status=0 QTime=0
   [junit4]   2> 2499882 INFO  (parallelCoreAdminExecutor-10481-thread-1-processing-n:127.0.0.1:40803_solr x:testAsyncOperations_shard1_replica_n1 7bcc4812-86d3-4102-bb99-3792ba274b2d2705903877585990 CREATE) [n:127.0.0.1:40803_solr    x:testAsyncOperations_shard1_replica_n1] o.a.s.h.a.CoreAdminOperation core create command qt=/admin/cores&collection.configName=conf1&newCollection=true&collection=testAsyncOperations&version=2&replicaType=NRT&async=7bcc4812-86d3-4102-bb99-3792ba274b2d2705903877585990&coreNodeName=core_node2&name=testAsyncOperations_shard1_replica_n1&action=CREATE&numShards=1&shard=shard1&wt=javabin
   [junit4]   2> 2499882 INFO  (qtp1563172504-28448) [n:127.0.0.1:40803_solr    ] o.a.s.h.a.CoreAdminOperation Checking request status for : 7bcc4812-86d3-4102-bb99-3792ba274b2d2705903877585990
   [junit4]   2> 2499882 INFO  (qtp1563172504-28448) [n:127.0.0.1:40803_solr    ] o.a.s.s.HttpSolrCall [admin] webapp=null path=/admin/cores params={qt=/admin/cores&requestid=7bcc4812-86d3-4102-bb99-3792ba274b2d2705903877585990&action=REQUESTSTATUS&wt=javabin&version=2} status=0 QTime=0
   [junit4]   2> 2500575 INFO  (qtp1563172504-28449) [n:127.0.0.1:40803_solr    ] o.a.s.h.a.CollectionsHandler Invoked Collection Action :requeststatus with params requestid=7bcc4812-86d3-4102-bb99-3792ba274b2d&action=REQUESTSTATUS&wt=javabin&version=2 and sendToOCPQueue=true
   [junit4]   2> 2500576 INFO  (qtp1563172504-28449) [n:127.0.0.1:40803_solr    ] o.a.s.s.HttpSolrCall [admin] webapp=null path=/admin/collections params={requestid=7bcc4812-86d3-4102-bb99-3792ba274b2d&action=REQUESTSTATUS&wt=javabin&version=2} status=0 QTime=1
   [junit4]   2> 2500883 INFO  (qtp1563172504-28442) [n:127.0.0.1:40803_solr    ] o.a.s.h.a.CoreAdminOperation Checking request status for : 7bcc4812-86d3-4102-bb99-3792ba274b2d2705903877585990
   [junit4]   2> 2500883 INFO  (qtp1563172504-28442) [n:127.0.0.1:40803_solr    ] o.a.s.s.HttpSolrCall [admin] webapp=null path=/admin/cores params={qt=/admin/cores&requestid=7bcc4812-86d3-4102-bb99-3792ba274b2d2705903877585990&action=REQUESTSTATUS&wt=javabin&version=2} status=0 QTime=0
   [junit4]   2> 2500892 INFO  (parallelCoreAdminExecutor-10481-thread-1-processing-n:127.0.0.1:40803_solr x:testAsyncOperations_shard1_replica_n1 7bcc4812-86d3-4102-bb99-3792ba274b2d2705903877585990 CREATE) [n:127.0.0.1:40803_solr c:testAsyncOperations s:shard1 r:core_node2 x:testAsyncOperations_shard1_replica_n1] o.a.s.c.SolrConfig Using Lucene MatchVersion: 7.6.0
   [junit4]   2> 2500897 INFO  (parallelCoreAdminExecutor-10481-thread-1-processing-n:127.0.0.1:40803_solr x:testAsyncOperations_shard1_replica_n1 7bcc4812-86d3-4102-bb99-3792ba274b2d2705903877585990 CREATE) [n:127.0.0.1:40803_solr c:testAsyncOperations s:shard1 r:core_node2 x:testAsyncOperations_shard1_replica_n1] o.a.s.s.IndexSchema [testAsyncOperations_shard1_replica_n1] Schema name=minimal
   [junit4]   2> 2500898 INFO  (parallelCoreAdminExecutor-10481-thread-1-processing-n:127.0.0.1:40803_solr x:testAsyncOperations_shard1_replica_n1 7bcc4812-86d3-4102-bb99-3792ba274b2d2705903877585990 CREATE) [n:127.0.0.1:40803_solr c:testAsyncOperations s:shard1 r:core_node2 x:testAsyncOperations_shard1_replica_n1] o.a.s.s.IndexSchema Loaded schema minimal/1.1 with uniqueid field id
   [junit4]   2> 2500898 INFO  (parallelCoreAdminExecutor-10481-thread-1-processing-n:127.0.0.1:40803_solr x:testAsyncOperations_shard1_replica_n1 7bcc4812-86d3-4102-bb99-3792ba274b2d2705903877585990 CREATE) [n:127.0.0.1:40803_solr c:testAsyncOperations s:shard1 r:core_node2 x:testAsyncOperations_shard1_replica_n1] o.a.s.c.CoreContainer Creating SolrCore 'testAsyncOperations_shard1_replica_n1' using configuration from collection testAsyncOperations, trusted=true
   [junit4]   2> 2500898 INFO  (parallelCoreAdminExecutor-10481-thread-1-processing-n:127.0.0.1:40803_solr x:testAsyncOperations_shard1_replica_n1 7bcc4812-86d3-4102-bb99-3792ba274b2d2705903877585990 CREATE) [n:127.0.0.1:40803_solr c:testAsyncOperations s:shard1 r:core_node2 x:testAsyncOperations_shard1_replica_n1] o.a.s.m.r.SolrJmxReporter JMX monitoring for 'solr_40803.solr.core.testAsyncOperations.shard1.replica_n1' (registry 'solr.core.testAsyncOperations.shard1.replica_n1') enabled at server: com.sun.jmx.mbeanserver.JmxMBeanServer@525d2e77
   [junit4]   2> 2500898 INFO  (parallelCoreAdminExecutor-10481-thread-1-processing-n:127.0.0.1:40803_solr x:testAsyncOperations_shard1_replica_n1 7bcc4812-86d3-4102-bb99-3792ba274b2d2705903877585990 CREATE) [n:127.0.0.1:40803_solr c:testAsyncOperations s:shard1 r:core_node2 x:testAsyncOperations_shard1_replica_n1] o.a.s.c.SolrCore [[testAsyncOperations_shard1_replica_n1] ] Opening new SolrCore at [/home/jenkins/workspace/Lucene-Solr-7.x-Linux/solr/build/solr-core/test/J2/temp/solr.cloud.api.collections.CollectionsAPIAsyncDistributedZkTest_D2C63D7AAC33D434-001/tempDir-001/node2/testAsyncOperations_shard1_replica_n1], dataDir=[/home/jenkins/workspace/Lucene-Solr-7.x-Linux/solr/build/solr-core/test/J2/temp/solr.cloud.api.collections.CollectionsAPIAsyncDistributedZkTest_D2C63D7AAC33D434-001/tempDir-001/node2/./testAsyncOperations_shard1_replica_n1/data/]
   [junit4]   2> 2500936 INFO  (parallelCoreAdminExecutor-10481-thread-1-processing-n:127.0.0.1:40803_solr x:testAsyncOperations_shard1_replica_n1 7bcc4812-86d3-4102-bb99-3792ba274b2d2705903877585990 CREATE) [n:127.0.0.1:40803_solr c:testAsyncOperations s:shard1 r:core_node2 x:testAsyncOperations_shard1_replica_n1] o.a.s.u.UpdateHandler Using UpdateLog implementation: org.apache.solr.update.UpdateLog
   [junit4]   2> 2500936 INFO  (parallelCoreAdminExecutor-10481-thread-1-processing-n:127.0.0.1:40803_solr x:testAsyncOperations_shard1_replica_n1 7bcc4812-86d3-4102-bb99-3792ba274b2d2705903877585990 CREATE) [n:127.0.0.1:40803_solr c:testAsyncOperations s:shard1 r:core_node2 x:testAsyncOperations_shard1_replica_n1] o.a.s.u.UpdateLog Initializing UpdateLog: dataDir=null defaultSyncLevel=FLUSH numRecordsToKeep=100 maxNumLogsToKeep=10 numVersionBuckets=65536
   [junit4]   2> 2500937 INFO  (parallelCoreAdminExecutor-10481-thread-1-processing-n:127.0.0.1:40803_solr x:testAsyncOperations_shard1_replica_n1 7bcc4812-86d3-4102-bb99-3792ba274b2d2705903877585990 CREATE) [n:127.0.0.1:40803_solr c:testAsyncOperations s:shard1 r:core_node2 x:testAsyncOperations_shard1_replica_n1] o.a.s.u.CommitTracker Hard AutoCommit: disabled
   [junit4]   2> 2500937 INFO  (parallelCoreAdminExecutor-10481-thread-1-processing-n:127.0.0.1:40803_solr x:testAsyncOperations_shard1_replica_n1 7bcc4812-86d3-4102-bb99-3792ba274b2d2705903877585990 CREATE) [n:127.0.0.1:40803_solr c:testAsyncOperations s:shard1 r:core_node2 x:testAsyncOperations_shard1_replica_n1] o.a.s.u.CommitTracker Soft AutoCommit: disabled
   [junit4]   2> 2500938 INFO  (parallelCoreAdminExecutor-10481-thread-1-processing-n:127.0.0.1:40803_solr x:testAsyncOperations_shard1_replica_n1 7bcc4812-86d3-4102-bb99-3792ba274b2d2705903877585990 CREATE) [n:127.0.0.1:40803_solr c:testAsyncOperations s:shard1 r:core_node2 x:testAsyncOperations_shard1_replica_n1] o.a.s.s.SolrIndexSearcher Opening [Searcher@78829549[testAsyncOperations_shard1_replica_n1] main]
   [junit4]   2> 2500939 INFO  (parallelCoreAdminExecutor-10481-thread-1-processing-n:127.0.0.1:40803_solr x:testAsyncOperations_shard1_replica_n1 7bcc4812-86d3-4102-bb99-3792ba274b2d2705903877585990 CREATE) [n:127.0.0.1:40803_solr c:testAsyncOperations s:shard1 r:core_node2 x:testAsyncOperations_shard1_replica_n1] o.a.s.r.ManagedResourceStorage Configured ZooKeeperStorageIO with znodeBase: /configs/conf1
   [junit4]   2> 2500939 INFO  (parallelCoreAdminExecutor-10481-thread-1-processing-n:127.0.0.1:40803_solr x:testAsyncOperations_shard1_replica_n1 7bcc4812-86d3-4102-bb99-3792ba274b2d2705903877585990 CREATE) [n:127.0.0.1:40803_solr c:testAsyncOperations s:shard1 r:core_node2 x:testAsyncOperations_shard1_replica_n1] o.a.s.r.ManagedResourceStorage Loaded null at path _rest_managed.json using ZooKeeperStorageIO:path=/configs/conf1
   [junit4]   2> 2500939 INFO  (parallelCoreAdminExecutor-10481-thread-1-processing-n:127.0.0.1:40803_solr x:testAsyncOperations_shard1_replica_n1 7bcc4812-86d3-4102-bb99-3792ba274b2d2705903877585990 CREATE) [n:127.0.0.1:40803_solr c:testAsyncOperations s:shard1 r:core_node2 x:testAsyncOperations_shard1_replica_n1] o.a.s.h.ReplicationHandler Commits will be reserved for 10000ms.
   [junit4]   2> 2500939 INFO  (searcherExecutor-10485-thread-1-processing-x:testAsyncOperations_shard1_replica_n1 7bcc4812-86d3-4102-bb99-3792ba274b2d2705903877585990 r:core_node2 CREATE n:127.0.0.1:40803_solr c:testAsyncOperations s:shard1) [n:127.0.0.1:40803_solr c:testAsyncOperations s:shard1 r:core_node2 x:testAsyncOperations_shard1_replica_n1] o.a.s.c.SolrCore [testAsyncOperations_shard1_replica_n1] Registered new searcher Searcher@78829549[testAsyncOperations_shard1_replica_n1] main{ExitableDirectoryReader(UninvertingDirectoryReader())}
   [junit4]   2> 2500940 INFO  (parallelCoreAdminExecutor-10481-thread-1-processing-n:127.0.0.1:40803_solr x:testAsyncOperations_shard1_replica_n1 7bcc4812-86d3-4102-bb99-3792ba274b2d2705903877585990 CREATE) [n:127.0.0.1:40803_solr c:testAsyncOperations s:shard1 r:core_node2 x:testAsyncOperations_shard1_replica_n1] o.a.s.u.UpdateLog Could not find max version in index or recent updates, using new clock 1611776893921525760
   [junit4]   2> 2500943 INFO  (parallelCoreAdminExecutor-10481-thread-1-processing-n:127.0.0.1:40803_solr x:testAsyncOperations_shard1_replica_n1 7bcc4812-86d3-4102-bb99-3792ba274b2d2705903877585990 CREATE) [n:127.0.0.1:40803_solr c:testAsyncOperations s:shard1 r:core_node2 x:testAsyncOperations_shard1_replica_n1] o.a.s.c.ZkShardTerms Successful update of terms at /collections/testAsyncOperations/terms/shard1 to Terms{values={core_node2=0}, version=0}
   [junit4]   2> 2500944 INFO  (parallelCoreAdminExecutor-10481-thread-1-processing-n:127.0.0.1:40803_solr x:testAsyncOperations_shard1_replica_n1 7bcc4812-86d3-4102-bb99-3792ba274b2d2705903877585990 CREATE) [n:127.0.0.1:40803_solr c:testAsyncOperations s:shard1 r:core_node2 x:testAsyncOperations_shard1_replica_n1] o.a.s.c.ShardLeaderElectionContext Enough replicas found to continue.
   [junit4]   2> 2500944 INFO  (parallelCoreAdminExecutor-10481-thread-1-processing-n:127.0.0.1:40803_solr x:testAsyncOperations_shard1_replica_n1 7bcc4812-86d3-4102-bb99-3792ba274b2d2705903877585990 CREATE) [n:127.0.0.1:40803_solr c:testAsyncOperations s:shard1 r:core_node2 x:testAsyncOperations_shard1_replica_n1] o.a.s.c.ShardLeaderElectionContext I may be the new leader - try and sync
   [junit4]   2> 2500944 INFO  (parallelCoreAdminExecutor-10481-thread-1-processing-n:127.0.0.1:40803_solr x:testAsyncOperations_shard1_replica_n1 7bcc4812-86d3-4102-bb99-3792ba274b2d2705903877585990 CREATE) [n:127.0.0.1:40803_solr c:testAsyncOperations s:shard1 r:core_node2 x:testAsyncOperations_shard1_replica_n1] o.a.s.c.SyncStrategy Sync replicas to http://127.0.0.1:40803/solr/testAsyncOperations_shard1_replica_n1/
   [junit4]   2> 2500944 INFO  (parallelCoreAdminExecutor-10481-thread-1-processing-n:127.0.0.1:40803_solr x:testAsyncOperations_shard1_replica_n1 7bcc4812-86d3-4102-bb99-3792ba274b2d2705903877585990 CREATE) [n:127.0.0.1:40803_solr c:testAsyncOperations s:shard1 r:core_node2 x:testAsyncOperations_shard1_replica_n1] o.a.s.c.SyncStrategy Sync Success - now sync replicas to me
   [junit4]   2> 2500944 INFO  (parallelCoreAdminExecutor-10481-thread-1-processing-n:127.0.0.1:40803_solr x:testAsyncOperations_shard1_replica_n1 7bcc4812-86d3-4102-bb99-3792ba274b2d2705903877585990 CREATE) [n:127.0.0.1:40803_solr c:testAsyncOperations s:shard1 r:core_node2 x:testAsyncOperations_shard1_replica_n1] o.a.s.c.SyncStrategy http://127.0.0.1:40803/solr/testAsyncOperations_shard1_replica_n1/ has no replicas
   [junit4]   2> 2500944 INFO  (parallelCoreAdminExecutor-10481-thread-1-processing-n:127.0.0.1:40803_solr x:testAsyncOperations_shard1_replica_n1 7bcc4812-86d3-4102-bb99-3792ba274b2d2705903877585990 CREATE) [n:127.0.0.1:40803_solr c:testAsyncOperations s:shard1 r:core_node2 x:testAsyncOperations_shard1_replica_n1] o.a.s.c.ShardLeaderElectionContext Found all replicas participating in election, clear LIR
   [junit4]   2> 2500945 INFO  (parallelCoreAdminExecutor-10481-thread-1-processing-n:127.0.0.1:40803_solr x:testAsyncOperations_shard1_replica_n1 7bcc4812-86d3-4102-bb99-3792ba274b2d2705903877585990 CREATE) [n:127.0.0.1:40803_solr c:testAsyncOperations s:shard1 r:core_node2 x:testAsyncOperations_shard1_replica_n1] o.a.s.c.ShardLeaderElectionContext I am the new leader: http://127.0.0.1:40803/solr/testAsyncOperations_shard1_replica_n1/ shard1
   [junit4]   2> 2501047 INFO  (parallelCoreAdminExecutor-10481-thread-1-processing-n:127.0.0.1:40803_solr x:testAsyncOperations_shard1_replica_n1 7bcc4812-86d3-4102-bb99-3792ba274b2d2705903877585990 CREATE) [n:127.0.0.1:40803_solr c:testAsyncOperations s:shard1 r:core_node2 x:testAsyncOperations_shard1_replica_n1] o.a.s.c.ZkController I am the leader, no recovery necessary
   [junit4]   2> 2501149 INFO  (zkCallback-7279-thread-1) [    ] o.a.s.c.c.ZkStateReader A cluster state change: [WatchedEvent state:SyncConnected type:NodeDataChanged path:/collections/testAsyncOperations/state.json] for collection [testAsyncOperations] has occurred - updating... (live nodes size: [2])
   [junit4]   2> 2501577 INFO  (qtp1563172504-28448) [n:127.0.0.1:40803_solr    ] o.a.s.h.a.CollectionsHandler Invoked Collection Action :requeststatus with params requestid=7bcc4812-86d3-4102-bb99-3792ba274b2d&action=REQUESTSTATUS&wt=javabin&version=2 and sendToOCPQueue=true
   [junit4]   2> 2501578 INFO  (qtp1563172504-28448) [n:127.0.0.1:40803_solr    ] o.a.s.s.HttpSolrCall [admin] webapp=null path=/admin/collections params={requestid=7bcc4812-86d3-4102-bb99-3792ba274b2d&action=REQUESTSTATUS&wt=javabin&version=2} status=0 QTime=0
   [junit4]   2> 2501884 INFO  (qtp1563172504-28449) [n:127.0.0.1:40803_solr    ] o.a.s.h.a.CoreAdminOperation Checking request status for : 7bcc4812-86d3-4102-bb99-3792ba274b2d2705903877585990
   [junit4]   2> 2501884 INFO  (qtp1563172504-28449) [n:127.0.0.1:40803_solr    ] o.a.s.s.HttpSolrCall [admin] webapp=null path=/admin/cores params={qt=/admin/cores&requestid=7bcc4812-86d3-4102-bb99-3792ba274b2d2705903877585990&action=REQUESTSTATUS&wt=javabin&version=2} status=0 QTime=0
   [junit4]   2> 2501886 INFO  (OverseerThreadFactory-10473-thread-1-processing-n:127.0.0.1:42145_solr) [n:127.0.0.1:42145_solr    ] o.a.s.c.OverseerTaskQueue Response ZK path: /overseer/collection-queue-work/qnr-0000000000 doesn't exist.  Requestor may have disconnected from ZooKeeper
   [junit4]   2> 2502578 INFO  (qtp1563172504-28442) [n:127.0.0.1:40803_solr    ] o.a.s.h.a.CollectionsHandler Invoked Collection Action :requeststatus with params requestid=7bcc4812-86d3-4102-bb99-3792ba274b2d&action=REQUESTSTATUS&wt=javabin&version=2 and sendToOCPQueue=true
   [junit4]   2> 2502579 INFO  (qtp1563172504-28442) [n:127.0.0.1:40803_solr    ] o.a.s.s.HttpSolrCall [admin] webapp=null path=/admin/collections params={requestid=7bcc4812-86d3-4102-bb99-3792ba274b2d&action=REQUESTSTATUS&wt=javabin&version=2} status=0 QTime=1
   [junit4]   2> 2502580 INFO  (qtp1563172504-28449) [n:127.0.0.1:40803_solr    ] o.a.s.h.a.CollectionsHandler Invoked Collection Action :deletestatus with params requestid=7bcc4812-86d3-4102-bb99-3792ba274b2d&action=DELETESTATUS&wt=javabin&version=2 and sendToOCPQueue=true
   [junit4]   2> 2502580 INFO  (qtp1563172504-28449) [n:127.0.0.1:40803_solr    ] o.a.s.s.HttpSolrCall [admin] webapp=null path=/admin/collections params={requestid=7bcc4812-86d3-4102-bb99-3792ba274b2d&action=DELETESTATUS&wt=javabin&version=2} status=0 QTime=0
   [junit4]   2> 2502583 INFO  (qtp1563172504-28442) [n:127.0.0.1:40803_solr c:testAsyncOperations s:shard1 r:core_node2 x:testAsyncOperations_shard1_replica_n1] o.a.s.c.ZkShardTerms Successful update of terms at /collections/testAsyncOperations/terms/shard1 to Terms{values={core_node2=1}, version=1}
   [junit4]   2> 2502583 INFO  (qtp1563172504-28442) [n:127.0.0.1:40803_solr c:testAsyncOperations s:shard1 r:core_node2 x:testAsyncOperations_shard1_replica_n1] o.a.s.u.p.LogUpdateProcessorFactory [testAsyncOperations_shard1_replica_n1]  webapp=/solr path=/update params={wt=javabin&version=2}{add=[0 (1611776895643287552), 1 (1611776895644336128), 2 (1611776895644336129), 3 (1611776895644336130), 4 (1611776895644336131), 5 (1611776895644336132), 6 (1611776895644336133), 7 (1611776895644336134), 8 (1611776895644336135), 9 (1611776895644336136), ... (53 adds)]} 0 1
   [junit4]   2> 2502584 INFO  (qtp1563172504-28449) [n:127.0.0.1:40803_solr c:testAsyncOperations s:shard1 r:core_node2 x:testAsyncOperations_shard1_replica_n1] o.a.s.u.DirectUpdateHandler2 start commit{_version_=1611776895645384704,optimize=false,openSearcher=true,waitSearcher=true,expungeDeletes=false,softCommit=false,prepareCommit=false}
   [junit4]   2> 2502584 INFO  (qtp1563172504-28449) [n:127.0.0.1:40803_solr c:testAsyncOperations s:shard1 r:core_node2 x:testAsyncOperations_shard1_replica_n1] o.a.s.u.SolrIndexWriter Calling setCommitData with IW:org.apache.solr.update.SolrIndexWriter@1d423025 commitCommandVersion:1611776895645384704
   [junit4]   2> 2502586 INFO  (qtp1563172504-28449) [n:127.0.0.1:40803_solr c:testAsyncOperations s:shard1 r:core_node2 x:testAsyncOperations_shard1_replica_n1] o.a.s.s.SolrIndexSearcher Opening [Searcher@38ea61b9[testAsyncOperations_shard1_replica_n1] main]
   [junit4]   2> 2502586 INFO  (qtp1563172504-28449) [n:127.0.0.1:40803_solr c:testAsyncOperations s:shard1 r:core_node2 x:testAsyncOperations_shard1_replica_n1] o.a.s.u.DirectUpdateHandler2 end_commit_flush
   [junit4]   2> 2502587 INFO  (searcherExecutor-10485-thread-1-processing-n:127.0.0.1:40803_solr x:testAsyncOperations_shard1_replica_n1 c:testAsyncOperations s:shard1 r:core_node2) [n:127.0.0.1:40803_solr c:testAsyncOperations s:shard1 r:core_node2 x:testAsyncOperations_shard1_replica_n1] o.a.s.c.SolrCore [testAsyncOperations_shard1_replica_n1] Registered new searcher Searcher@38ea61b9[testAsyncOperations_shard1_replica_n1] main{ExitableDirectoryReader(UninvertingDirectoryReader(Uninverting(_0(7.6.0):C53)))}
   [junit4]   2> 2502587 INFO  (qtp1563172504-28449) [n:127.0.0.1:40803_solr c:testAsyncOperations s:shard1 r:core_node2 x:testAsyncOperations_shard1_replica_n1] o.a.s.u.p.LogUpdateProcessorFactory [testAsyncOperations_shard1_replica_n1]  webapp=/solr path=/update params={_stateVer_=testAsyncOperations:4&waitSearcher=true&commit=true&softCommit=false&wt=javabin&version=2}{commit=} 0 3
   [junit4]   2> 2502588 INFO  (qtp1563172504-28442) [n:127.0.0.1:40803_solr c:testAsyncOperations s:shard1 r:core_node2 x:testAsyncOperations_shard1_replica_n1] o.a.s.c.S.Request [testAsyncOperations_shard1_replica_n1]  webapp=/solr path=/select params={q=*:*&shards=shard1&_stateVer_=testAsyncOperations:4&wt=javabin&version=2} hits=53 status=0 QTime=0
   [junit4]   2> 2502588 INFO  (qtp1563172504-28449) [n:127.0.0.1:40803_solr    ] o.a.s.h.a.CollectionsHandler Invoked Collection Action :reload with params async=da30e85d-32f1-4ba6-85a6-ceb2d9b42bfb&name=testAsyncOperations&action=RELOAD&wt=javabin&version=2 and sendToOCPQueue=true
   [junit4]   2> 2502590 INFO  (qtp1563172504-28449) [n:127.0.0.1:40803_solr    ] o.a.s.s.HttpSolrCall [admin] webapp=null path=/admin/collections params={async=da30e85d-32f1-4ba6-85a6-ceb2d9b42bfb&name=testAsyncOperations&action=RELOAD&wt=javabin&version=2} status=0 QTime=1
   [junit4]   2> 2502590 INFO  (qtp1563172504-28442) [n:127.0.0.1:40803_solr    ] o.a.s.h.a.CollectionsHandler Invoked Collection Action :requeststatus with params requestid=da30e85d-32f1-4ba6-85a6-ceb2d9b42bfb&action=REQUESTSTATUS&wt=javabin&version=2 and sendToOCPQueue=true
   [junit4]   2> 2502591 INFO  (qtp1563172504-28442) [n:127.0.0.1:40803_solr    ] o.a.s.s.HttpSolrCall [admin] webapp=null path=/admin/collections params={requestid=da30e85d-32f1-4ba6-85a6-ceb2d9b42bfb&action=REQUESTSTATUS&wt=javabin&version=2} status=0 QTime=0
   [junit4]   2> 2502591 INFO  (OverseerThreadFactory-10473-thread-2-processing-n:127.0.0.1:42145_solr) [n:127.0.0.1:42145_solr    ] o.a.s.c.a.c.OverseerCollectionMessageHandler Executing Collection Cmd=action=RELOAD, asyncId=da30e85d-32f1-4ba6-85a6-ceb2d9b42bfb
   [junit4]   2> 2502592 INFO  (OverseerCollectionConfigSetProcessor-72234928123609092-127.0.0.1:42145_solr-n_0000000000) [n:127.0.0.1:42145_solr    ] o.a.s.c.OverseerTaskQueue Response ZK path: /overseer/collection-queue-work/qnr-0000000000 doesn't exist.  Requestor may have disconnected from ZooKeeper
   [junit4]   2> 2502592 INFO  (qtp1563172504-28448) [n:127.0.0.1:40803_solr    x:testAsyncOperations_shard1_replica_n1] o.a.s.s.HttpSolrCall [admin] webapp=null path=/admin/cores params={core=testAsyncOperations_shard1_replica_n1&async=da30e85d-32f1-4ba6-85a6-ceb2d9b42bfb2705906790636871&qt=/admin/cores&action=RELOAD&wt=javabin&version=2} status=0 QTime=0
   [junit4]   2> 2502592 INFO  (qtp1563172504-28442) [n:127.0.0.1:40803_solr    ] o.a.s.h.a.CoreAdminOperation Checking request status for : da30e85d-32f1-4ba6-85a6-ceb2d9b42bfb2705906790636871
   [junit4]   2> 2502592 INFO  (qtp1563172504-28442) [n:127.0.0.1:40803_solr    ] o.a.s.s.HttpSolrCall [admin] webapp=null path=/admin/cores params={qt=/admin/cores&requestid=da30e85d-32f1-4ba6-85a6-ceb2d9b42bfb2705906790636871&action=REQUESTSTATUS&wt=javabin&version=2} status=0 QTime=0
   [junit4]   2> 2502596 INFO  (parallelCoreAdminExecutor-10481-thread-2-processing-n:127.0.0.1:40803_solr x:testAsyncOperations_shard1_replica_n1 da30e85d-32f1-4ba6-85a6-ceb2d9b42bfb2705906790636871 RELOAD) [n:127.0.0.1:40803_solr    x:testAsyncOperations_shard1_replica_n1] o.a.s.c.SolrConfig Using Lucene MatchVersion: 7.6.0
   [junit4]   2> 2502601 INFO  (parallelCoreAdminExecutor-10481-thread-2-processing-n:127.0.0.1:40803_solr x:testAsyncOperations_shard1_replica_n1 da30e85d-32f1-4ba6-85a6-ceb2d9b42bfb2705906790636871 RELOAD) [n:127.0.0.1:40803_solr    x:testAsyncOperations_shard1_replica_n1] o.a.s.s.IndexSchema [testAsyncOperations_shard1_replica_n1] Schema name=minimal
   [junit4]   2> 2502602 INFO  (parallelCoreAdminExecutor-10481-thread-2-processing-n:127.0.0.1:40803_solr x:testAsyncOperations_shard1_replica_n1 da30e85d-32f1-4ba6-85a6-ceb2d9b42bfb2705906790636871 RELOAD) [n:127.0.0.1:40803_solr    x:testAsyncOperations_shard1_replica_n1] o.a.s.s.IndexSchema Loaded schema minimal/1.1 with uniqueid field id
   [junit4]   2> 2502602 INFO  (parallelCoreAdminExecutor-10481-thread-2-processing-n:127.0.0.1:40803_solr x:testAsyncOperations_shard1_replica_n1 da30e85d-32f1-4ba6-85a6-ceb2d9b42bfb2705906790636871 RELOAD) [n:127.0.0.1:40803_solr    x:testAsyncOperations_shard1_replica_n1] o.a.s.c.CoreContainer Reloading SolrCore 'testAsyncOperations_shard1_replica_n1' using configuration from collection testAsyncOperations
   [junit4]   2> 2502617 INFO  (parallelCoreAdminExecutor-10481-thread-2-processing-n:127.0.0.1:40803_solr x:testAsyncOperations_shard1_replica_n1 da30e85d-32f1-4ba6-85a6-ceb2d9b42bfb2705906790636871 RELOAD) [n:127.0.0.1:40803_solr c:testAsyncOperations s:shard1 r:core_node2 x:testAsyncOperations_shard1_replica_n1] o.a.s.m.r.SolrJmxReporter JMX monitoring for 'solr_40803.solr.core.testAsyncOperations.shard1.replica_n1' (registry 'solr.core.testAsyncOperations.shard1.replica_n1') enabled at server: com.sun.jmx.mbeanserver.JmxMBeanServer@525d2e77
   [junit4]   2> 2502617 INFO  (parallelCoreAdminExecutor-10481-thread-2-processing-n:127.0.0.1:40803_solr x:testAsyncOperations_shard1_replica_n1 da30e85d-32f1-4ba6-85a6-ceb2d9b42bfb2705906790636871 RELOAD) [n:127.0.0.1:40803_solr c:testAsyncOperations s:shard1 r:core_node2 x:testAsyncOperations_shard1_replica_n1] o.a.s.c.SolrCore [[testAsyncOperations_shard1_replica_n1] ] Opening new SolrCore at [/home/jenkins/workspace/Lucene-Solr-7.x-Linux/solr/build/solr-core/test/J2/temp/solr.cloud.api.collections.CollectionsAPIAsyncDistributedZkTest_D2C63D7AAC33D434-001/tempDir-001/node2/testAsyncOperations_shard1_replica_n1], dataDir=[/home/jenkins/workspace/Lucene-Solr-7.x-Linux/solr/build/solr-core/test/J2/temp/solr.cloud.api.collections.CollectionsAPIAsyncDistributedZkTest_D2C63D7AAC33D434-001/tempDir-001/node2/./testAsyncOperations_shard1_replica_n1/data/]
   [junit4]   2> 2502639 INFO  (parallelCoreAdminExecutor-10481-thread-2-processing-n:127.0.0.1:40803_solr x:testAsyncOperations_shard1_replica_n1 da30e85d-32f1-4ba6-85a6-ceb2d9b42bfb2705906790636871 RELOAD) [n:127.0.0.1:40803_solr c:testAsyncOperations s:shard1 r:core_node2 x:testAsyncOperations_shard1_replica_n1] o.a.s.u.CommitTracker Hard AutoCommit: disabled
   [junit4]   2> 2502639 INFO  (parallelCoreAdminExecutor-10481-thread-2-processing-n:127.0.0.1:40803_solr x:testAsyncOperations_shard1_replica_n1 da30e85d-32f1-4ba6-85a6-ceb2d9b42bfb2705906790636871 RELOAD) [n:127.0.0.1:40803_solr c:testAsyncOperations s:shard1 r:core_node2 x:testAsyncOperations_shard1_replica_n1] o.a.s.u.CommitTracker Soft AutoCommit: disabled
   [junit4]   2> 2502641 INFO  (parallelCoreAdminExecutor-10481-thread-2-processing-n:127.0.0.1:40803_solr x:testAsyncOperations_shard1_replica_n1 da30e85d-32f1-4ba6-85a6-ceb2d9b42bfb2705906790636871 RELOAD) [n:127.0.0.1:40803_solr c:testAsyncOperations s:shard1 r:core_node2 x:testAsyncOperations_shard1_replica_n1] o.a.s.s.SolrIndexSearcher Opening [Searcher@cfee4b5[testAsyncOperations_shard1_replica_n1] main]
   [junit4]   2> 2502642 INFO  (parallelCoreAdminExecutor-10481-thread-2-processing-n:127.0.0.1:40803_solr x:testAsyncOperations_shard1_replica_n1 da30e85d-32f1-4ba6-85a6-ceb2d9b42bfb2705906790636871 RELOAD) [n:127.0.0.1:40803_solr c:testAsyncOperations s:shard1 r:core_node2 x:testAsyncOperations_shard1_replica_n1] o.a.s.r.ManagedResourceStorage Configured ZooKeeperStorageIO with znodeBase: /configs/conf1
   [junit4]   2> 2502642 INFO  (parallelCoreAdminExecutor-10481-thread-2-processing-n:127.0.0.1:40803_solr x:testAsyncOperations_shard1_replica_n1 da30e85d-32f1-4ba6-85a6-ceb2d9b42bfb2705906790636871 RELOAD) [n:127.0.0.1:40803_solr c:testAsyncOperations s:shard1 r:core_node2 x:testAsyncOperations_shard1_replica_n1] o.a.s.r.ManagedResourceStorage Loaded null at path _rest_managed.json using ZooKeeperStorageIO:path=/configs/conf1
   [junit4]   2> 2502642 INFO  (parallelCoreAdminExecutor-10481-thread-2-processing-n:127.0.0.1:40803_solr x:testAsyncOperations_shard1_replica_n1 da30e85d-32f1-4ba6-85a6-ceb2d9b42bfb2705906790636871 RELOAD) [n:127.0.0.1:40803_solr c:testAsyncOperations s:shard1 r:core_node2 x:testAsyncOperations_shard1_replica_n1] o.a.s.h.ReplicationHandler Commits will be reserved for 10000ms.
   [junit4]   2> 2502644 INFO  (searcherExecutor-10490-thread-1-processing-x:testAsyncOperations_shard1_replica_n1 da30e85d-32f1-4ba6-85a6-ceb2d9b42bfb2705906790636871 r:core_node2 RELOAD n:127.0.0.1:40803_solr c:testAsyncOperations s:shard1) [n:127.0.0.1:40803_solr c:testAsyncOperations s:shard1 r:core_node2 x:testAsyncOperations_shard1_replica_n1] o.a.s.c.SolrCore [testAsyncOperations_shard1_replica_n1] Registered new searcher Searcher@cfee4b5[testAsyncOperations_shard1_replica_n1] main{ExitableDirectoryReader(UninvertingDirectoryReader(Uninverting(_0(7.6.0):C53)))}
   [junit4]   2> 2502644 INFO  (parallelCoreAdminExecutor-10481-thread-2-processing-n:127.0.0.1:40803_solr x:testAsyncOperations_shard1_replica_n1 da30e85d-32f1-4ba6-85a6-ceb2d9b42bfb2705906790636871 RELOAD) [n:127.0.0.1:40803_solr c:testAsyncOperations s:shard1 r:core_node2 x:testAsyncOperations_shard1_replica_n1] o.a.s.u.DefaultSolrCoreState New IndexWriter is ready to be used.
   [junit4]   2> 2502644 INFO  (parallelCoreAdminExecutor-10481-thread-2-processing-n:127.0.0.1:40803_solr x:testAsyncOperations_shard1_replica_n1 da30e85d-32f1-4ba6-85a6-ceb2d9b42bfb2705906790636871 RELOAD) [n:127.0.0.1:40803_solr c:testAsyncOperations s:shard1 r:core_node2 x:testAsyncOperations_shard1_replica_n1] o.a.s.s.SolrIndexSearcher Opening [Searcher@1609f4c9[testAsyncOperations_shard1_replica_n1] main]
   [junit4]   2> 2502645 INFO  (parallelCoreAdminExecutor-10481-thread-2-processing-n:127.0.0.1:40803_solr x:testAsyncOperations_shard1_replica_n1 da30e85d-32f1-4ba6-85a6-ceb2d9b42bfb2705906790636871 RELOAD) [n:127.0.0.1:40803_solr c:testAsyncOperations s:shard1 r:core_node2 x:testAsyncOperations_shard1_replica_n1] o.a.s.c.SolrCore [testAsyncOperations_shard1_replica_n1]  CLOSING SolrCore org.apache.solr.core.SolrCore@6b69a1b3
   [junit4]   2> 2502645 INFO  (parallelCoreAdminExecutor-10481-thread-2-processing-n:127.0.0.1:40803_solr x:testAsyncOperations_shard1_replica_n1 da30e85d-32f1-4ba6-85a6-ceb2d9b42bfb2705906790636871 RELOAD) [n:127.0.0.1:40803_solr c:testAsyncOperations s:shard1 r:core_node2 x:testAsyncOperations_shard1_replica_n1] o.a.s.m.SolrMetricManager Closing metric reporters for registry=solr.core.testAsyncOperations.shard1.replica_n1, tag=6b69a1b3
   [junit4]   2> 2502645 INFO  (parallelCoreAdminExecutor-10481-thread-2-processing-n:127.0.0.1:40803_solr x:testAsyncOperations_shard1_replica_n1 da30e85d-32f1-4ba6-85a6-ceb2d9b42bfb2705906790636871 RELOAD) [n:127.0.0.1:40803_solr c:testAsyncOperations s:shard1 r:core_node2 x:testAsyncOperations_shard1_replica_n1] o.a.s.m.r.SolrJmxReporter Closing reporter [org.apache.solr.metrics.reporters.SolrJmxReporter@2d0416d6: rootName = solr_40803, domain = solr.core.testAsyncOperations.shard1.replica_n1, service url = null, agent id = null] for registry solr.core.testAsyncOperations.shard1.replica_n1 / com.codahale.metrics.MetricRegistry@47ccc17
   [junit4]   2> 2502645 INFO  (searcherExecutor-10490-thread-1-processing-x:testAsyncOperations_shard1_replica_n1 da30e85d-32f1-4ba6-85a6-ceb2d9b42bfb2705906790636871 r:core_node2 RELOAD n:127.0.0.1:40803_solr c:testAsyncOperations s:shard1) [n:127.0.0.1:40803_solr c:testAsyncOperations s:shard1 r:core_node2 x:testAsyncOperations_shard1_replica_n1] o.a.s.c.SolrCore [testAsyncOperations_shard1_replica_n1] Registered new searcher Searcher@1609f4c9[testAsyncOperations_shard1_replica_n1] main{ExitableDirectoryReader(UninvertingDirectoryReader(Uninverting(_0(7.6.0):C53)))}
   [junit4]   2> 2502649 INFO  (parallelCoreAdminExecutor-10481-thread-2-processing-n:127.0.0.1:40803_solr x:testAsyncOperations_shard1_replica_n1 da30e85d-32f1-4ba6-85a6-ceb2d9b42bfb2705906790636871 RELOAD) [n:127.0.0.1:40803_solr c:testAsyncOperations s:shard1 r:core_node2 x:testAsyncOperations_shard1_replica_n1] o.a.s.m.SolrMetricManager Closing metric reporters for registry=solr.collection.testAsyncOperations.shard1.leader, tag=6b69a1b3
   [junit4]   2> 2503591 INFO  (qtp1563172504-28449) [n:127.0.0.1:40803_solr    ] o.a.s.h.a.CollectionsHandler Invoked Collection Action :requeststatus with params requestid=da30e85d-32f1-4ba6-85a6-ceb2d9b42bfb&action=REQUESTSTATUS&wt=javabin&version=2 and sendToOCPQueue=true
   [junit4]   2> 2503592 INFO  (qtp1563172504-28449) [n:127.0.0.1:40803_solr    ] o.a.s.s.HttpSolrCall [admin] webapp=null path=/admin/collections params={requestid=da30e85d-32f1-4ba6-85a6-ceb2d9b42bfb&action=REQUESTSTATUS&wt=javabin&version=2} status=0 QTime=1
   [junit4]   2> 2503593 INFO  (qtp1563172504-28448) [n:127.0.0.1:40803_solr    ] o.a.s.h.a.CoreAdminOperation Checking request status for : da30e85d-32f1-4ba6-85a6-ceb2d9b42bfb2705906790636871
   [junit4]   2> 2503593 INFO  (qtp1563172504-28448) [n:127.0.0.1:40803_solr    ] o.a.s.s.HttpSolrCall [admin] webapp=null path=/admin/cores params={qt=/admin/cores&requestid=da30e85d-32f1-4ba6-85a6-ceb2d9b42bfb2705906790636871&action=REQUESTSTATUS&wt=javabin&version=2} status=0 QTime=0
   [junit4]   2> 2503596 INFO  (OverseerThreadFactory-10473-thread-2-processing-n:127.0.0.1:42145_solr) [n:127.0.0.1:42145_solr    ] o.a.s.c.OverseerTaskQueue Response ZK path: /overseer/collection-queue-work/qnr-0000000001 doesn't exist.  Requestor may have disconnected from ZooKeeper
   [junit4]   2> 2504593 INFO  (OverseerCollectionConfigSetProcessor-72234928123609092-127.0.0.1:42145_solr-n_0000000000) [n:127.0.0.1:42145_solr    ] o.a.s.c.OverseerTaskQueue Response ZK path: /overseer/collection-queue-work/qnr-0000000001 doesn't exist.  Requestor may have disconnected from ZooKeeper
   [junit4]   2> 2504593 INFO  (qtp1563172504-28442) [n:127.0.0.1:40803_solr    ] o.a.s.h.a.CollectionsHandler Invoked Collection Action :requeststatus with params requestid=da30e85d-32f1-4ba6-85a6-ceb2d9b42bfb&action=REQUESTSTATUS&wt=javabin&version=2 and sendToOCPQueue=true
   [junit4]   2> 2504594 INFO  (qtp1563172504-28442) [n:127.0.0.1:40803_solr    ] o.a.s.s.HttpSolrCall [admin] webapp=null path=/admin/collections params={requestid=da30e85d-32f1-4ba6-85a6-ceb2d9b42bfb&action=REQUESTSTATUS&wt=javabin&version=2} status=0 QTime=0
   [junit4]   2> 2504594 INFO  (qtp1563172504-28448) [n:127.0.0.1:40803_solr    ] o.a.s.h.a.CollectionsHandler Invoked Collection Action :deletestatus with params requestid=da30e85d-32f1-4ba6-85a6-ceb2d9b42bfb&action=DELETESTATUS&wt=javabin&version=2 and sendToOCPQueue=true
   [junit4]   2> 2504594 INFO  (qtp1563172504-28448) [n:127.0.0.1:40803_solr    ] o.a.s.s.HttpSolrCall [admin] webapp=null path=/admin/collections params={requestid=da30e85d-32f1-4ba6-85a6-ceb2d9b42bfb&action=DELETESTATUS&wt=javabin&version=2} status=0 QTime=0
   [junit4]   2> 2504595 INFO  (qtp1563172504-28442) [n:127.0.0.1:40803_solr    ] o.a.s.h.a.CollectionsHandler Invoked Collection Action :createshard with params async=45945e7d-f6f6-47c1-bf39-30454046eff7&action=CREATESHARD&collection=testAsyncOperations&shard=shard2&wt=javabin&version=2 and sendToOCPQueue=true
   [junit4]   2> 2504596 INFO  (qtp1563172504-28442) [n:127.0.0.1:40803_solr c:testAsyncOperations   ] o.a.s.s.HttpSolrCall [admin] webapp=null path=/admin/collections params={async=45945e7d-f6f6-47c1-bf39-30454046eff7&action=CREATESHARD&collection=testAsyncOperations&shard=shard2&wt=javabin&version=2} status=0 QTime=1
   [junit4]   2> 2504596 INFO  (qtp1563172504-28448) [n:127.0.0.1:40803_solr    ] o.a.s.h.a.CollectionsHandler Invoked Collection Action :requeststatus with params requestid=45945e7d-f6f6-47c1-bf39-30454046eff7&action=REQUESTSTATUS&wt=javabin&version=2 and sendToOCPQueue=true
   [junit4]   2> 2504597 INFO  (qtp1563172504-28448) [n:127.0.0.1:40803_solr    ] o.a.s.s.HttpSolrCall [admin] webapp=null path=/admin/collections params={requestid=45945e7d-f6f6-47c1-bf39-30454046eff7&action=REQUESTSTATUS&wt=javabin&version=2} status=0 QTime=0
   [junit4]   2> 2504597 INFO  (OverseerThreadFactory-10473-thread-3-processing-n:127.0.0.1:42145_solr) [n:127.0.0.1:42145_solr c:testAsyncOperations s:shard2  ] o.a.s.c.a.c.CreateShardCmd Create shard invoked: {
   [junit4]   2>   "collection":"testAsyncOperations",
   [junit4]   2>   "shard":"shard2",
   [junit4]   2>   "async":"45945e7d-f6f6-47c1-bf39-30454046eff7",
   [junit4]   2>   "operation":"createshard"}
   [junit4]   2> 2504600 INFO  (zkCallback-7279-thread-1) [    ] o.a.s.c.c.ZkStateReader A cluster state change: [WatchedEvent state:SyncConnected type:NodeDataChanged path:/collections/testAsyncOperations/state.json] for collection [testAsyncOperations] has occurred - updating... (live nodes size: [2])
   [junit4]   2> 2505597 INFO  (qtp1563172504-28442) [n:127.0.0.1:40803_solr    ] o.a.s.h.a.CollectionsHandler Invoked Collection Action :requeststatus with params requestid=45945e7d-f6f6-47c1-bf39-30454046eff7&action=REQUESTSTATUS&wt=javabin&version=2 and sendToOCPQueue=true
   [junit4]   2> 2505599 INFO  (qtp1563172504-28442) [n:127.0.0.1:40803_solr    ] o.a.s.s.HttpSolrCall [admin] webapp=null path=/admin/collections params={requestid=45945e7d-f6f6-47c1-bf39-30454046eff7&action=REQUESTSTATUS&wt=javabin&version=2} status=0 QTime=1
   [junit4]   2> 2505601 INFO  (OverseerThreadFactory-10473-thread-3-processing-n:127.0.0.1:42145_solr) [n:127.0.0.1:42145_solr c:testAsyncOperations s:shard2  ] o.a.s.c.a.c.CreateShardCmd Creating replica testAsyncOperations_shard2_replica_n3 as part of slice shard2 of collection testAsyncOperations on 127.0.0.1:42145_solr
   [junit4]   2> 2505603 INFO  (OverseerThreadFactory-10473-thread-3-processing-n:127.0.0.1:42145_solr) [n:127.0.0.1:42145_solr c:testAsyncOperations s:shard2  ] o.a.s.c.a.c.AddReplicaCmd Node Identified 127.0.0.1:42145_solr for creating new replica of shard shard2
   [junit4]   2> 2505604 INFO  (OverseerStateUpdate-72234928123609092-127.0.0.1:42145_solr-n_0000000000) [n:127.0.0.1:42145_solr    ] o.a.s.c.o.SliceMutator createReplica() {
   [junit4]   2>   "operation":"addreplica",
   [junit4]   2>   "collection":"testAsyncOperations",
   [junit4]   2>   "shard":"shard2",
   [junit4]   2>   "core":"testAsyncOperations_shard2_replica_n3",
   [junit4]   2>   "state":"down",
   [junit4]   2>   "base_url":"http://127.0.0.1:42145/solr",
   [junit4]   2>   "node_name":"127.0.0.1:42145_solr",
   [junit4]   2>   "type":"NRT"} 
   [junit4]   2> 2505706 INFO  (zkCallback-7279-thread-1) [    ] o.a.s.c.c.ZkStateReader A cluster state change: [WatchedEvent state:SyncConnected type:NodeDataChanged path:/collections/testAsyncOperations/state.json] for collection [testAsyncOperations] has occurred - updating... (live nodes size: [2])
   [junit4]   2> 2505807 INFO  (qtp1971283520-28456) [n:127.0.0.1:42145_solr    x:testAsyncOperations_shard2_replica_n3] o.a.s.s.HttpSolrCall [admin] webapp=null path=/admin/cores params={async=45945e7d-f6f6-47c1-bf39-30454046eff72705910004671372&qt=/admin/cores&coreNodeName=core_node4&collection.configName=conf1&name=testAsyncOperations_shard2_replica_n3&action=CREATE&collection=testAsyncOperations&shard=shard2&wt=javabin&version=2&replicaType=NRT} status=0 QTime=0
   [junit4]   2> 2505807 INFO  (parallelCoreAdminExecutor-10474-thread-1-processing-n:127.0.0.1:42145_solr x:testAsyncOperations_shard2_replica_n3 45945e7d-f6f6-47c1-bf39-30454046eff72705910004671372 CREATE) [n:127.0.0.1:42145_solr    x:testAsyncOperations_shard2_replica_n3] o.a.s.h.a.CoreAdminOperation core create command async=45945e7d-f6f6-47c1-bf39-30454046eff72705910004671372&qt=/admin/cores&coreNodeName=core_node4&collection.configName=conf1&name=testAsyncOperations_shard2_replica_n3&action=CREATE&collection=testAsyncOperations&shard=shard2&wt=javabin&version=2&replicaType=NRT
   [junit4]   2> 2505807 INFO  (parallelCoreAdminExecutor-10474-thread-1-processing-n:127.0.0.1:42145_solr x:testAsyncOperations_shard2_replica_n3 45945e7d-f6f6-47c1-bf39-30454046eff72705910004671372 CREATE) [n:127.0.0.1:42145_solr    x:testAsyncOperations_shard2_replica_n3] o.a.s.c.TransientSolrCoreCacheDefault Allocating transient cache for 2147483647 transient cores
   [junit4]   2> 2505807 INFO  (qtp1971283520-28443) [n:127.0.0.1:42145_solr    ] o.a.s.h.a.CoreAdminOperation Checking request status for : 45945e7d-f6f6-47c1-bf39-30454046eff72705910004671372
   [junit4]   2> 2505808 INFO  (qtp1971283520-28443) [n:127.0.0.1:42145_solr    ] o.a.s.s.HttpSolrCall [admin] webapp=null path=/admin/cores params={qt=/admin/cores&requestid=45945e7d-f6f6-47c1-bf39-30454046eff72705910004671372&action=REQUESTSTATUS&wt=javabin&version=2} status=0 QTime=0
   [junit4]   2> 2505814 INFO  (parallelCoreAdminExecutor-10474-thread-1-processing-n:127.0.0.1:42145_solr x:testAsyncOperations_shard2_replica_n3 45945e7d-f6f6-47c1-bf39-30454046eff72705910004671372 CREATE) [n:127.0.0.1:42145_solr c:testAsyncOperations s:shard2 r:core_node4 x:testAsyncOperations_shard2_replica_n3] o.a.s.c.SolrConfig Using Lucene MatchVersion: 7.6.0
   [junit4]   2> 2505833 INFO  (parallelCoreAdminExecutor-10474-thread-1-processing-n:127.0.0.1:42145_solr x:testAsyncOperations_shard2_replica_n3 45945e7d-f6f6-47c1-bf39-30454046eff72705910004671372 CREATE) [n:127.0.0.1:42145_solr c:testAsyncOperations s:shard2 r:core_node4 x:testAsyncOperations_shard2_replica_n3] o.a.s.s.IndexSchema [testAsyncOperations_shard2_replica_n3] Schema name=minimal
   [junit4]   2> 2505835 INFO  (parallelCoreAdminExecutor-10474-thread-1-processing-n:127.0.0.1:42145_solr x:testAsyncOperations_shard2_replica_n3 45945e7d-f6f6-47c1-bf39-30454046eff72705910004671372 CREATE) [n:127.0.0.1:42145_solr c:testAsyncOperations s:shard2 r:core_node4 x:testAsyncOperations_shard2_replica_n3] o.a.s.s.IndexSchema Loaded schema minimal/1.1 with uniqueid field id
   [junit4]   2> 2505835 INFO  (parallelCoreAdminExecutor-10474-thread-1-processing-n:127.0.0.1:42145_solr x:testAsyncOperations_shard2_replica_n3 45945e7d-f6f6-47c1-bf39-30454046eff72705910004671372 CREATE) [n:127.0.0.1:42145_solr c:testAsyncOperations s:shard2 r:core_node4 x:testAsyncOperations_shard2_replica_n3] o.a.s.c.CoreContainer Creating SolrCore 'testAsyncOperations_shard2_replica_n3' using configuration from collection testAsyncOperations, trusted=true
   [junit4]   2> 2505835 INFO  (parallelCoreAdminExecutor-10474-thread-1-processing-n:127.0.0.1:42145_solr x:testAsyncOperations_shard2_replica_n3 45945e7d-f6f6-47c1-bf39-30454046eff72705910004671372 CREATE) [n:127.0.0.1:42145_solr c:testAsyncOperations s:shard2 r:core_node4 x:testAsyncOperations_shard2_replica_n3] o.a.s.m.r.SolrJmxReporter JMX monitoring for 'solr_42145.solr.core.testAsyncOperations.shard2.replica_n3' (registry 'solr.core.testAsyncOperations.shard2.replica_n3') enabled at server: com.sun.jmx.mbeanserver.JmxMBeanServer@525d2e77
   [junit4]   2> 2505835 INFO  (parallelCoreAdminExecutor-10474-thread-1-processing-n:127.0.0.1:42145_solr x:testAsyncOperations_shard2_replica_n3 45945e7d-f6f6-47c1-bf39-30454046eff72705910004671372 CREATE) [n:127.0.0.1:42145_solr c:testAsyncOperations s:shard2 r:core_node4 x:testAsyncOperations_shard2_replica_n3] o.a.s.c.SolrCore [[testAsyncOperations_shard2_replica_n3] ] Opening new SolrCore at [/home/jenkins/workspace/Lucene-Solr-7.x-Linux/solr/build/solr-core/test/J2/temp/solr.cloud.api.collections.CollectionsAPIAsyncDistributedZkTest_D2C63D7AAC33D434-001/tempDir-001/node1/testAsyncOperations_shard2_replica_n3], dataDir=[/home/jenkins/workspace/Lucene-Solr-7.x-Linux/solr/build/solr-core/test/J2/temp/solr.cloud.api.collections.CollectionsAPIAsyncDistributedZkTest_D2C63D7AAC33D434-001/tempDir-001/node1/./testAsyncOperations_shard2_replica_n3/data/]
   [junit4]   2> 2505859 INFO  (parallelCoreAdminExecutor-10474-thread-1-processing-n:127.0.0.1:42145_solr x:testAsyncOperations_shard2_replica_n3 45945e7d-f6f6-47c1-bf39-30454046eff72705910004671372 CREATE) [n:127.0.0.1:42145_solr c:testAsyncOperations s:shard2 r:core_node4 x:testAsyncOperations_shard2_replica_n3] o.a.s.u.UpdateHandler Using UpdateLog implementation: org.apache.solr.update.UpdateLog
   [junit4]   2> 2505859 INFO  (parallelCoreAdminExecutor-10474-thread-1-processing-n:127.0.0.1:42145_solr x:testAsyncOperations_shard2_replica_n3 45945e7d-f6f6-47c1-bf39-30454046eff72705910004671372 CREATE) [n:127.0.0.1:42145_solr c:testAsyncOperations s:shard2 r:core_node4 x:testAsyncOperations_shard2_replica_n3] o.a.s.u.UpdateLog Initializing UpdateLog: dataDir=null defaultSyncLevel=FLUSH numRecordsToKeep=100 maxNumLogsToKeep=10 numVersionBuckets=65536
   [junit4]   2> 2505860 INFO  (parallelCoreAdminExecutor-10474-thread-1-processing-n:127.0.0.1:42145_solr x:testAsyncOperations_shard2_replica_n3 45945e7d-f6f6-47c1-bf39-30454046eff72705910004671372 CREATE) [n:127.0.0.1:42145_solr c:testAsyncOperations s:shard2 r:core_node4 x:testAsyncOperations_shard2_replica_n3] o.a.s.u.CommitTracker Hard AutoCommit: disabled
   [junit4]   2> 2505860 INFO  (parallelCoreAdminExecutor-10474-thread-1-processing-n:127.0.0.1:42145_solr x:testAsyncOperations_shard2_replica_n3 45945e7d-f6f6-47c1-bf39-30454046eff72705910004671372 CREATE) [n:127.0.0.1:42145_solr c:testAsyncOperations s:shard2 r:core_node4 x:testAsyncOperations_shard2_replica_n3] o.a.s.u.CommitTracker Soft AutoCommit: disabled
   [junit4]   2> 2505861 INFO  (parallelCoreAdminExecutor-10474-thread-1-processing-n:127.0.0.1:42145_solr x:testAsyncOperations_shard2_replica_n3 45945e7d-f6f6-47c1-bf39-30454046eff72705910004671372 CREATE) [n:127.0.0.1:42145_solr c:testAsyncOperations s:shard2 r:core_node4 x:testAsyncOperations_shard2_replica_n3] o.a.s.s.SolrIndexSearcher Opening [Searcher@676c381d[testAsyncOperations_shard2_replica_n3] main]
   [junit4]   2> 2505862 INFO  (parallelCoreAdminExecutor-10474-thread-1-processing-n:127.0.0.1:42145_solr x:testAsyncOperations_shard2_replica_n3 45945e7d-f6f6-47c1-bf39-30454046eff72705910004671372 CREATE) [n:127.0.0.1:42145_solr c:testAsyncOperations s:shard2 r:core_node4 x:testAsyncOperations_shard2_replica_n3] o.a.s.r.ManagedResourceStorage Configured ZooKeeperStorageIO with znodeBase: /configs/conf1
   [junit4]   2> 2505862 INFO  (parallelCoreAdminExecutor-10474-thread-1-processing-n:127.0.0.1:42145_solr x:testAsyncOperations_shard2_replica_n3 45945e7d-f6f6-47c1-bf39-30454046eff72705910004671372 CREATE) [n:127.0.0.1:42145_solr c:testAsyncOperations s:shard2 r:core_node4 x:testAsyncOperations_shard2_replica_n3] o.a.s.r.ManagedResourceStorage Loaded null at path _rest_managed.json using ZooKeeperStorageIO:path=/configs/conf1
   [junit4]   2> 2505862 INFO  (parallelCoreAdminExecutor-10474-thread-1-processing-n:127.0.0.1:42145_solr x:testAsyncOperations_shard2_replica_n3 45945e7d-f6f6-47c1-bf39-30454046eff72705910004671372 CREATE) [n:127.0.0.1:42145_solr c:testAsyncOperations s:shard2 r:core_node4 x:testAsyncOperations_shard2_replica_n3] o.a.s.h.ReplicationHandler Commits will be reserved for 10000ms.
   [junit4]   2> 2505862 INFO  (parallelCoreAdminExecutor-10474-thread-1-processing-n:127.0.0.1:42145_solr x:testAsyncOperations_shard2_replica_n3 45945e7d-f6f6-47c1-bf39-30454046eff72705910004671372 CREATE) [n:127.0.0.1:42145_solr c:testAsyncOperations s:shard2 r:core_node4 x:testAsyncOperations_shard2_replica_n3] o.a.s.u.UpdateLog Could not find max version in index or recent updates, using new clock 1611776899082616832
   [junit4]   2> 2505863 INFO  (searcherExecutor-10494-thread-1-processing-x:testAsyncOperations_shard2_replica_n3 45945e7d-f6f6-47c1-bf39-30454046eff72705910004671372 r:core_node4 CREATE n:127.0.0.1:42145_solr c:testAsyncOperations s:shard2) [n:127.0.0.1:42145_solr c:testAsyncOperations s:shard2 r:core_node4 x:testAsyncOperations_shard2_replica_n3] o.a.s.c.SolrCore [testAsyncOperations_shard2_replica_n3] Registered new searcher Searcher@676c381d[testAsyncOperations_shard2_replica_n3] main{ExitableDirectoryReader(UninvertingDirectoryReader())}
   [junit4]   2> 2505865 INFO  (parallelCoreAdminExecutor-10474-thread-1-processing-n:127.0.0.1:42145_solr x:testAsyncOperations_shard2_replica_n3 45945e7d-f6f6-47c1-bf39-30454046eff72705910004671372 CREATE) [n:127.0.0.1:42145_solr c:testAsyncOperations s:shard2 r:core_node4 x:testAsyncOperations_shard2_replica_n3] o.a.s.c.ZkShardTerms Successful update of terms at /collections/testAsyncOperations/terms/shard2 to Terms{values={core_node4=0}, version=0}
   [junit4]   2> 2505867 INFO  (parallelCoreAdminExecutor-10474-thread-1-processing-n:127.0.0.1:42145_solr x:testAsyncOperations_shard2_replica_n3 45945e7d-f6f6-47c1-bf39-30454046eff72705910004671372 CREATE) [n:127.0.0.1:42145_solr c:testAsyncOperations s:shard2 r:core_node4 x:testAsyncOperations_shard2_replica_n3] o.a.s.c.ShardLeaderElectionContext Enough replicas found to continue.
   [junit4]   2> 2505867 INFO  (parallelCoreAdminExecutor-10474-thread-1-processing-n:127.0.0.1:42145_solr x:testAsyncOperations_shard2_replica_n3 45945e7d-f6f6-47c1-bf39-30454046eff72705910004671372 CREATE) [n:127.0.0.1:42145_solr c:testAsyncOperations s:shard2 r:core_node4 x:testAsyncOperations_shard2_replica_n3] o.a.s.c.ShardLeaderElectionContext I may be the new leader - try and sync
   [junit4]   2> 2505867 INFO  (parallelCoreAdminExecutor-10474-thread-1-processing-n:127.0.0.1:42145_solr x:testAsyncOperations_shard2_replica_n3 45945e7d-f6f6-47c1-bf39-30454046eff72705910004671372 CREATE) [n:127.0.0.1:42145_solr c:testAsyncOperations s:shard2 r:core_node4 x:testAsyncOperations_shard2_replica_n3] o.a.s.c.SyncStrategy Sync replicas to http://127.0.0.1:42145/solr/testAsyncOperations_shard2_replica_n3/
   [junit4]   2> 2505867 INFO  (parallelCoreAdminExecutor-10474-thread-1-processing-n:127.0.0.1:42145_solr x:testAsyncOperations_shard2_replica_n3 45945e7d-f6f6-47c1-bf39-30454046eff72705910004671372 CREATE) [n:127.0.0.1:42145_solr c:testAsyncOperations s:shard2 r:core_node4 x:testAsyncOperations_shard2_replica_n3] o.a.s.c.SyncStrategy Sync Success - now sync replicas to me
   [junit4]   2> 2505867 INFO  (parallelCoreAdminExecutor-10474-thread-1-processing-n:127.0.0.1:42145_solr x:testAsyncOperations_shard2_replica_n3 45945e7d-f6f6-47c1-bf39-30454046eff72705910004671372 CREATE) [n:127.0.0.1:42145_solr c:testAsyncOperations s:shard2 r:core_node4 x:testAsyncOperations_shard2_replica_n3] o.a.s.c.SyncStrategy http://127.0.0.1:42145/solr/testAsyncOperations_shard2_replica_n3/ has no replicas
   [junit4]   2> 2505867 INFO  (parallelCoreAdminExecutor-10474-thread-1-processing-n:127.0.0.1:42145_solr x:testAsyncOperations_shard2_replica_n3 45945e7d-f6f6-47c1-bf39-30454046eff72705910004671372 CREATE) [n:127.0.0.1:42145_solr c:testAsyncOperations s:shard2 r:core_node4 x:testAsyncOperations_shard2_replica_n3] o.a.s.c.ShardLeaderElectionContext Found all replicas participating in election, clear LIR
   [junit4]   2> 2505868 INFO  (parallelCoreAdminExecutor-10474-thread-1-processing-n:127.0.0.1:42145_solr x:testAsyncOperations_shard2_replica_n3 45945e7d-f6f6-47c1-bf39-30454046eff72705910004671372 CREATE) [n:127.0.0.1:42145_solr c:testAsyncOperations s:shard2 r:core_node4 x:testAsyncOperations_shard2_replica_n3] o.a.s.c.ShardLeaderElectionContext I am the new leader: http://127.0.0.1:42145/solr/testAsyncOperations_shard2_replica_n3/ shard2
   [junit4]   2> 2505969 INFO  (zkCallback-7279-thread-1) [    ] o.a.s.c.c.ZkStateReader A cluster state change: [WatchedEvent state:SyncConnected type:NodeDataChanged path:/collections/testAsyncOperations/state.json] for collection [testAsyncOperations] has occurred - updating... (live nodes size: [2])
   [junit4]   2> 2505970 INFO  (parallelCoreAdminExecutor-10474-thread-1-processing-n:127.0.0.1:42145_solr x:testAsyncOperations_shard2_replica_n3 45945e7d-f6f6-47c1-bf39-30454046eff72705910004671372 CREATE) [n:127.0.0.1:42145_solr c:testAsyncOperations s:shard2 r:core_node4 x:testAsyncOperations_shard2_replica_n3] o.a.s.c.ZkController I am the leader, no recovery necessary
   [junit4]   2> 2506071 INFO  (zkCallback-7279-thread-1) [    ] o.a.s.c.c.ZkStateReader A cluster state change: [WatchedEvent state:SyncConnected type:NodeDataChanged path:/collections/testAsyncOperations/state.json] for collection [testAsyncOperations] has occurred - updating... (live nodes size: [2])
   [junit4]   2> 2506071 INFO  (zkCallback-7265-thread-2) [    ] o.a.s.c.c.ZkStateReader A cluster state change: [WatchedEvent state:SyncConnected type:NodeDataChanged path:/collections/testAsyncOperations/state.json] for collection [testAsyncOperations] has occurred - updating... (live nodes size: [2])
   [junit4]   2> 2506600 INFO  (qtp1563172504-28448) [n:127.0.0.1:40803_solr    ] o.a.s.h.a.CollectionsHandler Invoked Collection Action :requeststatus with params requestid=45945e7d-f6f6-47c1-bf39-30454046eff7&action=REQUESTSTATUS&wt=javabin&version=2 and sendToOCPQueue=true
   [junit4]   2> 2506601 INFO  (qtp1563172504-28448) [n:127.0.0.1:40803_solr    ] o.a.s.s.HttpSolrCall [admin] webapp=null path=/admin/collections params={requestid=45945e7d-f6f6-47c1-bf39-30454046eff7&action=REQUESTSTATUS&wt=javabin&version=2} status=0 QTime=1
   [junit4]   2> 2506808 INFO  (qtp1971283520-28453) [n:127.0.0.1:42145_solr    ] o.a.s.h.a.CoreAdminOperation Checking request status for : 45945e7d-f6f6-47c1-bf39-30454046eff72705910004671372
   [junit4]   2> 2506808 INFO  (qtp1971283520-28453) [n:127.0.0.1:42145_solr    ] o.a.s.s.HttpSolrCall [admin] webapp=null path=/admin/cores params={qt=/admin/cores&requestid=45945e7d-f6f6-47c1-bf39-30454046eff72705910004671372&action=REQUESTSTATUS&wt=javabin&version=2} status=0 QTime=0
   [junit4]   2> 2506809 INFO  (OverseerThreadFactory-10473-thread-3-processing-n:127.0.0.1:42145_solr) [n:127.0.0.1:42145_solr c:testAsyncOperations s:shard2  ] o.a.s.c.a.c.CreateShardCmd Finished create command on all shards for collection: testAsyncOperations
   [junit4]   2> 2506810 INFO  (OverseerThreadFactory-10473-thread-3-processing-n:127.0.0.1:42145_solr) [n:127.0.0.1:42145_solr c:testAsyncOperations s:shard2  ] o.a.s.c.OverseerTaskQueue Response ZK path: /overseer/collection-queue-work/qnr-0000000002 doesn't exist.  Requestor may have disconnected from ZooKeeper
   [junit4]   2> 2507602 INFO  (qtp1563172504-28442) [n:127.0.0.1:40803_solr    ] o.a.s.h.a.CollectionsHandler Invoked Collection Action :requeststatus with params requestid=45945e7d-f6f6-47c1-bf39-30454046eff7&action=REQUESTSTATUS&wt=javabin&version=2 and sendToOCPQueue=true
   [junit4]   2> 2507603 INFO  (qtp1563172504-28442) [n:127.0.0.1:40803_solr    ] o.a.s.s.HttpSolrCall [admin] webapp=null path=/admin/collections params={requestid=45945e7d-f6f6-47c1-bf39-30454046eff7&action=REQUESTSTATUS&wt=javabin&version=2} status=0 QTime=1
   [junit4]   2> 2507603 INFO  (qtp1563172504-28448) [n:127.0.0.1:40803_solr    ] o.a.s.h.a.CollectionsHandler Invoked Collection Action :deletestatus with params requestid=45945e7d-f6f6-47c1-bf39-30454046eff7&action=DELETESTATUS&wt=javabin&version=2 and sendToOCPQueue=true
   [junit4]   2> 2507604 INFO  (qtp1563172504-28448) [n:127.0.0.1:40803_solr    ] o.a.s.s.HttpSolrCall [admin] webapp=null path=/admin/collections params={requestid=45945e7d-f6f6-47c1-bf39-30454046eff7&action=DELETESTATUS&wt=javabin&version=2} status=0 QTime=0
   [junit4]   2> 2507606 INFO  (qtp1971283520-28445) [n:127.0.0.1:42145_solr c:testAsyncOperations s:shard2 r:core_node4 x:testAsyncOperations_shard2_replica_n3] o.a.s.c.ZkShardTerms Successful update of terms at /collections/testAsyncOperations/terms/shard2 to Terms{values={core_node4=1}, version=1}
   [junit4]   2> 2507606 INFO  (qtp1971283520-28445) [n:127.0.0.1:42145_solr c:testAsyncOperations s:shard2 r:core_node4 x:testAsyncOperations_shard2_replica_n3] o.a.s.u.p.LogUpdateProcessorFactory [testAsyncOperations_shard2_replica_n3]  webapp=/solr path=/update params={update.distrib=TOLEADER&distrib.from=http://127.0.0.1:40803/solr/testAsyncOperations_shard1_replica_n1/&wt=javabin&version=2}{add=[54 (1611776900910284800)]} 0 1
   [junit4]   2> 2507607 INFO  (qtp1563172504-28442) [n:127.0.0.1:40803_solr c:testAsyncOperations s:shard1 r:core_node2 x:testAsyncOperations_shard1_replica_n1] o.a.s.u.p.LogUpdateProcessorFactory [testAsyncOperations_shard1_replica_n1]  webapp=/solr path=/update params={wt=javabin&version=2}{add=[54]} 0 2
   [junit4]   2> 2507608 INFO  (qtp1971283520-28453) [n:127.0.0.1:42145_solr c:testAsyncOperations s:shard2 r:core_node4 x:testAsyncOperations_shard2_replica_n3] o.a.s.u.DirectUpdateHandler2 start commit{_version_=1611776900913430528,optimize=false,openSearcher=true,waitSearcher=true,expungeDeletes=false,softCommit=false,prepareCommit=false}
   [junit4]   2> 2507608 INFO  (qtp1971283520-28453) [n:127.0.0.1:42145_solr c:testAsyncOperations s:shard2 r:core_node4 x:testAsyncOperations_shard2_replica_n3] o.a.s.u.SolrIndexWriter Calling setCommitData with IW:org.apache.solr.update.SolrIndexWriter@fdf685f commitCommandVersion:1611776900913430528
   [junit4]   2> 2507608 INFO  (qtp1563172504-28446) [n:127.0.0.1:40803_solr c:testAsyncOperations s:shard1 r:core_node2 x:testAsyncOperations_shard1_replica_n1] o.a.s.u.DirectUpdateHandler2 start commit{_version_=1611776900913430528,optimize=false,openSearcher=true,waitSearcher=true,expungeDeletes=false,softCommit=false,prepareCommit=false}
   [junit4]   2> 2507608 INFO  (qtp1563172504-28446) [n:127.0.0.1:40803_solr c:testAsyncOperations s:shard1 r:core_node2 x:testAsyncOperations_shard1_replica_n1] o.a.s.u.DirectUpdateHandler2 No uncommitted changes. Skipping IW.commit.
   [junit4]   2> 2507608 INFO  (qtp1563172504-28446) [n:127.0.0.1:40803_solr c:testAsyncOperations s:shard1 r:core_node2 x:testAsyncOperations_shard1_replica_n1] o.a.s.u.DirectUpdateHandler2 end_commit_flush
   [junit4]   2> 2507609 INFO  (qtp1563172504-28446) [n:127.0.0.1:40803_solr c:testAsyncOperations s:shard1 r:core_node2 x:testAsyncOperations_shard1_replica_n1] o.a.s.u.p.LogUpdateProcessorFactory [testAsyncOperations_shard1_replica_n1]  webapp=/solr path=/update params={update.distrib=FROMLEADER&waitSearcher=true&openSearcher=true&commit=true&softCommit=false&distrib.from=http://127.0.0.1:40803/solr/testAsyncOperations_shard1_replica_n1/&commit_end_point=true&wt=javabin&version=2&expungeDeletes=false}{commit=} 0 0
   [junit4]   2> 2507611 INFO  (qtp1971283520-28453) [n:127.0.0.1:42145_solr c:testAsyncOperations s:shard2 r:core_node4 x:testAsyncOperations_shard2_replica_n3] o.a.s.s.SolrIndexSearcher Opening [Searcher@47bb5e7b[testAsyncOperations_shard2_replica_n3] main]
   [junit4]   2> 2507611 INFO  (qtp1971283520-28453) [n:127.0.0.1:42145_solr c:testAsyncOperations s:shard2 r:core_node4 x:testAsyncOperations_shard2_replica_n3] o.a.s.u.DirectUpdateHandler2 end_commit_flush
   [junit4]   2> 2507612 INFO  (searcherExecutor-10494-thread-1-processing-n:127.0.0.1:42145_solr x:testAsyncOperations_shard2_replica_n3 c:testAsyncOperations s:shard2 r:core_node4) [n:127.0.0.1:42145_solr c:testAsyncOperations s:shard2 r:core_node4 x:testAsyncOperations_shard2_replica_n3] o.a.s.c.SolrCore [testAsyncOperations_shard2_replica_n3] Registered new searcher Searcher@47bb5e7b[testAsyncOperations_shard2_replica_n3] main{ExitableDirectoryReader(UninvertingDirectoryReader(Uninverting(_0(7.6.0):C1)))}
   [junit4]   2> 2507612 INFO  (qtp1971283520-28453) [n:127.0.0.1:42145_solr c:testAsyncOperations s:shard2 r:core_node4 x:testAsyncOperations_shard2_replica_n3] o.a.s.u.p.LogUpdateProcessorFactory [testAsyncOperations_shard2_replica_n3]  webapp=/solr path=/update params={update.distrib=FROMLEADER&waitSearcher=true&openSearcher=true&commit=true&softCommit=false&distrib.from=http://127.0.0.1:40803/solr/testAsyncOperations_shard1_replica_n1/&commit_end_point=true&wt=javabin&version=2&expungeDeletes=false}{commit=} 0 4
   [junit4]   2> 2507612 INFO  (qtp1563172504-28448) [n:127.0.0.1:40803_solr c:testAsyncOperations s:shard1 r:core_node2 x:testAsyncOperations_shard1_replica_n1] o.a.s.u.p.LogUpdateProcessorFactory [testAsyncOperations_shard1_replica_n1]  webapp=/solr path=/update params={_stateVer_=testAsyncOperations:4&waitSearcher=true&commit=true&softCommit=false&wt=javabin&version=2}{commit=} 0 5
   [junit4]   2> 2507614 INFO  (qtp1971283520-28451) [n:127.0.0.1:42145_solr c:testAsyncOperations s:shard2 r:core_node4 x:testAsyncOperations_shard2_replica_n3] o.a.s.c.S.Request [testAsyncOperations_shard2_replica_n3]  webapp=/solr path=/select params={df=text&distrib=false&_stateVer_=testAsyncOperations:8&fl=id&fl=score&shards.purpose=4&start=0&fsv=true&shard.url=http://127.0.0.1:42145/solr/testAsyncOperations_shard2_replica_n3/&rows=10&version=2&q=*:*&NOW=1537110234183&isShard=true&wt=javabin} hits=1 status=0 QTime=0
   [junit4]   2> 2507615 INFO  (qtp1971283520-28453) [n:127.0.0.1:42145_solr c:testAsyncOperations s:shard2 r:core_node4 x:testAsyncOperations_shard2_replica_n3] o.a.s.c.S.Request [testAsyncOperations_shard2_replica_n3]  webapp=/solr path=/select params={q=*:*&df=text&distrib=false&_stateVer_=testAsyncOperations:8&shards.purpose=64&NOW=1537110234183&ids=54&isShard=true&shard.url=http://127.0.0.1:42145/solr/testAsyncOperations_shard2_replica_n3/&wt=javabin&version=2} status=0 QTime=0
   [junit4]   2> 2507615 INFO  (qtp1563172504-28442) [n:127.0.0.1:40803_solr c:testAsyncOperations s:shard1 r:core_node2 x:testAsyncOperations_shard1_replica_n1] o.a.s.c.S.Request [testAsyncOperations_shard1_replica_n1]  webapp=/solr path=/select params={q=*:*&shards=shard2&_stateVer_=testAsyncOperations:8&wt=javabin&version=2} hits=1 status=0 QTime=2
   [junit4]   2> 2507615 INFO  (qtp1563172504-28448) [n:127.0.0.1:40803_solr    ] o.a.s.h.a.CollectionsHandler Invoked Collection Action :deleteshard with params async=abae6d97-fc27-4c33-807e-75d71b939d42&action=DELETESHARD&collection=testAsyncOperations&shard=shard2&wt=javabin&version=2 and sendToOCPQueue=true
   [junit4]   2> 2507618 INFO  (qtp1563172504-28448) [n:127.0.0.1:40803_solr c:testAsyncOperations   ] o.a.s.s.HttpSolrCall [admin] webapp=null path=/admin/collections params={async=abae6d97-fc27-4c33-807e-75d71b939d42&action=DELETESHARD&collection=testAsyncOperations&shard=shard2&wt=javabin&version=2} status=0 QTime=2
   [junit4]   2> 2507618 INFO  (qtp1563172504-28442) [n:127.0.0.1:40803_solr    ] o.a.s.h.a.CollectionsHandler Invoked Collection Action :requeststatus with params requestid=abae6d97-fc27-4c33-807e-75d71b939d42&action=REQUESTSTATUS&wt=javabin&version=2 and sendToOCPQueue=true
   [junit4]   2> 2507619 INFO  (qtp1563172504-28442) [n:127.0.0.1:40803_solr    ] o.a.s.s.HttpSolrCall [admin] webapp=null path=/admin/collections params={requestid=abae6d97-fc27-4c33-807e-75d71b939d42&action=REQUESTSTATUS&wt=javabin&version=2} status=0 QTime=0
   [junit4]   2> 2507621 INFO  (OverseerThreadFactory-10473-thread-4-processing-n:127.0.0.1:42145_solr) [n:127.0.0.1:42145_solr c:testAsyncOperations s:shard2  ] o.a.s.c.a.c.DeleteShardCmd Delete shard invoked
   [junit4]   2> 2507621 INFO  (OverseerCollectionConfigSetProcessor-72234928123609092-127.0.0.1:42145_solr-n_0000000000) [n:127.0.0.1:42145_solr    ] o.a.s.c.OverseerTaskQueue Response ZK path: /overseer/collection-queue-work/qnr-0000000002 doesn't exist.  Requestor may have disconnected from ZooKeeper
   [junit4]   2> 2507622 INFO  (OverseerThreadFactory-10473-thread-4-processing-n:127.0.0.1:42145_solr) [n:127.0.0.1:42145_solr c:testAsyncOperations s:shard2  ] o.a.s.c.a.c.DeleteShardCmd Deleting replica for collection=testAsyncOperations shard=shard2 on node=127.0.0.1:42145_solr
   [junit4]   2> 2507622 INFO  (qtp1971283520-28455) [n:127.0.0.1:42145_solr    x:testAsyncOperations_shard2_replica_n3] o.a.s.s.HttpSolrCall [admin] webapp=null path=/admin/cores params={deleteInstanceDir=true&core=testAsyncOperations_shard2_replica_n3&deleteMetricsHistory=true&async=abae6d97-fc27-4c33-807e-75d71b939d422705911820676665&qt=/admin/cores&deleteDataDir=true&action=UNLOAD&wt=javabin&version=2&deleteIndex=true} status=0 QTime=0
   [junit4]   2> 2507623 INFO  (parallelCoreAdminExecutor-10474-thread-2-processing-n:127.0.0.1:42145_solr x:testAsyncOperations_shard2_replica_n3 abae6d97-fc27-4c33-807e-75d71b939d422705911820676665 UNLOAD) [n:127.0.0.1:42145_solr    x:testAsyncOperations_shard2_replica_n3] o.a.s.m.SolrMetricManager Closing metric reporters for registry=solr.core.testAsyncOperations.shard2.replica_n3, tag=null
   [junit4]   2> 2507623 INFO  (parallelCoreAdminExecutor-10474-thread-2-processing-n:127.0.0.1:42145_solr x:testAsyncOperations_shard2_replica_n3 abae6d97-fc27-4c33-807e-75d71b939d422705911820676665 UNLOAD) [n:127.0.0.1:42145_solr    x:testAsyncOperations_shard2_replica_n3] o.a.s.m.r.SolrJmxReporter Closing reporter [org.apache.solr.metrics.reporters.SolrJmxReporter@12bb3514: rootName = solr_42145, domain = solr.core.testAsyncOperations.shard2.replica_n3, service url = null, agent id = null] for registry solr.core.testAsyncOperations.shard2.replica_n3 / com.codahale.metrics.MetricRegistry@7bda117e
   [junit4]   2> 2507623 INFO  (qtp1971283520-28453) [n:127.0.0.1:42145_solr    ] o.a.s.h.a.CoreAdminOperation Checking request status for : abae6d97-fc27-4c33-807e-75d71b939d422705911820676665
   [junit4]   2> 2507623 INFO  (qtp1971283520-28453) [n:127.0.0.1:42145_solr    ] o.a.s.s.HttpSolrCall [admin] webapp=null path=/admin/cores params={qt=/admin/cores&requestid=abae6d97-fc27-4c33-807e-75d71b939d422705911820676665&action=REQUESTSTATUS&wt=javabin&version=2} status=0 QTime=0
   [junit4]   2> 2507629 INFO  (parallelCoreAdminExecutor-10474-thread-2-processing-n:127.0.0.1:42145_solr x:testAsyncOperations_shard2_replica_n3 abae6d97-fc27-4c33-807e-75d71b939d422705911820676665 UNLOAD) [n:127.0.0.1:42145_solr    x:testAsyncOperations_shard2_replica_n3] o.a.s.c.SolrCore [testAsyncOperations_shard2_replica_n3]  CLOSING SolrCore org.apache.solr.core.SolrCore@6e5cca
   [junit4]   2> 2507629 INFO  (parallelCoreAdminExecutor-10474-thread-2-processing-n:127.0.0.1:42145_solr x:testAsyncOperations_shard2_replica_n3 abae6d97-fc27-4c33-807e-75d71b939d422705911820676665 UNLOAD) [n:127.0.0.1:42145_solr    x:testAsyncOperations_shard2_replica_n3] o.a.s.m.SolrMetricManager Closing metric reporters for registry=solr.core.testAsyncOperations.shard2.replica_n3, tag=6e5cca
   [junit4]   2> 2507629 INFO  (parallelCoreAdminExecutor-10474-thread-2-processing-n:127.0.0.1:42145_solr x:testAsyncOperations_shard2_replica_n3 abae6d97-fc27-4c33-807e-75d71b939d422705911820676665 UNLOAD) [n:127.0.0.1:42145_solr    x:testAsyncOperations_shard2_replica_n3] o.a.s.m.SolrMetricManager Closing metric reporters for registry=solr.collection.testAsyncOperations.shard2.leader, tag=6e5cca
   [junit4]   2> 2507631 INFO  (parallelCoreAdminExecutor-10474-thread-2-processing-n:127.0.0.1:42145_solr x:testAsyncOperations_shard2_replica_n3 abae6d97-fc27-4c33-807e-75d71b939d422705911820676665 UNLOAD) [n:127.0.0.1:42145_solr    x:testAsyncOperations_shard2_replica_n3] o.a.s.c.ZkShardTerms Successful update of terms at /collections/testAsyncOperations/terms/shard2 to Terms{values={}, version=2}
   [junit4]   2> 2507733 INFO  (zkCallback-7279-thread-1) [    ] o.a.s.c.c.ZkStateReader A cluster state change: [WatchedEvent state:SyncConnected type:NodeDataChanged path:/collections/testAsyncOperations/state.json] for collection [testAsyncOperations] has occurred - updating... (live nodes size: [2])
   [junit4]   2> 2507733 INFO  (zkCallback-7265-thread-2) [    ] o.a.s.c.c.ZkStateReader A cluster state change: [WatchedEvent state:SyncConnected type:NodeDataChanged path:/collections/testAsyncOperations/state.json] for collection [testAsyncOperations] has occurred - updating... (live nodes size: [2])
   [junit4]   2> 2508620 INFO  (qtp1563172504-28448) [n:127.0.0.1:40803_solr    ] o.a.s.h.a.CollectionsHandler Invoked Collection Action :requeststatus with params requestid=abae6d97-fc27-4c33-807e-75d71b939d42&action=REQUESTSTATUS&wt=javabin&version=2 and sendToOCPQueue=true
   [junit4]   2> 2508621 INFO  (qtp1563172504-28448) [n:127.0.0.1:40803_solr    ] o.a.s.s.HttpSolrCall [admin] webapp=null path=/admin/collections params={requestid=abae6d97-fc27-4c33-807e-75d71b939d42&action=REQUESTSTATUS&wt=javabin&version=2} status=0 QTime=1
   [junit4]   2> 2508623 INFO  (qtp1971283520-28455) [n:127.0.0.1:42145_solr    ] o.a.s.h.a.CoreAdminOperation Checking request status for : abae6d97-fc27-4c33-807e-75d71b939d422705911820676665
   [junit4]   2> 2508623 INFO  (qtp1971283520-28455) [n:127.0.0.1:42145_solr    ] o.a.s.s.HttpSolrCall [admin] webapp=null path=/admin/cores params={qt=/admin/cores&requestid=abae6d97-fc27-4c33-807e-75d71b939d422705911820676665&action=REQUESTSTATUS&wt=javabin&version=2} status=0 QTime=0
   [junit4]   2> 2508726 INFO  (OverseerStateUpdate-72234928123609092-127.0.0.1:42145_solr-n_0000000000) [n:127.0.0.1:42145_solr    ] o.a.s.c.o.CollectionMutator Removing collection: testAsyncOperations shard: shard2 from clusterstate
   [junit4]   2> 2508827 INFO  (zkCallback-7279-thread-1) [    ] o.a.s.c.c.ZkStateReader A cluster state change: [WatchedEvent state:SyncConnected type:NodeDataChanged path:/collections/testAsyncOperations/state.json] for collection [testAsyncOperations] has occurred - updating... (live nodes size: [2])
   [junit4]   2> 2509028 INFO  (OverseerThreadFactory-10473-thread-4-processing-n:127.0.0.1:42145_solr) [n:127.0.0.1:42145_solr c:testAsyncOperations s:shard2  ] o.a.s.c.a.c.DeleteShardCmd Successfully deleted collection: testAsyncOperations, shard: shard2
   [junit4]   2> 2509031 INFO  (OverseerThreadFactory-10473-thread-4-processing-n:127.0.0.1:42145_solr) [n:127.0.0.1:42145_solr c:testAsyncOperations s:shard2  ] o.a.s.c.OverseerTaskQueue Response ZK path: /overseer/collection-queue-work/qnr-0000000003 doesn't exist.  Requestor may have disconnected from ZooKeeper
   [junit4]   2> 2509621 INFO  (qtp1563172504-28442) [n:127.0.0.1:40803_solr    ] o.a.s.h.a.CollectionsHandler Invoked Collection Action :requeststatus with params requestid=abae6d97-fc27-4c33-807e-75d71b939d42&action=REQUESTSTATUS&wt=javabin&version=2 and sendToOCPQueue=true
   [junit4]   2> 2509622 INFO  (qtp1563172504-28442) [n:127.0.0.1:40803_solr    ] o.a.s.s.HttpSolrCall [admin] webapp=null path=/admin/collections params={requestid=abae6d97-fc27-4c33-807e-75d71b939d42&action=REQUESTSTATUS&wt=javabin&version=2} status=0 QTime=1
   [junit4]   2> 2509622 INFO  (OverseerCollectionConfigSetProcessor-72234928123609092-127.0.0.1:42145_solr-n_0000000000) [n:127.0.0.1:42145_solr    ] o.a

[...truncated too long message...]

de a deprecated API.
    [javac] Note: Recompile with -Xlint:deprecation for details.
    [javac] Note: Some input files use unchecked or unsafe operations.
    [javac] Note: Recompile with -Xlint:unchecked for details.
    [javac] Creating empty /home/jenkins/workspace/Lucene-Solr-7.x-Linux/solr/build/solr-core/classes/test/org/apache/solr/cloud/autoscaling/sim/package-info.class
     [copy] Copying 1 file to /home/jenkins/workspace/Lucene-Solr-7.x-Linux/solr/build/solr-core/classes/test

common-solr.compile-test:

compile-test:

BUILD SUCCESSFUL
Total time: 49 seconds
[repro] ant test-nocompile -Dtests.dups=5 -Dtests.maxfailures=5 -Dtests.class="*.CollectionsAPIAsyncDistributedZkTest" -Dtests.showOutput=onerror "-Dargs=-XX:-UseCompressedOops -XX:+UseSerialGC" -Dtests.seed=D2C63D7AAC33D434 -Dtests.multiplier=3 -Dtests.slow=true -Dtests.locale=es-VE -Dtests.timezone=Etc/GMT -Dtests.asserts=true -Dtests.file.encoding=ISO-8859-1
Buildfile: /home/jenkins/workspace/Lucene-Solr-7.x-Linux/solr/core/build.xml

-clover.disable:

ivy-configure:
[ivy:configure] :: Apache Ivy 2.4.0 - 20141213170938 :: http://ant.apache.org/ivy/ ::
[ivy:configure] :: loading settings :: file = /home/jenkins/workspace/Lucene-Solr-7.x-Linux/lucene/top-level-ivy-settings.xml

install-junit4-taskdef:

ivy-availability-check:
[loadresource] Do not set property disallowed.ivy.jars.list as its length is 0.

-ivy-fail-disallowed-ivy-version:

ivy-fail:

resolve-groovy:
[ivy:cachepath] :: resolving dependencies :: org.codehaus.groovy#groovy-all-caller;working
[ivy:cachepath] 	confs: [default]
[ivy:cachepath] 	found org.codehaus.groovy#groovy-all;2.4.15 in public
[ivy:cachepath] :: resolution report :: resolve 13ms :: artifacts dl 0ms
	---------------------------------------------------------------------
	|                  |            modules            ||   artifacts   |
	|       conf       | number| search|dwnlded|evicted|| number|dwnlded|
	---------------------------------------------------------------------
	|      default     |   1   |   0   |   0   |   0   ||   1   |   0   |
	---------------------------------------------------------------------

-init-totals:

-test:
    [mkdir] Created dir: /home/jenkins/workspace/Lucene-Solr-7.x-Linux/solr/build/solr-core/test
[junit4:pickseed] Seed property 'tests.seed' already defined: D2C63D7AAC33D434
    [mkdir] Created dir: /home/jenkins/workspace/Lucene-Solr-7.x-Linux/solr/build/solr-core/test/temp
   [junit4] <JUnit4> says hello! Master seed: D2C63D7AAC33D434
   [junit4] Executing 5 suites with 3 JVMs.
   [junit4] 
   [junit4] Started J0 PID(31337@serv1.sd-datasolutions.de).
   [junit4] Started J1 PID(31354@serv1.sd-datasolutions.de).
   [junit4] Started J2 PID(31371@serv1.sd-datasolutions.de).
   [junit4] Suite: org.apache.solr.cloud.api.collections.CollectionsAPIAsyncDistributedZkTest
   [junit4] OK      24.0s J0 | CollectionsAPIAsyncDistributedZkTest.testAsyncRequests
   [junit4] OK      3.04s J0 | CollectionsAPIAsyncDistributedZkTest.testAsyncIdRaceCondition
   [junit4] OK      14.1s J0 | CollectionsAPIAsyncDistributedZkTest.testSolrJAPICalls
   [junit4] OK      0.02s J0 | CollectionsAPIAsyncDistributedZkTest.testAsyncIdBackCompat
   [junit4] Completed [1/5] on J0 in 46.22s, 4 tests
   [junit4] 
   [junit4] Suite: org.apache.solr.cloud.api.collections.CollectionsAPIAsyncDistributedZkTest
   [junit4] OK      24.0s J2 | CollectionsAPIAsyncDistributedZkTest.testAsyncRequests
   [junit4] OK      3.05s J2 | CollectionsAPIAsyncDistributedZkTest.testAsyncIdRaceCondition
   [junit4] OK      14.1s J2 | CollectionsAPIAsyncDistributedZkTest.testSolrJAPICalls
   [junit4] OK      0.06s J2 | CollectionsAPIAsyncDistributedZkTest.testAsyncIdBackCompat
   [junit4] Completed [2/5] on J2 in 46.93s, 4 tests
   [junit4] 
   [junit4] Duplicate suite name used with XML reports: org.apache.solr.cloud.api.collections.CollectionsAPIAsyncDistributedZkTest. This may confuse tools that process XML reports. Set 'ignoreDuplicateSuites' to true to skip this message.
   [junit4] Suite: org.apache.solr.cloud.api.collections.CollectionsAPIAsyncDistributedZkTest
   [junit4] OK      24.0s J1 | CollectionsAPIAsyncDistributedZkTest.testAsyncRequests
   [junit4] OK      3.05s J1 | CollectionsAPIAsyncDistributedZkTest.testAsyncIdRaceCondition
   [junit4] OK      14.1s J1 | CollectionsAPIAsyncDistributedZkTest.testSolrJAPICalls
   [junit4] OK      0.03s J1 | CollectionsAPIAsyncDistributedZkTest.testAsyncIdBackCompat
   [junit4] Completed [3/5] on J1 in 47.93s, 4 tests
   [junit4] 
   [junit4] Suite: org.apache.solr.cloud.api.collections.CollectionsAPIAsyncDistributedZkTest
   [junit4] OK      22.2s J0 | CollectionsAPIAsyncDistributedZkTest.testAsyncRequests
   [junit4] OK      3.05s J0 | CollectionsAPIAsyncDistributedZkTest.testAsyncIdRaceCondition
   [junit4] OK      14.1s J0 | CollectionsAPIAsyncDistributedZkTest.testSolrJAPICalls
   [junit4] OK      0.03s J0 | CollectionsAPIAsyncDistributedZkTest.testAsyncIdBackCompat
   [junit4] Completed [4/5] on J0 in 40.74s, 4 tests
   [junit4] 
   [junit4] Suite: org.apache.solr.cloud.api.collections.CollectionsAPIAsyncDistributedZkTest
   [junit4] OK      22.2s J2 | CollectionsAPIAsyncDistributedZkTest.testAsyncRequests
   [junit4] OK      3.05s J2 | CollectionsAPIAsyncDistributedZkTest.testAsyncIdRaceCondition
   [junit4] OK      14.1s J2 | CollectionsAPIAsyncDistributedZkTest.testSolrJAPICalls
   [junit4] OK      0.02s J2 | CollectionsAPIAsyncDistributedZkTest.testAsyncIdBackCompat
   [junit4] Completed [5/5] on J2 in 40.76s, 4 tests
   [junit4] 
   [junit4] JVM J0:     0.76 ..    88.49 =    87.73s
   [junit4] JVM J1:     0.86 ..    49.47 =    48.62s
   [junit4] JVM J2:     0.96 ..    89.62 =    88.65s
   [junit4] Execution time total: 1 minute 29 seconds
   [junit4] Tests summary: 5 suites, 20 tests
   [junit4] Could not remove temporary path: /home/jenkins/workspace/Lucene-Solr-7.x-Linux/solr/build/solr-core/test/J0 (java.nio.file.DirectoryNotEmptyException: Remaining files: [/home/jenkins/workspace/Lucene-Solr-7.x-Linux/solr/build/solr-core/test/J0/temp])
   [junit4] Could not remove temporary path: /home/jenkins/workspace/Lucene-Solr-7.x-Linux/solr/build/solr-core/test/J1 (java.nio.file.DirectoryNotEmptyException: Remaining files: [/home/jenkins/workspace/Lucene-Solr-7.x-Linux/solr/build/solr-core/test/J1/temp])
   [junit4] Could not remove temporary path: /home/jenkins/workspace/Lucene-Solr-7.x-Linux/solr/build/solr-core/test/J2 (java.nio.file.DirectoryNotEmptyException: Remaining files: [/home/jenkins/workspace/Lucene-Solr-7.x-Linux/solr/build/solr-core/test/J2/temp])
     [echo] 5 slowest tests:
[junit4:tophints] 1205.51s | org.apache.solr.cloud.BasicDistributedZkTest
[junit4:tophints] 641.69s | org.apache.solr.cloud.cdcr.CdcrOpsAndBoundariesTest
[junit4:tophints] 641.40s | org.apache.solr.cloud.cdcr.CdcrWithNodesRestartsTest
[junit4:tophints] 430.77s | org.apache.solr.cloud.api.collections.ShardSplitTest
[junit4:tophints] 213.50s | org.apache.solr.update.TestInPlaceUpdatesDistrib

-check-totals:

test-nocompile:

BUILD SUCCESSFUL
Total time: 1 minute 31 seconds
[repro] Failures:
[repro]   0/5 failed: org.apache.solr.cloud.api.collections.CollectionsAPIAsyncDistributedZkTest
[repro] Exiting with code 0
+ mv lucene/build lucene/build.repro
+ mv solr/build solr/build.repro
+ mv lucene/build.orig lucene/build
+ mv solr/build.orig solr/build
Archiving artifacts
Setting ANT_1_8_2_HOME=/var/lib/jenkins/tools/hudson.tasks.Ant_AntInstallation/ANT_1.8.2
java.lang.InterruptedException: no matches found within 10000
	at hudson.FilePath$ValidateAntFileMask.hasMatch(FilePath.java:2845)
	at hudson.FilePath$ValidateAntFileMask.invoke(FilePath.java:2724)
	at hudson.FilePath$ValidateAntFileMask.invoke(FilePath.java:2705)
	at hudson.FilePath.act(FilePath.java:1076)
	at hudson.FilePath.act(FilePath.java:1059)
	at hudson.FilePath.validateAntFileMask(FilePath.java:2703)
	at hudson.tasks.ArtifactArchiver.perform(ArtifactArchiver.java:243)
	at hudson.tasks.BuildStepCompatibilityLayer.perform(BuildStepCompatibilityLayer.java:81)
	at hudson.tasks.BuildStepMonitor$1.perform(BuildStepMonitor.java:20)
	at hudson.model.AbstractBuild$AbstractBuildExecution.perform(AbstractBuild.java:744)
	at hudson.model.AbstractBuild$AbstractBuildExecution.performAllBuildSteps(AbstractBuild.java:690)
	at hudson.model.Build$BuildExecution.post2(Build.java:186)
	at hudson.model.AbstractBuild$AbstractBuildExecution.post(AbstractBuild.java:635)
	at hudson.model.Run.execute(Run.java:1840)
	at hudson.model.FreeStyleBuild.run(FreeStyleBuild.java:43)
	at hudson.model.ResourceController.execute(ResourceController.java:97)
	at hudson.model.Executor.run(Executor.java:429)
No artifacts found that match the file pattern "**/*.events,heapdumps/**,**/*_pid*.log". Configuration error?
[WARNINGS] Parsing warnings in console log with parser Java Compiler (javac)
Setting ANT_1_8_2_HOME=/var/lib/jenkins/tools/hudson.tasks.Ant_AntInstallation/ANT_1.8.2
Setting ANT_1_8_2_HOME=/var/lib/jenkins/tools/hudson.tasks.Ant_AntInstallation/ANT_1.8.2
<Git Blamer> Using GitBlamer to create author and commit information for all warnings.
<Git Blamer> GIT_COMMIT=20123377479bd3d0689f106ec53aa9e1148a258a, workspace=/var/lib/jenkins/workspace/Lucene-Solr-7.x-Linux
[WARNINGS] Computing warning deltas based on reference build #2752
Recording test results
Setting ANT_1_8_2_HOME=/var/lib/jenkins/tools/hudson.tasks.Ant_AntInstallation/ANT_1.8.2
Build step 'Publish JUnit test result report' changed build result to UNSTABLE
Email was triggered for: Unstable (Test Failures)
Sending email for trigger: Unstable (Test Failures)
Setting ANT_1_8_2_HOME=/var/lib/jenkins/tools/hudson.tasks.Ant_AntInstallation/ANT_1.8.2
Setting ANT_1_8_2_HOME=/var/lib/jenkins/tools/hudson.tasks.Ant_AntInstallation/ANT_1.8.2
Setting ANT_1_8_2_HOME=/var/lib/jenkins/tools/hudson.tasks.Ant_AntInstallation/ANT_1.8.2
Setting ANT_1_8_2_HOME=/var/lib/jenkins/tools/hudson.tasks.Ant_AntInstallation/ANT_1.8.2

Mime
View raw message