lucene-dev mailing list archives

Site index · List index
Message view « Date » · « Thread »
Top « Date » · « Thread »
From Apache Jenkins Server <jenk...@builds.apache.org>
Subject [JENKINS] Lucene-Solr-BadApples-Tests-master - Build # 166 - Still Unstable
Date Sat, 29 Sep 2018 21:07:40 GMT
Build: https://builds.apache.org/job/Lucene-Solr-BadApples-Tests-master/166/

1 tests failed.
FAILED:  org.apache.solr.cloud.MoveReplicaHDFSTest.testFailedMove

Error Message:
No live SolrServers available to handle this request:[https://127.0.0.1:33009/solr/MoveReplicaHDFSTest_failed_coll_true, https://127.0.0.1:45824/solr/MoveReplicaHDFSTest_failed_coll_true]

Stack Trace:
org.apache.solr.client.solrj.SolrServerException: No live SolrServers available to handle this request:[https://127.0.0.1:33009/solr/MoveReplicaHDFSTest_failed_coll_true, https://127.0.0.1:45824/solr/MoveReplicaHDFSTest_failed_coll_true]
	at __randomizedtesting.SeedInfo.seed([DF78F1E1A93D7E38:75B522131EEEABE8]:0)
	at org.apache.solr.client.solrj.impl.LBHttpSolrClient.request(LBHttpSolrClient.java:462)
	at org.apache.solr.client.solrj.impl.CloudSolrClient.sendRequest(CloudSolrClient.java:1107)
	at org.apache.solr.client.solrj.impl.CloudSolrClient.requestWithRetryOnStaleState(CloudSolrClient.java:884)
	at org.apache.solr.client.solrj.impl.CloudSolrClient.requestWithRetryOnStaleState(CloudSolrClient.java:994)
	at org.apache.solr.client.solrj.impl.CloudSolrClient.request(CloudSolrClient.java:817)
	at org.apache.solr.client.solrj.SolrRequest.process(SolrRequest.java:194)
	at org.apache.solr.client.solrj.SolrClient.query(SolrClient.java:942)
	at org.apache.solr.cloud.MoveReplicaTest.testFailedMove(MoveReplicaTest.java:301)
	at sun.reflect.NativeMethodAccessorImpl.invoke0(Native Method)
	at sun.reflect.NativeMethodAccessorImpl.invoke(NativeMethodAccessorImpl.java:62)
	at sun.reflect.DelegatingMethodAccessorImpl.invoke(DelegatingMethodAccessorImpl.java:43)
	at java.lang.reflect.Method.invoke(Method.java:498)
	at com.carrotsearch.randomizedtesting.RandomizedRunner.invoke(RandomizedRunner.java:1742)
	at com.carrotsearch.randomizedtesting.RandomizedRunner$8.evaluate(RandomizedRunner.java:935)
	at com.carrotsearch.randomizedtesting.RandomizedRunner$9.evaluate(RandomizedRunner.java:971)
	at com.carrotsearch.randomizedtesting.RandomizedRunner$10.evaluate(RandomizedRunner.java:985)
	at com.carrotsearch.randomizedtesting.rules.SystemPropertiesRestoreRule$1.evaluate(SystemPropertiesRestoreRule.java:57)
	at org.apache.lucene.util.TestRuleSetupTeardownChained$1.evaluate(TestRuleSetupTeardownChained.java:49)
	at org.apache.lucene.util.AbstractBeforeAfterRule$1.evaluate(AbstractBeforeAfterRule.java:45)
	at org.apache.lucene.util.TestRuleThreadAndTestName$1.evaluate(TestRuleThreadAndTestName.java:48)
	at org.apache.lucene.util.TestRuleIgnoreAfterMaxFailures$1.evaluate(TestRuleIgnoreAfterMaxFailures.java:64)
	at org.apache.lucene.util.TestRuleMarkFailure$1.evaluate(TestRuleMarkFailure.java:47)
	at com.carrotsearch.randomizedtesting.rules.StatementAdapter.evaluate(StatementAdapter.java:36)
	at com.carrotsearch.randomizedtesting.ThreadLeakControl$StatementRunner.run(ThreadLeakControl.java:368)
	at com.carrotsearch.randomizedtesting.ThreadLeakControl.forkTimeoutingTask(ThreadLeakControl.java:817)
	at com.carrotsearch.randomizedtesting.ThreadLeakControl$3.evaluate(ThreadLeakControl.java:468)
	at com.carrotsearch.randomizedtesting.RandomizedRunner.runSingleTest(RandomizedRunner.java:944)
	at com.carrotsearch.randomizedtesting.RandomizedRunner$5.evaluate(RandomizedRunner.java:830)
	at com.carrotsearch.randomizedtesting.RandomizedRunner$6.evaluate(RandomizedRunner.java:880)
	at com.carrotsearch.randomizedtesting.RandomizedRunner$7.evaluate(RandomizedRunner.java:891)
	at com.carrotsearch.randomizedtesting.rules.StatementAdapter.evaluate(StatementAdapter.java:36)
	at com.carrotsearch.randomizedtesting.rules.SystemPropertiesRestoreRule$1.evaluate(SystemPropertiesRestoreRule.java:57)
	at org.apache.lucene.util.AbstractBeforeAfterRule$1.evaluate(AbstractBeforeAfterRule.java:45)
	at com.carrotsearch.randomizedtesting.rules.StatementAdapter.evaluate(StatementAdapter.java:36)
	at org.apache.lucene.util.TestRuleStoreClassName$1.evaluate(TestRuleStoreClassName.java:41)
	at com.carrotsearch.randomizedtesting.rules.NoShadowingOrOverridesOnMethodsRule$1.evaluate(NoShadowingOrOverridesOnMethodsRule.java:40)
	at com.carrotsearch.randomizedtesting.rules.NoShadowingOrOverridesOnMethodsRule$1.evaluate(NoShadowingOrOverridesOnMethodsRule.java:40)
	at com.carrotsearch.randomizedtesting.rules.StatementAdapter.evaluate(StatementAdapter.java:36)
	at com.carrotsearch.randomizedtesting.rules.StatementAdapter.evaluate(StatementAdapter.java:36)
	at com.carrotsearch.randomizedtesting.rules.StatementAdapter.evaluate(StatementAdapter.java:36)
	at org.apache.lucene.util.TestRuleAssertionsRequired$1.evaluate(TestRuleAssertionsRequired.java:53)
	at org.apache.lucene.util.TestRuleMarkFailure$1.evaluate(TestRuleMarkFailure.java:47)
	at org.apache.lucene.util.TestRuleIgnoreAfterMaxFailures$1.evaluate(TestRuleIgnoreAfterMaxFailures.java:64)
	at org.apache.lucene.util.TestRuleIgnoreTestSuites$1.evaluate(TestRuleIgnoreTestSuites.java:54)
	at com.carrotsearch.randomizedtesting.rules.StatementAdapter.evaluate(StatementAdapter.java:36)
	at com.carrotsearch.randomizedtesting.ThreadLeakControl$StatementRunner.run(ThreadLeakControl.java:368)
	at java.lang.Thread.run(Thread.java:748)
Caused by: org.apache.solr.client.solrj.impl.HttpSolrClient$RemoteSolrException: Error from server at https://127.0.0.1:33009/solr/MoveReplicaHDFSTest_failed_coll_true: no servers hosting shard: shard2
	at org.apache.solr.client.solrj.impl.HttpSolrClient.executeMethod(HttpSolrClient.java:643)
	at org.apache.solr.client.solrj.impl.HttpSolrClient.request(HttpSolrClient.java:255)
	at org.apache.solr.client.solrj.impl.HttpSolrClient.request(HttpSolrClient.java:244)
	at org.apache.solr.client.solrj.impl.LBHttpSolrClient.doRequest(LBHttpSolrClient.java:483)
	at org.apache.solr.client.solrj.impl.LBHttpSolrClient.request(LBHttpSolrClient.java:436)
	... 46 more




Build Log:
[...truncated 13903 lines...]
   [junit4] Suite: org.apache.solr.cloud.MoveReplicaHDFSTest
   [junit4]   2> 2031322 INFO  (SUITE-MoveReplicaHDFSTest-seed#[DF78F1E1A93D7E38]-worker) [    ] o.a.s.SolrTestCaseJ4 SecureRandom sanity checks: test.solr.allowed.securerandom=null & java.security.egd=file:/dev/./urandom
   [junit4]   2> Creating dataDir: /x1/jenkins/jenkins-slave/workspace/Lucene-Solr-BadApples-Tests-master/solr/build/solr-core/test/J1/temp/solr.cloud.MoveReplicaHDFSTest_DF78F1E1A93D7E38-001/init-core-data-001
   [junit4]   2> 2031323 WARN  (SUITE-MoveReplicaHDFSTest-seed#[DF78F1E1A93D7E38]-worker) [    ] o.a.s.SolrTestCaseJ4 startTrackingSearchers: numOpens=5 numCloses=5
   [junit4]   2> 2031323 INFO  (SUITE-MoveReplicaHDFSTest-seed#[DF78F1E1A93D7E38]-worker) [    ] o.a.s.SolrTestCaseJ4 Using PointFields (NUMERIC_POINTS_SYSPROP=true) w/NUMERIC_DOCVALUES_SYSPROP=true
   [junit4]   2> 2031325 INFO  (SUITE-MoveReplicaHDFSTest-seed#[DF78F1E1A93D7E38]-worker) [    ] o.a.s.SolrTestCaseJ4 Randomized ssl (true) and clientAuth (false) via: @org.apache.solr.util.RandomizeSSL(reason=, ssl=NaN, value=NaN, clientAuth=NaN)
   [junit4]   2> 2031325 INFO  (SUITE-MoveReplicaHDFSTest-seed#[DF78F1E1A93D7E38]-worker) [    ] o.a.s.c.MiniSolrCloudCluster Starting cluster of 4 servers in /x1/jenkins/jenkins-slave/workspace/Lucene-Solr-BadApples-Tests-master/solr/build/solr-core/test/J1/temp/solr.cloud.MoveReplicaHDFSTest_DF78F1E1A93D7E38-001/tempDir-001
   [junit4]   2> 2031325 INFO  (SUITE-MoveReplicaHDFSTest-seed#[DF78F1E1A93D7E38]-worker) [    ] o.a.s.c.ZkTestServer STARTING ZK TEST SERVER
   [junit4]   2> 2031326 INFO  (Thread-4571) [    ] o.a.s.c.ZkTestServer client port:0.0.0.0/0.0.0.0:0
   [junit4]   2> 2031326 INFO  (Thread-4571) [    ] o.a.s.c.ZkTestServer Starting server
   [junit4]   2> 2031328 ERROR (Thread-4571) [    ] o.a.z.s.ZooKeeperServer ZKShutdownHandler is not registered, so ZooKeeper server won't take any action on ERROR or SHUTDOWN server state changes
   [junit4]   2> 2031426 INFO  (SUITE-MoveReplicaHDFSTest-seed#[DF78F1E1A93D7E38]-worker) [    ] o.a.s.c.ZkTestServer start zk server on port:37797
   [junit4]   2> 2031430 INFO  (zkConnectionManagerCallback-7614-thread-1) [    ] o.a.s.c.c.ConnectionManager zkClient has connected
   [junit4]   2> 2031445 INFO  (jetty-launcher-7611-thread-2) [    ] o.e.j.s.Server jetty-9.4.11.v20180605; built: 2018-06-05T18:24:03.829Z; git: d5fc0523cfa96bfebfbda19606cad384d772f04c; jvm 1.8.0_172-b11
   [junit4]   2> 2031445 INFO  (jetty-launcher-7611-thread-1) [    ] o.e.j.s.Server jetty-9.4.11.v20180605; built: 2018-06-05T18:24:03.829Z; git: d5fc0523cfa96bfebfbda19606cad384d772f04c; jvm 1.8.0_172-b11
   [junit4]   2> 2031446 INFO  (jetty-launcher-7611-thread-1) [    ] o.e.j.s.session DefaultSessionIdManager workerName=node0
   [junit4]   2> 2031446 INFO  (jetty-launcher-7611-thread-1) [    ] o.e.j.s.session No SessionScavenger set, using defaults
   [junit4]   2> 2031446 INFO  (jetty-launcher-7611-thread-1) [    ] o.e.j.s.session node0 Scavenging every 660000ms
   [junit4]   2> 2031446 INFO  (jetty-launcher-7611-thread-1) [    ] o.e.j.s.h.ContextHandler Started o.e.j.s.ServletContextHandler@768395b1{/solr,null,AVAILABLE}
   [junit4]   2> 2031447 INFO  (jetty-launcher-7611-thread-1) [    ] o.e.j.s.AbstractConnector Started ServerConnector@6c72c8de{SSL,[ssl, http/1.1]}{127.0.0.1:40140}
   [junit4]   2> 2031447 INFO  (jetty-launcher-7611-thread-1) [    ] o.e.j.s.Server Started @2031512ms
   [junit4]   2> 2031447 INFO  (jetty-launcher-7611-thread-1) [    ] o.a.s.c.s.e.JettySolrRunner Jetty properties: {hostContext=/solr, hostPort=40140}
   [junit4]   2> 2031447 ERROR (jetty-launcher-7611-thread-1) [    ] o.a.s.u.StartupLoggingUtils Missing Java Option solr.log.dir. Logging may be missing or incomplete.
   [junit4]   2> 2031447 INFO  (jetty-launcher-7611-thread-1) [    ] o.a.s.s.SolrDispatchFilter Using logger factory org.apache.logging.slf4j.Log4jLoggerFactory
   [junit4]   2> 2031447 INFO  (jetty-launcher-7611-thread-1) [    ] o.a.s.s.SolrDispatchFilter  ___      _       Welcome to Apache Solr™ version 8.0.0
   [junit4]   2> 2031447 INFO  (jetty-launcher-7611-thread-1) [    ] o.a.s.s.SolrDispatchFilter / __| ___| |_ _   Starting in cloud mode on port null
   [junit4]   2> 2031447 INFO  (jetty-launcher-7611-thread-1) [    ] o.a.s.s.SolrDispatchFilter \__ \/ _ \ | '_|  Install dir: null
   [junit4]   2> 2031447 INFO  (jetty-launcher-7611-thread-1) [    ] o.a.s.s.SolrDispatchFilter |___/\___/_|_|    Start time: 2018-09-29T20:20:06.217Z
   [junit4]   2> 2031450 INFO  (jetty-launcher-7611-thread-3) [    ] o.e.j.s.Server jetty-9.4.11.v20180605; built: 2018-06-05T18:24:03.829Z; git: d5fc0523cfa96bfebfbda19606cad384d772f04c; jvm 1.8.0_172-b11
   [junit4]   2> 2031450 INFO  (jetty-launcher-7611-thread-2) [    ] o.e.j.s.session DefaultSessionIdManager workerName=node0
   [junit4]   2> 2031450 INFO  (jetty-launcher-7611-thread-2) [    ] o.e.j.s.session No SessionScavenger set, using defaults
   [junit4]   2> 2031450 INFO  (jetty-launcher-7611-thread-2) [    ] o.e.j.s.session node0 Scavenging every 660000ms
   [junit4]   2> 2031452 INFO  (jetty-launcher-7611-thread-4) [    ] o.e.j.s.Server jetty-9.4.11.v20180605; built: 2018-06-05T18:24:03.829Z; git: d5fc0523cfa96bfebfbda19606cad384d772f04c; jvm 1.8.0_172-b11
   [junit4]   2> 2031452 INFO  (zkConnectionManagerCallback-7616-thread-1) [    ] o.a.s.c.c.ConnectionManager zkClient has connected
   [junit4]   2> 2031452 INFO  (jetty-launcher-7611-thread-1) [    ] o.a.s.s.SolrDispatchFilter solr.xml found in ZooKeeper. Loading...
   [junit4]   2> 2031453 INFO  (jetty-launcher-7611-thread-3) [    ] o.e.j.s.session DefaultSessionIdManager workerName=node0
   [junit4]   2> 2031453 INFO  (jetty-launcher-7611-thread-3) [    ] o.e.j.s.session No SessionScavenger set, using defaults
   [junit4]   2> 2031453 INFO  (jetty-launcher-7611-thread-3) [    ] o.e.j.s.session node0 Scavenging every 600000ms
   [junit4]   2> 2031453 INFO  (jetty-launcher-7611-thread-3) [    ] o.e.j.s.h.ContextHandler Started o.e.j.s.ServletContextHandler@75cecc43{/solr,null,AVAILABLE}
   [junit4]   2> 2031454 INFO  (jetty-launcher-7611-thread-3) [    ] o.e.j.s.AbstractConnector Started ServerConnector@3ab26c5a{SSL,[ssl, http/1.1]}{127.0.0.1:41385}
   [junit4]   2> 2031454 INFO  (jetty-launcher-7611-thread-3) [    ] o.e.j.s.Server Started @2031519ms
   [junit4]   2> 2031454 INFO  (jetty-launcher-7611-thread-3) [    ] o.a.s.c.s.e.JettySolrRunner Jetty properties: {hostContext=/solr, hostPort=41385}
   [junit4]   2> 2031454 ERROR (jetty-launcher-7611-thread-3) [    ] o.a.s.u.StartupLoggingUtils Missing Java Option solr.log.dir. Logging may be missing or incomplete.
   [junit4]   2> 2031454 INFO  (jetty-launcher-7611-thread-3) [    ] o.a.s.s.SolrDispatchFilter Using logger factory org.apache.logging.slf4j.Log4jLoggerFactory
   [junit4]   2> 2031454 INFO  (jetty-launcher-7611-thread-3) [    ] o.a.s.s.SolrDispatchFilter  ___      _       Welcome to Apache Solr™ version 8.0.0
   [junit4]   2> 2031454 INFO  (jetty-launcher-7611-thread-3) [    ] o.a.s.s.SolrDispatchFilter / __| ___| |_ _   Starting in cloud mode on port null
   [junit4]   2> 2031454 INFO  (jetty-launcher-7611-thread-3) [    ] o.a.s.s.SolrDispatchFilter \__ \/ _ \ | '_|  Install dir: null
   [junit4]   2> 2031454 INFO  (jetty-launcher-7611-thread-3) [    ] o.a.s.s.SolrDispatchFilter |___/\___/_|_|    Start time: 2018-09-29T20:20:06.224Z
   [junit4]   2> 2031461 INFO  (jetty-launcher-7611-thread-2) [    ] o.e.j.s.h.ContextHandler Started o.e.j.s.ServletContextHandler@1294427b{/solr,null,AVAILABLE}
   [junit4]   2> 2031462 INFO  (jetty-launcher-7611-thread-2) [    ] o.e.j.s.AbstractConnector Started ServerConnector@1c13ea15{SSL,[ssl, http/1.1]}{127.0.0.1:43569}
   [junit4]   2> 2031462 INFO  (jetty-launcher-7611-thread-2) [    ] o.e.j.s.Server Started @2031527ms
   [junit4]   2> 2031462 INFO  (jetty-launcher-7611-thread-2) [    ] o.a.s.c.s.e.JettySolrRunner Jetty properties: {hostContext=/solr, hostPort=43569}
   [junit4]   2> 2031462 ERROR (jetty-launcher-7611-thread-2) [    ] o.a.s.u.StartupLoggingUtils Missing Java Option solr.log.dir. Logging may be missing or incomplete.
   [junit4]   2> 2031462 INFO  (jetty-launcher-7611-thread-2) [    ] o.a.s.s.SolrDispatchFilter Using logger factory org.apache.logging.slf4j.Log4jLoggerFactory
   [junit4]   2> 2031462 INFO  (jetty-launcher-7611-thread-2) [    ] o.a.s.s.SolrDispatchFilter  ___      _       Welcome to Apache Solr™ version 8.0.0
   [junit4]   2> 2031462 INFO  (jetty-launcher-7611-thread-2) [    ] o.a.s.s.SolrDispatchFilter / __| ___| |_ _   Starting in cloud mode on port null
   [junit4]   2> 2031462 INFO  (jetty-launcher-7611-thread-2) [    ] o.a.s.s.SolrDispatchFilter \__ \/ _ \ | '_|  Install dir: null
   [junit4]   2> 2031462 INFO  (jetty-launcher-7611-thread-2) [    ] o.a.s.s.SolrDispatchFilter |___/\___/_|_|    Start time: 2018-09-29T20:20:06.232Z
   [junit4]   2> 2031464 INFO  (jetty-launcher-7611-thread-4) [    ] o.e.j.s.session DefaultSessionIdManager workerName=node0
   [junit4]   2> 2031464 INFO  (jetty-launcher-7611-thread-4) [    ] o.e.j.s.session No SessionScavenger set, using defaults
   [junit4]   2> 2031464 INFO  (jetty-launcher-7611-thread-4) [    ] o.e.j.s.session node0 Scavenging every 660000ms
   [junit4]   2> 2031465 INFO  (jetty-launcher-7611-thread-4) [    ] o.e.j.s.h.ContextHandler Started o.e.j.s.ServletContextHandler@6e3dc430{/solr,null,AVAILABLE}
   [junit4]   2> 2031465 INFO  (jetty-launcher-7611-thread-4) [    ] o.e.j.s.AbstractConnector Started ServerConnector@428bc824{SSL,[ssl, http/1.1]}{127.0.0.1:33009}
   [junit4]   2> 2031465 INFO  (jetty-launcher-7611-thread-4) [    ] o.e.j.s.Server Started @2031530ms
   [junit4]   2> 2031465 INFO  (jetty-launcher-7611-thread-4) [    ] o.a.s.c.s.e.JettySolrRunner Jetty properties: {hostContext=/solr, hostPort=33009}
   [junit4]   2> 2031465 ERROR (jetty-launcher-7611-thread-4) [    ] o.a.s.u.StartupLoggingUtils Missing Java Option solr.log.dir. Logging may be missing or incomplete.
   [junit4]   2> 2031465 INFO  (jetty-launcher-7611-thread-4) [    ] o.a.s.s.SolrDispatchFilter Using logger factory org.apache.logging.slf4j.Log4jLoggerFactory
   [junit4]   2> 2031465 INFO  (jetty-launcher-7611-thread-4) [    ] o.a.s.s.SolrDispatchFilter  ___      _       Welcome to Apache Solr™ version 8.0.0
   [junit4]   2> 2031465 INFO  (jetty-launcher-7611-thread-4) [    ] o.a.s.s.SolrDispatchFilter / __| ___| |_ _   Starting in cloud mode on port null
   [junit4]   2> 2031465 INFO  (jetty-launcher-7611-thread-4) [    ] o.a.s.s.SolrDispatchFilter \__ \/ _ \ | '_|  Install dir: null
   [junit4]   2> 2031465 INFO  (jetty-launcher-7611-thread-4) [    ] o.a.s.s.SolrDispatchFilter |___/\___/_|_|    Start time: 2018-09-29T20:20:06.235Z
   [junit4]   2> 2031467 INFO  (zkConnectionManagerCallback-7618-thread-1) [    ] o.a.s.c.c.ConnectionManager zkClient has connected
   [junit4]   2> 2031468 INFO  (jetty-launcher-7611-thread-3) [    ] o.a.s.s.SolrDispatchFilter solr.xml found in ZooKeeper. Loading...
   [junit4]   2> 2031470 INFO  (zkConnectionManagerCallback-7620-thread-1) [    ] o.a.s.c.c.ConnectionManager zkClient has connected
   [junit4]   2> 2031498 INFO  (jetty-launcher-7611-thread-2) [    ] o.a.s.s.SolrDispatchFilter solr.xml found in ZooKeeper. Loading...
   [junit4]   2> 2031503 INFO  (zkConnectionManagerCallback-7622-thread-1) [    ] o.a.s.c.c.ConnectionManager zkClient has connected
   [junit4]   2> 2031504 INFO  (jetty-launcher-7611-thread-4) [    ] o.a.s.s.SolrDispatchFilter solr.xml found in ZooKeeper. Loading...
   [junit4]   2> 2031625 INFO  (jetty-launcher-7611-thread-1) [    ] o.a.s.c.ZkContainer Zookeeper client=127.0.0.1:37797/solr
   [junit4]   2> 2031627 INFO  (zkConnectionManagerCallback-7626-thread-1) [    ] o.a.s.c.c.ConnectionManager zkClient has connected
   [junit4]   2> 2031628 INFO  (jetty-launcher-7611-thread-2) [    ] o.a.s.c.ZkContainer Zookeeper client=127.0.0.1:37797/solr
   [junit4]   2> 2031629 DEBUG (jetty-launcher-7611-thread-1) [n:127.0.0.1:40140_solr    ] o.a.s.c.ZkController Added new OnReconnect listener org.apache.solr.cloud.ZkController$$Lambda$271/1755433460@371bbea
   [junit4]   2> 2031631 INFO  (zkConnectionManagerCallback-7630-thread-1) [    ] o.a.s.c.c.ConnectionManager zkClient has connected
   [junit4]   2> 2031632 INFO  (zkConnectionManagerCallback-7632-thread-1) [    ] o.a.s.c.c.ConnectionManager zkClient has connected
   [junit4]   2> 2031632 DEBUG (jetty-launcher-7611-thread-2) [n:127.0.0.1:43569_solr    ] o.a.s.c.ZkController Added new OnReconnect listener org.apache.solr.cloud.ZkController$$Lambda$271/1755433460@74bf1237
   [junit4]   2> 2031636 INFO  (zkConnectionManagerCallback-7634-thread-1) [    ] o.a.s.c.c.ConnectionManager zkClient has connected
   [junit4]   2> 2031673 INFO  (jetty-launcher-7611-thread-3) [    ] o.a.s.c.ZkContainer Zookeeper client=127.0.0.1:37797/solr
   [junit4]   2> 2031677 INFO  (zkConnectionManagerCallback-7642-thread-1) [    ] o.a.s.c.c.ConnectionManager zkClient has connected
   [junit4]   2> 2031678 DEBUG (jetty-launcher-7611-thread-3) [n:127.0.0.1:41385_solr    ] o.a.s.c.ZkController Added new OnReconnect listener org.apache.solr.cloud.ZkController$$Lambda$271/1755433460@6de3e9d7
   [junit4]   2> 2031681 INFO  (zkConnectionManagerCallback-7644-thread-1) [    ] o.a.s.c.c.ConnectionManager zkClient has connected
   [junit4]   2> 2031700 DEBUG (SyncThread:0) [    ] o.a.s.c.ZkTestServer Watch added: data: /solr/clusterprops.json
   [junit4]   2> 2031701 DEBUG (SyncThread:0) [    ] o.a.s.c.ZkTestServer Watch added: children: /solr/live_nodes
   [junit4]   2> 2031701 DEBUG (SyncThread:0) [    ] o.a.s.c.ZkTestServer Watch added: data: /solr/clusterstate.json
   [junit4]   2> 2031702 DEBUG (SyncThread:0) [    ] o.a.s.c.ZkTestServer Watch added: children: /solr/collections
   [junit4]   2> 2031702 DEBUG (SyncThread:0) [    ] o.a.s.c.ZkTestServer Watch added: create/delete: /solr/aliases.json
   [junit4]   2> 2031703 DEBUG (SyncThread:0) [    ] o.a.s.c.ZkTestServer Watch added: create/delete: /solr/security.json
   [junit4]   2> 2031709 DEBUG (jetty-launcher-7611-thread-3) [n:127.0.0.1:41385_solr    ] o.a.s.c.LeaderElector Joined leadership election with path: /overseer_elect/election/72420737233059850-127.0.0.1:41385_solr-n_0000000000
   [junit4]   2> 2031709 INFO  (jetty-launcher-7611-thread-3) [n:127.0.0.1:41385_solr    ] o.a.s.c.OverseerElectionContext I am going to be the leader 127.0.0.1:41385_solr
   [junit4]   2> 2031711 INFO  (jetty-launcher-7611-thread-3) [n:127.0.0.1:41385_solr    ] o.a.s.c.Overseer Overseer (id=72420737233059850-127.0.0.1:41385_solr-n_0000000000) starting
   [junit4]   2> 2031722 INFO  (zkConnectionManagerCallback-7651-thread-1) [    ] o.a.s.c.c.ConnectionManager zkClient has connected
   [junit4]   2> 2031723 DEBUG (SyncThread:0) [    ] o.a.s.c.ZkTestServer Watch added: data: /solr/clusterprops.json
   [junit4]   2> 2031723 DEBUG (SyncThread:0) [    ] o.a.s.c.ZkTestServer Watch added: children: /solr/live_nodes
   [junit4]   2> 2031723 DEBUG (SyncThread:0) [    ] o.a.s.c.ZkTestServer Watch added: data: /solr/clusterstate.json
   [junit4]   2> 2031724 DEBUG (SyncThread:0) [    ] o.a.s.c.ZkTestServer Watch added: children: /solr/collections
   [junit4]   2> 2031724 DEBUG (SyncThread:0) [    ] o.a.s.c.ZkTestServer Watch added: create/delete: /solr/aliases.json
   [junit4]   2> 2031725 INFO  (jetty-launcher-7611-thread-3) [n:127.0.0.1:41385_solr    ] o.a.s.c.s.i.ZkClientClusterStateProvider Cluster at 127.0.0.1:37797/solr ready
   [junit4]   2> 2031725 DEBUG (OverseerCollectionConfigSetProcessor-72420737233059850-127.0.0.1:41385_solr-n_0000000000) [n:127.0.0.1:41385_solr    ] o.a.s.c.OverseerTaskProcessor Process current queue of overseer operations
   [junit4]   2> 2031726 INFO  (OverseerStateUpdate-72420737233059850-127.0.0.1:41385_solr-n_0000000000) [n:127.0.0.1:41385_solr    ] o.a.s.c.Overseer Starting to work on the main queue : 127.0.0.1:41385_solr
   [junit4]   2> 2031726 INFO  (jetty-launcher-7611-thread-3) [n:127.0.0.1:41385_solr    ] o.a.s.c.ZkController Register node as live in ZooKeeper:/live_nodes/127.0.0.1:41385_solr
   [junit4]   2> 2031727 DEBUG (OverseerAutoScalingTriggerThread-72420737233059850-127.0.0.1:41385_solr-n_0000000000) [    ] o.a.s.c.a.OverseerTriggerThread Adding .auto_add_replicas and .scheduled_maintenance triggers
   [junit4]   2> 2031728 DEBUG (SyncThread:0) [    ] o.a.s.c.ZkTestServer Watch fired: children: /solr/live_nodes
   [junit4]   2> 2031728 DEBUG (SyncThread:0) [    ] o.a.s.c.ZkTestServer Watch fired: children: /solr/live_nodes
   [junit4]   2> 2031728 DEBUG (SyncThread:0) [    ] o.a.s.c.ZkTestServer Watch added: data: /solr/autoscaling.json
   [junit4]   2> 2031728 DEBUG (OverseerAutoScalingTriggerThread-72420737233059850-127.0.0.1:41385_solr-n_0000000000) [    ] o.a.s.c.a.OverseerTriggerThread Refreshing /autoscaling.json with znode version 1
   [junit4]   2> 2031729 DEBUG (OverseerAutoScalingTriggerThread-72420737233059850-127.0.0.1:41385_solr-n_0000000000) [    ] o.a.s.c.a.OverseerTriggerThread Current znodeVersion 1, lastZnodeVersion -1
   [junit4]   2> 2031729 DEBUG (OverseerAutoScalingTriggerThread-72420737233059850-127.0.0.1:41385_solr-n_0000000000) [    ] o.a.s.c.a.OverseerTriggerThread Processed trigger updates upto znodeVersion 1
   [junit4]   2> 2031736 DEBUG (OverseerCollectionConfigSetProcessor-72420737233059850-127.0.0.1:41385_solr-n_0000000000) [n:127.0.0.1:41385_solr    ] o.a.s.c.OverseerTaskProcessor Cleaning up work-queue. #Running tasks: 0
   [junit4]   2> 2031736 DEBUG (OverseerCollectionConfigSetProcessor-72420737233059850-127.0.0.1:41385_solr-n_0000000000) [n:127.0.0.1:41385_solr    ] o.a.s.c.OverseerTaskProcessor RunningTasks: []
   [junit4]   2> 2031736 DEBUG (OverseerCollectionConfigSetProcessor-72420737233059850-127.0.0.1:41385_solr-n_0000000000) [n:127.0.0.1:41385_solr    ] o.a.s.c.OverseerTaskProcessor BlockedTasks: []
   [junit4]   2> 2031736 DEBUG (OverseerCollectionConfigSetProcessor-72420737233059850-127.0.0.1:41385_solr-n_0000000000) [n:127.0.0.1:41385_solr    ] o.a.s.c.OverseerTaskProcessor CompletedTasks: []
   [junit4]   2> 2031736 DEBUG (OverseerCollectionConfigSetProcessor-72420737233059850-127.0.0.1:41385_solr-n_0000000000) [n:127.0.0.1:41385_solr    ] o.a.s.c.OverseerTaskProcessor RunningZKTasks: []
   [junit4]   2> 2031736 DEBUG (OverseerCollectionConfigSetProcessor-72420737233059850-127.0.0.1:41385_solr-n_0000000000) [n:127.0.0.1:41385_solr    ] o.a.s.c.OverseerTaskQueue Peeking for top 100 elements. ExcludeSet: []
   [junit4]   2> 2031740 DEBUG (SyncThread:0) [    ] o.a.s.c.ZkTestServer Watch added: children: /solr/overseer/collection-queue-work
   [junit4]   2> 2031741 DEBUG (SyncThread:0) [    ] o.a.s.c.ZkTestServer Watch added: children: /solr/overseer/queue-work
   [junit4]   2> 2031742 DEBUG (SyncThread:0) [    ] o.a.s.c.ZkTestServer Watch added: children: /solr/overseer/queue
   [junit4]   2> 2031760 INFO  (jetty-launcher-7611-thread-3) [n:127.0.0.1:41385_solr    ] o.a.s.h.a.MetricsHistoryHandler No .system collection, keeping metrics history in memory.
   [junit4]   2> 2031761 DEBUG (SyncThread:0) [    ] o.a.s.c.ZkTestServer Watch added: children: /solr/live_nodes
   [junit4]   2> 2031761 INFO  (zkCallback-7650-thread-1) [    ] o.a.s.c.c.ZkStateReader Updated live nodes from ZooKeeper... (0) -> (1)
   [junit4]   2> 2031765 DEBUG (SyncThread:0) [    ] o.a.s.c.ZkTestServer Watch added: data: /solr/clusterprops.json
   [junit4]   2> 2031765 DEBUG (SyncThread:0) [    ] o.a.s.c.ZkTestServer Watch added: children: /solr/live_nodes
   [junit4]   2> 2031765 INFO  (jetty-launcher-7611-thread-1) [n:127.0.0.1:40140_solr    ] o.a.s.c.c.ZkStateReader Updated live nodes from ZooKeeper... (0) -> (1)
   [junit4]   2> 2031765 DEBUG (SyncThread:0) [    ] o.a.s.c.ZkTestServer Watch added: data: /solr/clusterstate.json
   [junit4]   2> 2031766 DEBUG (SyncThread:0) [    ] o.a.s.c.ZkTestServer Watch added: children: /solr/collections
   [junit4]   2> 2031766 DEBUG (SyncThread:0) [    ] o.a.s.c.ZkTestServer Watch added: create/delete: /solr/aliases.json
   [junit4]   2> 2031766 DEBUG (SyncThread:0) [    ] o.a.s.c.ZkTestServer Watch added: data: /solr/clusterprops.json
   [junit4]   2> 2031767 DEBUG (SyncThread:0) [    ] o.a.s.c.ZkTestServer Watch added: children: /solr/live_nodes
   [junit4]   2> 2031767 INFO  (jetty-launcher-7611-thread-2) [n:127.0.0.1:43569_solr    ] o.a.s.c.c.ZkStateReader Updated live nodes from ZooKeeper... (0) -> (1)
   [junit4]   2> 2031767 DEBUG (SyncThread:0) [    ] o.a.s.c.ZkTestServer Watch added: create/delete: /solr/security.json
   [junit4]   2> 2031767 DEBUG (SyncThread:0) [    ] o.a.s.c.ZkTestServer Watch added: data: /solr/clusterstate.json
   [junit4]   2> 2031767 DEBUG (SyncThread:0) [    ] o.a.s.c.ZkTestServer Watch added: children: /solr/collections
   [junit4]   2> 2031768 DEBUG (SyncThread:0) [    ] o.a.s.c.ZkTestServer Watch added: create/delete: /solr/aliases.json
   [junit4]   2> 2031769 DEBUG (SyncThread:0) [    ] o.a.s.c.ZkTestServer Watch added: create/delete: /solr/security.json
   [junit4]   2> 2031769 DEBUG (jetty-launcher-7611-thread-1) [n:127.0.0.1:40140_solr    ] o.a.s.c.LeaderElector Joined leadership election with path: /overseer_elect/election/72420737233059847-127.0.0.1:40140_solr-n_0000000001
   [junit4]   2> 2031770 DEBUG (SyncThread:0) [    ] o.a.s.c.ZkTestServer Watch added: data: /solr/overseer_elect/election/72420737233059850-127.0.0.1:41385_solr-n_0000000000
   [junit4]   2> 2031770 DEBUG (jetty-launcher-7611-thread-1) [n:127.0.0.1:40140_solr    ] o.a.s.c.LeaderElector Watching path /overseer_elect/election/72420737233059850-127.0.0.1:41385_solr-n_0000000000 to know if I could be the leader
   [junit4]   2> 2031770 DEBUG (jetty-launcher-7611-thread-1) [n:127.0.0.1:40140_solr    ] o.a.s.c.ZkController Publish node=127.0.0.1:40140_solr as DOWN
   [junit4]   2> 2031771 DEBUG (jetty-launcher-7611-thread-2) [n:127.0.0.1:43569_solr    ] o.a.s.c.LeaderElector Joined leadership election with path: /overseer_elect/election/72420737233059848-127.0.0.1:43569_solr-n_0000000002
   [junit4]   2> 2031771 DEBUG (SyncThread:0) [    ] o.a.s.c.ZkTestServer Watch added: data: /solr/overseer_elect/election/72420737233059847-127.0.0.1:40140_solr-n_0000000001
   [junit4]   2> 2031772 DEBUG (jetty-launcher-7611-thread-2) [n:127.0.0.1:43569_solr    ] o.a.s.c.LeaderElector Watching path /overseer_elect/election/72420737233059847-127.0.0.1:40140_solr-n_0000000001 to know if I could be the leader
   [junit4]   2> 2031772 DEBUG (SyncThread:0) [    ] o.a.s.c.ZkTestServer Watch fired: children: /solr/overseer/queue
   [junit4]   2> 2031772 INFO  (jetty-launcher-7611-thread-1) [n:127.0.0.1:40140_solr    ] o.a.s.c.TransientSolrCoreCacheDefault Allocating transient cache for 2147483647 transient cores
   [junit4]   2> 2031772 INFO  (jetty-launcher-7611-thread-1) [n:127.0.0.1:40140_solr    ] o.a.s.c.ZkController Register node as live in ZooKeeper:/live_nodes/127.0.0.1:40140_solr
   [junit4]   2> 2031772 DEBUG (jetty-launcher-7611-thread-2) [n:127.0.0.1:43569_solr    ] o.a.s.c.ZkController Publish node=127.0.0.1:43569_solr as DOWN
   [junit4]   2> 2031773 DEBUG (SyncThread:0) [    ] o.a.s.c.ZkTestServer Watch fired: children: /solr/live_nodes
   [junit4]   2> 2031773 DEBUG (SyncThread:0) [    ] o.a.s.c.ZkTestServer Watch fired: children: /solr/live_nodes
   [junit4]   2> 2031773 DEBUG (SyncThread:0) [    ] o.a.s.c.ZkTestServer Watch fired: children: /solr/live_nodes
   [junit4]   2> 2031784 DEBUG (SyncThread:0) [    ] o.a.s.c.ZkTestServer Watch added: children: /solr/live_nodes
   [junit4]   2> 2031784 DEBUG (SyncThread:0) [    ] o.a.s.c.ZkTestServer Watch added: children: /solr/autoscaling/events/.scheduled_maintenance
   [junit4]   2> 2031784 DEBUG (SyncThread:0) [    ] o.a.s.c.ZkTestServer Watch added: children: /solr/live_nodes
   [junit4]   2> 2031784 INFO  (zkCallback-7650-thread-1) [    ] o.a.s.c.c.ZkStateReader Updated live nodes from ZooKeeper... (1) -> (2)
   [junit4]   2> 2031784 INFO  (zkCallback-7643-thread-1) [    ] o.a.s.c.c.ZkStateReader Updated live nodes from ZooKeeper... (0) -> (2)
   [junit4]   2> 2031785 DEBUG (SyncThread:0) [    ] o.a.s.c.ZkTestServer Watch added: children: /solr/live_nodes
   [junit4]   2> 2031785 INFO  (zkCallback-7631-thread-1) [    ] o.a.s.c.c.ZkStateReader Updated live nodes from ZooKeeper... (1) -> (2)
   [junit4]   2> 2031785 DEBUG (OverseerAutoScalingTriggerThread-72420737233059850-127.0.0.1:41385_solr-n_0000000000) [    ] o.a.s.c.a.NodeLostTrigger NodeLostTrigger .auto_add_replicas - Initial livenodes: [127.0.0.1:40140_solr, 127.0.0.1:41385_solr]
   [junit4]   2> 2031786 INFO  (jetty-launcher-7611-thread-2) [n:127.0.0.1:43569_solr    ] o.a.s.c.TransientSolrCoreCacheDefault Allocating transient cache for 2147483647 transient cores
   [junit4]   2> 2031786 INFO  (jetty-launcher-7611-thread-2) [n:127.0.0.1:43569_solr    ] o.a.s.c.ZkController Register node as live in ZooKeeper:/live_nodes/127.0.0.1:43569_solr
   [junit4]   2> 2031786 DEBUG (SyncThread:0) [    ] o.a.s.c.ZkTestServer Watch fired: children: /solr/live_nodes
   [junit4]   2> 2031786 DEBUG (SyncThread:0) [    ] o.a.s.c.ZkTestServer Watch fired: children: /solr/live_nodes
   [junit4]   2> 2031786 DEBUG (SyncThread:0) [    ] o.a.s.c.ZkTestServer Watch fired: children: /solr/live_nodes
   [junit4]   2> 2031788 DEBUG (SyncThread:0) [    ] o.a.s.c.ZkTestServer Watch added: children: /solr/live_nodes
   [junit4]   2> 2031788 DEBUG (SyncThread:0) [    ] o.a.s.c.ZkTestServer Watch added: children: /solr/live_nodes
   [junit4]   2> 2031789 INFO  (zkCallback-7650-thread-1) [    ] o.a.s.c.c.ZkStateReader Updated live nodes from ZooKeeper... (2) -> (3)
   [junit4]   2> 2031789 DEBUG (SyncThread:0) [    ] o.a.s.c.ZkTestServer Watch added: children: /solr/autoscaling/events/.auto_add_replicas
   [junit4]   2> 2031789 INFO  (zkCallback-7633-thread-1) [    ] o.a.s.c.c.ZkStateReader Updated live nodes from ZooKeeper... (1) -> (3)
   [junit4]   2> 2031789 DEBUG (ScheduledTrigger-9239-thread-1) [    ] o.a.s.c.a.NodeLostTrigger Running NodeLostTrigger: .auto_add_replicas with currently live nodes: 3
   [junit4]   2> 2031789 DEBUG (OverseerAutoScalingTriggerThread-72420737233059850-127.0.0.1:41385_solr-n_0000000000) [    ] o.a.s.c.a.OverseerTriggerThread -- clean old nodeAdded markers
   [junit4]   2> 2031792 DEBUG (SyncThread:0) [    ] o.a.s.c.ZkTestServer Watch added: children: /solr/live_nodes
   [junit4]   2> 2031792 DEBUG (SyncThread:0) [    ] o.a.s.c.ZkTestServer Watch added: children: /solr/live_nodes
   [junit4]   2> 2031792 INFO  (zkCallback-7643-thread-1) [    ] o.a.s.c.c.ZkStateReader Updated live nodes from ZooKeeper... (2) -> (3)
   [junit4]   2> 2031792 INFO  (zkCallback-7631-thread-1) [    ] o.a.s.c.c.ZkStateReader Updated live nodes from ZooKeeper... (2) -> (3)
   [junit4]   2> 2031792 DEBUG (SyncThread:0) [    ] o.a.s.c.ZkTestServer Watch added: children: /solr/overseer/queue
   [junit4]   2> 2031792 INFO  (jetty-launcher-7611-thread-3) [n:127.0.0.1:41385_solr    ] o.a.s.m.r.SolrJmxReporter JMX monitoring for 'solr_41385.solr.node' (registry 'solr.node') enabled at server: com.sun.jmx.mbeanserver.JmxMBeanServer@2a08d804
   [junit4]   2> 2031793 DEBUG (OverseerStateUpdate-72420737233059850-127.0.0.1:41385_solr-n_0000000000) [n:127.0.0.1:41385_solr    ] o.a.s.c.Overseer processMessage: queueSize: 2, message = {
   [junit4]   2>   "operation":"downnode",
   [junit4]   2>   "node_name":"127.0.0.1:40140_solr"} current state version: 0
   [junit4]   2> 2031792 DEBUG (OverseerAutoScalingTriggerThread-72420737233059850-127.0.0.1:41385_solr-n_0000000000) [    ] o.a.s.c.a.OverseerTriggerThread Current znodeVersion 1, lastZnodeVersion 1
   [junit4]   2> 2031793 DEBUG (OverseerStateUpdate-72420737233059850-127.0.0.1:41385_solr-n_0000000000) [n:127.0.0.1:41385_solr    ] o.a.s.c.Overseer processMessage: queueSize: 2, message = {
   [junit4]   2>   "operation":"downnode",
   [junit4]   2>   "node_name":"127.0.0.1:43569_solr"} current state version: 0
   [junit4]   2> 2031797 INFO  (jetty-launcher-7611-thread-4) [    ] o.a.s.c.ZkContainer Zookeeper client=127.0.0.1:37797/solr
   [junit4]   2> 2031802 INFO  (zkConnectionManagerCallback-7656-thread-1) [    ] o.a.s.c.c.ConnectionManager zkClient has connected
   [junit4]   2> 2031804 INFO  (jetty-launcher-7611-thread-3) [n:127.0.0.1:41385_solr    ] o.a.s.m.r.SolrJmxReporter JMX monitoring for 'solr_41385.solr.jvm' (registry 'solr.jvm') enabled at server: com.sun.jmx.mbeanserver.JmxMBeanServer@2a08d804
   [junit4]   2> 2031804 INFO  (jetty-launcher-7611-thread-3) [n:127.0.0.1:41385_solr    ] o.a.s.m.r.SolrJmxReporter JMX monitoring for 'solr_41385.solr.jetty' (registry 'solr.jetty') enabled at server: com.sun.jmx.mbeanserver.JmxMBeanServer@2a08d804
   [junit4]   2> 2031805 DEBUG (jetty-launcher-7611-thread-4) [n:127.0.0.1:33009_solr    ] o.a.s.c.ZkController Added new OnReconnect listener org.apache.solr.cloud.ZkController$$Lambda$271/1755433460@444444d1
   [junit4]   2> 2031805 INFO  (jetty-launcher-7611-thread-3) [n:127.0.0.1:41385_solr    ] o.a.s.c.CorePropertiesLocator Found 0 core definitions underneath /x1/jenkins/jenkins-slave/workspace/Lucene-Solr-BadApples-Tests-master/solr/build/solr-core/test/J1/temp/solr.cloud.MoveReplicaHDFSTest_DF78F1E1A93D7E38-001/tempDir-001/node3/.
   [junit4]   2> 2031806 INFO  (zkConnectionManagerCallback-7662-thread-1) [    ] o.a.s.c.c.ConnectionManager zkClient has connected
   [junit4]   2> 2031806 DEBUG (SyncThread:0) [    ] o.a.s.c.ZkTestServer Watch added: data: /solr/clusterprops.json
   [junit4]   2> 2031807 DEBUG (SyncThread:0) [    ] o.a.s.c.ZkTestServer Watch added: children: /solr/live_nodes
   [junit4]   2> 2031807 INFO  (jetty-launcher-7611-thread-2) [n:127.0.0.1:43569_solr    ] o.a.s.c.c.ZkStateReader Updated live nodes from ZooKeeper... (0) -> (3)
   [junit4]   2> 2031808 DEBUG (SyncThread:0) [    ] o.a.s.c.ZkTestServer Watch added: data: /solr/clusterstate.json
   [junit4]   2> 2031808 INFO  (zkConnectionManagerCallback-7664-thread-1) [    ] o.a.s.c.c.ConnectionManager zkClient has connected
   [junit4]   2> 2031809 DEBUG (SyncThread:0) [    ] o.a.s.c.ZkTestServer Watch added: children: /solr/collections
   [junit4]   2> 2031809 DEBUG (SyncThread:0) [    ] o.a.s.c.ZkTestServer Watch added: create/delete: /solr/aliases.json
   [junit4]   2> 2031809 INFO  (jetty-launcher-7611-thread-2) [n:127.0.0.1:43569_solr    ] o.a.s.c.s.i.ZkClientClusterStateProvider Cluster at 127.0.0.1:37797/solr ready
   [junit4]   2> 2031809 INFO  (zkConnectionManagerCallback-7668-thread-1) [    ] o.a.s.c.c.ConnectionManager zkClient has connected
   [junit4]   2> 2031810 INFO  (jetty-launcher-7611-thread-2) [n:127.0.0.1:43569_solr    ] o.a.s.h.a.MetricsHistoryHandler No .system collection, keeping metrics history in memory.
   [junit4]   2> 2031816 DEBUG (SyncThread:0) [    ] o.a.s.c.ZkTestServer Watch added: data: /solr/clusterprops.json
   [junit4]   2> 2031817 DEBUG (SyncThread:0) [    ] o.a.s.c.ZkTestServer Watch added: children: /solr/live_nodes
   [junit4]   2> 2031818 INFO  (jetty-launcher-7611-thread-1) [n:127.0.0.1:40140_solr    ] o.a.s.c.c.ZkStateReader Updated live nodes from ZooKeeper... (0) -> (3)
   [junit4]   2> 2031819 DEBUG (SyncThread:0) [    ] o.a.s.c.ZkTestServer Watch added: data: /solr/clusterstate.json
   [junit4]   2> 2031819 DEBUG (SyncThread:0) [    ] o.a.s.c.ZkTestServer Watch added: children: /solr/collections
   [junit4]   2> 2031819 DEBUG (SyncThread:0) [    ] o.a.s.c.ZkTestServer Watch added: create/delete: /solr/aliases.json
   [junit4]   2> 2031820 INFO  (jetty-launcher-7611-thread-1) [n:127.0.0.1:40140_solr    ] o.a.s.c.s.i.ZkClientClusterStateProvider Cluster at 127.0.0.1:37797/solr ready
   [junit4]   2> 2031821 INFO  (jetty-launcher-7611-thread-1) [n:127.0.0.1:40140_solr    ] o.a.s.h.a.MetricsHistoryHandler No .system collection, keeping metrics history in memory.
   [junit4]   2> 2031827 DEBUG (SyncThread:0) [    ] o.a.s.c.ZkTestServer Watch added: data: /solr/clusterprops.json
   [junit4]   2> 2031827 DEBUG (SyncThread:0) [    ] o.a.s.c.ZkTestServer Watch added: children: /solr/live_nodes
   [junit4]   2> 2031827 INFO  (jetty-launcher-7611-thread-4) [n:127.0.0.1:33009_solr    ] o.a.s.c.c.ZkStateReader Updated live nodes from ZooKeeper... (0) -> (3)
   [junit4]   2> 2031827 DEBUG (SyncThread:0) [    ] o.a.s.c.ZkTestServer Watch added: data: /solr/clusterstate.json
   [junit4]   2> 2031828 DEBUG (SyncThread:0) [    ] o.a.s.c.ZkTestServer Watch added: children: /solr/collections
   [junit4]   2> 2031828 DEBUG (SyncThread:0) [    ] o.a.s.c.ZkTestServer Watch added: create/delete: /solr/aliases.json
   [junit4]   2> 2031828 DEBUG (SyncThread:0) [    ] o.a.s.c.ZkTestServer Watch added: create/delete: /solr/security.json
   [junit4]   2> 2031830 DEBUG (jetty-launcher-7611-thread-4) [n:127.0.0.1:33009_solr    ] o.a.s.c.LeaderElector Joined leadership election with path: /overseer_elect/election/72420737233059854-127.0.0.1:33009_solr-n_0000000003
   [junit4]   2> 2031830 DEBUG (SyncThread:0) [    ] o.a.s.c.ZkTestServer Watch added: data: /solr/overseer_elect/election/72420737233059848-127.0.0.1:43569_solr-n_0000000002
   [junit4]   2> 2031830 DEBUG (jetty-launcher-7611-thread-4) [n:127.0.0.1:33009_solr    ] o.a.s.c.LeaderElector Watching path /overseer_elect/election/72420737233059848-127.0.0.1:43569_solr-n_0000000002 to know if I could be the leader
   [junit4]   2> 2031831 DEBUG (jetty-launcher-7611-thread-4) [n:127.0.0.1:33009_solr    ] o.a.s.c.ZkController Publish node=127.0.0.1:33009_solr as DOWN
   [junit4]   2> 2031831 DEBUG (SyncThread:0) [    ] o.a.s.c.ZkTestServer Watch fired: children: /solr/overseer/queue
   [junit4]   2> 2031831 INFO  (jetty-launcher-7611-thread-4) [n:127.0.0.1:33009_solr    ] o.a.s.c.TransientSolrCoreCacheDefault Allocating transient cache for 2147483647 transient cores
   [junit4]   2> 2031831 INFO  (jetty-launcher-7611-thread-4) [n:127.0.0.1:33009_solr    ] o.a.s.c.ZkController Register node as live in ZooKeeper:/live_nodes/127.0.0.1:33009_solr
   [junit4]   2> 2031832 DEBUG (SyncThread:0) [    ] o.a.s.c.ZkTestServer Watch added: children: /solr/overseer/queue
   [junit4]   2> 2031832 DEBUG (OverseerStateUpdate-72420737233059850-127.0.0.1:41385_solr-n_0000000000) [n:127.0.0.1:41385_solr    ] o.a.s.c.Overseer processMessage: queueSize: 3, message = {
   [junit4]   2>   "operation":"downnode",
   [junit4]   2>   "node_name":"127.0.0.1:33009_solr"} current state version: 0
   [junit4]   2> 2031832 DEBUG (SyncThread:0) [    ] o.a.s.c.ZkTestServer Watch fired: children: /solr/live_nodes
   [junit4]   2> 2031832 DEBUG (SyncThread:0) [    ] o.a.s.c.ZkTestServer Watch fired: children: /solr/live_nodes
   [junit4]   2> 2031832 DEBUG (SyncThread:0) [    ] o.a.s.c.ZkTestServer Watch fired: children: /solr/live_nodes
   [junit4]   2> 2031832 DEBUG (SyncThread:0) [    ] o.a.s.c.ZkTestServer Watch fired: children: /solr/live_nodes
   [junit4]   2> 2031832 DEBUG (SyncThread:0) [    ] o.a.s.c.ZkTestServer Watch fired: children: /solr/live_nodes
   [junit4]   2> 2031832 DEBUG (SyncThread:0) [    ] o.a.s.c.ZkTestServer Watch fired: children: /solr/live_nodes
   [junit4]   2> 2031832 DEBUG (SyncThread:0) [    ] o.a.s.c.ZkTestServer Watch fired: children: /solr/live_nodes
   [junit4]   2> 2031833 DEBUG (SyncThread:0) [    ] o.a.s.c.ZkTestServer Watch added: children: /solr/live_nodes
   [junit4]   2> 2031833 DEBUG (SyncThread:0) [    ] o.a.s.c.ZkTestServer Watch added: children: /solr/live_nodes
   [junit4]   2> 2031833 DEBUG (SyncThread:0) [    ] o.a.s.c.ZkTestServer Watch added: children: /solr/live_nodes
   [junit4]   2> 2031833 INFO  (zkCallback-7650-thread-1) [    ] o.a.s.c.c.ZkStateReader Updated live nodes from ZooKeeper... (3) -> (4)
   [junit4]   2> 2031833 INFO  (zkCallback-7631-thread-1) [    ] o.a.s.c.c.ZkStateReader Updated live nodes from ZooKeeper... (3) -> (4)
   [junit4]   2> 2031833 INFO  (zkCallback-7643-thread-1) [    ] o.a.s.c.c.ZkStateReader Updated live nodes from ZooKeeper... (3) -> (4)
   [junit4]   2> 2031836 DEBUG (SyncThread:0) [    ] o.a.s.c.ZkTestServer Watch added: children: /solr/live_nodes
   [junit4]   2> 2031836 DEBUG (SyncThread:0) [    ] o.a.s.c.ZkTestServer Watch added: children: /solr/live_nodes
   [junit4]   2> 2031836 INFO  (zkCallback-7633-thread-1) [    ] o.a.s.c.c.ZkStateReader Updated live nodes from ZooKeeper... (3) -> (4)
   [junit4]   2> 2031836 INFO  (zkCallback-7667-thread-1) [    ] o.a.s.c.c.ZkStateReader Updated live nodes from ZooKeeper... (3) -> (4)
   [junit4]   2> 2031836 DEBUG (SyncThread:0) [    ] o.a.s.c.ZkTestServer Watch added: children: /solr/live_nodes
   [junit4]   2> 2031837 INFO  (zkCallback-7663-thread-1) [    ] o.a.s.c.c.ZkStateReader Updated live nodes from ZooKeeper... (3) -> (4)
   [junit4]   2> 2031837 DEBUG (SyncThread:0) [    ] o.a.s.c.ZkTestServer Watch added: children: /solr/live_nodes
   [junit4]   2> 2031837 INFO  (zkCallback-7661-thread-1) [    ] o.a.s.c.c.ZkStateReader Updated live nodes from ZooKeeper... (3) -> (4)
   [junit4]   2> 2031838 INFO  (jetty-launcher-7611-thread-2) [n:127.0.0.1:43569_solr    ] o.a.s.m.r.SolrJmxReporter JMX monitoring for 'solr_43569.solr.node' (registry 'solr.node') enabled at server: com.sun.jmx.mbeanserver.JmxMBeanServer@2a08d804
   [junit4]   2> 2031846 INFO  (jetty-launcher-7611-thread-1) [n:127.0.0.1:40140_solr    ] o.a.s.m.r.SolrJmxReporter JMX monitoring for 'solr_40140.solr.node' (registry 'solr.node') enabled at server: com.sun.jmx.mbeanserver.JmxMBeanServer@2a08d804
   [junit4]   2> 2031864 INFO  (jetty-launcher-7611-thread-2) [n:127.0.0.1:43569_solr    ] o.a.s.m.r.SolrJmxReporter JMX monitoring for 'solr_43569.solr.jvm' (registry 'solr.jvm') enabled at server: com.sun.jmx.mbeanserver.JmxMBeanServer@2a08d804
   [junit4]   2> 2031864 INFO  (jetty-launcher-7611-thread-2) [n:127.0.0.1:43569_solr    ] o.a.s.m.r.SolrJmxReporter JMX monitoring for 'solr_43569.solr.jetty' (registry 'solr.jetty') enabled at server: com.sun.jmx.mbeanserver.JmxMBeanServer@2a08d804
   [junit4]   2> 2031865 INFO  (jetty-launcher-7611-thread-2) [n:127.0.0.1:43569_solr    ] o.a.s.c.CorePropertiesLocator Found 0 core definitions underneath /x1/jenkins/jenkins-slave/workspace/Lucene-Solr-BadApples-Tests-master/solr/build/solr-core/test/J1/temp/solr.cloud.MoveReplicaHDFSTest_DF78F1E1A93D7E38-001/tempDir-001/node2/.
   [junit4]   2> 2031869 INFO  (jetty-launcher-7611-thread-1) [n:127.0.0.1:40140_solr    ] o.a.s.m.r.SolrJmxReporter JMX monitoring for 'solr_40140.solr.jvm' (registry 'solr.jvm') enabled at server: com.sun.jmx.mbeanserver.JmxMBeanServer@2a08d804
   [junit4]   2> 2031869 INFO  (jetty-launcher-7611-thread-1) [n:127.0.0.1:40140_solr    ] o.a.s.m.r.SolrJmxReporter JMX monitoring for 'solr_40140.solr.jetty' (registry 'solr.jetty') enabled at server: com.sun.jmx.mbeanserver.JmxMBeanServer@2a08d804
   [junit4]   2> 2031869 INFO  (zkConnectionManagerCallback-7677-thread-1) [    ] o.a.s.c.c.ConnectionManager zkClient has connected
   [junit4]   2> 2031870 DEBUG (SyncThread:0) [    ] o.a.s.c.ZkTestServer Watch added: data: /solr/clusterprops.json
   [junit4]   2> 2031870 DEBUG (SyncThread:0) [    ] o.a.s.c.ZkTestServer Watch added: children: /solr/live_nodes
   [junit4]   2> 2031870 INFO  (jetty-launcher-7611-thread-4) [n:127.0.0.1:33009_solr    ] o.a.s.c.c.ZkStateReader Updated live nodes from ZooKeeper... (0) -> (4)
   [junit4]   2> 2031870 DEBUG (SyncThread:0) [    ] o.a.s.c.ZkTestServer Watch added: data: /solr/clusterstate.json
   [junit4]   2> 2031870 DEBUG (SyncThread:0) [    ] o.a.s.c.ZkTestServer Watch added: children: /solr/collections
   [junit4]   2> 2031871 DEBUG (SyncThread:0) [    ] o.a.s.c.ZkTestServer Watch added: create/delete: /solr/aliases.json
   [junit4]   2> 2031871 INFO  (jetty-launcher-7611-thread-4) [n:127.0.0.1:33009_solr    ] o.a.s.c.s.i.ZkClientClusterStateProvider Cluster at 127.0.0.1:37797/solr ready
   [junit4]   2> 2031871 INFO  (jetty-launcher-7611-thread-1) [n:127.0.0.1:40140_solr    ] o.a.s.c.CorePropertiesLocator Found 0 core definitions underneath /x1/jenkins/jenkins-slave/workspace/Lucene-Solr-BadApples-Tests-master/solr/build/solr-core/test/J1/temp/solr.cloud.MoveReplicaHDFSTest_DF78F1E1A93D7E38-001/tempDir-001/node1/.
   [junit4]   2> 2031871 INFO  (jetty-launcher-7611-thread-4) [n:127.0.0.1:33009_solr    ] o.a.s.h.a.MetricsHistoryHandler No .system collection, keeping metrics history in memory.
   [junit4]   2> 2031887 INFO  (jetty-launcher-7611-thread-4) [n:127.0.0.1:33009_solr    ] o.a.s.m.r.SolrJmxReporter JMX monitoring for 'solr_33009.solr.node' (registry 'solr.node') enabled at server: com.sun.jmx.mbeanserver.JmxMBeanServer@2a08d804
   [junit4]   2> 2031896 INFO  (jetty-launcher-7611-thread-4) [n:127.0.0.1:33009_solr    ] o.a.s.m.r.SolrJmxReporter JMX monitoring for 'solr_33009.solr.jvm' (registry 'solr.jvm') enabled at server: com.sun.jmx.mbeanserver.JmxMBeanServer@2a08d804
   [junit4]   2> 2031896 INFO  (jetty-launcher-7611-thread-4) [n:127.0.0.1:33009_solr    ] o.a.s.m.r.SolrJmxReporter JMX monitoring for 'solr_33009.solr.jetty' (registry 'solr.jetty') enabled at server: com.sun.jmx.mbeanserver.JmxMBeanServer@2a08d804
   [junit4]   2> 2031897 INFO  (jetty-launcher-7611-thread-4) [n:127.0.0.1:33009_solr    ] o.a.s.c.CorePropertiesLocator Found 0 core definitions underneath /x1/jenkins/jenkins-slave/workspace/Lucene-Solr-BadApples-Tests-master/solr/build/solr-core/test/J1/temp/solr.cloud.MoveReplicaHDFSTest_DF78F1E1A93D7E38-001/tempDir-001/node4/.
   [junit4]   2> 2031933 DEBUG (SyncThread:0) [    ] o.a.s.c.ZkTestServer Watch fired: children: /solr/overseer/queue
   [junit4]   2> 2031933 DEBUG (SyncThread:0) [    ] o.a.s.c.ZkTestServer Watch added: children: /solr/overseer/queue
   [junit4]   2> 2031970 INFO  (zkConnectionManagerCallback-7680-thread-1) [    ] o.a.s.c.c.ConnectionManager zkClient has connected
   [junit4]   2> 2031976 INFO  (zkConnectionManagerCallback-7685-thread-1) [    ] o.a.s.c.c.ConnectionManager zkClient has connected
   [junit4]   2> 2031977 DEBUG (SyncThread:0) [    ] o.a.s.c.ZkTestServer Watch added: data: /solr/clusterprops.json
   [junit4]   2> 2031977 DEBUG (SyncThread:0) [    ] o.a.s.c.ZkTestServer Watch added: children: /solr/live_nodes
   [junit4]   2> 2031977 INFO  (SUITE-MoveReplicaHDFSTest-seed#[DF78F1E1A93D7E38]-worker) [    ] o.a.s.c.c.ZkStateReader Updated live nodes from ZooKeeper... (0) -> (4)
   [junit4]   2> 2031977 DEBUG (SyncThread:0) [    ] o.a.s.c.ZkTestServer Watch added: data: /solr/clusterstate.json
   [junit4]   2> 2031977 DEBUG (SyncThread:0) [    ] o.a.s.c.ZkTestServer Watch added: children: /solr/collections
   [junit4]   2> 2031977 DEBUG (SyncThread:0) [    ] o.a.s.c.ZkTestServer Watch added: create/delete: /solr/aliases.json
   [junit4]   2> 2031978 INFO  (SUITE-MoveReplicaHDFSTest-seed#[DF78F1E1A93D7E38]-worker) [    ] o.a.s.c.s.i.ZkClientClusterStateProvider Cluster at 127.0.0.1:37797/solr ready
   [junit4]   2> 2031995 INFO  (qtp2096599319-23609) [n:127.0.0.1:40140_solr    ] o.a.s.h.a.CollectionsHandler Invoked Collection Action :overseerstatus with params action=OVERSEERSTATUS&wt=javabin&version=2 and sendToOCPQueue=true
   [junit4]   2> 2031996 DEBUG (SyncThread:0) [    ] o.a.s.c.ZkTestServer Watch fired: children: /solr/overseer/collection-queue-work
   [junit4]   2> 2031996 DEBUG (SyncThread:0) [    ] o.a.s.c.ZkTestServer Watch added: children: /solr/overseer/collection-queue-work
   [junit4]   2> 2031996 DEBUG (OverseerCollectionConfigSetProcessor-72420737233059850-127.0.0.1:41385_solr-n_0000000000) [n:127.0.0.1:41385_solr    ] o.a.s.c.ZkDistributedQueue Found child node with improper name: qnr-0000000000
   [junit4]   2> 2031996 DEBUG (SyncThread:0) [    ] o.a.s.c.ZkTestServer Watch added: create/delete: /solr/overseer/collection-queue-work/qnr-0000000000
   [junit4]   2> 2031997 DEBUG (SyncThread:0) [    ] o.a.s.c.ZkTestServer Watch fired: children: /solr/overseer/collection-queue-work
   [junit4]   2> 2031997 DEBUG (SyncThread:0) [    ] o.a.s.c.ZkTestServer Watch added: children: /solr/overseer/collection-queue-work
   [junit4]   2> 2031997 DEBUG (OverseerCollectionConfigSetProcessor-72420737233059850-127.0.0.1:41385_solr-n_0000000000) [n:127.0.0.1:41385_solr    ] o.a.s.c.ZkDistributedQueue Found child node with improper name: qnr-0000000000
   [junit4]   2> 2031997 DEBUG (OverseerCollectionConfigSetProcessor-72420737233059850-127.0.0.1:41385_solr-n_0000000000) [n:127.0.0.1:41385_solr    ] o.a.s.c.OverseerTaskQueue Returning topN elements: [/overseer/collection-queue-work/qn-0000000000, ]
   [junit4]   2> 2031997 DEBUG (OverseerCollectionConfigSetProcessor-72420737233059850-127.0.0.1:41385_solr-n_0000000000) [n:127.0.0.1:41385_solr    ] o.a.s.c.OverseerTaskProcessor Got 1 tasks from work-queue : [[org.apache.solr.cloud.OverseerTaskQueue$QueueEvent@2e684ecf]]
   [junit4]   2> 2031997 DEBUG (OverseerCollectionConfigSetProcessor-72420737233059850-127.0.0.1:41385_solr-n_0000000000) [n:127.0.0.1:41385_solr    ] o.a.s.c.OverseerTaskProcessor Marked task [/overseer/collection-queue-work/qn-0000000000] as running
   [junit4]   2> 2031997 DEBUG (OverseerCollectionConfigSetProcessor-72420737233059850-127.0.0.1:41385_solr-n_0000000000) [n:127.0.0.1:41385_solr    ] o.a.s.c.OverseerTaskProcessor Overseer Collection Message Handler: Get the message id:/overseer/collection-queue-work/qn-0000000000 message:{"operation":"overseerstatus"}
   [junit4]   2> 2031999 DEBUG (OverseerThreadFactory-9241-thread-1-processing-n:127.0.0.1:41385_solr) [n:127.0.0.1:41385_solr    ] o.a.s.c.OverseerTaskProcessor Runner processing /overseer/collection-queue-work/qn-0000000000
   [junit4]   2> 2031999 DEBUG (OverseerCollectionConfigSetProcessor-72420737233059850-127.0.0.1:41385_solr-n_0000000000) [n:127.0.0.1:41385_solr    ] o.a.s.c.OverseerTaskProcessor Cleaning up work-queue. #Running tasks: 1
   [junit4]   2> 2031999 DEBUG (OverseerThreadFactory-9241-thread-1-processing-n:127.0.0.1:41385_solr) [n:127.0.0.1:41385_solr    ] o.a.s.c.a.c.OverseerCollectionMessageHandler OverseerCollectionMessageHandler.processMessage : overseerstatus , {"operation":"overseerstatus"}
   [junit4]   2> 2031999 DEBUG (OverseerCollectionConfigSetProcessor-72420737233059850-127.0.0.1:41385_solr-n_0000000000) [n:127.0.0.1:41385_solr    ] o.a.s.c.OverseerTaskProcessor RunningTasks: [/overseer/collection-queue-work/qn-0000000000]
   [junit4]   2> 2031999 DEBUG (OverseerCollectionConfigSetProcessor-72420737233059850-127.0.0.1:41385_solr-n_0000000000) [n:127.0.0.1:41385_solr    ] o.a.s.c.OverseerTaskProcessor BlockedTasks: []
   [junit4]   2> 2031999 DEBUG (OverseerCollectionConfigSetProcessor-72420737233059850-127.0.0.1:41385_solr-n_0000000000) [n:127.0.0.1:41385_solr    ] o.a.s.c.OverseerTaskProcessor CompletedTasks: []
   [junit4]   2> 2031999 DEBUG (OverseerCollectionConfigSetProcessor-72420737233059850-127.0.0.1:41385_solr-n_0000000000) [n:127.0.0.1:41385_solr    ] o.a.s.c.OverseerTaskProcessor RunningZKTasks: [/overseer/collection-queue-work/qn-0000000000]
   [junit4]   2> 2031999 DEBUG (OverseerCollectionConfigSetProcessor-72420737233059850-127.0.0.1:41385_solr-n_0000000000) [n:127.0.0.1:41385_solr    ] o.a.s.c.OverseerTaskQueue Peeking for top 99 elements. ExcludeSet: [/overseer/collection-queue-work/qn-0000000000],[]
   [junit4]   2> 2032000 DEBUG (OverseerThreadFactory-9241-thread-1-processing-n:127.0.0.1:41385_solr) [n:127.0.0.1:41385_solr    ] o.a.s.c.OverseerTaskProcessor Completed task:[/overseer/collection-queue-work/qn-0000000000]
   [junit4]   2> 2032001 DEBUG (SyncThread:0) [    ] o.a.s.c.ZkTestServer Watch fired: data: /solr/overseer/collection-queue-work/qnr-0000000000
   [junit4]   2> 2032001 DEBUG (zkCallback-7631-thread-1) [    ] o.a.s.c.OverseerTaskQueue NodeDataChanged fired on path /overseer/collection-queue-work/qnr-0000000000 state SyncConnected latchEventType null
   [junit4]   2> 2032001 DEBUG (SyncThread:0) [    ] o.a.s.c.ZkTestServer Watch fired: children: /solr/overseer/collection-queue-work
   [junit4]   2> 2032001 DEBUG (OverseerThreadFactory-9241-thread-1-processing-n:127.0.0.1:41385_solr) [n:127.0.0.1:41385_solr    ] o.a.s.c.OverseerTaskProcessor Marked task [/overseer/collection-queue-work/qn-0000000000] as completed.
   [junit4]   2> 2032001 DEBUG (OverseerThreadFactory-9241-thread-1-processing-n:127.0.0.1:41385_solr) [n:127.0.0.1:41385_solr    ] o.a.s.c.OverseerTaskProcessor RunningTasks: []
   [junit4]   2> 2032001 DEBUG (OverseerThreadFactory-9241-thread-1-processing-n:127.0.0.1:41385_solr) [n:127.0.0.1:41385_solr    ] o.a.s.c.OverseerTaskProcessor BlockedTasks: []
   [junit4]   2> 2032001 DEBUG (SyncThread:0) [    ] o.a.s.c.ZkTestServer Watch added: children: /solr/overseer/collection-queue-work
   [junit4]   2> 2032001 DEBUG (OverseerThreadFactory-9241-thread-1-processing-n:127.0.0.1:41385_solr) [n:127.0.0.1:41385_solr    ] o.a.s.c.OverseerTaskProcessor CompletedTasks: [/overseer/collection-queue-work/qn-0000000000]
   [junit4]   2> 2032001 DEBUG (OverseerThreadFactory-9241-thread-1-processing-n:127.0.0.1:41385_solr) [n:127.0.0.1:41385_solr    ] o.a.s.c.OverseerTaskProcessor RunningZKTasks: [/overseer/collection-queue-work/qn-0000000000]
   [junit4]   2> 2032001 DEBUG (OverseerCollectionConfigSetProcessor-72420737233059850-127.0.0.1:41385_solr-n_0000000000) [n:127.0.0.1:41385_solr    ] o.a.s.c.ZkDistributedQueue Found child node with improper name: qnr-0000000000
   [junit4]   2> 2032001 DEBUG (OverseerThreadFactory-9241-thread-1-processing-n:127.0.0.1:41385_solr) [n:127.0.0.1:41385_solr    ] o.a.s.c.OverseerTaskProcessor Overseer Collection Message Handler: Message id:/overseer/collection-queue-work/qn-0000000000 complete, response:{leader=127.0.0.1:41385_solr,overseer_queue_size=0,overseer_work_queue_size=0,overseer_collection_queue_size=2,overseer_operations={am_i_leader={requests=3,errors=0,avgRequestsPerSecond=10.903654545182945,5minRateRequestsPerSecond=0.0,15minRateRequestsPerSecond=0.0,avgTimePerRequest=0.562455,medianRequestTime=0.539516,75thPcRequestTime=0.976445,95thPcRequestTime=0.976445,99thPcRequestTime=0.976445,999thPcRequestTime=0.976445},downnode={requests=3,errors=0,avgRequestsPerSecond=14.488402902780498,5minRateRequestsPerSecond=0.0,15minRateRequestsPerSecond=0.0,avgTimePerRequest=0.007782,medianRequestTime=0.007442,75thPcRequestTime=0.009705,95thPcRequestTime=0.009705,99thPcRequestTime=0.009705,999thPcRequestTime=0.009705}},collection_operations={am_i_leader={requests=3,errors=0,avgRequestsPerSecond=10.914771392714533,5minRateRequestsPerSecond=0.0,15minRateRequestsPerSecond=0.0,avgTimePerRequest=3.268474333333333,medianRequestTime=0.696378,75thPcRequestTime=8.909413,95thPcRequestTime=8.909413,99thPcRequestTime=8.909413,999thPcRequestTime=8.909413},overseerstatus={requests=0,errors=0,avgRequestsPerSecond=0.0,5minRateRequestsPerSecond=0.0,15minRateRequestsPerSecond=0.0,avgTimePerRequest=0.0,medianRequestTime=0.0,75thPcRequestTime=0.0,95thPcRequestTime=0.0,99thPcRequestTime=0.0,999thPcRequestTime=0.0}},overseer_queue={},overseer_internal_queue={peek={avgRequestsPerSecond=3.8292463684729388,5minRateRequestsPerSecond=0.0,15minRateRequestsPerSecond=0.0,avgTimePerRequest=1.59328,medianRequestTime=1.59328,75thPcRequestTime=1.59328,95thPcRequestTime=1.59328,99thPcRequestTime=1.59328,999thPcRequestTime=1.59328}},collection_queue={peektopn_wait2000={avgRequestsPerSecond=3.79321296487418,5minRateRequestsPerSecond=0.0,15minRateRequestsPerSecond=0.0,avgTimePerRequest=260.722914,medianRequestTime=260.722914,75thPcRequestTime=260.722914,95thPcRequestTime=260.722914,99thPcRequestTime=260.722914,999thPcRequestTime=260.722914}}}
   [junit4]   2> 2032002 DEBUG (SyncThread:0) [    ] o.a.s.c.ZkTestServer Watch fired: children: /solr/overseer/collection-queue-work
   [junit4]   2> 2032002 DEBUG (SyncThread:0) [    ] o.a.s.c.ZkTestServer Watch added: children: /solr/overseer/collection-queue-work
   [junit4]   2> 2032003 INFO  (qtp2096599319-23609) [n:127.0.0.1:40140_solr    ] o.a.s.s.HttpSolrCall [admin] webapp=null path=/admin/collections params={action=OVERSEERSTATUS&wt=javabin&version=2} status=0 QTime=7
   [junit4]   1> Formatting using clusterid: testClusterID
   [junit4]   2> 2032042 WARN  (SUITE-MoveReplicaHDFSTest-seed#[DF78F1E1A93D7E38]-worker) [    ] o.a.h.m.i.MetricsConfig Cannot locate configuration: tried hadoop-metrics2-namenode.properties,hadoop-metrics2.properties
   [junit4]   2> 2032054 WARN  (SUITE-MoveReplicaHDFSTest-seed#[DF78F1E1A93D7E38]-worker) [    ] o.a.h.h.HttpRequestLog Jetty request log can only be enabled using Log4j
   [junit4]   2> 2032056 INFO  (SUITE-MoveReplicaHDFSTest-seed#[DF78F1E1A93D7E38]-worker) [    ] o.m.log jetty-6.1.26
   [junit4]   2> 2032076 INFO  (SUITE-MoveReplicaHDFSTest-seed#[DF78F1E1A93D7E38]-worker) [    ] o.m.log Extract jar:file:/x1/jenkins/.ivy2/cache/org.apache.hadoop/hadoop-hdfs/tests/hadoop-hdfs-2.7.4-tests.jar!/webapps/hdfs to ./temp/Jetty_localhost_45275_hdfs____.yctofb/webapp
   [junit4]   2> 2032449 INFO  (SUITE-MoveReplicaHDFSTest-seed#[DF78F1E1A93D7E38]-worker) [    ] o.m.log Started HttpServer2$SelectChannelConnectorWithSafeStartup@localhost:45275
   [junit4]   2> 2033461 DEBUG (ScheduledTrigger-9239-thread-2) [    ] o.a.s.c.a.NodeLostTrigger Running NodeLostTrigger: .auto_add_replicas with currently live nodes: 4
   [junit4]   2> 2033500 WARN  (SUITE-MoveReplicaHDFSTest-seed#[DF78F1E1A93D7E38]-worker) [    ] o.a.h.h.HttpRequestLog Jetty request log can only be enabled using Log4j
   [junit4]   2> 2033506 INFO  (SUITE-MoveReplicaHDFSTest-seed#[DF78F1E1A93D7E38]-worker) [    ] o.m.log jetty-6.1.26
   [junit4]   2> 2033527 INFO  (SUITE-MoveReplicaHDFSTest-seed#[DF78F1E1A93D7E38]-worker) [    ] o.m.log Extract jar:file:/x1/jenkins/.ivy2/cache/org.apache.hadoop/hadoop-hdfs/tests/hadoop-hdfs-2.7.4-tests.jar!/webapps/datanode to ./temp/Jetty_localhost_39984_datanode____.i64vka/webapp
   [junit4]   2> 2033958 INFO  (SUITE-MoveReplicaHDFSTest-seed#[DF78F1E1A93D7E38]-worker) [    ] o.m.log Started HttpServer2$SelectChannelConnectorWithSafeStartup@localhost:39984
   [junit4]   2> 2034000 DEBUG (OverseerCollectionConfigSetProcessor-72420737233059850-127.0.0.1:41385_solr-n_0000000000) [n:127.0.0.1:41385_solr    ] o.a.s.c.OverseerTaskProcessor Got 0 tasks from work-queue : [[]]
   [junit4]   2> 2034001 DEBUG (OverseerCollectionConfigSetProcessor-72420737233059850-127.0.0.1:41385_solr-n_0000000000) [n:127.0.0.1:41385_solr    ] o.a.s.c.OverseerTaskProcessor Cleaning up work-queue. #Running tasks: 0
   [junit4]   2> 2034001 INFO  (OverseerCollectionConfigSetProcessor-72420737233059850-127.0.0.1:41385_solr-n_0000000000) [n:127.0.0.1:41385_solr    ] o.a.s.c.OverseerTaskQueue Response ZK path: /overseer/collection-queue-work/qnr-0000000000 doesn't exist.  Requestor may have disconnected from ZooKeeper
   [junit4]   2> 2034006 DEBUG (OverseerCollectionConfigSetProcessor-72420737233059850-127.0.0.1:41385_solr-n_0000000000) [n:127.0.0.1:41385_solr    ] o.a.s.c.OverseerTaskProcessor RunningTasks: []
   [junit4]   2> 2034006 DEBUG (OverseerCollectionConfigSetProcessor-72420737233059850-127.0.0.1:41385_solr-n_0000000000) [n:127.0.0.1:41385_solr    ] o.a.s.c.OverseerTaskProcessor BlockedTasks: []
   [junit4]   2> 2034006 DEBUG (OverseerCollectionConfigSetProcessor-72420737233059850-127.0.0.1:41385_solr-n_0000000000) [n:127.0.0.1:41385_solr    ] o.a.s.c.OverseerTaskProcessor CompletedTasks: []
   [junit4]   2> 2034006 DEBUG (OverseerCollectionConfigSetProcessor-72420737233059850-127.0.0.1:41385_solr-n_0000000000) [n:127.0.0.1:41385_solr    ] o.a.s.c.OverseerTaskProcessor RunningZKTasks: []
   [junit4]   2> 2034006 DEBUG (OverseerCollectionConfigSetProcessor-72420737233059850-127.0.0.1:41385_solr-n_0000000000) [n:127.0.0.1:41385_solr    ] o.a.s.c.OverseerTaskQueue Peeking for top 100 elements. ExcludeSet: []
   [junit4]   2> 2034033 WARN  (SUITE-MoveReplicaHDFSTest-seed#[DF78F1E1A93D7E38]-worker) [    ] o.a.h.h.HttpRequestLog Jetty request log can only be enabled using Log4j
   [junit4]   2> 2034034 INFO  (SUITE-MoveReplicaHDFSTest-seed#[DF78F1E1A93D7E38]-worker) [    ] o.m.log jetty-6.1.26
   [junit4]   2> 2034051 INFO  (SUITE-MoveReplicaHDFSTest-seed#[DF78F1E1A93D7E38]-worker) [    ] o.m.log Extract jar:file:/x1/jenkins/.ivy2/cache/org.apache.hadoop/hadoop-hdfs/tests/hadoop-hdfs-2.7.4-tests.jar!/webapps/datanode to ./temp/Jetty_localhost_46866_datanode____bmj76l/webapp
   [junit4]   2> 2034145 ERROR (DataNode: [[[DISK]file:/x1/jenkins/jenkins-slave/workspace/Lucene-Solr-BadApples-Tests-master/solr/build/solr-core/test/J1/temp/solr.cloud.MoveReplicaHDFSTest_DF78F1E1A93D7E38-001/tempDir-002/hdfsBaseDir/data/data1/, [DISK]file:/x1/jenkins/jenkins-slave/workspace/Lucene-Solr-BadApples-Tests-master/solr/build/solr-core/test/J1/temp/solr.cloud.MoveReplicaHDFSTest_DF78F1E1A93D7E38-001/tempDir-002/hdfsBaseDir/data/data2/]]  heartbeating to localhost/127.0.0.1:35426) [    ] o.a.h.h.s.d.DirectoryScanner dfs.datanode.directoryscan.throttle.limit.ms.per.sec set to value below 1 ms/sec. Assuming default value of 1000
   [junit4]   2> 2034170 INFO  (Block report processor) [    ] BlockStateChange BLOCK* processReport 0x13afa0755b744a: from storage DS-a5f3b728-a9e3-42a4-9df6-347d9e0c641f node DatanodeRegistration(127.0.0.1:43870, datanodeUuid=894daa2d-5737-46de-bd16-c8daefa0e20b, infoPort=37655, infoSecurePort=0, ipcPort=37349, storageInfo=lv=-56;cid=testClusterID;nsid=598464968;c=0), blocks: 0, hasStaleStorage: true, processing time: 0 msecs
   [junit4]   2> 2034170 INFO  (Block report processor) [    ] BlockStateChange BLOCK* processReport 0x13afa0755b744a: from storage DS-aed89191-e2fc-4bc3-aab3-2b2f36d19b7d node DatanodeRegistration(127.0.0.1:43870, datanodeUuid=894daa2d-5737-46de-bd16-c8daefa0e20b, infoPort=37655, infoSecurePort=0, ipcPort=37349, storageInfo=lv=-56;cid=testClusterID;nsid=598464968;c=0), blocks: 0, hasStaleStorage: false, processing time: 0 msecs
   [junit4]   2> 2034466 DEBUG (ScheduledTrigger-9239-thread-4) [    ] o.a.s.c.a.NodeLostTrigger Running NodeLostTrigger: .auto_add_replicas with currently live nodes: 4
   [junit4]   2> 2034560 INFO  (SUITE-MoveReplicaHDFSTest-seed#[DF78F1E1A93D7E38]-worker) [    ] o.m.log Started HttpServer2$SelectChannelConnectorWithSafeStartup@localhost:46866
   [junit4]   2> 2034689 ERROR (DataNode: [[[DISK]file:/x1/jenkins/jenkins-slave/workspace/Lucene-Solr-BadApples-Tests-master/solr/build/solr-core/test/J1/temp/solr.cloud.MoveReplicaHDFSTest_DF78F1E1A93D7E38-001/tempDir-002/hdfsBaseDir/data/data3/, [DISK]file:/x1/jenkins/jenkins-slave/workspace/Lucene-Solr-BadApples-Tests-master/solr/build/solr-core/test/J1/temp/solr.cloud.MoveReplicaHDFSTest_DF78F1E1A93D7E38-001/tempDir-002/hdfsBaseDir/data/data4/]]  heartbeating to localhost/127.0.0.1:35426) [    ] o.a.h.h.s.d.DirectoryScanner dfs.datanode.directoryscan.throttle.limit.ms.per.sec set to value below 1 ms/sec. Assuming default value of 1000
   [junit4]   2> 2034712 INFO  (Block report processor) [    ] BlockStateChange BLOCK* processReport 0x13afa095bd027c: from storage DS-5306fff3-d015-4c06-b120-037ea3b2f1e3 node DatanodeRegistration(127.0.0.1:36606, datanodeUuid=2324949e-9395-4bc2-ba58-b8410d384c45, infoPort=43285, infoSecurePort=0, ipcPort=44704, storageInfo=lv=-56;cid=testClusterID;nsid=598464968;c=0), blocks: 0, hasStaleStorage: true, processing time: 1 msecs
   [junit4]   2> 2034712 INFO  (Block report processor) [    ] BlockStateChange BLOCK* processReport 0x13afa095bd027c: from storage DS-dfb9b41b-e081-4d5c-9a3a-26955a0a0128 node DatanodeRegistration(127.0.0.1:36606, datanodeUuid=2324949e-9395-4bc2-ba58-b8410d384c45, infoPort=43285, infoSecurePort=0, ipcPort=44704, storageInfo=lv=-56;cid=testClusterID;nsid=598464968;c=0), blocks: 0, hasStaleStorage: false, processing time: 0 msecs
   [junit4]   2> 2035139 INFO  (TEST-MoveReplicaHDFSTest.testFailedMove-seed#[DF78F1E1A93D7E38]) [    ] o.a.s.SolrTestCaseJ4 ###Starting testFailedMove
   [junit4]   2> 2035140 DEBUG (SyncThread:0) [    ] o.a.s.c.ZkTestServer Watch added: data: /solr/clusterprops.json
   [junit4]   2> 2035140 DEBUG (SyncThread:0) [    ] o.a.s.c.ZkTestServer Watch added: children: /solr/live_nodes
   [junit4]   2> 2035140 INFO  (TEST-MoveReplicaHDFSTest.testFailedMove-seed#[DF78F1E1A93D7E38]) [    ] o.a.s.c.c.ZkStateReader Updated live nodes from ZooKeeper... (0) -> (4)
   [junit4]   2> 2035141 DEBUG (SyncThread:0) [    ] o.a.s.c.ZkTestServer Watch added: data: /solr/clusterstate.json
   [junit4]   2> 2035141 DEBUG (SyncThread:0) [    ] o.a.s.c.ZkTestServer Watch added: children: /solr/collections
   [junit4]   2> 2035141 DEBUG (SyncThread:0) [    ] o.a.s.c.ZkTestServer Watch added: create/delete: /solr/aliases.json
   [junit4]   2> 2035142 DEBUG (SyncThread:0) [    ] o.a.s.c.ZkTestServer Watch fired: data: /solr/aliases.json
   [junit4]   2> 2035142 DEBUG (SyncThread:0) [    ] o.a.s.c.ZkTestServer Watch fired: data: /solr/aliases.json
   [junit4]   2> 2035142 DEBUG (SyncThread:0) [    ] o.a.s.c.ZkTestServer Watch fired: data: /solr/aliases.json
   [junit4]   2> 2035142 DEBUG (SyncThread:0) [    ] o.a.s.c.ZkTestServer Watch fired: data: /solr/aliases.json
   [junit4]   2> 2035142 DEBUG (SyncThread:0) [    ] o.a.s.c.ZkTestServer Watch fired: data: /solr/aliases.json
   [junit4]   2> 2035142 DEBUG (SyncThread:0) [    ] o.a.s.c.ZkTestServer Watch fired: data: /solr/aliases.json
   [junit4]   2> 2035142 DEBUG (SyncThread:0) [    ] o.a.s.c.ZkTestServer Watch fired: data: /solr/aliases.json
   [junit4]   2> 2035142 DEBUG (SyncThread:0) [    ] o.a.s.c.ZkTestServer Watch fired: data: /solr/aliases.json
   [junit4]   2> 2035142 DEBUG (SyncThread:0) [    ] o.a.s.c.ZkTestServer Watch fired: data: /solr/aliases.json
   [junit4]   2> 2035143 DEBUG (SyncThread:0) [    ] o.a.s.c.ZkTestServer Watch added: data: /solr/aliases.json
   [junit4]   2> 2035143 DEBUG (SyncThread:0) [    ] o.a.s.c.ZkTestServer Watch added: data: /solr/aliases.json
   [junit4]   2> 2035143 DEBUG (SyncThread:0) [    ] o.a.s.c.ZkTestServer Watch added: data: /solr/aliases.json
   [junit4]   2> 2035143 DEBUG (SyncThread:0) [    ] o.a.s.c.ZkTestServer Watch added: data: /solr/aliases.json
   [junit4]   2> 2035143 DEBUG (SyncThread:0) [    ] o.a.s.c.ZkTestServer Watch added: data: /solr/aliases.json
   [junit4]   2> 2035143 DEBUG (SyncThread:0) [    ] o.a.s.c.ZkTestServer Watch added: data: /solr/aliases.json
   [junit4]   2> 2035143 DEBUG (SyncThread:0) [    ] o.a.s.c.ZkTestServer Watch added: data: /solr/aliases.json
   [junit4]   2> 2035145 INFO  (TEST-MoveReplicaHDFSTest.testFailedMove-seed#[DF78F1E1A93D7E38]) [    ] o.e.j.s.Server jetty-9.4.11.v20180605; built: 2018-06-05T18:24:03.829Z; git: d5fc0523cfa96bfebfbda19606cad384d772f04c; jvm 1.8.0_172-b11
   [junit4]   2> 2035145 DEBUG (SyncThread:0) [    ] o.a.s.c.ZkTestServer Watch added: data: /solr/aliases.json
   [junit4]   2> 2035145 DEBUG (SyncThread:0) [    ] o.a.s.c.ZkTestServer Watch added: data: /solr/aliases.json
   [junit4]   2> 2035145 DEBUG (SyncThread:0) [    ] o.a.s.c.ZkTestServer Watch added: data: /solr/aliases.json
   [junit4]   2> 2035146 INFO  (TEST-MoveReplicaHDFSTest.testFailedMove-seed#[DF78F1E1A93D7E38]) [    ] o.e.j.s.session DefaultSessionIdManager workerName=node0
   [junit4]   2> 2035146 INFO  (TEST-MoveReplicaHDFSTest.testFailedMove-seed#[DF78F1E1A93D7E38]) [    ] o.e.j.s.session No SessionScavenger set, using defaults
   [junit4]   2> 2035146 INFO  (TEST-MoveReplicaHDFSTest.testFailedMove-seed#[DF78F1E1A93D7E38]) [    ] o.e.j.s.session node0 Scavenging every 660000ms
   [junit4]   2> 2035146 INFO  (TEST-MoveReplicaHDFSTest.testFailedMove-seed#[DF78F1E1A93D7E38]) [    ] o.e.j.s.h.ContextHandler Started o.e.j.s.ServletContextHandler@2552fb6{/solr,null,AVAILABLE}
   [junit4]   2> 2035147 INFO  (TEST-MoveReplicaHDFSTest.testFailedMove-seed#[DF78F1E1A93D7E38]) [    ] o.e.j.s.AbstractConnector Started ServerConnector@34635b3e{SSL,[ssl, http/1.1]}{127.0.0.1:45824}
   [junit4]   2> 2035147 INFO  (TEST-MoveReplicaHDFSTest.testFailedMove-seed#[DF78F1E1A93D7E38]) [    ] o.e.j.s.Server Started @2035212ms
   [junit4]   2> 2035147 INFO  (TEST-MoveReplicaHDFSTest.testFailedMove-seed#[DF78F1E1A93D7E38]) [    ] o.a.s.c.s.e.JettySolrRunner Jetty properties: {hostContext=/solr, hostPort=45824}
   [junit4]   2> 2035147 ERROR (TEST-MoveReplicaHDFSTest.testFailedMove-seed#[DF78F1E1A93D7E38]) [    ] o.a.s.u.StartupLoggingUtils Missing Java Option solr.log.dir. Logging may be missing or incomplete.
   [junit4]   2> 2035147 INFO  (TEST-MoveReplicaHDFSTest.testFailedMove-seed#[DF78F1E1A93D7E38]) [    ] o.a.s.s.SolrDispatchFilter Using logger factory org.apache.logging.slf4j.Log4jLoggerFactory
   [junit4]   2> 2035147 INFO  (TEST-MoveReplicaHDFSTest.testFailedMove-seed#[DF78F1E1A93D7E38]) [    ] o.a.s.s.SolrDispatchFilter  ___      _       Welcome to Apache Solr™ version 8.0.0
   [junit4]   2> 2035147 INFO  (TEST-MoveReplicaHDFSTest.testFailedMove-seed#[DF78F1E1A93D7E38]) [    ] o.a.s.s.SolrDispatchFilter / __| ___| |_ _   Starting in cloud mode on port null
   [junit4]   2> 2035148 INFO  (TEST-MoveReplicaHDFSTest.testFailedMove-seed#[DF78F1E1A93D7E38]) [    ] o.a.s.s.SolrDispatchFilter \__ \/ _ \ | '_|  Install dir: null
   [junit4]   2> 2035148 INFO  (TEST-MoveReplicaHDFSTest.testFailedMove-seed#[DF78F1E1A93D7E38]) [    ] o.a.s.s.SolrDispatchFilter |___/\___/_|_|    Start time: 2018-09-29T20:20:09.918Z
   [junit4]   2> 2035149 INFO  (zkConnectionManagerCallback-7689-thread-1) [    ] o.a.s.c.c.ConnectionManager zkClient has connected
   [junit4]   2> 2035149 INFO  (TEST-MoveReplicaHDFSTest.testFailedMove-seed#[DF78F1E1A93D7E38]) [    ] o.a.s.s.SolrDispatchFilter solr.xml found in ZooKeeper. Loading...
   [junit4]   2> 2035268 INFO  (TEST-MoveReplicaHDFSTest.testFailedMove-seed#[DF78F1E1A93D7E38]) [    ] o.a.s.c.ZkContainer Zookeeper client=127.0.0.1:37797/solr
   [junit4]   2> 2035269 INFO  (zkConnectionManagerCallback-7693-thread-1) [    ] o.a.s.c.c.ConnectionManager zkClient has connected
   [junit4]   2> 2035270 DEBUG (TEST-MoveReplicaHDFSTest.testFailedMove-seed#[DF78F1E1A93D7E38]) [n:127.0.0.1:45824_solr    ] o.a.s.c.ZkController Added new OnReconnect listener org.apache.solr.cloud.ZkController$$Lambda$271/1755433460@5104585d
   [junit4]   2> 2035271 INFO  (zkConnectionManagerCallback-7695-thread-1) [    ] o.a.s.c.c.ConnectionManager zkClient has connected
   [junit4]   2> 2035278 DEBUG (SyncThread:0) [    ] o.a.s.c.ZkTestServer Watch added: data: /solr/clusterprops.json
   [junit4]   2> 2035278 DEBUG (SyncThread:0) [    ] o.a.s.c.ZkTestServer Watch added: children: /solr/live_nodes
   [junit4]   2> 2035278 INFO  (TEST-MoveReplicaHDFSTest.testFailedMove-seed#[DF78F1E1A93D7E38]) [n:127.0.0.1:45824_solr    ] o.a.s.c.c.ZkStateReader Updated live nodes from ZooKeeper... (0) -> (4)
   [junit4]   2> 2035278 DEBUG (SyncThread:0) [    ] o.a.s.c.ZkTestServer Watch added: data: /solr/clusterstate.json
   [junit4]   2> 2035279 DEBUG (SyncThread:0) [    ] o.a.s.c.ZkTestServer Watch added: children: /solr/collections
   [junit4]   2> 2035279 DEBUG (SyncThread:0) [    ] o.a.s.c.ZkTestServer Watch added: create/delete: /solr/aliases.json
   [junit4]   2> 2035279 DEBUG (SyncThread:0) [    ] o.a.s.c.ZkTestServer Watch added: create/delete: /solr/security.json
   [junit4]   2> 2035281 DEBUG (TEST-MoveReplicaHDFSTest.testFailedMove-seed#[DF78F1E1A93D7E38]) [n:127.0.0.1:45824_solr    ] o.a.s.c.LeaderElector Joined leadership election with path: /overseer_elect/election/72420737233059861-127.0.0.1:45824_solr-n_0000000004
   [junit4]   2> 2035281 DEBUG (SyncThread:0) [    ] o.a.s.c.ZkTestServer Watch added: data: /solr/overseer_elect/election/72420737233059854-127.0.0.1:33009_solr-n_0000000003
   [junit4]   2> 2035282 DEBUG (TEST-MoveReplicaHDFSTest.testFailedMove-seed#[DF78F1E1A93D7E38]) [n:127.0.0.1:45824_solr    ] o.a.s.c.LeaderElector Watching path /overseer_elect/election/72420737233059854-127.0.0.1:33009_solr-n_0000000003 to know if I could be the leader
   [junit4]   2> 2035282 DEBUG (TEST-MoveReplicaHDFSTest.testFailedMove-seed#[DF78F1E1A93D7E38]) [n:127.0.0.1:45824_solr    ] o.a.s.c.ZkController Publish node=127.0.0.1:45824_solr as DOWN
   [junit4]   2> 2035283 DEBUG (SyncThread:0) [    ] o.a.s.c.ZkTestServer Watch fired: children: /solr/overseer/queue
   [junit4]   2> 2035283 DEBUG (SyncThread:0) [    ] o.a.s.c.ZkTestServer Watch added: children: /solr/overseer/queue
   [junit4]   2> 2035283 INFO  (TEST-MoveReplicaHDFSTest.testFailedMove-seed#[DF78F1E1A93D7E38]) [n:127.0.0.1:45824_solr    ] o.a.s.c.TransientSolrCoreCacheDefault Allocating transient cache for 2147483647 transient cores
   [junit4]   2> 2035283 INFO  (TEST-MoveReplicaHDFSTest.testFailedMove-seed#[DF78F1E1A93D7E38]) [n:127.0.0.1:45824_solr    ] o.a.s.c.ZkController Register node as live in ZooKeeper:/live_nodes/127.0.0.1:45824_solr
   [junit4]   2> 2035283 DEBUG (OverseerStateUpdate-72420737233059850-127.0.0.1:41385_solr-n_0000000000) [n:127.0.0.1:41385_solr    ] o.a.s.c.Overseer processMessage: queueSize: 1, message = {
   [junit4]   2>   "operation":"downnode",
   [junit4]   2>   "node_name":"127.0.0.1:45824_solr"} current state version: 0
   [junit4]   2> 2035284 DEBUG (SyncThread:0) [    ] o.a.s.c.ZkTestServer Watch fired: children: /solr/live_nodes
   [junit4]   2> 2035284 DEBUG (SyncThread:0) [    ] o.a.s.c.ZkTestServer Watch fired: children: /solr/live_nodes
   [junit4]   2> 2035284 DEBUG (SyncThread:0) [    ] o.a.s.c.ZkTestServer Watch fired: children: /solr/live_nodes
   [junit4]   2> 2035284 DEBUG (SyncThread:0) [    ] o.a.s.c.ZkTestServer Watch fired: children: /solr/live_nodes
   [junit4]   2> 2035284 DEBUG (SyncThread:0) [    ] o.a.s.c.ZkTestServer Watch fired: children: /solr/live_nodes
   [junit4]   2> 2035284 DEBUG (SyncThread:0) [    ] o.a.s.c.ZkTestServer Watch fired: children: /solr/live_nodes
   [junit4]   2> 2035284 DEBUG (SyncThread:0) [    ] o.a.s.c.ZkTestServer Watch fired: children: /solr/live_nodes
   [junit4]   2> 2035284 DEBUG (SyncThread:0) [    ] o.a.s.c.ZkTestServer Watch fired: children: /solr/live_nodes
   [junit4]   2> 2035285 DEBUG (SyncThread:0) [    ] o.a.s.c.ZkTestServer Watch fired: children: /solr/live_nodes
   [junit4]   2> 2035285 DEBUG (SyncThread:0) [    ] o.a.s.c.ZkTestServer Watch fired: children: /solr/live_nodes
   [junit4]   2> 2035285 DEBUG (SyncThread:0) [    ] o.a.s.c.ZkTestServer Watch added: children: /solr/live_nodes
   [junit4]   2> 2035285 DEBUG (SyncThread:0) [    ] o.a.s.c.ZkTestServer Watch added: children: /solr/live_nodes
   [junit4]   2> 2035285 INFO  (zkCallback-7667-thread-1) [    ] o.a.s.c.c.ZkStateReader Updated live nodes from ZooKeeper... (4) -> (5)
   [junit4]   2> 2035285 INFO  (zkCallback-7631-thread-1) [    ] o.a.s.c.c.ZkStateReader Updated live nodes from ZooKeeper... (4) -> (5)
   [junit4]   2> 2035285 DEBUG (SyncThread:0) [    ] o.a.s.c.ZkTestServer Watch added: children: /solr/live_nodes
   [junit4]   2> 2035285 DEBUG (SyncThread:0) [    ] o.a.s.c.ZkTestServer Watch added: children: /solr/live_nodes
   [junit4]   2> 2035285 DEBUG (SyncThread:0) [    ] o.a.s.c.ZkTestServer Watch added: children: /solr/live_nodes
   [junit4]   2> 2035285 DEBUG (SyncThread:0) [    ] o.a.s.c.ZkTestServer Watch added: children: /solr/live_nodes
   [junit4]   2> 2035285 INFO  (zkCallback-7684-thread-1) [    ] o.a.s.c.c.ZkStateReader Updated live nodes from ZooKeeper... (4) -> (5)
   [junit4]   2> 2035285 DEBUG (SyncThread:0) [    ] o.a.s.c.ZkTestServer Watch added: children: /solr/live_nodes
   [junit4]   2> 2035285 INFO  (zkCallback-7684-thread-2) [    ] o.a.s.c.c.ZkStateReader Updated live nodes from ZooKeeper... (4) -> (5)
   [junit4]   2> 2035285 INFO  (zkCallback-7633-thread-1) [    ] o.a.s.c.c.ZkStateReader Updated live nodes from ZooKeeper... (4) -> (5)
   [junit4]   2> 2035285 DEBUG (SyncThread:0) [    ] o.a.s.c.ZkTestServer Watch added: children: /solr/live_nodes
   [junit4]   2> 2035285 INFO  (zkCallback-7661-thread-1) [    ] o.a.s.c.c.ZkStateReader Updated live nodes from ZooKeeper... (4) -> (5)
   [junit4]   2> 2035285 DEBUG (SyncThread:0) [    ] o.a.s.c.ZkTestServer Watch added: children: /solr/live_nodes
   [junit4]   2> 2035285 INFO  (zkCallback-7663-thread-1) [    ] o.a.s.c.c.ZkStateReader Updated live nodes from ZooKeeper... (4) -> (5)
   [junit4]   2> 2035285 INFO  (zkCallback-7650-thread-1) [    ] o.a.s.c.c.ZkStateReader Updated live nodes from ZooKeeper... (4) -> (5)
   [junit4]   2> 2035285 DEBUG (SyncThread:0) [    ] o.a.s.c.ZkTestServer Watch added: children: /solr/live_nodes
   [junit4]   2> 2035285 INFO  (zkCallback-7676-thread-1) [    ] o.a.s.c.c.ZkStateReader Updated live nodes from ZooKeeper... (4) -> (5)
   [junit4]   2> 2035286 INFO  (zkCallback-7643-thread-1) [    ] o.a.s.c.c.ZkStateReader Updated live nodes from ZooKeeper... (4) -> (5)
   [junit4]   2> 2035286 DEBUG (SyncThread:0) [    ] o.a.s.c.ZkTestServer Watch added: children: /solr/live_nodes
   [junit4]   2> 2035286 INFO  (zkCallback-7694-thread-1) [    ] o.a.s.c.c.ZkStateReader Updated live nodes from ZooKeeper... (4) -> (5)
   [junit4]   2> 2035313 INFO  (zkConnectionManagerCallback-7702-thread-1) [    ] o.a.s.c.c.ConnectionManager zkClient has connected
   [junit4]   2> 2035313 DEBUG (SyncThread:0) [    ] o.a.s.c.ZkTestServer Watch added: data: /solr/clusterprops.json
   [junit4]   2> 2035314 DEBUG (SyncThread:0) [    ] o.a.s.c.ZkTestServer Watch added: children: /solr/live_nodes
   [junit4]   2> 2035314 INFO  (TEST-MoveReplicaHDFSTest.testFailedMove-seed#[DF78F1E1A93D7E38]) [n:127.0.0.1:45824_solr    ] o.a.s.c.c.ZkStateReader Updated live nodes from ZooKeeper... (0) -> (5)
   [junit4]   2> 2035314 DEBUG (SyncThread:0) [    ] o.a.s.c.ZkTestServer Watch added: data: /solr/clusterstate.json
   [junit4]   2> 2035314 DEBUG (SyncThread:0) [    ] o.a.s.c.ZkTestServer Watch added: children: /solr/collections
   [junit4]   2> 2035315 DEBUG (SyncThread:0) [    ] o.a.s.c.ZkTestServer Watch added: create/delete: /solr/aliases.json
   [junit4]   2> 2035315 INFO  (TEST-MoveReplicaHDFSTest.testFailedMove-seed#[DF78F1E1A93D7E38]) [n:127.0.0.1:45824_solr    ] o.a.s.c.s.i.ZkClientClusterStateProvider Cluster at 127.0.0.1:37797/solr ready
   [junit4]   2> 2035315 INFO  (TEST-MoveReplicaHDFSTest.testFailedMove-seed#[DF78F1E1A93D7E38]) [n:127.0.0.1:45824_solr    ] o.a.s.h.a.MetricsHistoryHandler No .system collection, keeping metrics history in memory.
   [junit4]   2> 2035336 INFO  (TEST-MoveReplicaHDFSTest.testFailedMove-seed#[DF78F1E1A93D7E38]) [n:127.0.0.1:45824_solr    ] o.a.s.m.r.SolrJmxReporter JMX monitoring for 'solr_45824.solr.node' (registry 'solr.node') enabled at server: com.sun.jmx.mbeanserver.JmxMBeanServer@2a08d804
   [junit4]   2> 2035364 INFO  (TEST-MoveReplicaHDFSTest.testFailedMove-seed#[DF78F1E1A93D7E38]) [n:127.0.0.1:45824_solr    ] o.a.s.m.r.SolrJmxReporter JMX monitoring for 'solr_45824.solr.jvm' (registry 'solr.jvm') enabled at server: com.sun.jmx.mbeanserver.JmxMBeanServer@2a08d804
   [junit4]   2> 2035364 INFO  (TEST-MoveReplicaHDFSTest.testFailedMove-seed#[DF78F1E1A93D7E38]) [n:127.0.0.1:45824_solr    ] o.a.s.m.r.SolrJmxReporter JMX monitoring for 'solr_45824.solr.jetty' (registry 'solr.jetty') enabled at server: com.sun.jmx.mbeanserver.JmxMBeanServer@2a08d804
   [junit4]   2> 2035365 INFO  (TEST-MoveReplicaHDFSTest.testFailedMove-seed#[DF78F1E1A93D7E38]) [n:127.0.0.1:45824_solr    ] o.a.s.c.CorePropertiesLocator Found 0 core definitions underneath /x1/jenkins/jenkins-slave/workspace/Lucene-Solr-BadApples-Tests-master/solr/build/solr-core/test/J1/temp/solr.cloud.MoveReplicaHDFSTest_DF78F1E1A93D7E38-001/tempDir-001/node5/.
   [junit4]   2> 2035384 DEBUG (SyncThread:0) [    ] o.a.s.c.ZkTestServer Watch fired: children: /solr/overseer/queue
   [junit4]   2> 2035384 DEBUG (SyncThread:0) [    ] o.a.s.c.ZkTestServer Watch added: children: /solr/overseer/queue
   [junit4]   2> 2035428 INFO  (zkConnectionManagerCallback-7705-thread-1) [    ] o.a.s.c.c.ConnectionManager zkClient has connected
   [junit4]   2> 2035451 INFO  (qtp784122423-23643) [n:127.0.0.1:33009_solr    ] o.a.s.h.a.CollectionsHandler Invoked Collection Action :create with params collection.configName=conf1&autoAddReplicas=false&name=MoveReplicaHDFSTest_failed_coll_true&nrtReplicas=2&action=CREATE&numShards=2&wt=javabin&version=2 and sendToOCPQueue=true
   [junit4]   2> 2035452 DEBUG (SyncThread:0) [    ] o.a.s.c.ZkTestServer Watch fired: children: /solr/overseer/collection-queue-work
   [junit4]   2> 2035452 DEBUG (SyncThread:0) [    ] o.a.s.c.ZkTestServer Watch added: children: /solr/overseer/collection-queue-work
   [junit4]   2> 2035452 DEBUG (SyncThread:0) [    ] o.a.s.c.ZkTestServer Watch added: create/delete: /solr/overseer/collection-queue-work/qnr-0000000002
   [junit4]   2> 2035452 DEBUG (OverseerCollectionConfigSetProcessor-72420737233059850-127.0.0.1:41385_solr-n_0000000000) [n:127.0.0.1:41385_solr    ] o.a.s.c.ZkDistributedQueue Found child node with improper name: qnr-0000000002
   [junit4]   2> 2035453 DEBUG (SyncThread:0) [    ] o.a.s.c.ZkTestServer Watch fired: children: /solr/overseer/collection-queue-work
   [junit4]   2> 2035453 DEBUG (SyncThread:0) [    ] o.a.s.c.ZkTestServer Watch added: children: /solr/overseer/collection-queue-work
   [junit4]   2> 2035453 DEBUG (OverseerCollectionConfigSetProcessor-72420737233059850-127.0.0.1:41385_solr-n_0000000000) [n:127.0.0.1:41385_solr    ] o.a.s.c.ZkDistributedQueue Found child node with improper name: qnr-0000000002
   [junit4]   2> 2035453 DEBUG (OverseerCollectionConfigSetProcessor-72420737233059850-127.0.0.1:41385_solr-n_0000000000) [n:127.0.0.1:41385_solr    ] o.a.s.c.OverseerTaskQueue Returning topN elements: [/overseer/collection-queue-work/qn-0000000002, ]
   [junit4]   2> 2035454 DEBUG (OverseerCollectionConfigSetProcessor-72420737233059850-127.0.0.1:41385_solr-n_0000000000) [n:127.0.0.1:41385_solr    ] o.a.s.c.OverseerTaskProcessor Got 1 tasks from work-queue : [[org.apache.solr.cloud.OverseerTaskQueue$QueueEvent@2e684ed1]]
   [junit4]   2> 2035454 DEBUG (OverseerCollectionConfigSetProcessor-72420737233059850-127.0.0.1:41385_solr-n_0000000000) [n:127.0.0.1:41385_solr    ] o.a.s.c.OverseerTaskProcessor Marked task [/overseer/collection-queue-work/qn-0000000002] as running
   [junit4]   2> 2035454 DEBUG (OverseerCollectionConfigSetProcessor-72420737233059850-127.0.0.1:41385_solr-n_0000000000) [n:127.0.0.1:41385_solr    ] o.a.s.c.OverseerTaskProcessor Overseer Collection Message Handler: Get the message id:/overseer/collection-queue-work/qn-0000000002 message:{
   [junit4]   2>   "name":"MoveReplicaHDFSTest_failed_coll_true",
   [junit4]   2>   "fromApi":"true",
   [junit4]   2>   "collection.configName":"conf1",
   [junit4]   2>   "numShards":"2",
   [junit4]   2>   "autoAddReplicas":"false",
   [junit4]   2>   "nrtReplicas":"2",
   [junit4]   2>   "stateFormat":"2",
   [junit4]   2>   "replicationFactor":"2",
   [junit4]   2>   "operation":"create"}
   [junit4]   2> 2035454 DEBUG (OverseerThreadFactory-9241-thread-2-processing-n:127.0.0.1:41385_solr) [n:127.0.0.1:41385_solr    ] o.a.s.c.OverseerTaskProcessor Runner processing /overseer/collection-queue-work/qn-0000000002
   [junit4]   2> 2035454 DEBUG (OverseerThreadFactory-9241-thread-2-processing-n:127.0.0.1:41385_solr) [n:127.0.0.1:41385_solr    ] o.a.s.c.a.c.OverseerCollectionMessageHandler OverseerCollectionMessageHandler.processMessage : create , {
   [junit4]   2>   "name":"MoveReplicaHDFSTest_failed_coll_true",
   [junit4]   2>   "fromApi":"true",
   [junit4]   2>   "collection.configName":"conf1",
   [junit4]   2>   "numShards":"2",
   [junit4]   2>   "autoAddReplicas":"false",
   [junit4]   2>   "nrtReplicas":"2",
   [junit4]   2>   "stateFormat":"2",
   [junit4]   2>   "replicationFactor":"2",
   [junit4]   2>   "operation":"create"}
   [junit4]   2> 2035454 DEBUG (OverseerCollectionConfigSetProcessor-72420737233059850-127.0.0.1:41385_solr-n_0000000000) [n:127.0.0.1:41385_solr    ] o.a.s.c.OverseerTaskProcessor Cleaning up work-queue. #Running tasks: 1
   [junit4]   2> 2035454 DEBUG (OverseerCollectionConfigSetProcessor-72420737233059850-127.0.0.1:41385_solr-n_0000000000) [n:127.0.0.1:41385_solr    ] o.a.s.c.OverseerTaskProcessor RunningTasks: [/overseer/collection-queue-work/qn-0000000002]
   [junit4]   2> 2035454 INFO  (OverseerThreadFactory-9241-thread-2-processing-n:127.0.0.1:41385_solr) [n:127.0.0.1:41385_solr    ] o.a.s.c.a.c.CreateCollectionCmd Create collection MoveReplicaHDFSTest_failed_coll_true
   [junit4]   2> 2035454 DEBUG (OverseerCollectionConfigSetProcessor-72420737233059850-127.0.0.1:41385_solr-n_0000000000) [n:127.0.0.1:41385_solr    ] o.a.s.c.OverseerTaskProcessor BlockedTasks: []
   [junit4]   2> 2035454 DEBUG (OverseerCollectionConfigSetProcessor-72420737233059850-127.0.0.1:41385_solr-n_0000000000) [n:127.0.0.1:41385_solr    ] o.a.s.c.OverseerTaskProcessor CompletedTasks: []
   [junit4]   2> 2035454 DEBUG (OverseerCollectionConfigSetProcessor-72420737233059850-127.0.0.1:41385_solr-n_0000000000) [n:127.0.0.1:41385_solr    ] o.a.s.c.OverseerTaskProcessor RunningZKTasks: [/overseer/collection-queue-work/qn-0000000002]
   [junit4]   2> 2035454 DEBUG (OverseerCollectionConfigSetProcessor-72420737233059850-127.0.0.1:41385_solr-n_0000000000) [n:127.0.0.1:41385_solr    ] o.a.s.c.OverseerTaskQueue Peeking for top 99 elements. ExcludeSet: [/overseer/collection-queue-work/qn-0000000002],[]
   [junit4]   2> 2035455 DEBUG (OverseerThreadFactory-9241-thread-2-processing-n:127.0.0.1:41385_solr) [n:127.0.0.1:41385_solr    ] o.a.s.c.a.c.OverseerCollectionMessageHandler creating collections conf node /collections/MoveReplicaHDFSTest_failed_coll_true 
   [junit4]   2> 2035456 DEBUG (SyncThread:0) [    ] o.a.s.c.ZkTestServer Watch fired: children: /solr/collections
   [junit4]   2> 2035456 DEBUG (SyncThread:0) [    ] o.a.s.c.ZkTestServer Watch fired: children: /solr/collections
   [junit4]   2> 2035456 DEBUG (SyncThread:0) [    ] o.a.s.c.ZkTestServer Watch fired: children: /solr/collections
   [junit4]   2> 2035456 DEBUG (SyncThread:0) [    ] o.a.s.c.ZkTestServer Watch fired: children: /solr/collections
   [junit4]   2> 2035456 DEBUG (SyncThread:0) [    ] o.a.s.c.ZkTestServer Watch fired: children: /solr/collections
   [junit4]   2> 2035456 DEBUG (SyncThread:0) [    ] o.a.s.c.ZkTestServer Watch fired: children: /solr/collections
   [junit4]   2> 2035456 DEBUG (SyncThread:0) [    ] o.a.s.c.ZkTestServer Watch fired: children: /solr/collections
   [junit4]   2> 2035456 DEBUG (SyncThread:0) [    ] o.a.s.c.ZkTestServer Watch fired: children: /solr/collections
   [junit4]   2> 2035456 DEBUG (SyncThread:0) [    ] o.a.s.c.ZkTestServer Watch fired: children: /solr/collections
   [junit4]   2> 2035456 DEBUG (SyncThread:0) [    ] o.a.s.c.ZkTestServer Watch fired: children: /solr/collections
   [junit4]   2> 2035456 DEBUG (SyncThread:0) [    ] o.a.s.c.ZkTestServer Watch fired: children: /solr/collections
   [junit4]   2> 2035456 DEBUG (SyncThread:0) [    ] o.a.s.c.ZkTestServer Watch added: children: /solr/collections
   [junit4]   2> 2035456 DEBUG (SyncThread:0) [    ] o.a.s.c.ZkTestServer Watch added: children: /solr/collections
   [junit4]   2> 2035456 DEBUG (SyncThread:0) [    ] o.a.s.c.ZkTestServer Watch added: children: /solr/collections
   [junit4]   2> 2035457 DEBUG (SyncThread:0) [    ] o.a.s.c.ZkTestServer Watch added: children: /solr/collections
   [junit4]   2> 2035457 DEBUG (SyncThread:0) [    ] o.a.s.c.ZkTestServer Watch added: children: /solr/collections
   [junit4]   2> 2035457 DEBUG (SyncThread:0) [    ] o.a.s.c.ZkTestServer Watch added: children: /solr/collections
   [junit4]   2> 2035457 DEBUG (SyncThread:0) [    ] o.a.s.c.ZkTestServer Watch added: children: /solr/collections
   [junit4]   2> 2035457 DEBUG (SyncThread:0) [    ] o.a.s.c.ZkTestServer Watch added: children: /solr/collections
   [junit4]   2> 2035457 DEBUG (SyncThread:0) [    ] o.a.s.c.ZkTestServer Watch added: children: /solr/collections
   [junit4]   2> 2035457 DE

[...truncated too long message...]

kins-slave/workspace/Lucene-Solr-BadApples-Tests-master/lucene/top-level-ivy-settings.xml

resolve:

ivy-availability-check:
[loadresource] Do not set property disallowed.ivy.jars.list as its length is 0.

-ivy-fail-disallowed-ivy-version:

ivy-fail:

ivy-configure:
[ivy:configure] :: loading settings :: file = /x1/jenkins/jenkins-slave/workspace/Lucene-Solr-BadApples-Tests-master/lucene/top-level-ivy-settings.xml

resolve:

ivy-availability-check:
[loadresource] Do not set property disallowed.ivy.jars.list as its length is 0.

-ivy-fail-disallowed-ivy-version:

ivy-fail:

ivy-fail:

ivy-configure:
[ivy:configure] :: loading settings :: file = /x1/jenkins/jenkins-slave/workspace/Lucene-Solr-BadApples-Tests-master/lucene/top-level-ivy-settings.xml

resolve:

ivy-availability-check:
[loadresource] Do not set property disallowed.ivy.jars.list as its length is 0.

-ivy-fail-disallowed-ivy-version:

ivy-fail:

ivy-configure:
[ivy:configure] :: loading settings :: file = /x1/jenkins/jenkins-slave/workspace/Lucene-Solr-BadApples-Tests-master/lucene/top-level-ivy-settings.xml

resolve:

ivy-availability-check:
[loadresource] Do not set property disallowed.ivy.jars.list as its length is 0.

-ivy-fail-disallowed-ivy-version:

ivy-fail:

ivy-fail:

ivy-configure:
[ivy:configure] :: loading settings :: file = /x1/jenkins/jenkins-slave/workspace/Lucene-Solr-BadApples-Tests-master/lucene/top-level-ivy-settings.xml

resolve:

ivy-availability-check:
[loadresource] Do not set property disallowed.ivy.jars.list as its length is 0.

-ivy-fail-disallowed-ivy-version:

ivy-fail:

ivy-fail:

ivy-configure:
[ivy:configure] :: loading settings :: file = /x1/jenkins/jenkins-slave/workspace/Lucene-Solr-BadApples-Tests-master/lucene/top-level-ivy-settings.xml

resolve:

ivy-availability-check:
[loadresource] Do not set property disallowed.ivy.jars.list as its length is 0.

-ivy-fail-disallowed-ivy-version:

ivy-fail:

ivy-fail:

ivy-configure:
[ivy:configure] :: loading settings :: file = /x1/jenkins/jenkins-slave/workspace/Lucene-Solr-BadApples-Tests-master/lucene/top-level-ivy-settings.xml

resolve:

ivy-availability-check:
[loadresource] Do not set property disallowed.ivy.jars.list as its length is 0.

-ivy-fail-disallowed-ivy-version:

ivy-fail:

ivy-fail:

ivy-configure:
[ivy:configure] :: loading settings :: file = /x1/jenkins/jenkins-slave/workspace/Lucene-Solr-BadApples-Tests-master/lucene/top-level-ivy-settings.xml

resolve:

ivy-availability-check:
[loadresource] Do not set property disallowed.ivy.jars.list as its length is 0.

-ivy-fail-disallowed-ivy-version:

ivy-fail:

ivy-fail:

ivy-configure:
[ivy:configure] :: loading settings :: file = /x1/jenkins/jenkins-slave/workspace/Lucene-Solr-BadApples-Tests-master/lucene/top-level-ivy-settings.xml

resolve:

ivy-availability-check:
[loadresource] Do not set property disallowed.ivy.jars.list as its length is 0.

-ivy-fail-disallowed-ivy-version:

ivy-fail:

ivy-fail:

ivy-configure:
[ivy:configure] :: loading settings :: file = /x1/jenkins/jenkins-slave/workspace/Lucene-Solr-BadApples-Tests-master/lucene/top-level-ivy-settings.xml

resolve:

ivy-availability-check:
[loadresource] Do not set property disallowed.ivy.jars.list as its length is 0.

-ivy-fail-disallowed-ivy-version:

ivy-fail:

ivy-fail:

ivy-configure:
[ivy:configure] :: loading settings :: file = /x1/jenkins/jenkins-slave/workspace/Lucene-Solr-BadApples-Tests-master/lucene/top-level-ivy-settings.xml

resolve:

ivy-availability-check:
[loadresource] Do not set property disallowed.ivy.jars.list as its length is 0.

-ivy-fail-disallowed-ivy-version:

ivy-fail:

ivy-fail:

ivy-configure:
[ivy:configure] :: loading settings :: file = /x1/jenkins/jenkins-slave/workspace/Lucene-Solr-BadApples-Tests-master/lucene/top-level-ivy-settings.xml

resolve:

ivy-availability-check:
[loadresource] Do not set property disallowed.ivy.jars.list as its length is 0.

-ivy-fail-disallowed-ivy-version:

ivy-fail:

ivy-fail:

ivy-configure:
[ivy:configure] :: loading settings :: file = /x1/jenkins/jenkins-slave/workspace/Lucene-Solr-BadApples-Tests-master/lucene/top-level-ivy-settings.xml

resolve:

ivy-availability-check:
[loadresource] Do not set property disallowed.ivy.jars.list as its length is 0.

-ivy-fail-disallowed-ivy-version:

ivy-fail:

ivy-fail:

ivy-configure:
[ivy:configure] :: loading settings :: file = /x1/jenkins/jenkins-slave/workspace/Lucene-Solr-BadApples-Tests-master/lucene/top-level-ivy-settings.xml

resolve:

jar-checksums:
    [mkdir] Created dir: /x1/jenkins/jenkins-slave/workspace/Lucene-Solr-BadApples-Tests-master/solr/null203519803
     [copy] Copying 238 files to /x1/jenkins/jenkins-slave/workspace/Lucene-Solr-BadApples-Tests-master/solr/null203519803
   [delete] Deleting directory /x1/jenkins/jenkins-slave/workspace/Lucene-Solr-BadApples-Tests-master/solr/null203519803

check-working-copy:
[ivy:cachepath] :: resolving dependencies :: org.eclipse.jgit#org.eclipse.jgit-caller;working
[ivy:cachepath] 	confs: [default]
[ivy:cachepath] 	found org.eclipse.jgit#org.eclipse.jgit;4.6.0.201612231935-r in public
[ivy:cachepath] 	found com.jcraft#jsch;0.1.53 in public
[ivy:cachepath] 	found com.googlecode.javaewah#JavaEWAH;1.1.6 in public
[ivy:cachepath] 	found org.apache.httpcomponents#httpclient;4.3.6 in public
[ivy:cachepath] 	found org.apache.httpcomponents#httpcore;4.3.3 in public
[ivy:cachepath] 	found commons-logging#commons-logging;1.1.3 in public
[ivy:cachepath] 	found commons-codec#commons-codec;1.6 in public
[ivy:cachepath] 	found org.slf4j#slf4j-api;1.7.2 in public
[ivy:cachepath] :: resolution report :: resolve 24ms :: artifacts dl 1ms
	---------------------------------------------------------------------
	|                  |            modules            ||   artifacts   |
	|       conf       | number| search|dwnlded|evicted|| number|dwnlded|
	---------------------------------------------------------------------
	|      default     |   8   |   0   |   0   |   0   ||   8   |   0   |
	---------------------------------------------------------------------
[wc-checker] Initializing working copy...
[wc-checker] SLF4J: Failed to load class "org.slf4j.impl.StaticLoggerBinder".
[wc-checker] SLF4J: Defaulting to no-operation (NOP) logger implementation
[wc-checker] SLF4J: See http://www.slf4j.org/codes.html#StaticLoggerBinder for further details.
[wc-checker] Checking working copy status...

-jenkins-base:

BUILD SUCCESSFUL
Total time: 117 minutes 37 seconds
Archiving artifacts
java.lang.InterruptedException: no matches found within 10000
	at hudson.FilePath$34.hasMatch(FilePath.java:2678)
	at hudson.FilePath$34.invoke(FilePath.java:2557)
	at hudson.FilePath$34.invoke(FilePath.java:2547)
	at hudson.FilePath$FileCallableWrapper.call(FilePath.java:2918)
Also:   hudson.remoting.Channel$CallSiteStackTrace: Remote call to lucene
		at hudson.remoting.Channel.attachCallSiteStackTrace(Channel.java:1741)
		at hudson.remoting.UserRequest$ExceptionResponse.retrieve(UserRequest.java:357)
		at hudson.remoting.Channel.call(Channel.java:955)
		at hudson.FilePath.act(FilePath.java:1036)
		at hudson.FilePath.act(FilePath.java:1025)
		at hudson.FilePath.validateAntFileMask(FilePath.java:2547)
		at hudson.tasks.ArtifactArchiver.perform(ArtifactArchiver.java:243)
		at hudson.tasks.BuildStepCompatibilityLayer.perform(BuildStepCompatibilityLayer.java:81)
		at hudson.tasks.BuildStepMonitor$1.perform(BuildStepMonitor.java:20)
		at hudson.model.AbstractBuild$AbstractBuildExecution.perform(AbstractBuild.java:744)
		at hudson.model.AbstractBuild$AbstractBuildExecution.performAllBuildSteps(AbstractBuild.java:690)
		at hudson.model.Build$BuildExecution.post2(Build.java:186)
		at hudson.model.AbstractBuild$AbstractBuildExecution.post(AbstractBuild.java:635)
		at hudson.model.Run.execute(Run.java:1819)
		at hudson.model.FreeStyleBuild.run(FreeStyleBuild.java:43)
		at hudson.model.ResourceController.execute(ResourceController.java:97)
		at hudson.model.Executor.run(Executor.java:429)
Caused: hudson.FilePath$TunneledInterruptedException
	at hudson.FilePath$FileCallableWrapper.call(FilePath.java:2920)
	at hudson.remoting.UserRequest.perform(UserRequest.java:212)
	at hudson.remoting.UserRequest.perform(UserRequest.java:54)
	at hudson.remoting.Request$2.run(Request.java:369)
	at hudson.remoting.InterceptingExecutorService$1.call(InterceptingExecutorService.java:72)
	at java.util.concurrent.FutureTask.run(FutureTask.java:266)
	at java.util.concurrent.ThreadPoolExecutor.runWorker(ThreadPoolExecutor.java:1142)
	at java.util.concurrent.ThreadPoolExecutor$Worker.run(ThreadPoolExecutor.java:617)
	at java.lang.Thread.run(Thread.java:748)
Caused: java.lang.InterruptedException: java.lang.InterruptedException: no matches found within 10000
	at hudson.FilePath.act(FilePath.java:1038)
	at hudson.FilePath.act(FilePath.java:1025)
	at hudson.FilePath.validateAntFileMask(FilePath.java:2547)
	at hudson.tasks.ArtifactArchiver.perform(ArtifactArchiver.java:243)
	at hudson.tasks.BuildStepCompatibilityLayer.perform(BuildStepCompatibilityLayer.java:81)
	at hudson.tasks.BuildStepMonitor$1.perform(BuildStepMonitor.java:20)
	at hudson.model.AbstractBuild$AbstractBuildExecution.perform(AbstractBuild.java:744)
	at hudson.model.AbstractBuild$AbstractBuildExecution.performAllBuildSteps(AbstractBuild.java:690)
	at hudson.model.Build$BuildExecution.post2(Build.java:186)
	at hudson.model.AbstractBuild$AbstractBuildExecution.post(AbstractBuild.java:635)
	at hudson.model.Run.execute(Run.java:1819)
	at hudson.model.FreeStyleBuild.run(FreeStyleBuild.java:43)
	at hudson.model.ResourceController.execute(ResourceController.java:97)
	at hudson.model.Executor.run(Executor.java:429)
No artifacts found that match the file pattern "**/*.events,heapdumps/**,**/hs_err_pid*". Configuration error?
Recording test results
Build step 'Publish JUnit test result report' changed build result to UNSTABLE
Email was triggered for: Unstable (Test Failures)
Sending email for trigger: Unstable (Test Failures)

Mime
View raw message