lucene-dev mailing list archives

Site index · List index
Message view « Date » · « Thread »
Top « Date » · « Thread »
From Policeman Jenkins Server <jenk...@thetaphi.de>
Subject [JENKINS] Lucene-Solr-7.x-Windows (64bit/jdk-10) - Build # 797 - Still Unstable!
Date Fri, 21 Sep 2018 22:26:03 GMT
Build: https://jenkins.thetaphi.de/job/Lucene-Solr-7.x-Windows/797/
Java: 64bit/jdk-10 -XX:-UseCompressedOops -XX:+UseSerialGC

6 tests failed.
FAILED:  org.apache.solr.cloud.autoscaling.sim.TestSimGenericDistributedQueue.testDistributedQueue {#2}

Error Message:
Test abandoned because suite timeout was reached.

Stack Trace:
java.lang.Exception: Test abandoned because suite timeout was reached.
	at __randomizedtesting.SeedInfo.seed([489E4C08E39E4501]:0)


FAILED:  org.apache.solr.cloud.autoscaling.sim.TestSimGenericDistributedQueue.testDistributedQueue

Error Message:
Test abandoned because suite timeout was reached.

Stack Trace:
java.lang.Exception: Test abandoned because suite timeout was reached.
	at __randomizedtesting.SeedInfo.seed([489E4C08E39E4501]:0)


FAILED:  junit.framework.TestSuite.org.apache.solr.cloud.autoscaling.sim.TestSimGenericDistributedQueue

Error Message:
Suite timeout exceeded (>= 7200000 msec).

Stack Trace:
java.lang.Exception: Suite timeout exceeded (>= 7200000 msec).
	at __randomizedtesting.SeedInfo.seed([489E4C08E39E4501]:0)


FAILED:  junit.framework.TestSuite.org.apache.solr.cloud.autoscaling.sim.TestSimGenericDistributedQueue

Error Message:
Suite timeout exceeded (>= 7200000 msec).

Stack Trace:
java.lang.Exception: Suite timeout exceeded (>= 7200000 msec).
	at __randomizedtesting.SeedInfo.seed([489E4C08E39E4501]:0)


FAILED:  org.apache.solr.cloud.autoscaling.sim.TestSimGenericDistributedQueue.testDistributedQueueBlocking

Error Message:


Stack Trace:
java.util.concurrent.TimeoutException
	at __randomizedtesting.SeedInfo.seed([489E4C08E39E4501:D343E71A7CCF975]:0)
	at java.base/java.util.concurrent.FutureTask.get(FutureTask.java:204)
	at org.apache.solr.cloud.autoscaling.sim.TestSimDistributedQueue.testDistributedQueueBlocking(TestSimDistributedQueue.java:102)
	at java.base/jdk.internal.reflect.NativeMethodAccessorImpl.invoke0(Native Method)
	at java.base/jdk.internal.reflect.NativeMethodAccessorImpl.invoke(NativeMethodAccessorImpl.java:62)
	at java.base/jdk.internal.reflect.DelegatingMethodAccessorImpl.invoke(DelegatingMethodAccessorImpl.java:43)
	at java.base/java.lang.reflect.Method.invoke(Method.java:564)
	at com.carrotsearch.randomizedtesting.RandomizedRunner.invoke(RandomizedRunner.java:1742)
	at com.carrotsearch.randomizedtesting.RandomizedRunner$8.evaluate(RandomizedRunner.java:935)
	at com.carrotsearch.randomizedtesting.RandomizedRunner$9.evaluate(RandomizedRunner.java:971)
	at com.carrotsearch.randomizedtesting.RandomizedRunner$10.evaluate(RandomizedRunner.java:985)
	at com.carrotsearch.randomizedtesting.rules.SystemPropertiesRestoreRule$1.evaluate(SystemPropertiesRestoreRule.java:57)
	at org.apache.lucene.util.TestRuleSetupTeardownChained$1.evaluate(TestRuleSetupTeardownChained.java:49)
	at org.apache.lucene.util.AbstractBeforeAfterRule$1.evaluate(AbstractBeforeAfterRule.java:45)
	at org.apache.lucene.util.TestRuleThreadAndTestName$1.evaluate(TestRuleThreadAndTestName.java:48)
	at org.apache.lucene.util.TestRuleIgnoreAfterMaxFailures$1.evaluate(TestRuleIgnoreAfterMaxFailures.java:64)
	at org.apache.lucene.util.TestRuleMarkFailure$1.evaluate(TestRuleMarkFailure.java:47)
	at com.carrotsearch.randomizedtesting.rules.StatementAdapter.evaluate(StatementAdapter.java:36)
	at com.carrotsearch.randomizedtesting.ThreadLeakControl$StatementRunner.run(ThreadLeakControl.java:368)
	at com.carrotsearch.randomizedtesting.ThreadLeakControl.forkTimeoutingTask(ThreadLeakControl.java:817)
	at com.carrotsearch.randomizedtesting.ThreadLeakControl$3.evaluate(ThreadLeakControl.java:468)
	at com.carrotsearch.randomizedtesting.RandomizedRunner.runSingleTest(RandomizedRunner.java:944)
	at com.carrotsearch.randomizedtesting.RandomizedRunner$5.evaluate(RandomizedRunner.java:830)
	at com.carrotsearch.randomizedtesting.RandomizedRunner$6.evaluate(RandomizedRunner.java:880)
	at com.carrotsearch.randomizedtesting.RandomizedRunner$7.evaluate(RandomizedRunner.java:891)
	at com.carrotsearch.randomizedtesting.rules.StatementAdapter.evaluate(StatementAdapter.java:36)
	at com.carrotsearch.randomizedtesting.rules.SystemPropertiesRestoreRule$1.evaluate(SystemPropertiesRestoreRule.java:57)
	at org.apache.lucene.util.AbstractBeforeAfterRule$1.evaluate(AbstractBeforeAfterRule.java:45)
	at com.carrotsearch.randomizedtesting.rules.StatementAdapter.evaluate(StatementAdapter.java:36)
	at org.apache.lucene.util.TestRuleStoreClassName$1.evaluate(TestRuleStoreClassName.java:41)
	at com.carrotsearch.randomizedtesting.rules.NoShadowingOrOverridesOnMethodsRule$1.evaluate(NoShadowingOrOverridesOnMethodsRule.java:40)
	at com.carrotsearch.randomizedtesting.rules.NoShadowingOrOverridesOnMethodsRule$1.evaluate(NoShadowingOrOverridesOnMethodsRule.java:40)
	at com.carrotsearch.randomizedtesting.rules.StatementAdapter.evaluate(StatementAdapter.java:36)
	at com.carrotsearch.randomizedtesting.rules.StatementAdapter.evaluate(StatementAdapter.java:36)
	at org.apache.lucene.util.TestRuleAssertionsRequired$1.evaluate(TestRuleAssertionsRequired.java:53)
	at org.apache.lucene.util.TestRuleMarkFailure$1.evaluate(TestRuleMarkFailure.java:47)
	at org.apache.lucene.util.TestRuleIgnoreAfterMaxFailures$1.evaluate(TestRuleIgnoreAfterMaxFailures.java:64)
	at org.apache.lucene.util.TestRuleIgnoreTestSuites$1.evaluate(TestRuleIgnoreTestSuites.java:54)
	at com.carrotsearch.randomizedtesting.rules.StatementAdapter.evaluate(StatementAdapter.java:36)
	at com.carrotsearch.randomizedtesting.ThreadLeakControl$StatementRunner.run(ThreadLeakControl.java:368)
	at java.base/java.lang.Thread.run(Thread.java:844)


FAILED:  junit.framework.TestSuite.org.apache.solr.cloud.autoscaling.sim.TestSimGenericDistributedQueue

Error Message:
1 thread leaked from SUITE scope at org.apache.solr.cloud.autoscaling.sim.TestSimGenericDistributedQueue:     1) Thread[id=15137, name=sdqtest--4323-thread-1, state=TIMED_WAITING, group=TGRP-TestSimGenericDistributedQueue]         at java.base@10/jdk.internal.misc.Unsafe.park(Native Method)         at java.base@10/java.util.concurrent.locks.LockSupport.parkNanos(LockSupport.java:234)         at java.base@10/java.util.concurrent.locks.AbstractQueuedSynchronizer$ConditionObject.awaitNanos(AbstractQueuedSynchronizer.java:2117)         at app//org.apache.solr.cloud.autoscaling.sim.GenericDistributedQueue.peek(GenericDistributedQueue.java:194)         at app//org.apache.solr.cloud.autoscaling.sim.GenericDistributedQueue.peek(GenericDistributedQueue.java:167)         at app//org.apache.solr.cloud.autoscaling.sim.TestSimDistributedQueue.lambda$testDistributedQueueBlocking$0(TestSimDistributedQueue.java:93)         at app//org.apache.solr.cloud.autoscaling.sim.TestSimDistributedQueue$$Lambda$1350/457746086.call(Unknown Source)         at java.base@10/java.util.concurrent.FutureTask.run(FutureTask.java:264)         at app//org.apache.solr.common.util.ExecutorUtil$MDCAwareThreadPoolExecutor.lambda$execute$0(ExecutorUtil.java:209)         at app//org.apache.solr.common.util.ExecutorUtil$MDCAwareThreadPoolExecutor$$Lambda$275/435940844.run(Unknown Source)         at java.base@10/java.util.concurrent.ThreadPoolExecutor.runWorker(ThreadPoolExecutor.java:1135)         at java.base@10/java.util.concurrent.ThreadPoolExecutor$Worker.run(ThreadPoolExecutor.java:635)         at java.base@10/java.lang.Thread.run(Thread.java:844)

Stack Trace:
com.carrotsearch.randomizedtesting.ThreadLeakError: 1 thread leaked from SUITE scope at org.apache.solr.cloud.autoscaling.sim.TestSimGenericDistributedQueue: 
   1) Thread[id=15137, name=sdqtest--4323-thread-1, state=TIMED_WAITING, group=TGRP-TestSimGenericDistributedQueue]
        at java.base@10/jdk.internal.misc.Unsafe.park(Native Method)
        at java.base@10/java.util.concurrent.locks.LockSupport.parkNanos(LockSupport.java:234)
        at java.base@10/java.util.concurrent.locks.AbstractQueuedSynchronizer$ConditionObject.awaitNanos(AbstractQueuedSynchronizer.java:2117)
        at app//org.apache.solr.cloud.autoscaling.sim.GenericDistributedQueue.peek(GenericDistributedQueue.java:194)
        at app//org.apache.solr.cloud.autoscaling.sim.GenericDistributedQueue.peek(GenericDistributedQueue.java:167)
        at app//org.apache.solr.cloud.autoscaling.sim.TestSimDistributedQueue.lambda$testDistributedQueueBlocking$0(TestSimDistributedQueue.java:93)
        at app//org.apache.solr.cloud.autoscaling.sim.TestSimDistributedQueue$$Lambda$1350/457746086.call(Unknown Source)
        at java.base@10/java.util.concurrent.FutureTask.run(FutureTask.java:264)
        at app//org.apache.solr.common.util.ExecutorUtil$MDCAwareThreadPoolExecutor.lambda$execute$0(ExecutorUtil.java:209)
        at app//org.apache.solr.common.util.ExecutorUtil$MDCAwareThreadPoolExecutor$$Lambda$275/435940844.run(Unknown Source)
        at java.base@10/java.util.concurrent.ThreadPoolExecutor.runWorker(ThreadPoolExecutor.java:1135)
        at java.base@10/java.util.concurrent.ThreadPoolExecutor$Worker.run(ThreadPoolExecutor.java:635)
        at java.base@10/java.lang.Thread.run(Thread.java:844)
	at __randomizedtesting.SeedInfo.seed([489E4C08E39E4501]:0)




Build Log:
[...truncated 13752 lines...]
   [junit4] Suite: org.apache.solr.cloud.autoscaling.sim.TestSimGenericDistributedQueue
   [junit4]   2> Creating dataDir: C:\Users\jenkins\workspace\Lucene-Solr-7.x-Windows\solr\build\solr-core\test\J1\temp\solr.cloud.autoscaling.sim.TestSimGenericDistributedQueue_489E4C08E39E4501-001\init-core-data-001
   [junit4]   2> 1860161 WARN  (SUITE-TestSimGenericDistributedQueue-seed#[489E4C08E39E4501]-worker) [    ] o.a.s.SolrTestCaseJ4 startTrackingSearchers: numOpens=1 numCloses=1
   [junit4]   2> 1860161 INFO  (SUITE-TestSimGenericDistributedQueue-seed#[489E4C08E39E4501]-worker) [    ] o.a.s.SolrTestCaseJ4 Using PointFields (NUMERIC_POINTS_SYSPROP=true) w/NUMERIC_DOCVALUES_SYSPROP=false
   [junit4]   2> 1860162 INFO  (SUITE-TestSimGenericDistributedQueue-seed#[489E4C08E39E4501]-worker) [    ] o.a.s.SolrTestCaseJ4 Randomized ssl (false) and clientAuth (false) via: @org.apache.solr.util.RandomizeSSL(reason="", value=0.0/0.0, ssl=0.0/0.0, clientAuth=0.0/0.0)
   [junit4]   2> 1860162 INFO  (SUITE-TestSimGenericDistributedQueue-seed#[489E4C08E39E4501]-worker) [    ] o.a.s.SolrTestCaseJ4 SecureRandom sanity checks: test.solr.allowed.securerandom=null & java.security.egd=file:/dev/./urandom
   [junit4]   2> 1860163 INFO  (TEST-TestSimGenericDistributedQueue.testDistributedQueueBlocking-seed#[489E4C08E39E4501]) [    ] o.a.s.SolrTestCaseJ4 ###Starting testDistributedQueueBlocking
   [junit4]   2> 1862166 INFO  (TEST-TestSimGenericDistributedQueue.testDistributedQueueBlocking-seed#[489E4C08E39E4501]) [    ] o.a.s.SolrTestCaseJ4 ###Ending testDistributedQueueBlocking
   [junit4]   2> NOTE: reproduce with: ant test  -Dtestcase=TestSimGenericDistributedQueue -Dtests.method=testDistributedQueueBlocking -Dtests.seed=489E4C08E39E4501 -Dtests.slow=true -Dtests.locale=en-WS -Dtests.timezone=America/Lower_Princes -Dtests.asserts=true -Dtests.file.encoding=US-ASCII
   [junit4] ERROR   2.01s J1 | TestSimGenericDistributedQueue.testDistributedQueueBlocking <<<
   [junit4]    > Throwable #1: java.util.concurrent.TimeoutException
   [junit4]    > 	at __randomizedtesting.SeedInfo.seed([489E4C08E39E4501:D343E71A7CCF975]:0)
   [junit4]    > 	at java.base/java.util.concurrent.FutureTask.get(FutureTask.java:204)
   [junit4]    > 	at org.apache.solr.cloud.autoscaling.sim.TestSimDistributedQueue.testDistributedQueueBlocking(TestSimDistributedQueue.java:102)
   [junit4]    > 	at java.base/jdk.internal.reflect.NativeMethodAccessorImpl.invoke0(Native Method)
   [junit4]    > 	at java.base/jdk.internal.reflect.NativeMethodAccessorImpl.invoke(NativeMethodAccessorImpl.java:62)
   [junit4]    > 	at java.base/jdk.internal.reflect.DelegatingMethodAccessorImpl.invoke(DelegatingMethodAccessorImpl.java:43)
   [junit4]    > 	at java.base/java.lang.reflect.Method.invoke(Method.java:564)
   [junit4]    > 	at java.base/java.lang.Thread.run(Thread.java:844)
   [junit4]   2> 1862169 INFO  (TEST-TestSimGenericDistributedQueue.testDistributedQueue-seed#[489E4C08E39E4501]) [    ] o.a.s.SolrTestCaseJ4 ###Starting testDistributedQueue
   [junit4]   2> 1864172 INFO  (TEST-TestSimGenericDistributedQueue.testDistributedQueue-seed#[489E4C08E39E4501]) [    ] o.a.s.SolrTestCaseJ4 ###Ending testDistributedQueue
   [junit4]   2> 1864174 INFO  (TEST-TestSimGenericDistributedQueue.testPeekElements-seed#[489E4C08E39E4501]) [    ] o.a.s.SolrTestCaseJ4 ###Starting testPeekElements
   [junit4]   2> 1865677 INFO  (TEST-TestSimGenericDistributedQueue.testPeekElements-seed#[489E4C08E39E4501]) [    ] o.a.s.SolrTestCaseJ4 ###Ending testPeekElements
   [junit4]   2> 1865679 INFO  (TEST-TestSimGenericDistributedQueue.testLocallyOffer-seed#[489E4C08E39E4501]) [    ] o.a.s.SolrTestCaseJ4 ###Starting testLocallyOffer
   [junit4]   2> 1865893 INFO  (TEST-TestSimGenericDistributedQueue.testLocallyOffer-seed#[489E4C08E39E4501]) [    ] o.a.s.SolrTestCaseJ4 ###Ending testLocallyOffer
   [junit4]   2> 1865895 INFO  (TEST-TestSimGenericDistributedQueue.testDistributedQueue-seed#[489E4C08E39E4501]) [    ] o.a.s.SolrTestCaseJ4 ###Starting testDistributedQueue {#2}
   [junit4]   2> 1867896 INFO  (TEST-TestSimGenericDistributedQueue.testDistributedQueue-seed#[489E4C08E39E4501]) [    ] o.a.s.SolrTestCaseJ4 ###Ending testDistributedQueue {#2}
   [junit4]   2> NOTE: leaving temporary files on disk at: C:\Users\jenkins\workspace\Lucene-Solr-7.x-Windows\solr\build\solr-core\test\J1\temp\solr.cloud.autoscaling.sim.TestSimGenericDistributedQueue_489E4C08E39E4501-001
   [junit4]   2> Sep 21, 2018 7:05:43 PM com.carrotsearch.randomizedtesting.ThreadLeakControl checkThreadLeaks
   [junit4]   2> WARNING: Will linger awaiting termination of 1 leaked thread(s).
   [junit4]   2> Sep 21, 2018 7:07:03 PM com.carrotsearch.randomizedtesting.ThreadLeakControl checkThreadLeaks
   [junit4]   2> SEVERE: 1 thread leaked from SUITE scope at org.apache.solr.cloud.autoscaling.sim.TestSimGenericDistributedQueue: 
   [junit4]   2>    1) Thread[id=15137, name=sdqtest--4323-thread-1, state=TIMED_WAITING, group=TGRP-TestSimGenericDistributedQueue]
   [junit4]   2>         at java.base@10/jdk.internal.misc.Unsafe.park(Native Method)
   [junit4]   2>         at java.base@10/java.util.concurrent.locks.LockSupport.parkNanos(LockSupport.java:234)
   [junit4]   2>         at java.base@10/java.util.concurrent.locks.AbstractQueuedSynchronizer$ConditionObject.awaitNanos(AbstractQueuedSynchronizer.java:2117)
   [junit4]   2>         at app//org.apache.solr.cloud.autoscaling.sim.GenericDistributedQueue.peek(GenericDistributedQueue.java:194)
   [junit4]   2>         at app//org.apache.solr.cloud.autoscaling.sim.GenericDistributedQueue.peek(GenericDistributedQueue.java:167)
   [junit4]   2>         at app//org.apache.solr.cloud.autoscaling.sim.TestSimDistributedQueue.lambda$testDistributedQueueBlocking$0(TestSimDistributedQueue.java:93)
   [junit4]   2>         at app//org.apache.solr.cloud.autoscaling.sim.TestSimDistributedQueue$$Lambda$1350/457746086.call(Unknown Source)
   [junit4]   2>         at java.base@10/java.util.concurrent.FutureTask.run(FutureTask.java:264)
   [junit4]   2>         at app//org.apache.solr.common.util.ExecutorUtil$MDCAwareThreadPoolExecutor.lambda$execute$0(ExecutorUtil.java:209)
   [junit4]   2>         at app//org.apache.solr.common.util.ExecutorUtil$MDCAwareThreadPoolExecutor$$Lambda$275/435940844.run(Unknown Source)
   [junit4]   2>         at java.base@10/java.util.concurrent.ThreadPoolExecutor.runWorker(ThreadPoolExecutor.java:1135)
   [junit4]   2>         at java.base@10/java.util.concurrent.ThreadPoolExecutor$Worker.run(ThreadPoolExecutor.java:635)
   [junit4]   2>         at java.base@10/java.lang.Thread.run(Thread.java:844)
   [junit4]   2> Sep 21, 2018 7:07:03 PM com.carrotsearch.randomizedtesting.ThreadLeakControl tryToInterruptAll
   [junit4]   2> INFO: Starting to interrupt leaked threads:
   [junit4]   2>    1) Thread[id=15137, name=sdqtest--4323-thread-1, state=TIMED_WAITING, group=TGRP-TestSimGenericDistributedQueue]
   [junit4]   2> Sep 21, 2018 7:07:03 PM com.carrotsearch.randomizedtesting.ThreadLeakControl tryToInterruptAll
   [junit4]   2> INFO: All leaked threads terminated.
   [junit4]   2> NOTE: test params are: codec=Asserting(Lucene70): {}, docValues:{}, maxPointsInLeafNode=1189, maxMBSortInHeap=7.025222226668049, sim=RandomSimilarity(queryNorm=true): {}, locale=en-WS, timezone=America/Lower_Princes
   [junit4]   2> NOTE: Windows 10 10.0 amd64/Oracle Corporation 10 (64-bit)/cpus=3,threads=1,free=212170400,total=518979584
   [junit4]   2> NOTE: All tests run in this JVM: [TestCopyFieldCollectionResource, SignificantTermsQParserPluginTest, PingRequestHandlerTest, TestDynamicLoading, RequiredFieldsTest, TestFileDictionaryLookup, SolrPluginUtilsTest, HdfsRecoverLeaseTest, TestQuerySenderNoQuery, ShardSplitTest, TestDocBasedVersionConstraints, DistributedSuggestComponentTest, CoreAdminOperationTest, SystemInfoHandlerTest, DistribCursorPagingTest, NumberUtilsTest, TestCustomSort, SearchRateTriggerTest, TestLazyCores, TestBadConfig, BlockJoinFacetDistribTest, TestSizeLimitedDistributedMap, SolrIndexSplitterTest, SecurityConfHandlerTest, PreAnalyzedUpdateProcessorTest, TestCloudDeleteByQuery, TestAuthenticationFramework, TestSchemaVersionResource, CopyFieldTest, CoreSorterTest, TestNumericTerms64, DistributedQueryElevationComponentTest, TestNRTOpen, PKIAuthenticationIntegrationTest, TestDeleteCollectionOnDownNodes, DistributedFacetSimpleRefinementLongTailTest, ForceLeaderTest, TimeZoneUtilsTest, TestPivotHelperCode, CleanupOldIndexTest, DocValuesMissingTest, DistributedUpdateProcessorTest, AdminHandlersProxyTest, OverriddenZkACLAndCredentialsProvidersTest, LeaderElectionContextKeyTest, RankQueryTest, TestExportWriter, SuggesterWFSTTest, TestConfigSetImmutable, ZkShardTermsTest, TestXmlQParser, ReplaceNodeTest, NodeLostTriggerIntegrationTest, SolrXmlInZkTest, BlockJoinFacetSimpleTest, TestOrdValues, TestFastLRUCache, TestSegmentSorting, AddSchemaFieldsUpdateProcessorFactoryTest, ZkFailoverTest, TestBinaryField, ExternalFileFieldSortTest, TestSolrConfigHandlerConcurrent, TaggingAttributeTest, TestCloudSearcherWarming, HdfsUnloadDistributedZkTest, TestConfigSets, TestDistribIDF, HdfsRestartWhileUpdatingTest, TriggerSetPropertiesIntegrationTest, TestClassicSimilarityFactory, TestChildDocTransformerHierarchy, CdcrBootstrapTest, OverseerStatusTest, TestMultiWordSynonyms, TlogReplayBufferedWhileIndexingTest, TestFoldingMultitermQuery, SharedFSAutoReplicaFailoverTest, CdcrReplicationHandlerTest, TestHdfsUpdateLog, TestInPlaceUpdatesStandalone, TestIntervalFaceting, SpellingQueryConverterTest, NumericFieldsTest, ExitableDirectoryReaderTest, TestDocTermOrds, IndexBasedSpellCheckerTest, QueryResultKeyTest, TestPrepRecovery, TestZkAclsWithHadoopAuth, TestPostingsSolrHighlighter, TestCursorMarkWithoutUniqueKey, PrimUtilsTest, TestPKIAuthenticationPlugin, ChaosMonkeyNothingIsSafeWithPullReplicasTest, MetricsHistoryIntegrationTest, TestRestoreCore, SpatialFilterTest, TestRangeQuery, ResponseBuilderTest, ExecutePlanActionTest, SolrCLIZkUtilsTest, TestConfigSetsAPIZkFailure, HdfsThreadLeakTest, MaxSizeAutoCommitTest, StressHdfsTest, DirectSolrConnectionTest, TestEmbeddedSolrServerAdminHandler, TestJsonFacets, TestQueryTypes, RulesTest, DistributedFacetPivotSmallAdvancedTest, RestartWhileUpdatingTest, AtomicUpdatesTest, TestGeoJSONResponseWriter, PhrasesIdentificationComponentTest, SuggestComponentContextFilterQueryTest, SimpleFacetsTest, TestRecovery, TestRTGBase, TestUniqueKeyFieldResource, FacetPivotSmallTest, TestFieldResource, ImplicitSnitchTest, HighlighterMaxOffsetTest, TestOverriddenPrefixQueryForCustomFieldType, ReplicaListTransformerTest, HdfsDirectoryTest, SolrMetricManagerTest, TestSimComputePlanAction, OpenCloseCoreStressTest, TestLegacyNumericUtils, BaseCdcrDistributedZkTest, ScriptEngineTest, TestSolr4Spatial, TestLegacyField, DistributedIntervalFacetingTest, ChaosMonkeySafeLeaderWithPullReplicasTest, UpdateRequestProcessorFactoryTest, MissingSegmentRecoveryTest, TestCloudNestedDocsSort, LeaderElectionTest, TestEmbeddedSolrServerSchemaAPI, TestDistributedMissingSort, CloneFieldUpdateProcessorFactoryTest, TestPayloadScoreQParserPlugin, LeaderFailureAfterFreshStartTest, JsonLoaderTest, TestMacros, TestJavabinTupleStreamParser, HdfsChaosMonkeySafeLeaderTest, TestPhraseSuggestions, TestSimGenericDistributedQueue]
   [junit4]   2> NOTE: reproduce with: ant test  -Dtestcase=TestSimGenericDistributedQueue -Dtests.seed=489E4C08E39E4501 -Dtests.slow=true -Dtests.locale=en-WS -Dtests.timezone=America/Lower_Princes -Dtests.asserts=true -Dtests.file.encoding=US-ASCII
   [junit4] ERROR   0.00s J1 | TestSimGenericDistributedQueue (suite) <<<
   [junit4]    > Throwable #1: com.carrotsearch.randomizedtesting.ThreadLeakError: 1 thread leaked from SUITE scope at org.apache.solr.cloud.autoscaling.sim.TestSimGenericDistributedQueue: 
   [junit4]    >    1) Thread[id=15137, name=sdqtest--4323-thread-1, state=TIMED_WAITING, group=TGRP-TestSimGenericDistributedQueue]
   [junit4]    >         at java.base@10/jdk.internal.misc.Unsafe.park(Native Method)
   [junit4]    >         at java.base@10/java.util.concurrent.locks.LockSupport.parkNanos(LockSupport.java:234)
   [junit4]    >         at java.base@10/java.util.concurrent.locks.AbstractQueuedSynchronizer$ConditionObject.awaitNanos(AbstractQueuedSynchronizer.java:2117)
   [junit4]    >         at app//org.apache.solr.cloud.autoscaling.sim.GenericDistributedQueue.peek(GenericDistributedQueue.java:194)
   [junit4]    >         at app//org.apache.solr.cloud.autoscaling.sim.GenericDistributedQueue.peek(GenericDistributedQueue.java:167)
   [junit4]    >         at app//org.apache.solr.cloud.autoscaling.sim.TestSimDistributedQueue.lambda$testDistributedQueueBlocking$0(TestSimDistributedQueue.java:93)
   [junit4]    >         at app//org.apache.solr.cloud.autoscaling.sim.TestSimDistributedQueue$$Lambda$1350/457746086.call(Unknown Source)
   [junit4]    >         at java.base@10/java.util.concurrent.FutureTask.run(FutureTask.java:264)
   [junit4]    >         at app//org.apache.solr.common.util.ExecutorUtil$MDCAwareThreadPoolExecutor.lambda$execute$0(ExecutorUtil.java:209)
   [junit4]    >         at app//org.apache.solr.common.util.ExecutorUtil$MDCAwareThreadPoolExecutor$$Lambda$275/435940844.run(Unknown Source)
   [junit4]    >         at java.base@10/java.util.concurrent.ThreadPoolExecutor.runWorker(ThreadPoolExecutor.java:1135)
   [junit4]    >         at java.base@10/java.util.concurrent.ThreadPoolExecutor$Worker.run(ThreadPoolExecutor.java:635)
   [junit4]    >         at java.base@10/java.lang.Thread.run(Thread.java:844)
   [junit4]    > 	at __randomizedtesting.SeedInfo.seed([489E4C08E39E4501]:0)
   [junit4] Completed [363/833 (1!)] on J1 in 87.97s, 5 tests, 2 errors <<< FAILURES!

[...truncated 44031 lines...]
[repro] Jenkins log URL: https://jenkins.thetaphi.de/job/Lucene-Solr-7.x-Windows/797/consoleText

[repro] Revision: bf0f10d831a10db1607ef18cc9d85c75fc9122ad

[repro] Ant options: "-Dargs=-XX:-UseCompressedOops -XX:+UseSerialGC"

[repro] ant clean

[...truncated 6 lines...]
[repro] Test suites by module:
[repro]    solr\core
[repro]       TestSimGenericDistributedQueue
[repro] ant compile-test

[...truncated 3464 lines...]
[repro] ant test-nocompile -Dtests.dups=5 -Dtests.maxfailures=5 -Dtests.class="*.TestSimGenericDistributedQueue" -Dtests.showOutput=onerror "-Dargs=-XX:-UseCompressedOops -XX:+UseSerialGC" -Dtests.seed=489E4C08E39E4501 -Dtests.slow=true -Dtests.locale=en-WS -Dtests.timezone=America/Lower_Princes -Dtests.asserts=true -Dtests.file.encoding=US-ASCII

[...truncated 297 lines...]
   [junit4] Suite: org.apache.solr.cloud.autoscaling.sim.TestSimGenericDistributedQueue
   [junit4]   2> Creating dataDir: C:\Users\jenkins\workspace\Lucene-Solr-7.x-Windows\solr\build\solr-core\test\J0\temp\solr.cloud.autoscaling.sim.TestSimGenericDistributedQueue_489E4C08E39E4501-001\init-core-data-001
   [junit4]   2> 22431 INFO  (SUITE-TestSimGenericDistributedQueue-seed#[489E4C08E39E4501]-worker) [    ] o.a.s.SolrTestCaseJ4 Using PointFields (NUMERIC_POINTS_SYSPROP=true) w/NUMERIC_DOCVALUES_SYSPROP=false
   [junit4]   2> 22447 INFO  (SUITE-TestSimGenericDistributedQueue-seed#[489E4C08E39E4501]-worker) [    ] o.a.s.SolrTestCaseJ4 Randomized ssl (false) and clientAuth (false) via: @org.apache.solr.util.RandomizeSSL(reason="", ssl=0.0/0.0, value=0.0/0.0, clientAuth=0.0/0.0)
   [junit4]   2> 22447 INFO  (SUITE-TestSimGenericDistributedQueue-seed#[489E4C08E39E4501]-worker) [    ] o.a.s.SolrTestCaseJ4 SecureRandom sanity checks: test.solr.allowed.securerandom=null & java.security.egd=file:/dev/./urandom
   [junit4]   2> 22447 INFO  (TEST-TestSimGenericDistributedQueue.testDistributedQueueBlocking-seed#[489E4C08E39E4501]) [    ] o.a.s.SolrTestCaseJ4 ###Starting testDistributedQueueBlocking
   [junit4]   2> 24588 INFO  (TEST-TestSimGenericDistributedQueue.testDistributedQueueBlocking-seed#[489E4C08E39E4501]) [    ] o.a.s.SolrTestCaseJ4 ###Ending testDistributedQueueBlocking
   [junit4] OK      2.14s J0 | TestSimGenericDistributedQueue.testDistributedQueueBlocking
   [junit4]   2> 24588 INFO  (TEST-TestSimGenericDistributedQueue.testDistributedQueue-seed#[489E4C08E39E4501]) [    ] o.a.s.SolrTestCaseJ4 ###Starting testDistributedQueue
   [junit4]   2> 26604 INFO  (TEST-TestSimGenericDistributedQueue.testDistributedQueue-seed#[489E4C08E39E4501]) [    ] o.a.s.SolrTestCaseJ4 ###Ending testDistributedQueue
   [junit4] OK      2.02s J0 | TestSimGenericDistributedQueue.testDistributedQueue
   [junit4]   2> 26604 INFO  (TEST-TestSimGenericDistributedQueue.testPeekElements-seed#[489E4C08E39E4501]) [    ] o.a.s.SolrTestCaseJ4 ###Starting testPeekElements
   [junit4]   2> 28151 INFO  (TEST-TestSimGenericDistributedQueue.testPeekElements-seed#[489E4C08E39E4501]) [    ] o.a.s.SolrTestCaseJ4 ###Ending testPeekElements
   [junit4] OK      1.55s J0 | TestSimGenericDistributedQueue.testPeekElements
   [junit4]   2> 28151 INFO  (TEST-TestSimGenericDistributedQueue.testLocallyOffer-seed#[489E4C08E39E4501]) [    ] o.a.s.SolrTestCaseJ4 ###Starting testLocallyOffer
   [junit4]   2> 29918 INFO  (TEST-TestSimGenericDistributedQueue.testLocallyOffer-seed#[489E4C08E39E4501]) [    ] o.a.s.SolrTestCaseJ4 ###Ending testLocallyOffer
   [junit4] OK      1.77s J0 | TestSimGenericDistributedQueue.testLocallyOffer
   [junit4]   2> 29918 INFO  (TEST-TestSimGenericDistributedQueue.testDistributedQueue-seed#[489E4C08E39E4501]) [    ] o.a.s.SolrTestCaseJ4 ###Starting testDistributedQueue {#2}
   [junit4]   2> Sep 21, 2018 6:23:22 PM com.carrotsearch.randomizedtesting.ThreadLeakControl$2 evaluate
   [junit4]   2> WARNING: Suite execution timed out: org.apache.solr.cloud.autoscaling.sim.TestSimGenericDistributedQueue
   [junit4]   2> ==== jstack at approximately timeout time ====
   [junit4]   2> "main" ID=1 WAITING on com.carrotsearch.randomizedtesting.RandomizedRunner$2@17f5e33c
   [junit4]   2> 	at java.base@10/java.lang.Object.wait(Native Method)
   [junit4]   2> 	- waiting on com.carrotsearch.randomizedtesting.RandomizedRunner$2@17f5e33c
   [junit4]   2> 	at java.base@10/java.lang.Thread.join(Thread.java:1353)
   [junit4]   2> 	at java.base@10/java.lang.Thread.join(Thread.java:1427)
   [junit4]   2> 	at app//com.carrotsearch.randomizedtesting.RandomizedRunner.runSuite(RandomizedRunner.java:637)
   [junit4]   2> 	at app//com.carrotsearch.randomizedtesting.RandomizedRunner.run(RandomizedRunner.java:494)
   [junit4]   2> 	at app//com.carrotsearch.ant.tasks.junit4.slave.SlaveMain.execute(SlaveMain.java:269)
   [junit4]   2> 	at app//com.carrotsearch.ant.tasks.junit4.slave.SlaveMain.main(SlaveMain.java:394)
   [junit4]   2> 	at app//com.carrotsearch.ant.tasks.junit4.slave.SlaveMainSafe.main(SlaveMainSafe.java:13)
   [junit4]   2> 
   [junit4]   2> "Reference Handler" ID=2 RUNNABLE
   [junit4]   2> 	at java.base@10/java.lang.ref.Reference.waitForReferencePendingList(Native Method)
   [junit4]   2> 	at java.base@10/java.lang.ref.Reference.processPendingReferences(Reference.java:174)
   [junit4]   2> 	at java.base@10/java.lang.ref.Reference.access$000(Reference.java:44)
   [junit4]   2> 	at java.base@10/java.lang.ref.Reference$ReferenceHandler.run(Reference.java:138)
   [junit4]   2> 
   [junit4]   2> "Finalizer" ID=3 WAITING on java.lang.ref.ReferenceQueue$Lock@5f80fcea
   [junit4]   2> 	at java.base@10/java.lang.Object.wait(Native Method)
   [junit4]   2> 	- waiting on java.lang.ref.ReferenceQueue$Lock@5f80fcea
   [junit4]   2> 	at java.base@10/java.lang.ref.ReferenceQueue.remove(ReferenceQueue.java:151)
   [junit4]   2> 	at java.base@10/java.lang.ref.ReferenceQueue.remove(ReferenceQueue.java:172)
   [junit4]   2> 	at java.base@10/java.lang.ref.Finalizer$FinalizerThread.run(Finalizer.java:216)
   [junit4]   2> 
   [junit4]   2> "Signal Dispatcher" ID=4 RUNNABLE
   [junit4]   2> 
   [junit4]   2> "Attach Listener" ID=5 RUNNABLE
   [junit4]   2> 
   [junit4]   2> "Common-Cleaner" ID=9 TIMED_WAITING on java.lang.ref.ReferenceQueue$Lock@67d41825
   [junit4]   2> 	at java.base@10/java.lang.Object.wait(Native Method)
   [junit4]   2> 	- timed waiting on java.lang.ref.ReferenceQueue$Lock@67d41825
   [junit4]   2> 	at java.base@10/java.lang.ref.ReferenceQueue.remove(ReferenceQueue.java:151)
   [junit4]   2> 	at java.base@10/jdk.internal.ref.CleanerImpl.run(CleanerImpl.java:148)
   [junit4]   2> 	at java.base@10/java.lang.Thread.run(Thread.java:844)
   [junit4]   2> 	at java.base@10/jdk.internal.misc.InnocuousThread.run(InnocuousThread.java:134)
   [junit4]   2> 
   [junit4]   2> "JUnit4-serializer-daemon" ID=11 TIMED_WAITING
   [junit4]   2> 	at java.base@10/java.lang.Thread.sleep(Native Method)
   [junit4]   2> 	at app//com.carrotsearch.ant.tasks.junit4.events.Serializer$1.run(Serializer.java:50)
   [junit4]   2> 
   [junit4]   2> "SeedGenerator Thread" ID=15 WAITING on sun.security.provider.SeedGenerator$ThreadedSeedGenerator@27765370
   [junit4]   2> 	at java.base@10/java.lang.Object.wait(Native Method)
   [junit4]   2> 	- waiting on sun.security.provider.SeedGenerator$ThreadedSeedGenerator@27765370
   [junit4]   2> 	at java.base@10/java.lang.Object.wait(Object.java:328)
   [junit4]   2> 	at java.base@10/sun.security.provider.SeedGenerator$ThreadedSeedGenerator.run(SeedGenerator.java:332)
   [junit4]   2> 	at java.base@10/java.lang.Thread.run(Thread.java:844)
   [junit4]   2> 
   [junit4]   2> "SUITE-TestSimGenericDistributedQueue-seed#[489E4C08E39E4501]" ID=74 RUNNABLE
   [junit4]   2> 	at java.management@10/sun.management.ThreadImpl.dumpThreads0(Native Method)
   [junit4]   2> 	at java.management@10/sun.management.ThreadImpl.dumpAllThreads(ThreadImpl.java:502)
   [junit4]   2> 	at java.management@10/sun.management.ThreadImpl.dumpAllThreads(ThreadImpl.java:490)
   [junit4]   2> 	at app//com.carrotsearch.randomizedtesting.ThreadLeakControl.formatThreadStacksFull(ThreadLeakControl.java:681)
   [junit4]   2> 	at app//com.carrotsearch.randomizedtesting.ThreadLeakControl.access$1000(ThreadLeakControl.java:65)
   [junit4]   2> 	at app//com.carrotsearch.randomizedtesting.ThreadLeakControl$2.evaluate(ThreadLeakControl.java:415)
   [junit4]   2> 	- locked java.lang.Object@36e71648
   [junit4]   2> 	at app//com.carrotsearch.randomizedtesting.RandomizedRunner.runSuite(RandomizedRunner.java:706)
   [junit4]   2> 	at app//com.carrotsearch.randomizedtesting.RandomizedRunner.access$200(RandomizedRunner.java:140)
   [junit4]   2> 	at app//com.carrotsearch.randomizedtesting.RandomizedRunner$2.run(RandomizedRunner.java:627)
   [junit4]   2> 
   [junit4]   2> "TEST-TestSimGenericDistributedQueue.testDistributedQueue-seed#[489E4C08E39E4501]" ID=75 TIMED_WAITING on java.util.concurrent.locks.AbstractQueuedSynchronizer$ConditionObject@6ed8cbd2
   [junit4]   2> 	at java.base@10/jdk.internal.misc.Unsafe.park(Native Method)
   [junit4]   2> 	- timed waiting on java.util.concurrent.locks.AbstractQueuedSynchronizer$ConditionObject@6ed8cbd2
   [junit4]   2> 	at java.base@10/java.util.concurrent.locks.LockSupport.parkNanos(LockSupport.java:234)
   [junit4]   2> 	at java.base@10/java.util.concurrent.locks.AbstractQueuedSynchronizer$ConditionObject.awaitNanos(AbstractQueuedSynchronizer.java:2117)
   [junit4]   2> 	at app//org.apache.solr.cloud.autoscaling.sim.GenericDistributedQueue.peek(GenericDistributedQueue.java:194)
   [junit4]   2> 	at app//org.apache.solr.cloud.autoscaling.sim.GenericDistributedQueue.peek(GenericDistributedQueue.java:167)
   [junit4]   2> 	at app//org.apache.solr.cloud.autoscaling.sim.TestSimDistributedQueue.testDistributedQueue(TestSimDistributedQueue.java:74)
   [junit4]   2> 	at app//org.apache.solr.cloud.autoscaling.sim.TestSimGenericDistributedQueue.testDistributedQueue(TestSimGenericDistributedQueue.java:36)
   [junit4]   2> 	at java.base@10/jdk.internal.reflect.NativeMethodAccessorImpl.invoke0(Native Method)
   [junit4]   2> 	at java.base@10/jdk.internal.reflect.NativeMethodAccessorImpl.invoke(NativeMethodAccessorImpl.java:62)
   [junit4]   2> 	at java.base@10/jdk.internal.reflect.DelegatingMethodAccessorImpl.invoke(DelegatingMethodAccessorImpl.java:43)
   [junit4]   2> 	at java.base@10/java.lang.reflect.Method.invoke(Method.java:564)
   [junit4]   2> 	at app//com.carrotsearch.randomizedtesting.RandomizedRunner.invoke(RandomizedRunner.java:1742)
   [junit4]   2> 	at app//com.carrotsearch.randomizedtesting.RandomizedRunner$8.evaluate(RandomizedRunner.java:935)
   [junit4]   2> 	at app//com.carrotsearch.randomizedtesting.RandomizedRunner$9.evaluate(RandomizedRunner.java:971)
   [junit4]   2> 	at app//com.carrotsearch.randomizedtesting.RandomizedRunner$10.evaluate(RandomizedRunner.java:985)
   [junit4]   2> 	at app//com.carrotsearch.randomizedtesting.rules.SystemPropertiesRestoreRule$1.evaluate(SystemPropertiesRestoreRule.java:57)
   [junit4]   2> 	at app//org.apache.lucene.util.TestRuleSetupTeardownChained$1.evaluate(TestRuleSetupTeardownChained.java:49)
   [junit4]   2> 	at app//org.apache.lucene.util.AbstractBeforeAfterRule$1.evaluate(AbstractBeforeAfterRule.java:45)
   [junit4]   2> 	at app//org.apache.lucene.util.TestRuleThreadAndTestName$1.evaluate(TestRuleThreadAndTestName.java:48)
   [junit4]   2> 	at app//org.apache.lucene.util.TestRuleIgnoreAfterMaxFailures$1.evaluate(TestRuleIgnoreAfterMaxFailures.java:64)
   [junit4]   2> 	at app//org.apache.lucene.util.TestRuleMarkFailure$1.evaluate(TestRuleMarkFailure.java:47)
   [junit4]   2> 	at app//com.carrotsearch.randomizedtesting.rules.StatementAdapter.evaluate(StatementAdapter.java:36)
   [junit4]   2> 	at app//com.carrotsearch.randomizedtesting.ThreadLeakControl$StatementRunner.run(ThreadLeakControl.java:368)
   [junit4]   2> 	at app//com.carrotsearch.randomizedtesting.ThreadLeakControl.forkTimeoutingTask(ThreadLeakControl.java:817)
   [junit4]   2> 	at app//com.carrotsearch.randomizedtesting.ThreadLeakControl$3.evaluate(ThreadLeakControl.java:468)
   [junit4]   2> 	at app//com.carrotsearch.randomizedtesting.RandomizedRunner.runSingleTest(RandomizedRunner.java:944)
   [junit4]   2> 	at app//com.carrotsearch.randomizedtesting.RandomizedRunner$5.evaluate(RandomizedRunner.java:830)
   [junit4]   2> 	at app//com.carrotsearch.randomizedtesting.RandomizedRunner$6.evaluate(RandomizedRunner.java:880)
   [junit4]   2> 	at app//com.carrotsearch.randomizedtesting.RandomizedRunner$7.evaluate(RandomizedRunner.java:891)
   [junit4]   2> 	at app//com.carrotsearch.randomizedtesting.rules.StatementAdapter.evaluate(StatementAdapter.java:36)
   [junit4]   2> 	at app//com.carrotsearch.randomizedtesting.rules.SystemPropertiesRestoreRule$1.evaluate(SystemPropertiesRestoreRule.java:57)
   [junit4]   2> 	at app//org.apache.lucene.util.AbstractBeforeAfterRule$1.evaluate(AbstractBeforeAfterRule.java:45)
   [junit4]   2> 	at app//com.carrotsearch.randomizedtesting.rules.StatementAdapter.evaluate(StatementAdapter.java:36)
   [junit4]   2> 	at app//org.apache.lucene.util.TestRuleStoreClassName$1.evaluate(TestRuleStoreClassName.java:41)
   [junit4]   2> 	at app//com.carrotsearch.randomizedtesting.rules.NoShadowingOrOverridesOnMethodsRule$1.evaluate(NoShadowingOrOverridesOnMethodsRule.java:40)
   [junit4]   2> 	at app//com.carrotsearch.randomizedtesting.rules.NoShadowingOrOverridesOnMethodsRule$1.evaluate(NoShadowingOrOverridesOnMethodsRule.java:40)
   [junit4]   2> 	at app//com.carrotsearch.randomizedtesting.rules.StatementAdapter.evaluate(StatementAdapter.java:36)
   [junit4]   2> 	at app//com.carrotsearch.randomizedtesting.rules.StatementAdapter.evaluate(StatementAdapter.java:36)
   [junit4]   2> 	at app//org.apache.lucene.util.TestRuleAssertionsRequired$1.evaluate(TestRuleAssertionsRequired.java:53)
   [junit4]   2> 	at app//org.apache.lucene.util.TestRuleMarkFailure$1.evaluate(TestRuleMarkFailure.java:47)
   [junit4]   2> 	at app//org.apache.lucene.util.TestRuleIgnoreAfterMaxFailures$1.evaluate(TestRuleIgnoreAfterMaxFailures.java:64)
   [junit4]   2> 	at app//org.apache.lucene.util.TestRuleIgnoreTestSuites$1.evaluate(TestRuleIgnoreTestSuites.java:54)
   [junit4]   2> 	at app//com.carrotsearch.randomizedtesting.rules.StatementAdapter.evaluate(StatementAdapter.java:36)
   [junit4]   2> 	at app//com.carrotsearch.randomizedtesting.ThreadLeakControl$StatementRunner.run(ThreadLeakControl.java:368)
   [junit4]   2> 	at java.base@10/java.lang.Thread.run(Thread.java:844)
   [junit4]   2> 
   [junit4]   2> ^^==============================================
   [junit4]   2> 
   [junit4]   2> NOTE: reproduce with: ant test  -Dtestcase=TestSimGenericDistributedQueue -Dtests.method=testDistributedQueue -Dtests.seed=489E4C08E39E4501 -Dtests.slow=true -Dtests.badapples=true -Dtests.locale=en-WS -Dtests.timezone=America/Lower_Princes -Dtests.asserts=true -Dtests.file.encoding=US-ASCII
   [junit4] ERROR   7192s J0 | TestSimGenericDistributedQueue.testDistributedQueue {#2} <<<
   [junit4]    > Throwable #1: java.lang.Exception: Test abandoned because suite timeout was reached.
   [junit4]    > 	at __randomizedtesting.SeedInfo.seed([489E4C08E39E4501]:0)
   [junit4]   2> Sep 21, 2018 6:23:22 PM com.carrotsearch.randomizedtesting.ThreadLeakControl checkThreadLeaks
   [junit4]   2> WARNING: Will linger awaiting termination of 1 leaked thread(s).
   [junit4]   2> Sep 21, 2018 6:24:42 PM com.carrotsearch.randomizedtesting.ThreadLeakControl checkThreadLeaks
   [junit4]   2> SEVERE: 1 thread leaked from SUITE scope at org.apache.solr.cloud.autoscaling.sim.TestSimGenericDistributedQueue: 
   [junit4]   2>    1) Thread[id=75, name=TEST-TestSimGenericDistributedQueue.testDistributedQueue-seed#[489E4C08E39E4501], state=TIMED_WAITING, group=TGRP-TestSimGenericDistributedQueue]
   [junit4]   2>         at java.base@10/jdk.internal.misc.Unsafe.park(Native Method)
   [junit4]   2>         at java.base@10/java.util.concurrent.locks.LockSupport.parkNanos(LockSupport.java:234)
   [junit4]   2>         at java.base@10/java.util.concurrent.locks.AbstractQueuedSynchronizer$ConditionObject.awaitNanos(AbstractQueuedSynchronizer.java:2117)
   [junit4]   2>         at app//org.apache.solr.cloud.autoscaling.sim.GenericDistributedQueue.peek(GenericDistributedQueue.java:194)
   [junit4]   2>         at app//org.apache.solr.cloud.autoscaling.sim.GenericDistributedQueue.peek(GenericDistributedQueue.java:167)
   [junit4]   2>         at app//org.apache.solr.cloud.autoscaling.sim.TestSimDistributedQueue.testDistributedQueue(TestSimDistributedQueue.java:74)
   [junit4]   2>         at app//org.apache.solr.cloud.autoscaling.sim.TestSimGenericDistributedQueue.testDistributedQueue(TestSimGenericDistributedQueue.java:36)
   [junit4]   2>         at java.base@10/jdk.internal.reflect.NativeMethodAccessorImpl.invoke0(Native Method)
   [junit4]   2>         at java.base@10/jdk.internal.reflect.NativeMethodAccessorImpl.invoke(NativeMethodAccessorImpl.java:62)
   [junit4]   2>         at java.base@10/jdk.internal.reflect.DelegatingMethodAccessorImpl.invoke(DelegatingMethodAccessorImpl.java:43)
   [junit4]   2>         at java.base@10/java.lang.reflect.Method.invoke(Method.java:564)
   [junit4]   2>         at app//com.carrotsearch.randomizedtesting.RandomizedRunner.invoke(RandomizedRunner.java:1742)
   [junit4]   2>         at app//com.carrotsearch.randomizedtesting.RandomizedRunner$8.evaluate(RandomizedRunner.java:935)
   [junit4]   2>         at app//com.carrotsearch.randomizedtesting.RandomizedRunner$9.evaluate(RandomizedRunner.java:971)
   [junit4]   2>         at app//com.carrotsearch.randomizedtesting.RandomizedRunner$10.evaluate(RandomizedRunner.java:985)
   [junit4]   2>         at app//com.carrotsearch.randomizedtesting.rules.SystemPropertiesRestoreRule$1.evaluate(SystemPropertiesRestoreRule.java:57)
   [junit4]   2>         at app//org.apache.lucene.util.TestRuleSetupTeardownChained$1.evaluate(TestRuleSetupTeardownChained.java:49)
   [junit4]   2>         at app//org.apache.lucene.util.AbstractBeforeAfterRule$1.evaluate(AbstractBeforeAfterRule.java:45)
   [junit4]   2>         at app//org.apache.lucene.util.TestRuleThreadAndTestName$1.evaluate(TestRuleThreadAndTestName.java:48)
   [junit4]   2>         at app//org.apache.lucene.util.TestRuleIgnoreAfterMaxFailures$1.evaluate(TestRuleIgnoreAfterMaxFailures.java:64)
   [junit4]   2>         at app//org.apache.lucene.util.TestRuleMarkFailure$1.evaluate(TestRuleMarkFailure.java:47)
   [junit4]   2>         at app//com.carrotsearch.randomizedtesting.rules.StatementAdapter.evaluate(StatementAdapter.java:36)
   [junit4]   2>         at app//com.carrotsearch.randomizedtesting.ThreadLeakControl$StatementRunner.run(ThreadLeakControl.java:368)
   [junit4]   2>         at app//com.carrotsearch.randomizedtesting.ThreadLeakControl.forkTimeoutingTask(ThreadLeakControl.java:817)
   [junit4]   2>         at app//com.carrotsearch.randomizedtesting.ThreadLeakControl$3.evaluate(ThreadLeakControl.java:468)
   [junit4]   2>         at app//com.carrotsearch.randomizedtesting.RandomizedRunner.runSingleTest(RandomizedRunner.java:944)
   [junit4]   2>         at app//com.carrotsearch.randomizedtesting.RandomizedRunner$5.evaluate(RandomizedRunner.java:830)
   [junit4]   2>         at app//com.carrotsearch.randomizedtesting.RandomizedRunner$6.evaluate(RandomizedRunner.java:880)
   [junit4]   2>         at app//com.carrotsearch.randomizedtesting.RandomizedRunner$7.evaluate(RandomizedRunner.java:891)
   [junit4]   2>         at app//com.carrotsearch.randomizedtesting.rules.StatementAdapter.evaluate(StatementAdapter.java:36)
   [junit4]   2>         at app//com.carrotsearch.randomizedtesting.rules.SystemPropertiesRestoreRule$1.evaluate(SystemPropertiesRestoreRule.java:57)
   [junit4]   2>         at app//org.apache.lucene.util.AbstractBeforeAfterRule$1.evaluate(AbstractBeforeAfterRule.java:45)
   [junit4]   2>         at app//com.carrotsearch.randomizedtesting.rules.StatementAdapter.evaluate(StatementAdapter.java:36)
   [junit4]   2>         at app//org.apache.lucene.util.TestRuleStoreClassName$1.evaluate(TestRuleStoreClassName.java:41)
   [junit4]   2>         at app//com.carrotsearch.randomizedtesting.rules.NoShadowingOrOverridesOnMethodsRule$1.evaluate(NoShadowingOrOverridesOnMethodsRule.java:40)
   [junit4]   2>         at app//com.carrotsearch.randomizedtesting.rules.NoShadowingOrOverridesOnMethodsRule$1.evaluate(NoShadowingOrOverridesOnMethodsRule.java:40)
   [junit4]   2>         at app//com.carrotsearch.randomizedtesting.rules.StatementAdapter.evaluate(StatementAdapter.java:36)
   [junit4]   2>         at app//com.carrotsearch.randomizedtesting.rules.StatementAdapter.evaluate(StatementAdapter.java:36)
   [junit4]   2>         at app//org.apache.lucene.util.TestRuleAssertionsRequired$1.evaluate(TestRuleAssertionsRequired.java:53)
   [junit4]   2>         at app//org.apache.lucene.util.TestRuleMarkFailure$1.evaluate(TestRuleMarkFailure.java:47)
   [junit4]   2>         at app//org.apache.lucene.util.TestRuleIgnoreAfterMaxFailures$1.evaluate(TestRuleIgnoreAfterMaxFailures.java:64)
   [junit4]   2>         at app//org.apache.lucene.util.TestRuleIgnoreTestSuites$1.evaluate(TestRuleIgnoreTestSuites.java:54)
   [junit4]   2>         at app//com.carrotsearch.randomizedtesting.rules.StatementAdapter.evaluate(StatementAdapter.java:36)
   [junit4]   2>         at app//com.carrotsearch.randomizedtesting.ThreadLeakControl$StatementRunner.run(ThreadLeakControl.java:368)
   [junit4]   2>         at java.base@10/java.lang.Thread.run(Thread.java:844)
   [junit4]   2> Sep 21, 2018 6:24:42 PM com.carrotsearch.randomizedtesting.ThreadLeakControl tryToInterruptAll
   [junit4]   2> INFO: Starting to interrupt leaked threads:
   [junit4]   2>    1) Thread[id=75, name=TEST-TestSimGenericDistributedQueue.testDistributedQueue-seed#[489E4C08E39E4501], state=TIMED_WAITING, group=TGRP-TestSimGenericDistributedQueue]
   [junit4]   2> 7302628 INFO  (TEST-TestSimGenericDistributedQueue.testDistributedQueue-seed#[489E4C08E39E4501]) [    ] o.a.s.SolrTestCaseJ4 ###Ending testDistributedQueue {#2}
   [junit4]   2> NOTE: leaving temporary files on disk at: C:\Users\jenkins\workspace\Lucene-Solr-7.x-Windows\solr\build\solr-core\test\J0\temp\solr.cloud.autoscaling.sim.TestSimGenericDistributedQueue_489E4C08E39E4501-001
   [junit4]   2> Sep 21, 2018 10:24:42 PM com.carrotsearch.randomizedtesting.ThreadLeakControl tryToInterruptAll
   [junit4]   2> INFO: All leaked threads terminated.
   [junit4]   2> NOTE: test params are: codec=Asserting(Lucene70): {}, docValues:{}, maxPointsInLeafNode=1189, maxMBSortInHeap=7.025222226668049, sim=RandomSimilarity(queryNorm=true): {}, locale=en-WS, timezone=America/Lower_Princes
   [junit4]   2> NOTE: Windows 10 10.0 amd64/Oracle Corporation 10 (64-bit)/cpus=3,threads=1,free=74343336,total=97386496
   [junit4]   2> NOTE: All tests run in this JVM: [TestSimGenericDistributedQueue, TestSimGenericDistributedQueue]
   [junit4]   2> NOTE: reproduce with: ant test  -Dtestcase=TestSimGenericDistributedQueue -Dtests.seed=489E4C08E39E4501 -Dtests.slow=true -Dtests.badapples=true -Dtests.locale=en-WS -Dtests.timezone=America/Lower_Princes -Dtests.asserts=true -Dtests.file.encoding=US-ASCII
   [junit4] ERROR   0.00s J0 | TestSimGenericDistributedQueue (suite) <<<
   [junit4]    > Throwable #1: java.lang.Exception: Suite timeout exceeded (>= 7200000 msec).
   [junit4]    > 	at __randomizedtesting.SeedInfo.seed([489E4C08E39E4501]:0)
   [junit4] Completed [4/5 (1!)] on J0 in 7280.25s, 5 tests, 2 errors <<< FAILURES!

[...truncated 1 lines...]
   [junit4] Suite: org.apache.solr.cloud.autoscaling.sim.TestSimGenericDistributedQueue
   [junit4]   2> Creating dataDir: C:\Users\jenkins\workspace\Lucene-Solr-7.x-Windows\solr\build\solr-core\test\J1\temp\solr.cloud.autoscaling.sim.TestSimGenericDistributedQueue_489E4C08E39E4501-001\init-core-data-001
   [junit4]   2> 32341 INFO  (SUITE-TestSimGenericDistributedQueue-seed#[489E4C08E39E4501]-worker) [    ] o.a.s.SolrTestCaseJ4 Using PointFields (NUMERIC_POINTS_SYSPROP=true) w/NUMERIC_DOCVALUES_SYSPROP=false
   [junit4]   2> 32341 INFO  (SUITE-TestSimGenericDistributedQueue-seed#[489E4C08E39E4501]-worker) [    ] o.a.s.SolrTestCaseJ4 Randomized ssl (false) and clientAuth (false) via: @org.apache.solr.util.RandomizeSSL(reason="", value=0.0/0.0, ssl=0.0/0.0, clientAuth=0.0/0.0)
   [junit4]   2> 32341 INFO  (SUITE-TestSimGenericDistributedQueue-seed#[489E4C08E39E4501]-worker) [    ] o.a.s.SolrTestCaseJ4 SecureRandom sanity checks: test.solr.allowed.securerandom=null & java.security.egd=file:/dev/./urandom
   [junit4]   2> 32341 INFO  (TEST-TestSimGenericDistributedQueue.testDistributedQueueBlocking-seed#[489E4C08E39E4501]) [    ] o.a.s.SolrTestCaseJ4 ###Starting testDistributedQueueBlocking
   [junit4]   2> 34467 INFO  (TEST-TestSimGenericDistributedQueue.testDistributedQueueBlocking-seed#[489E4C08E39E4501]) [    ] o.a.s.SolrTestCaseJ4 ###Ending testDistributedQueueBlocking
   [junit4] OK      2.13s J1 | TestSimGenericDistributedQueue.testDistributedQueueBlocking
   [junit4]   2> 34467 INFO  (TEST-TestSimGenericDistributedQueue.testDistributedQueue-seed#[489E4C08E39E4501]) [    ] o.a.s.SolrTestCaseJ4 ###Starting testDistributedQueue
   [junit4]   2> Sep 21, 2018 6:23:32 PM com.carrotsearch.randomizedtesting.ThreadLeakControl$2 evaluate
   [junit4]   2> WARNING: Suite execution timed out: org.apache.solr.cloud.autoscaling.sim.TestSimGenericDistributedQueue
   [junit4]   2> ==== jstack at approximately timeout time ====
   [junit4]   2> "main" ID=1 WAITING on com.carrotsearch.randomizedtesting.RandomizedRunner$2@53143fbe
   [junit4]   2> 	at java.base@10/java.lang.Object.wait(Native Method)
   [junit4]   2> 	- waiting on com.carrotsearch.randomizedtesting.RandomizedRunner$2@53143fbe
   [junit4]   2> 	at java.base@10/java.lang.Thread.join(Thread.java:1353)
   [junit4]   2> 	at java.base@10/java.lang.Thread.join(Thread.java:1427)
   [junit4]   2> 	at app//com.carrotsearch.randomizedtesting.RandomizedRunner.runSuite(RandomizedRunner.java:637)
   [junit4]   2> 	at app//com.carrotsearch.randomizedtesting.RandomizedRunner.run(RandomizedRunner.java:494)
   [junit4]   2> 	at app//com.carrotsearch.ant.tasks.junit4.slave.SlaveMain.execute(SlaveMain.java:269)
   [junit4]   2> 	at app//com.carrotsearch.ant.tasks.junit4.slave.SlaveMain.main(SlaveMain.java:394)
   [junit4]   2> 	at app//com.carrotsearch.ant.tasks.junit4.slave.SlaveMainSafe.main(SlaveMainSafe.java:13)
   [junit4]   2> 
   [junit4]   2> "Reference Handler" ID=2 RUNNABLE
   [junit4]   2> 	at java.base@10/java.lang.ref.Reference.waitForReferencePendingList(Native Method)
   [junit4]   2> 	at java.base@10/java.lang.ref.Reference.processPendingReferences(Reference.java:174)
   [junit4]   2> 	at java.base@10/java.lang.ref.Reference.access$000(Reference.java:44)
   [junit4]   2> 	at java.base@10/java.lang.ref.Reference$ReferenceHandler.run(Reference.java:138)
   [junit4]   2> 
   [junit4]   2> "Finalizer" ID=3 WAITING on java.lang.ref.ReferenceQueue$Lock@12293585
   [junit4]   2> 	at java.base@10/java.lang.Object.wait(Native Method)
   [junit4]   2> 	- waiting on java.lang.ref.ReferenceQueue$Lock@12293585
   [junit4]   2> 	at java.base@10/java.lang.ref.ReferenceQueue.remove(ReferenceQueue.java:151)
   [junit4]   2> 	at java.base@10/java.lang.ref.ReferenceQueue.remove(ReferenceQueue.java:172)
   [junit4]   2> 	at java.base@10/java.lang.ref.Finalizer$FinalizerThread.run(Finalizer.java:216)
   [junit4]   2> 
   [junit4]   2> "Signal Dispatcher" ID=4 RUNNABLE
   [junit4]   2> 
   [junit4]   2> "Attach Listener" ID=5 RUNNABLE
   [junit4]   2> 
   [junit4]   2> "Common-Cleaner" ID=9 TIMED_WAITING on java.lang.ref.ReferenceQueue$Lock@516a4dce
   [junit4]   2> 	at java.base@10/java.lang.Object.wait(Native Method)
   [junit4]   2> 	- timed waiting on java.lang.ref.ReferenceQueue$Lock@516a4dce
   [junit4]   2> 	at java.base@10/java.lang.ref.ReferenceQueue.remove(ReferenceQueue.java:151)
   [junit4]   2> 	at java.base@10/jdk.internal.ref.CleanerImpl.run(CleanerImpl.java:148)
   [junit4]   2> 	at java.base@10/java.lang.Thread.run(Thread.java:844)
   [junit4]   2> 	at java.base@10/jdk.internal.misc.InnocuousThread.run(InnocuousThread.java:134)
   [junit4]   2> 
   [junit4]   2> "JUnit4-serializer-daemon" ID=11 TIMED_WAITING
   [junit4]   2> 	at java.base@10/java.lang.Thread.sleep(Native Method)
   [junit4]   2> 	at app//com.carrotsearch.ant.tasks.junit4.events.Serializer$1.run(Serializer.java:50)
   [junit4]   2> 
   [junit4]   2> "SeedGenerator Thread" ID=15 WAITING on sun.security.provider.SeedGenerator$ThreadedSeedGenerator@23716192
   [junit4]   2> 	at java.base@10/java.lang.Object.wait(Native Method)
   [junit4]   2> 	- waiting on sun.security.provider.SeedGenerator$ThreadedSeedGenerator@23716192
   [junit4]   2> 	at java.base@10/java.lang.Object.wait(Object.java:328)
   [junit4]   2> 	at java.base@10/sun.security.provider.SeedGenerator$ThreadedSeedGenerator.run(SeedGenerator.java:332)
   [junit4]   2> 	at java.base@10/java.lang.Thread.run(Thread.java:844)
   [junit4]   2> 
   [junit4]   2> "SUITE-TestSimGenericDistributedQueue-seed#[489E4C08E39E4501]" ID=82 RUNNABLE
   [junit4]   2> 	at java.management@10/sun.management.ThreadImpl.dumpThreads0(Native Method)
   [junit4]   2> 	at java.management@10/sun.management.ThreadImpl.dumpAllThreads(ThreadImpl.java:502)
   [junit4]   2> 	at java.management@10/sun.management.ThreadImpl.dumpAllThreads(ThreadImpl.java:490)
   [junit4]   2> 	at app//com.carrotsearch.randomizedtesting.ThreadLeakControl.formatThreadStacksFull(ThreadLeakControl.java:681)
   [junit4]   2> 	at app//com.carrotsearch.randomizedtesting.ThreadLeakControl.access$1000(ThreadLeakControl.java:65)
   [junit4]   2> 	at app//com.carrotsearch.randomizedtesting.ThreadLeakControl$2.evaluate(ThreadLeakControl.java:415)
   [junit4]   2> 	- locked java.lang.Object@29d84769
   [junit4]   2> 	at app//com.carrotsearch.randomizedtesting.RandomizedRunner.runSuite(RandomizedRunner.java:706)
   [junit4]   2> 	at app//com.carrotsearch.randomizedtesting.RandomizedRunner.access$200(RandomizedRunner.java:140)
   [junit4]   2> 	at app//com.carrotsearch.randomizedtesting.RandomizedRunner$2.run(RandomizedRunner.java:627)
   [junit4]   2> 
   [junit4]   2> "TEST-TestSimGenericDistributedQueue.testDistributedQueue-seed#[489E4C08E39E4501]" ID=83 TIMED_WAITING on java.util.concurrent.locks.AbstractQueuedSynchronizer$ConditionObject@7206caca
   [junit4]   2> 	at java.base@10/jdk.internal.misc.Unsafe.park(Native Method)
   [junit4]   2> 	- timed waiting on java.util.concurrent.locks.AbstractQueuedSynchronizer$ConditionObject@7206caca
   [junit4]   2> 	at java.base@10/java.util.concurrent.locks.LockSupport.parkNanos(LockSupport.java:234)
   [junit4]   2> 	at java.base@10/java.util.concurrent.locks.AbstractQueuedSynchronizer$ConditionObject.awaitNanos(AbstractQueuedSynchronizer.java:2117)
   [junit4]   2> 	at app//org.apache.solr.cloud.autoscaling.sim.GenericDistributedQueue.peek(GenericDistributedQueue.java:194)
   [junit4]   2> 	at app//org.apache.solr.cloud.autoscaling.sim.GenericDistributedQueue.peek(GenericDistributedQueue.java:167)
   [junit4]   2> 	at app//org.apache.solr.cloud.autoscaling.sim.TestSimDistributedQueue.testDistributedQueue(TestSimDistributedQueue.java:74)
   [junit4]   2> 	at app//org.apache.solr.cloud.autoscaling.sim.TestSimGenericDistributedQueue.testDistributedQueue(TestSimGenericDistributedQueue.java:36)
   [junit4]   2> 	at java.base@10/jdk.internal.reflect.NativeMethodAccessorImpl.invoke0(Native Method)
   [junit4]   2> 	at java.base@10/jdk.internal.reflect.NativeMethodAccessorImpl.invoke(NativeMethodAccessorImpl.java:62)
   [junit4]   2> 	at java.base@10/jdk.internal.reflect.DelegatingMethodAccessorImpl.invoke(DelegatingMethodAccessorImpl.java:43)
   [junit4]   2> 	at java.base@10/java.lang.reflect.Method.invoke(Method.java:564)
   [junit4]   2> 	at app//com.carrotsearch.randomizedtesting.RandomizedRunner.invoke(RandomizedRunner.java:1742)
   [junit4]   2> 	at app//com.carrotsearch.randomizedtesting.RandomizedRunner$8.evaluate(RandomizedRunner.java:935)
   [junit4]   2> 	at app//com.carrotsearch.randomizedtesting.RandomizedRunner$9.evaluate(RandomizedRunner.java:971)
   [junit4]   2> 	at app//com.carrotsearch.randomizedtesting.RandomizedRunner$10.evaluate(RandomizedRunner.java:985)
   [junit4]   2> 	at app//com.carrotsearch.randomizedtesting.rules.SystemPropertiesRestoreRule$1.evaluate(SystemPropertiesRestoreRule.java:57)
   [junit4]   2> 	at app//org.apache.lucene.util.TestRuleSetupTeardownChained$1.evaluate(TestRuleSetupTeardownChained.java:49)
   [junit4]   2> 	at app//org.apache.lucene.util.AbstractBeforeAfterRule$1.evaluate(AbstractBeforeAfterRule.java:45)
   [junit4]   2> 	at app//org.apache.lucene.util.TestRuleThreadAndTestName$1.evaluate(TestRuleThreadAndTestName.java:48)
   [junit4]   2> 	at app//org.apache.lucene.util.TestRuleIgnoreAfterMaxFailures$1.evaluate(TestRuleIgnoreAfterMaxFailures.java:64)
   [junit4]   2> 	at app//org.apache.lucene.util.TestRuleMarkFailure$1.evaluate(TestRuleMarkFailure.java:47)
   [junit4]   2> 	at app//com.carrotsearch.randomizedtesting.rules.StatementAdapter.evaluate(StatementAdapter.java:36)
   [junit4]   2> 	at app//com.carrotsearch.randomizedtesting.ThreadLeakControl$StatementRunner.run(ThreadLeakControl.java:368)
   [junit4]   2> 	at app//com.carrotsearch.randomizedtesting.ThreadLeakControl.forkTimeoutingTask(ThreadLeakControl.java:817)
   [junit4]   2> 	at app//com.carrotsearch.randomizedtesting.ThreadLeakControl$3.evaluate(ThreadLeakControl.java:468)
   [junit4]   2> 	at app//com.carrotsearch.randomizedtesting.RandomizedRunner.runSingleTest(RandomizedRunner.java:944)
   [junit4]   2> 	at app//com.carrotsearch.randomizedtesting.RandomizedRunner$5.evaluate(RandomizedRunner.java:830)
   [junit4]   2> 	at app//com.carrotsearch.randomizedtesting.RandomizedRunner$6.evaluate(RandomizedRunner.java:880)
   [junit4]   2> 	at app//com.carrotsearch.randomizedtesting.RandomizedRunner$7.evaluate(RandomizedRunner.java:891)
   [junit4]   2> 	at app//com.carrotsearch.randomizedtesting.rules.StatementAdapter.evaluate(StatementAdapter.java:36)
   [junit4]   2> 	at app//com.carrotsearch.randomizedtesting.rules.SystemPropertiesRestoreRule$1.evaluate(SystemPropertiesRestoreRule.java:57)
   [junit4]   2> 	at app//org.apache.lucene.util.AbstractBeforeAfterRule$1.evaluate(AbstractBeforeAfterRule.java:45)
   [junit4]   2> 	at app//com.carrotsearch.randomizedtesting.rules.StatementAdapter.evaluate(StatementAdapter.java:36)
   [junit4]   2> 	at app//org.apache.lucene.util.TestRuleStoreClassName$1.evaluate(TestRuleStoreClassName.java:41)
   [junit4]   2> 	at app//com.carrotsearch.randomizedtesting.rules.NoShadowingOrOverridesOnMethodsRule$1.evaluate(NoShadowingOrOverridesOnMethodsRule.java:40)
   [junit4]   2> 	at app//com.carrotsearch.randomizedtesting.rules.NoShadowingOrOverridesOnMethodsRule$1.evaluate(NoShadowingOrOverridesOnMethodsRule.java:40)
   [junit4]   2> 	at app//com.carrotsearch.randomizedtesting.rules.StatementAdapter.evaluate(StatementAdapter.java:36)
   [junit4]   2> 	at app//com.carrotsearch.randomizedtesting.rules.StatementAdapter.evaluate(StatementAdapter.java:36)
   [junit4]   2> 	at app//org.apache.lucene.util.TestRuleAssertionsRequired$1.evaluate(TestRuleAssertionsRequired.java:53)
   [junit4]   2> 	at app//org.apache.lucene.util.TestRuleMarkFailure$1.evaluate(TestRuleMarkFailure.java:47)
   [junit4]   2> 	at app//org.apache.lucene.util.TestRuleIgnoreAfterMaxFailures$1.evaluate(TestRuleIgnoreAfterMaxFailures.java:64)
   [junit4]   2> 	at app//org.apache.lucene.util.TestRuleIgnoreTestSuites$1.evaluate(TestRuleIgnoreTestSuites.java:54)
   [junit4]   2> 	at app//com.carrotsearch.randomizedtesting.rules.StatementAdapter.evaluate(StatementAdapter.java:36)
   [junit4]   2> 	at app//com.carrotsearch.randomizedtesting.ThreadLeakControl$StatementRunner.run(ThreadLeakControl.java:368)
   [junit4]   2> 	at java.base@10/java.lang.Thread.run(Thread.java:844)
   [junit4]   2> 
   [junit4]   2> ^^==============================================
   [junit4]   2> 
   [junit4]   2> NOTE: reproduce with: ant test  -Dtestcase=TestSimGenericDistributedQueue -Dtests.method=testDistributedQueue -Dtests.seed=489E4C08E39E4501 -Dtests.slow=true -Dtests.badapples=true -Dtests.locale=en-WS -Dtests.timezone=America/Lower_Princes -Dtests.asserts=true -Dtests.file.encoding=US-ASCII
   [junit4] ERROR   7198s J1 | TestSimGenericDistributedQueue.testDistributedQueue <<<
   [junit4]    > Throwable #1: java.lang.Exception: Test abandoned because suite timeout was reached.
   [junit4]    > 	at __randomizedtesting.SeedInfo.seed([489E4C08E39E4501]:0)
   [junit4]   2> Sep 21, 2018 6:23:32 PM com.carrotsearch.randomizedtesting.ThreadLeakControl checkThreadLeaks
   [junit4]   2> WARNING: Will linger awaiting termination of 1 leaked thread(s).
   [junit4]   2> Sep 21, 2018 6:24:52 PM com.carrotsearch.randomizedtesting.ThreadLeakControl checkThreadLeaks
   [junit4]   2> SEVERE: 1 thread leaked from SUITE scope at org.apache.solr.cloud.autoscaling.sim.TestSimGenericDistributedQueue: 
   [junit4]   2>    1) Thread[id=83, name=TEST-TestSimGenericDistributedQueue.testDistributedQueue-seed#[489E4C08E39E4501], state=TIMED_WAITING, group=TGRP-TestSimGenericDistributedQueue]
   [junit4]   2>         at java.base@10/jdk.internal.misc.Unsafe.park(Native Method)
   [junit4]   2>         at java.base@10/java.util.concurrent.locks.LockSupport.parkNanos(LockSupport.java:234)
   [junit4]   2>         at java.base@10/java.util.concurrent.locks.AbstractQueuedSynchronizer$ConditionObject.awaitNanos(AbstractQueuedSynchronizer.java:2117)
   [junit4]   2>         at app//org.apache.solr.cloud.autoscaling.sim.GenericDistributedQueue.peek(GenericDistributedQueue.java:194)
   [junit4]   2>         at app//org.apache.solr.cloud.autoscaling.sim.GenericDistributedQueue.peek(GenericDistributedQueue.java:167)
   [junit4]   2>         at app//org.apache.solr.cloud.autoscaling.sim.TestSimDistributedQueue.testDistributedQueue(TestSimDistributedQueue.java:74)
   [junit4]   2>         at app//org.apache.solr.cloud.autoscaling.sim.TestSimGenericDistributedQueue.testDistributedQueue(TestSimGenericDistributedQueue.java:36)
   [junit4]   2>         at java.base@10/jdk.internal.reflect.NativeMethodAccessorImpl.invoke0(Native Method)
   [junit4]   2>         at java.base@10/jdk.internal.reflect.NativeMethodAccessorImpl.invoke(NativeMethodAccessorImpl.java:62)
   [junit4]   2>         at java.base@10/jdk.internal.reflect.DelegatingMethodAccessorImpl.invoke(DelegatingMethodAccessorImpl.java:43)
   [junit4]   2>         at java.base@10/java.lang.reflect.Method.invoke(Method.java:564)
   [junit4]   2>         at app//com.carrotsearch.randomizedtesting.RandomizedRunner.invoke(RandomizedRunner.java:1742)
   [junit4]   2>         at app//com.carrotsearch.randomizedtesting.RandomizedRunner$8.evaluate(RandomizedRunner.java:935)
   [junit4]   2>         at app//com.carrotsearch.randomizedtesting.RandomizedRunner$9.evaluate(RandomizedRunner.java:971)
   [junit4]   2>         at app//com.carrotsearch.randomizedtesting.RandomizedRunner$10.evaluate(RandomizedRunner.java:985)
   [junit4]   2>         at app//com.carrotsearch.randomizedtesting.rules.SystemPropertiesRestoreRule$1.evaluate(SystemPropertiesRestoreRule.java:57)
   [junit4]   2>         at app//org.apache.lucene.util.TestRuleSetupTeardownChained$1.evaluate(TestRuleSetupTeardownChained.java:49)
   [junit4]   2>         at app//org.apache.lucene.util.AbstractBeforeAfterRule$1.evaluate(AbstractBeforeAfterRule.java:45)
   [junit4]   2>         at app//org.apache.lucene.util.TestRuleThreadAndTestName$1.evaluate(TestRuleThreadAndTestName.java:48)
   [junit4]   2>         at app//org.apache.lucene.util.TestRuleIgnoreAfterMaxFailures$1.evaluate(TestRuleIgnoreAfterMaxFailures.java:64)
   [junit4]   2>         at app//org.apache.lucene.util.TestRuleMarkFailure$1.evaluate(TestRuleMarkFailure.java:47)
   [junit4]   2>         at app//com.carrotsearch.randomizedtesting.rules.StatementAdapter.evaluate(StatementAdapter.java:36)
   [junit4]   2>         at app//com.carrotsearch.randomizedtesting.ThreadLeakControl$StatementRunner.run(ThreadLeakControl.java:368)
   [junit4]   2>         at app//com.carrotsearch.randomizedtesting.ThreadLeakControl.forkTimeoutingTask(ThreadLeakControl.java:817)
   [junit4]   2>         at app//com.carrotsearch.randomizedtesting.ThreadLeakControl$3.evaluate(ThreadLeakControl.java:468)
   [junit4]   2>         at app//com.carrotsearch.randomizedtesting.RandomizedRunner.runSingleTest(RandomizedRunner.java:944)
   [junit4]   2>         at app//com.carrotsearch.randomizedtesting.RandomizedRunner$5.evaluate(RandomizedRunner.java:830)
   [junit4]   2>         at app//com.carrotsearch.randomizedtesting.RandomizedRunner$6.evaluate(RandomizedRunner.java:880)
   [junit4]   2>         at app//com.carrotsearch.randomizedtesting.RandomizedRunner$7.evaluate(RandomizedRunner.java:891)
   [junit4]   2>         at app//com.carrotsearch.randomizedtesting.rules.StatementAdapter.evaluate(StatementAdapter.java:36)
   [junit4]   2>         at app//com.carrotsearch.randomizedtesting.rules.SystemPropertiesRestoreRule$1.evaluate(SystemPropertiesRestoreRule.java:57)
   [junit4]   2>         at app//org.apache.lucene.util.AbstractBeforeAfterRule$1.evaluate(AbstractBeforeAfterRule.java:45)
   [junit4]   2>         at app//com.carrotsearch.randomizedtesting.rules.StatementAdapter.evaluate(StatementAdapter.java:36)
   [junit4]   2>         at app//org.apache.lucene.util.TestRuleStoreClassName$1.evaluate(TestRuleStoreClassName.java:41)
   [junit4]   2>         at app//com.carrotsearch.randomizedtesting.rules.NoShadowingOrOverridesOnMethodsRule$1.evaluate(NoShadowingOrOverridesOnMethodsRule.java:40)
   [junit4]   2>         at app//com.carrotsearch.randomizedtesting.rules.NoShadowingOrOverridesOnMethodsRule$1.evaluate(NoShadowingOrOverridesOnMethodsRule.java:40)
   [junit4]   2>         at app//com.carrotsearch.randomizedtesting.rules.StatementAdapter.evaluate(StatementAdapter.java:36)
   [junit4]   2>         at app//com.carrotsearch.randomizedtesting.rules.StatementAdapter.evaluate(StatementAdapter.java:36)
   [junit4]   2>         at app//org.apache.lucene.util.TestRuleAssertionsRequired$1.evaluate(TestRuleAssertionsRequired.java:53)
   [junit4]   2>         at app//org.apache.lucene.util.TestRuleMarkFailure$1.evaluate(TestRuleMarkFailure.java:47)
   [junit4]   2>         at app//org.apache.lucene.util.TestRuleIgnoreAfterMaxFailures$1.evaluate(TestRuleIgnoreAfterMaxFailures.java:64)
   [junit4]   2>         at app//org.apache.lucene.util.TestRuleIgnoreTestSuites$1.evaluate(TestRuleIgnoreTestSuites.java:54)
   [junit4]   2>         at app//com.carrotsearch.randomizedtesting.rules.StatementAdapter.evaluate(StatementAdapter.java:36)
   [junit4]   2>         at app//com.carrotsearch.randomizedtesting.ThreadLeakControl$StatementRunner.run(ThreadLeakControl.java:368)
   [junit4]   2>         at java.base@10/java.lang.Thread.run(Thread.java:844)
   [junit4]   2> Sep 21, 2018 6:24:52 PM com.carrotsearch.randomizedtesting.ThreadLeakControl tryToInterruptAll
   [junit4]   2> INFO: Starting to interrupt leaked threads:
   [junit4]   2>    1) Thread[id=83, name=TEST-TestSimGenericDistributedQueue.testDistributedQueue-seed#[489E4C08E39E4501], state=TIMED_WAITING, group=TGRP-TestSimGenericDistributedQueue]
   [junit4]   2> 7312575 INFO  (TEST-TestSimGenericDistributedQueue.testDistributedQueue-seed#[489E4C08E39E4501]) [    ] o.a.s.SolrTestCaseJ4 ###Ending testDistributedQueue
   [junit4]   2> NOTE: leaving temporary files on disk at: C:\Users\jenkins\workspace\Lucene-Solr-7.x-Windows\solr\build\solr-core\test\J1\temp\solr.cloud.autoscaling.sim.TestSimGenericDistributedQueue_489E4C08E39E4501-001
   [junit4]   2> Sep 21, 2018 10:24:52 PM com.carrotsearch.randomizedtesting.ThreadLeakControl tryToInterruptAll
   [junit4]   2> INFO: All leaked threads terminated.
   [junit4]   2> NOTE: test params are: codec=Asserting(Lucene70): {}, docValues:{}, maxPointsInLeafNode=1189, maxMBSortInHeap=7.025222226668049, sim=RandomSimilarity(queryNorm=true): {}, locale=en-WS, timezone=America/Lower_Princes
   [junit4]   2> NOTE: Windows 10 10.0 amd64/Oracle Corporation 10 (64-bit)/cpus=3,threads=1,free=52349600,total=97386496
   [junit4]   2> NOTE: All tests run in this JVM: [TestSimGenericDistributedQueue, TestSimGenericDistributedQueue, TestSimGenericDistributedQueue]
   [junit4]   2> NOTE: reproduce with: ant test  -Dtestcase=TestSimGenericDistributedQueue -Dtests.seed=489E4C08E39E4501 -Dtests.slow=true -Dtests.badapples=true -Dtests.locale=en-WS -Dtests.timezone=America/Lower_Princes -Dtests.asserts=true -Dtests.file.encoding=US-ASCII
   [junit4] ERROR   0.00s J1 | TestSimGenericDistributedQueue (suite) <<<
   [junit4]    > Throwable #1: java.lang.Exception: Suite timeout exceeded (>= 7200000 msec).
   [junit4]    > 	at __randomizedtesting.SeedInfo.seed([489E4C08E39E4501]:0)
   [junit4] Completed [5/5 (2!)] on J1 in 7280.28s, 2 tests, 2 errors <<< FAILURES!

[...truncated 13 lines...]
BUILD FAILED
C:\Users\jenkins\workspace\Lucene-Solr-7.x-Windows\lucene\common-build.xml:1567: The following error occurred while executing this line:
C:\Users\jenkins\workspace\Lucene-Solr-7.x-Windows\lucene\common-build.xml:1092: There were test failures: 5 suites, 22 tests, 2 suite-level errors, 2 errors [seed: 489E4C08E39E4501]

Total time: 121 minutes 57 seconds

[repro] Setting last failure code to 1

[repro] Failures:
[repro]   2/5 failed: org.apache.solr.cloud.autoscaling.sim.TestSimGenericDistributedQueue
[repro] Exiting with code 1

C:\Users\jenkins\workspace\Lucene-Solr-7.x-Windows>IF EXIST lucene\build move /y lucene\build lucene\build.repro 
        1 dir(s) moved.

C:\Users\jenkins\workspace\Lucene-Solr-7.x-Windows>IF EXIST solr\build move /y solr\build solr\build.repro 
        1 dir(s) moved.

C:\Users\jenkins\workspace\Lucene-Solr-7.x-Windows>IF EXIST lucene\build.orig move /y lucene\build.orig lucene\build 
        1 dir(s) moved.

C:\Users\jenkins\workspace\Lucene-Solr-7.x-Windows>IF EXIST solr\build.orig move /y solr\build.orig solr\build 
        1 dir(s) moved.

C:\Users\jenkins\workspace\Lucene-Solr-7.x-Windows>exit 0 
Archiving artifacts
Setting ANT_1_8_2_HOME=C:\Users\jenkins\tools\hudson.tasks.Ant_AntInstallation\ANT_1.8.2
[WARNINGS] Parsing warnings in console log with parser Java Compiler (javac)
Setting ANT_1_8_2_HOME=C:\Users\jenkins\tools\hudson.tasks.Ant_AntInstallation\ANT_1.8.2
Setting ANT_1_8_2_HOME=C:\Users\jenkins\tools\hudson.tasks.Ant_AntInstallation\ANT_1.8.2
<Git Blamer> Using GitBlamer to create author and commit information for all warnings.
<Git Blamer> GIT_COMMIT=bf0f10d831a10db1607ef18cc9d85c75fc9122ad, workspace=C:\Users\jenkins\workspace\Lucene-Solr-7.x-Windows
[WARNINGS] Computing warning deltas based on reference build #796
Recording test results
Setting ANT_1_8_2_HOME=C:\Users\jenkins\tools\hudson.tasks.Ant_AntInstallation\ANT_1.8.2
Build step 'Publish JUnit test result report' changed build result to UNSTABLE
Email was triggered for: Unstable (Test Failures)
Sending email for trigger: Unstable (Test Failures)
Setting ANT_1_8_2_HOME=C:\Users\jenkins\tools\hudson.tasks.Ant_AntInstallation\ANT_1.8.2
Setting ANT_1_8_2_HOME=C:\Users\jenkins\tools\hudson.tasks.Ant_AntInstallation\ANT_1.8.2
Setting ANT_1_8_2_HOME=C:\Users\jenkins\tools\hudson.tasks.Ant_AntInstallation\ANT_1.8.2
Setting ANT_1_8_2_HOME=C:\Users\jenkins\tools\hudson.tasks.Ant_AntInstallation\ANT_1.8.2

Mime
View raw message