lucene-dev mailing list archives

Site index · List index
Message view « Date » · « Thread »
Top « Date » · « Thread »
From Policeman Jenkins Server <jenk...@thetaphi.de>
Subject [JENKINS] Lucene-Solr-7.x-Windows (64bit/jdk-10.0.1) - Build # 768 - Unstable!
Date Sun, 02 Sep 2018 12:03:21 GMT
Build: https://jenkins.thetaphi.de/job/Lucene-Solr-7.x-Windows/768/
Java: 64bit/jdk-10.0.1 -XX:+UseCompressedOops -XX:+UseSerialGC

5 tests failed.
FAILED:  org.apache.solr.handler.RequestLoggingTest.testLogBeforeExecuteWithCoreLogger

Error Message:


Stack Trace:
java.lang.AssertionError
	at __randomizedtesting.SeedInfo.seed([2A0D120E25F7C83E:E68B1280DB3EA3A8]:0)
	at org.junit.Assert.fail(Assert.java:92)
	at org.junit.Assert.assertTrue(Assert.java:43)
	at org.junit.Assert.assertTrue(Assert.java:54)
	at org.apache.solr.handler.RequestLoggingTest.testLogBeforeExecute(RequestLoggingTest.java:88)
	at org.apache.solr.handler.RequestLoggingTest.testLogBeforeExecuteWithCoreLogger(RequestLoggingTest.java:65)
	at java.base/jdk.internal.reflect.NativeMethodAccessorImpl.invoke0(Native Method)
	at java.base/jdk.internal.reflect.NativeMethodAccessorImpl.invoke(NativeMethodAccessorImpl.java:62)
	at java.base/jdk.internal.reflect.DelegatingMethodAccessorImpl.invoke(DelegatingMethodAccessorImpl.java:43)
	at java.base/java.lang.reflect.Method.invoke(Method.java:564)
	at com.carrotsearch.randomizedtesting.RandomizedRunner.invoke(RandomizedRunner.java:1737)
	at com.carrotsearch.randomizedtesting.RandomizedRunner$8.evaluate(RandomizedRunner.java:934)
	at com.carrotsearch.randomizedtesting.RandomizedRunner$9.evaluate(RandomizedRunner.java:970)
	at com.carrotsearch.randomizedtesting.RandomizedRunner$10.evaluate(RandomizedRunner.java:984)
	at com.carrotsearch.randomizedtesting.rules.SystemPropertiesRestoreRule$1.evaluate(SystemPropertiesRestoreRule.java:57)
	at org.apache.lucene.util.TestRuleSetupTeardownChained$1.evaluate(TestRuleSetupTeardownChained.java:49)
	at org.apache.lucene.util.AbstractBeforeAfterRule$1.evaluate(AbstractBeforeAfterRule.java:45)
	at org.apache.lucene.util.TestRuleThreadAndTestName$1.evaluate(TestRuleThreadAndTestName.java:48)
	at org.apache.lucene.util.TestRuleIgnoreAfterMaxFailures$1.evaluate(TestRuleIgnoreAfterMaxFailures.java:64)
	at org.apache.lucene.util.TestRuleMarkFailure$1.evaluate(TestRuleMarkFailure.java:47)
	at com.carrotsearch.randomizedtesting.rules.StatementAdapter.evaluate(StatementAdapter.java:36)
	at com.carrotsearch.randomizedtesting.ThreadLeakControl$StatementRunner.run(ThreadLeakControl.java:368)
	at com.carrotsearch.randomizedtesting.ThreadLeakControl.forkTimeoutingTask(ThreadLeakControl.java:817)
	at com.carrotsearch.randomizedtesting.ThreadLeakControl$3.evaluate(ThreadLeakControl.java:468)
	at com.carrotsearch.randomizedtesting.RandomizedRunner.runSingleTest(RandomizedRunner.java:943)
	at com.carrotsearch.randomizedtesting.RandomizedRunner$5.evaluate(RandomizedRunner.java:829)
	at com.carrotsearch.randomizedtesting.RandomizedRunner$6.evaluate(RandomizedRunner.java:879)
	at com.carrotsearch.randomizedtesting.RandomizedRunner$7.evaluate(RandomizedRunner.java:890)
	at com.carrotsearch.randomizedtesting.rules.StatementAdapter.evaluate(StatementAdapter.java:36)
	at com.carrotsearch.randomizedtesting.rules.SystemPropertiesRestoreRule$1.evaluate(SystemPropertiesRestoreRule.java:57)
	at org.apache.lucene.util.AbstractBeforeAfterRule$1.evaluate(AbstractBeforeAfterRule.java:45)
	at com.carrotsearch.randomizedtesting.rules.StatementAdapter.evaluate(StatementAdapter.java:36)
	at org.apache.lucene.util.TestRuleStoreClassName$1.evaluate(TestRuleStoreClassName.java:41)
	at com.carrotsearch.randomizedtesting.rules.NoShadowingOrOverridesOnMethodsRule$1.evaluate(NoShadowingOrOverridesOnMethodsRule.java:40)
	at com.carrotsearch.randomizedtesting.rules.NoShadowingOrOverridesOnMethodsRule$1.evaluate(NoShadowingOrOverridesOnMethodsRule.java:40)
	at com.carrotsearch.randomizedtesting.rules.StatementAdapter.evaluate(StatementAdapter.java:36)
	at com.carrotsearch.randomizedtesting.rules.StatementAdapter.evaluate(StatementAdapter.java:36)
	at org.apache.lucene.util.TestRuleAssertionsRequired$1.evaluate(TestRuleAssertionsRequired.java:53)
	at org.apache.lucene.util.TestRuleMarkFailure$1.evaluate(TestRuleMarkFailure.java:47)
	at org.apache.lucene.util.TestRuleIgnoreAfterMaxFailures$1.evaluate(TestRuleIgnoreAfterMaxFailures.java:64)
	at org.apache.lucene.util.TestRuleIgnoreTestSuites$1.evaluate(TestRuleIgnoreTestSuites.java:54)
	at com.carrotsearch.randomizedtesting.rules.StatementAdapter.evaluate(StatementAdapter.java:36)
	at com.carrotsearch.randomizedtesting.ThreadLeakControl$StatementRunner.run(ThreadLeakControl.java:368)
	at java.base/java.lang.Thread.run(Thread.java:844)


FAILED:  org.apache.solr.handler.RequestLoggingTest.testLogBeforeExecuteWithCoreLogger

Error Message:


Stack Trace:
java.lang.AssertionError
	at __randomizedtesting.SeedInfo.seed([2A0D120E25F7C83E:E68B1280DB3EA3A8]:0)
	at org.junit.Assert.fail(Assert.java:92)
	at org.junit.Assert.assertTrue(Assert.java:43)
	at org.junit.Assert.assertTrue(Assert.java:54)
	at org.apache.solr.handler.RequestLoggingTest.testLogBeforeExecute(RequestLoggingTest.java:88)
	at org.apache.solr.handler.RequestLoggingTest.testLogBeforeExecuteWithCoreLogger(RequestLoggingTest.java:65)
	at java.base/jdk.internal.reflect.NativeMethodAccessorImpl.invoke0(Native Method)
	at java.base/jdk.internal.reflect.NativeMethodAccessorImpl.invoke(NativeMethodAccessorImpl.java:62)
	at java.base/jdk.internal.reflect.DelegatingMethodAccessorImpl.invoke(DelegatingMethodAccessorImpl.java:43)
	at java.base/java.lang.reflect.Method.invoke(Method.java:564)
	at com.carrotsearch.randomizedtesting.RandomizedRunner.invoke(RandomizedRunner.java:1737)
	at com.carrotsearch.randomizedtesting.RandomizedRunner$8.evaluate(RandomizedRunner.java:934)
	at com.carrotsearch.randomizedtesting.RandomizedRunner$9.evaluate(RandomizedRunner.java:970)
	at com.carrotsearch.randomizedtesting.RandomizedRunner$10.evaluate(RandomizedRunner.java:984)
	at com.carrotsearch.randomizedtesting.rules.SystemPropertiesRestoreRule$1.evaluate(SystemPropertiesRestoreRule.java:57)
	at org.apache.lucene.util.TestRuleSetupTeardownChained$1.evaluate(TestRuleSetupTeardownChained.java:49)
	at org.apache.lucene.util.AbstractBeforeAfterRule$1.evaluate(AbstractBeforeAfterRule.java:45)
	at org.apache.lucene.util.TestRuleThreadAndTestName$1.evaluate(TestRuleThreadAndTestName.java:48)
	at org.apache.lucene.util.TestRuleIgnoreAfterMaxFailures$1.evaluate(TestRuleIgnoreAfterMaxFailures.java:64)
	at org.apache.lucene.util.TestRuleMarkFailure$1.evaluate(TestRuleMarkFailure.java:47)
	at com.carrotsearch.randomizedtesting.rules.StatementAdapter.evaluate(StatementAdapter.java:36)
	at com.carrotsearch.randomizedtesting.ThreadLeakControl$StatementRunner.run(ThreadLeakControl.java:368)
	at com.carrotsearch.randomizedtesting.ThreadLeakControl.forkTimeoutingTask(ThreadLeakControl.java:817)
	at com.carrotsearch.randomizedtesting.ThreadLeakControl$3.evaluate(ThreadLeakControl.java:468)
	at com.carrotsearch.randomizedtesting.RandomizedRunner.runSingleTest(RandomizedRunner.java:943)
	at com.carrotsearch.randomizedtesting.RandomizedRunner$5.evaluate(RandomizedRunner.java:829)
	at com.carrotsearch.randomizedtesting.RandomizedRunner$6.evaluate(RandomizedRunner.java:879)
	at com.carrotsearch.randomizedtesting.RandomizedRunner$7.evaluate(RandomizedRunner.java:890)
	at com.carrotsearch.randomizedtesting.rules.StatementAdapter.evaluate(StatementAdapter.java:36)
	at com.carrotsearch.randomizedtesting.rules.SystemPropertiesRestoreRule$1.evaluate(SystemPropertiesRestoreRule.java:57)
	at org.apache.lucene.util.AbstractBeforeAfterRule$1.evaluate(AbstractBeforeAfterRule.java:45)
	at com.carrotsearch.randomizedtesting.rules.StatementAdapter.evaluate(StatementAdapter.java:36)
	at org.apache.lucene.util.TestRuleStoreClassName$1.evaluate(TestRuleStoreClassName.java:41)
	at com.carrotsearch.randomizedtesting.rules.NoShadowingOrOverridesOnMethodsRule$1.evaluate(NoShadowingOrOverridesOnMethodsRule.java:40)
	at com.carrotsearch.randomizedtesting.rules.NoShadowingOrOverridesOnMethodsRule$1.evaluate(NoShadowingOrOverridesOnMethodsRule.java:40)
	at com.carrotsearch.randomizedtesting.rules.StatementAdapter.evaluate(StatementAdapter.java:36)
	at com.carrotsearch.randomizedtesting.rules.StatementAdapter.evaluate(StatementAdapter.java:36)
	at org.apache.lucene.util.TestRuleAssertionsRequired$1.evaluate(TestRuleAssertionsRequired.java:53)
	at org.apache.lucene.util.TestRuleMarkFailure$1.evaluate(TestRuleMarkFailure.java:47)
	at org.apache.lucene.util.TestRuleIgnoreAfterMaxFailures$1.evaluate(TestRuleIgnoreAfterMaxFailures.java:64)
	at org.apache.lucene.util.TestRuleIgnoreTestSuites$1.evaluate(TestRuleIgnoreTestSuites.java:54)
	at com.carrotsearch.randomizedtesting.rules.StatementAdapter.evaluate(StatementAdapter.java:36)
	at com.carrotsearch.randomizedtesting.ThreadLeakControl$StatementRunner.run(ThreadLeakControl.java:368)
	at java.base/java.lang.Thread.run(Thread.java:844)


FAILED:  org.apache.solr.handler.RequestLoggingTest.testLogBeforeExecuteWithCoreLogger

Error Message:


Stack Trace:
java.lang.AssertionError
	at __randomizedtesting.SeedInfo.seed([2A0D120E25F7C83E:E68B1280DB3EA3A8]:0)
	at org.junit.Assert.fail(Assert.java:92)
	at org.junit.Assert.assertTrue(Assert.java:43)
	at org.junit.Assert.assertTrue(Assert.java:54)
	at org.apache.solr.handler.RequestLoggingTest.testLogBeforeExecute(RequestLoggingTest.java:88)
	at org.apache.solr.handler.RequestLoggingTest.testLogBeforeExecuteWithCoreLogger(RequestLoggingTest.java:65)
	at java.base/jdk.internal.reflect.NativeMethodAccessorImpl.invoke0(Native Method)
	at java.base/jdk.internal.reflect.NativeMethodAccessorImpl.invoke(NativeMethodAccessorImpl.java:62)
	at java.base/jdk.internal.reflect.DelegatingMethodAccessorImpl.invoke(DelegatingMethodAccessorImpl.java:43)
	at java.base/java.lang.reflect.Method.invoke(Method.java:564)
	at com.carrotsearch.randomizedtesting.RandomizedRunner.invoke(RandomizedRunner.java:1737)
	at com.carrotsearch.randomizedtesting.RandomizedRunner$8.evaluate(RandomizedRunner.java:934)
	at com.carrotsearch.randomizedtesting.RandomizedRunner$9.evaluate(RandomizedRunner.java:970)
	at com.carrotsearch.randomizedtesting.RandomizedRunner$10.evaluate(RandomizedRunner.java:984)
	at com.carrotsearch.randomizedtesting.rules.SystemPropertiesRestoreRule$1.evaluate(SystemPropertiesRestoreRule.java:57)
	at org.apache.lucene.util.TestRuleSetupTeardownChained$1.evaluate(TestRuleSetupTeardownChained.java:49)
	at org.apache.lucene.util.AbstractBeforeAfterRule$1.evaluate(AbstractBeforeAfterRule.java:45)
	at org.apache.lucene.util.TestRuleThreadAndTestName$1.evaluate(TestRuleThreadAndTestName.java:48)
	at org.apache.lucene.util.TestRuleIgnoreAfterMaxFailures$1.evaluate(TestRuleIgnoreAfterMaxFailures.java:64)
	at org.apache.lucene.util.TestRuleMarkFailure$1.evaluate(TestRuleMarkFailure.java:47)
	at com.carrotsearch.randomizedtesting.rules.StatementAdapter.evaluate(StatementAdapter.java:36)
	at com.carrotsearch.randomizedtesting.ThreadLeakControl$StatementRunner.run(ThreadLeakControl.java:368)
	at com.carrotsearch.randomizedtesting.ThreadLeakControl.forkTimeoutingTask(ThreadLeakControl.java:817)
	at com.carrotsearch.randomizedtesting.ThreadLeakControl$3.evaluate(ThreadLeakControl.java:468)
	at com.carrotsearch.randomizedtesting.RandomizedRunner.runSingleTest(RandomizedRunner.java:943)
	at com.carrotsearch.randomizedtesting.RandomizedRunner$5.evaluate(RandomizedRunner.java:829)
	at com.carrotsearch.randomizedtesting.RandomizedRunner$6.evaluate(RandomizedRunner.java:879)
	at com.carrotsearch.randomizedtesting.RandomizedRunner$7.evaluate(RandomizedRunner.java:890)
	at com.carrotsearch.randomizedtesting.rules.StatementAdapter.evaluate(StatementAdapter.java:36)
	at com.carrotsearch.randomizedtesting.rules.SystemPropertiesRestoreRule$1.evaluate(SystemPropertiesRestoreRule.java:57)
	at org.apache.lucene.util.AbstractBeforeAfterRule$1.evaluate(AbstractBeforeAfterRule.java:45)
	at com.carrotsearch.randomizedtesting.rules.StatementAdapter.evaluate(StatementAdapter.java:36)
	at org.apache.lucene.util.TestRuleStoreClassName$1.evaluate(TestRuleStoreClassName.java:41)
	at com.carrotsearch.randomizedtesting.rules.NoShadowingOrOverridesOnMethodsRule$1.evaluate(NoShadowingOrOverridesOnMethodsRule.java:40)
	at com.carrotsearch.randomizedtesting.rules.NoShadowingOrOverridesOnMethodsRule$1.evaluate(NoShadowingOrOverridesOnMethodsRule.java:40)
	at com.carrotsearch.randomizedtesting.rules.StatementAdapter.evaluate(StatementAdapter.java:36)
	at com.carrotsearch.randomizedtesting.rules.StatementAdapter.evaluate(StatementAdapter.java:36)
	at org.apache.lucene.util.TestRuleAssertionsRequired$1.evaluate(TestRuleAssertionsRequired.java:53)
	at org.apache.lucene.util.TestRuleMarkFailure$1.evaluate(TestRuleMarkFailure.java:47)
	at org.apache.lucene.util.TestRuleIgnoreAfterMaxFailures$1.evaluate(TestRuleIgnoreAfterMaxFailures.java:64)
	at org.apache.lucene.util.TestRuleIgnoreTestSuites$1.evaluate(TestRuleIgnoreTestSuites.java:54)
	at com.carrotsearch.randomizedtesting.rules.StatementAdapter.evaluate(StatementAdapter.java:36)
	at com.carrotsearch.randomizedtesting.ThreadLeakControl$StatementRunner.run(ThreadLeakControl.java:368)
	at java.base/java.lang.Thread.run(Thread.java:844)


FAILED:  org.apache.solr.handler.RequestLoggingTest.testLogBeforeExecuteWithRequestLogger

Error Message:


Stack Trace:
java.lang.AssertionError
	at __randomizedtesting.SeedInfo.seed([2A0D120E25F7C83E:9B64320188017070]:0)
	at org.junit.Assert.fail(Assert.java:92)
	at org.junit.Assert.assertTrue(Assert.java:43)
	at org.junit.Assert.assertTrue(Assert.java:54)
	at org.apache.solr.handler.RequestLoggingTest.testLogBeforeExecute(RequestLoggingTest.java:88)
	at org.apache.solr.handler.RequestLoggingTest.testLogBeforeExecuteWithRequestLogger(RequestLoggingTest.java:71)
	at java.base/jdk.internal.reflect.NativeMethodAccessorImpl.invoke0(Native Method)
	at java.base/jdk.internal.reflect.NativeMethodAccessorImpl.invoke(NativeMethodAccessorImpl.java:62)
	at java.base/jdk.internal.reflect.DelegatingMethodAccessorImpl.invoke(DelegatingMethodAccessorImpl.java:43)
	at java.base/java.lang.reflect.Method.invoke(Method.java:564)
	at com.carrotsearch.randomizedtesting.RandomizedRunner.invoke(RandomizedRunner.java:1737)
	at com.carrotsearch.randomizedtesting.RandomizedRunner$8.evaluate(RandomizedRunner.java:934)
	at com.carrotsearch.randomizedtesting.RandomizedRunner$9.evaluate(RandomizedRunner.java:970)
	at com.carrotsearch.randomizedtesting.RandomizedRunner$10.evaluate(RandomizedRunner.java:984)
	at com.carrotsearch.randomizedtesting.rules.SystemPropertiesRestoreRule$1.evaluate(SystemPropertiesRestoreRule.java:57)
	at org.apache.lucene.util.TestRuleSetupTeardownChained$1.evaluate(TestRuleSetupTeardownChained.java:49)
	at org.apache.lucene.util.AbstractBeforeAfterRule$1.evaluate(AbstractBeforeAfterRule.java:45)
	at org.apache.lucene.util.TestRuleThreadAndTestName$1.evaluate(TestRuleThreadAndTestName.java:48)
	at org.apache.lucene.util.TestRuleIgnoreAfterMaxFailures$1.evaluate(TestRuleIgnoreAfterMaxFailures.java:64)
	at org.apache.lucene.util.TestRuleMarkFailure$1.evaluate(TestRuleMarkFailure.java:47)
	at com.carrotsearch.randomizedtesting.rules.StatementAdapter.evaluate(StatementAdapter.java:36)
	at com.carrotsearch.randomizedtesting.ThreadLeakControl$StatementRunner.run(ThreadLeakControl.java:368)
	at com.carrotsearch.randomizedtesting.ThreadLeakControl.forkTimeoutingTask(ThreadLeakControl.java:817)
	at com.carrotsearch.randomizedtesting.ThreadLeakControl$3.evaluate(ThreadLeakControl.java:468)
	at com.carrotsearch.randomizedtesting.RandomizedRunner.runSingleTest(RandomizedRunner.java:943)
	at com.carrotsearch.randomizedtesting.RandomizedRunner$5.evaluate(RandomizedRunner.java:829)
	at com.carrotsearch.randomizedtesting.RandomizedRunner$6.evaluate(RandomizedRunner.java:879)
	at com.carrotsearch.randomizedtesting.RandomizedRunner$7.evaluate(RandomizedRunner.java:890)
	at com.carrotsearch.randomizedtesting.rules.StatementAdapter.evaluate(StatementAdapter.java:36)
	at com.carrotsearch.randomizedtesting.rules.SystemPropertiesRestoreRule$1.evaluate(SystemPropertiesRestoreRule.java:57)
	at org.apache.lucene.util.AbstractBeforeAfterRule$1.evaluate(AbstractBeforeAfterRule.java:45)
	at com.carrotsearch.randomizedtesting.rules.StatementAdapter.evaluate(StatementAdapter.java:36)
	at org.apache.lucene.util.TestRuleStoreClassName$1.evaluate(TestRuleStoreClassName.java:41)
	at com.carrotsearch.randomizedtesting.rules.NoShadowingOrOverridesOnMethodsRule$1.evaluate(NoShadowingOrOverridesOnMethodsRule.java:40)
	at com.carrotsearch.randomizedtesting.rules.NoShadowingOrOverridesOnMethodsRule$1.evaluate(NoShadowingOrOverridesOnMethodsRule.java:40)
	at com.carrotsearch.randomizedtesting.rules.StatementAdapter.evaluate(StatementAdapter.java:36)
	at com.carrotsearch.randomizedtesting.rules.StatementAdapter.evaluate(StatementAdapter.java:36)
	at org.apache.lucene.util.TestRuleAssertionsRequired$1.evaluate(TestRuleAssertionsRequired.java:53)
	at org.apache.lucene.util.TestRuleMarkFailure$1.evaluate(TestRuleMarkFailure.java:47)
	at org.apache.lucene.util.TestRuleIgnoreAfterMaxFailures$1.evaluate(TestRuleIgnoreAfterMaxFailures.java:64)
	at org.apache.lucene.util.TestRuleIgnoreTestSuites$1.evaluate(TestRuleIgnoreTestSuites.java:54)
	at com.carrotsearch.randomizedtesting.rules.StatementAdapter.evaluate(StatementAdapter.java:36)
	at com.carrotsearch.randomizedtesting.ThreadLeakControl$StatementRunner.run(ThreadLeakControl.java:368)
	at java.base/java.lang.Thread.run(Thread.java:844)


FAILED:  org.apache.solr.handler.RequestLoggingTest.testLogBeforeExecuteWithCoreLogger

Error Message:


Stack Trace:
java.lang.AssertionError
	at __randomizedtesting.SeedInfo.seed([2A0D120E25F7C83E:E68B1280DB3EA3A8]:0)
	at org.junit.Assert.fail(Assert.java:92)
	at org.junit.Assert.assertTrue(Assert.java:43)
	at org.junit.Assert.assertTrue(Assert.java:54)
	at org.apache.solr.handler.RequestLoggingTest.testLogBeforeExecute(RequestLoggingTest.java:88)
	at org.apache.solr.handler.RequestLoggingTest.testLogBeforeExecuteWithCoreLogger(RequestLoggingTest.java:65)
	at java.base/jdk.internal.reflect.NativeMethodAccessorImpl.invoke0(Native Method)
	at java.base/jdk.internal.reflect.NativeMethodAccessorImpl.invoke(NativeMethodAccessorImpl.java:62)
	at java.base/jdk.internal.reflect.DelegatingMethodAccessorImpl.invoke(DelegatingMethodAccessorImpl.java:43)
	at java.base/java.lang.reflect.Method.invoke(Method.java:564)
	at com.carrotsearch.randomizedtesting.RandomizedRunner.invoke(RandomizedRunner.java:1737)
	at com.carrotsearch.randomizedtesting.RandomizedRunner$8.evaluate(RandomizedRunner.java:934)
	at com.carrotsearch.randomizedtesting.RandomizedRunner$9.evaluate(RandomizedRunner.java:970)
	at com.carrotsearch.randomizedtesting.RandomizedRunner$10.evaluate(RandomizedRunner.java:984)
	at com.carrotsearch.randomizedtesting.rules.SystemPropertiesRestoreRule$1.evaluate(SystemPropertiesRestoreRule.java:57)
	at org.apache.lucene.util.TestRuleSetupTeardownChained$1.evaluate(TestRuleSetupTeardownChained.java:49)
	at org.apache.lucene.util.AbstractBeforeAfterRule$1.evaluate(AbstractBeforeAfterRule.java:45)
	at org.apache.lucene.util.TestRuleThreadAndTestName$1.evaluate(TestRuleThreadAndTestName.java:48)
	at org.apache.lucene.util.TestRuleIgnoreAfterMaxFailures$1.evaluate(TestRuleIgnoreAfterMaxFailures.java:64)
	at org.apache.lucene.util.TestRuleMarkFailure$1.evaluate(TestRuleMarkFailure.java:47)
	at com.carrotsearch.randomizedtesting.rules.StatementAdapter.evaluate(StatementAdapter.java:36)
	at com.carrotsearch.randomizedtesting.ThreadLeakControl$StatementRunner.run(ThreadLeakControl.java:368)
	at com.carrotsearch.randomizedtesting.ThreadLeakControl.forkTimeoutingTask(ThreadLeakControl.java:817)
	at com.carrotsearch.randomizedtesting.ThreadLeakControl$3.evaluate(ThreadLeakControl.java:468)
	at com.carrotsearch.randomizedtesting.RandomizedRunner.runSingleTest(RandomizedRunner.java:943)
	at com.carrotsearch.randomizedtesting.RandomizedRunner$5.evaluate(RandomizedRunner.java:829)
	at com.carrotsearch.randomizedtesting.RandomizedRunner$6.evaluate(RandomizedRunner.java:879)
	at com.carrotsearch.randomizedtesting.RandomizedRunner$7.evaluate(RandomizedRunner.java:890)
	at com.carrotsearch.randomizedtesting.rules.StatementAdapter.evaluate(StatementAdapter.java:36)
	at com.carrotsearch.randomizedtesting.rules.SystemPropertiesRestoreRule$1.evaluate(SystemPropertiesRestoreRule.java:57)
	at org.apache.lucene.util.AbstractBeforeAfterRule$1.evaluate(AbstractBeforeAfterRule.java:45)
	at com.carrotsearch.randomizedtesting.rules.StatementAdapter.evaluate(StatementAdapter.java:36)
	at org.apache.lucene.util.TestRuleStoreClassName$1.evaluate(TestRuleStoreClassName.java:41)
	at com.carrotsearch.randomizedtesting.rules.NoShadowingOrOverridesOnMethodsRule$1.evaluate(NoShadowingOrOverridesOnMethodsRule.java:40)
	at com.carrotsearch.randomizedtesting.rules.NoShadowingOrOverridesOnMethodsRule$1.evaluate(NoShadowingOrOverridesOnMethodsRule.java:40)
	at com.carrotsearch.randomizedtesting.rules.StatementAdapter.evaluate(StatementAdapter.java:36)
	at com.carrotsearch.randomizedtesting.rules.StatementAdapter.evaluate(StatementAdapter.java:36)
	at org.apache.lucene.util.TestRuleAssertionsRequired$1.evaluate(TestRuleAssertionsRequired.java:53)
	at org.apache.lucene.util.TestRuleMarkFailure$1.evaluate(TestRuleMarkFailure.java:47)
	at org.apache.lucene.util.TestRuleIgnoreAfterMaxFailures$1.evaluate(TestRuleIgnoreAfterMaxFailures.java:64)
	at org.apache.lucene.util.TestRuleIgnoreTestSuites$1.evaluate(TestRuleIgnoreTestSuites.java:54)
	at com.carrotsearch.randomizedtesting.rules.StatementAdapter.evaluate(StatementAdapter.java:36)
	at com.carrotsearch.randomizedtesting.ThreadLeakControl$StatementRunner.run(ThreadLeakControl.java:368)
	at java.base/java.lang.Thread.run(Thread.java:844)




Build Log:
[...truncated 14589 lines...]
   [junit4] Suite: org.apache.solr.handler.RequestLoggingTest
   [junit4]   2> 3758561 INFO  (SUITE-RequestLoggingTest-seed#[2A0D120E25F7C83E]-worker) [    ] o.a.s.SolrTestCaseJ4 SecureRandom sanity checks: test.solr.allowed.securerandom=null & java.security.egd=file:/dev/./urandom
   [junit4]   2> Creating dataDir: C:\Users\jenkins\workspace\Lucene-Solr-7.x-Windows\solr\build\solr-core\test\J1\temp\solr.handler.RequestLoggingTest_2A0D120E25F7C83E-001\init-core-data-001
   [junit4]   2> 3758562 WARN  (SUITE-RequestLoggingTest-seed#[2A0D120E25F7C83E]-worker) [    ] o.a.s.SolrTestCaseJ4 startTrackingSearchers: numOpens=5 numCloses=5
   [junit4]   2> 3758562 INFO  (SUITE-RequestLoggingTest-seed#[2A0D120E25F7C83E]-worker) [    ] o.a.s.SolrTestCaseJ4 Using PointFields (NUMERIC_POINTS_SYSPROP=true) w/NUMERIC_DOCVALUES_SYSPROP=false
   [junit4]   2> 3758563 INFO  (SUITE-RequestLoggingTest-seed#[2A0D120E25F7C83E]-worker) [    ] o.a.s.SolrTestCaseJ4 Randomized ssl (false) and clientAuth (false) via: @org.apache.solr.util.RandomizeSSL(reason="", value=0.0/0.0, ssl=0.0/0.0, clientAuth=0.0/0.0)
   [junit4]   2> 3758563 INFO  (SUITE-RequestLoggingTest-seed#[2A0D120E25F7C83E]-worker) [    ] o.a.s.SolrTestCaseJ4 ####initCore
   [junit4]   2> 3758564 INFO  (SUITE-RequestLoggingTest-seed#[2A0D120E25F7C83E]-worker) [    ] o.a.s.c.SolrResourceLoader [null] Added 2 libs to classloader, from paths: [/C:/Users/jenkins/workspace/Lucene-Solr-7.x-Windows/solr/core/src/test-files/solr/collection1/lib, /C:/Users/jenkins/workspace/Lucene-Solr-7.x-Windows/solr/core/src/test-files/solr/collection1/lib/classes]
   [junit4]   2> 3758587 INFO  (SUITE-RequestLoggingTest-seed#[2A0D120E25F7C83E]-worker) [    ] o.a.s.c.SolrConfig Using Lucene MatchVersion: 7.5.0
   [junit4]   2> 3758601 INFO  (SUITE-RequestLoggingTest-seed#[2A0D120E25F7C83E]-worker) [    ] o.a.s.s.IndexSchema [null] Schema name=test
   [junit4]   2> 3758668 INFO  (SUITE-RequestLoggingTest-seed#[2A0D120E25F7C83E]-worker) [    ] o.a.s.s.IndexSchema Loaded schema test/1.0 with uniqueid field id
   [junit4]   2> 3758764 INFO  (SUITE-RequestLoggingTest-seed#[2A0D120E25F7C83E]-worker) [    ] o.a.s.c.TransientSolrCoreCacheDefault Allocating transient cache for 2147483647 transient cores
   [junit4]   2> 3758764 INFO  (SUITE-RequestLoggingTest-seed#[2A0D120E25F7C83E]-worker) [    ] o.a.s.h.a.MetricsHistoryHandler No .system collection, keeping metrics history in memory.
   [junit4]   2> 3758775 INFO  (SUITE-RequestLoggingTest-seed#[2A0D120E25F7C83E]-worker) [    ] o.a.s.m.r.SolrJmxReporter JMX monitoring for 'solr.node' (registry 'solr.node') enabled at server: com.sun.jmx.mbeanserver.JmxMBeanServer@540cf762
   [junit4]   2> 3758781 INFO  (SUITE-RequestLoggingTest-seed#[2A0D120E25F7C83E]-worker) [    ] o.a.s.m.r.SolrJmxReporter JMX monitoring for 'solr.jvm' (registry 'solr.jvm') enabled at server: com.sun.jmx.mbeanserver.JmxMBeanServer@540cf762
   [junit4]   2> 3758781 INFO  (SUITE-RequestLoggingTest-seed#[2A0D120E25F7C83E]-worker) [    ] o.a.s.m.r.SolrJmxReporter JMX monitoring for 'solr.jetty' (registry 'solr.jetty') enabled at server: com.sun.jmx.mbeanserver.JmxMBeanServer@540cf762
   [junit4]   2> 3758783 INFO  (coreLoadExecutor-12333-thread-1) [    x:collection1] o.a.s.c.SolrResourceLoader [null] Added 2 libs to classloader, from paths: [/C:/Users/jenkins/workspace/Lucene-Solr-7.x-Windows/solr/core/src/test-files/solr/collection1/lib, /C:/Users/jenkins/workspace/Lucene-Solr-7.x-Windows/solr/core/src/test-files/solr/collection1/lib/classes]
   [junit4]   2> 3758815 INFO  (coreLoadExecutor-12333-thread-1) [    x:collection1] o.a.s.c.SolrConfig Using Lucene MatchVersion: 7.5.0
   [junit4]   2> 3758828 INFO  (coreLoadExecutor-12333-thread-1) [    x:collection1] o.a.s.s.IndexSchema [collection1] Schema name=test
   [junit4]   2> 3758885 INFO  (coreLoadExecutor-12333-thread-1) [    x:collection1] o.a.s.s.IndexSchema Loaded schema test/1.0 with uniqueid field id
   [junit4]   2> 3758896 INFO  (coreLoadExecutor-12333-thread-1) [    x:collection1] o.a.s.c.CoreContainer Creating SolrCore 'collection1' using configuration from instancedir C:\Users\jenkins\workspace\Lucene-Solr-7.x-Windows\solr\core\src\test-files\solr\collection1, trusted=true
   [junit4]   2> 3758896 INFO  (coreLoadExecutor-12333-thread-1) [    x:collection1] o.a.s.m.r.SolrJmxReporter JMX monitoring for 'solr.core.collection1' (registry 'solr.core.collection1') enabled at server: com.sun.jmx.mbeanserver.JmxMBeanServer@540cf762
   [junit4]   2> 3758896 INFO  (coreLoadExecutor-12333-thread-1) [    x:collection1] o.a.s.c.SolrCore solr.RecoveryStrategy.Builder
   [junit4]   2> 3758896 INFO  (coreLoadExecutor-12333-thread-1) [    x:collection1] o.a.s.c.SolrCore [[collection1] ] Opening new SolrCore at [C:\Users\jenkins\workspace\Lucene-Solr-7.x-Windows\solr\core\src\test-files\solr\collection1], dataDir=[C:\Users\jenkins\workspace\Lucene-Solr-7.x-Windows\solr\build\solr-core\test\J1\temp\solr.handler.RequestLoggingTest_2A0D120E25F7C83E-001\init-core-data-001\]
   [junit4]   2> 3758898 INFO  (coreLoadExecutor-12333-thread-1) [    x:collection1] o.a.s.u.RandomMergePolicy RandomMergePolicy wrapping class org.apache.lucene.index.LogByteSizeMergePolicy: [LogByteSizeMergePolicy: minMergeSize=1677721, mergeFactor=16, maxMergeSize=2147483648, maxMergeSizeForForcedMerge=9223372036854775807, calibrateSizeByDeletes=false, maxMergeDocs=2147483647, maxCFSSegmentSizeMB=8.796093022207999E12, noCFSRatio=0.0]
   [junit4]   2> 3758990 INFO  (coreLoadExecutor-12333-thread-1) [    x:collection1] o.a.s.u.UpdateHandler Using UpdateLog implementation: org.apache.solr.update.UpdateLog
   [junit4]   2> 3758990 INFO  (coreLoadExecutor-12333-thread-1) [    x:collection1] o.a.s.u.UpdateLog Initializing UpdateLog: dataDir= defaultSyncLevel=FLUSH numRecordsToKeep=100 maxNumLogsToKeep=10 numVersionBuckets=65536
   [junit4]   2> 3758991 INFO  (coreLoadExecutor-12333-thread-1) [    x:collection1] o.a.s.u.CommitTracker Hard AutoCommit: disabled
   [junit4]   2> 3758991 INFO  (coreLoadExecutor-12333-thread-1) [    x:collection1] o.a.s.u.CommitTracker Soft AutoCommit: disabled
   [junit4]   2> 3758991 INFO  (coreLoadExecutor-12333-thread-1) [    x:collection1] o.a.s.u.RandomMergePolicy RandomMergePolicy wrapping class org.apache.lucene.index.TieredMergePolicy: [TieredMergePolicy: maxMergeAtOnce=31, maxMergeAtOnceExplicit=43, maxMergedSegmentMB=17.8173828125, floorSegmentMB=1.6103515625, forceMergeDeletesPctAllowed=6.096856967838161, segmentsPerTier=30.0, maxCFSSegmentSizeMB=8.796093022207999E12, noCFSRatio=0.0, deletesPctAllowed=29.725323755564027
   [junit4]   2> 3758992 INFO  (coreLoadExecutor-12333-thread-1) [    x:collection1] o.a.s.s.SolrIndexSearcher Opening [Searcher@55933181[collection1] main]
   [junit4]   2> 3758992 INFO  (coreLoadExecutor-12333-thread-1) [    x:collection1] o.a.s.h.c.SpellCheckComponent Initializing spell checkers
   [junit4]   2> 3759007 INFO  (coreLoadExecutor-12333-thread-1) [    x:collection1] o.a.s.s.DirectSolrSpellChecker init: {name=direct,classname=DirectSolrSpellChecker,field=lowerfilt,minQueryLength=3}
   [junit4]   2> 3759099 INFO  (coreLoadExecutor-12333-thread-1) [    x:collection1] o.a.s.h.ReplicationHandler Commits will be reserved for 10000ms.
   [junit4]   2> 3759099 INFO  (searcherExecutor-12334-thread-1-processing-x:collection1) [    x:collection1] o.a.s.h.c.SpellCheckComponent Loading spell index for spellchecker: default
   [junit4]   2> 3759099 INFO  (coreLoadExecutor-12333-thread-1) [    x:collection1] o.a.s.u.UpdateLog Could not find max version in index or recent updates, using new clock 1610495486553227264
   [junit4]   2> 3759100 INFO  (searcherExecutor-12334-thread-1-processing-x:collection1) [    x:collection1] o.a.s.h.c.SpellCheckComponent Loading spell index for spellchecker: direct
   [junit4]   2> 3759100 INFO  (searcherExecutor-12334-thread-1-processing-x:collection1) [    x:collection1] o.a.s.h.c.SpellCheckComponent Loading spell index for spellchecker: wordbreak
   [junit4]   2> 3759100 INFO  (searcherExecutor-12334-thread-1-processing-x:collection1) [    x:collection1] o.a.s.h.c.SpellCheckComponent Loading spell index for spellchecker: multipleFields
   [junit4]   2> 3759101 INFO  (searcherExecutor-12334-thread-1-processing-x:collection1) [    x:collection1] o.a.s.h.c.SpellCheckComponent Loading spell index for spellchecker: jarowinkler
   [junit4]   2> 3759102 INFO  (searcherExecutor-12334-thread-1-processing-x:collection1) [    x:collection1] o.a.s.h.c.SpellCheckComponent Loading spell index for spellchecker: external
   [junit4]   2> 3759102 INFO  (SUITE-RequestLoggingTest-seed#[2A0D120E25F7C83E]-worker) [    ] o.a.s.SolrTestCaseJ4 ####initCore end
   [junit4]   2> 3759103 INFO  (searcherExecutor-12334-thread-1-processing-x:collection1) [    x:collection1] o.a.s.h.c.SpellCheckComponent Loading spell index for spellchecker: freq
   [junit4]   2> 3759104 INFO  (searcherExecutor-12334-thread-1-processing-x:collection1) [    x:collection1] o.a.s.h.c.SpellCheckComponent Loading spell index for spellchecker: fqcn
   [junit4]   2> 3759105 INFO  (TEST-RequestLoggingTest.testLogBeforeExecuteWithRequestLogger-seed#[2A0D120E25F7C83E]) [    ] o.a.s.SolrTestCaseJ4 ###Starting testLogBeforeExecuteWithRequestLogger
   [junit4]   2> 3759105 INFO  (searcherExecutor-12334-thread-1-processing-x:collection1) [    x:collection1] o.a.s.h.c.SpellCheckComponent Loading spell index for spellchecker: perDict
   [junit4]   2> 3759105 INFO  (searcherExecutor-12334-thread-1-processing-x:collection1) [    x:collection1] o.a.s.c.SolrCore [collection1] Registered new searcher Searcher@55933181[collection1] main{ExitableDirectoryReader(UninvertingDirectoryReader())}
   [junit4]   2> 3759117 DEBUG (TEST-RequestLoggingTest.testLogBeforeExecuteWithRequestLogger-seed#[2A0D120E25F7C83E]) [    ] o.a.s.c.S.Request [collection1]  webapp=null path=null params={q=*:*&wt=xml}
   [junit4]   2> 3759117 DEBUG (TEST-RequestLoggingTest.testLogBeforeExecuteWithRequestLogger-seed#[2A0D120E25F7C83E]) [    ] o.a.s.h.c.SearchHandler Adding  component:org.apache.solr.handler.component.QueryComponent@37d20371
   [junit4]   2> 3759117 DEBUG (TEST-RequestLoggingTest.testLogBeforeExecuteWithRequestLogger-seed#[2A0D120E25F7C83E]) [    ] o.a.s.h.c.SearchHandler Adding  component:org.apache.solr.handler.component.FacetComponent@2c93b31e
   [junit4]   2> 3759117 DEBUG (TEST-RequestLoggingTest.testLogBeforeExecuteWithRequestLogger-seed#[2A0D120E25F7C83E]) [    ] o.a.s.h.c.SearchHandler Adding  component:org.apache.solr.search.facet.FacetModule@2df15098
   [junit4]   2> 3759117 DEBUG (TEST-RequestLoggingTest.testLogBeforeExecuteWithRequestLogger-seed#[2A0D120E25F7C83E]) [    ] o.a.s.h.c.SearchHandler Adding  component:org.apache.solr.handler.component.MoreLikeThisComponent@57e6c14e
   [junit4]   2> 3759117 DEBUG (TEST-RequestLoggingTest.testLogBeforeExecuteWithRequestLogger-seed#[2A0D120E25F7C83E]) [    ] o.a.s.h.c.SearchHandler Adding  component:org.apache.solr.handler.component.HighlightComponent@70889948
   [junit4]   2> 3759117 DEBUG (TEST-RequestLoggingTest.testLogBeforeExecuteWithRequestLogger-seed#[2A0D120E25F7C83E]) [    ] o.a.s.h.c.SearchHandler Adding  component:org.apache.solr.handler.component.StatsComponent@4132df04
   [junit4]   2> 3759117 DEBUG (TEST-RequestLoggingTest.testLogBeforeExecuteWithRequestLogger-seed#[2A0D120E25F7C83E]) [    ] o.a.s.h.c.SearchHandler Adding  component:org.apache.solr.handler.component.ExpandComponent@66e0222a
   [junit4]   2> 3759117 DEBUG (TEST-RequestLoggingTest.testLogBeforeExecuteWithRequestLogger-seed#[2A0D120E25F7C83E]) [    ] o.a.s.h.c.SearchHandler Adding  component:org.apache.solr.handler.component.TermsComponent@7ed7309
   [junit4]   2> 3759117 DEBUG (TEST-RequestLoggingTest.testLogBeforeExecuteWithRequestLogger-seed#[2A0D120E25F7C83E]) [    ] o.a.s.h.c.SearchHandler Adding  debug component:org.apache.solr.handler.component.DebugComponent@339bf865
   [junit4]   2> 3759117 DEBUG (TEST-RequestLoggingTest.testLogBeforeExecuteWithRequestLogger-seed#[2A0D120E25F7C83E]) [    ] o.a.s.h.c.QueryComponent process: q=*:*&df=text&wt=xml&indent=off
   [junit4]   2> 3759117 DEBUG (TEST-RequestLoggingTest.testLogBeforeExecuteWithRequestLogger-seed#[2A0D120E25F7C83E]) [    ] o.a.s.s.s.LocalStatsCache ## GET LocalSolrQueryRequest{q=*:*&df=text&wt=xml&indent=off}
   [junit4]   2> 3759117 INFO  (TEST-RequestLoggingTest.testLogBeforeExecuteWithRequestLogger-seed#[2A0D120E25F7C83E]) [    ] o.a.s.c.S.Request [collection1]  webapp=null path=null params={q=*:*&wt=xml} hits=0 status=0 QTime=0
   [junit4]   2> 3759119 INFO  (TEST-RequestLoggingTest.testLogBeforeExecuteWithRequestLogger-seed#[2A0D120E25F7C83E]) [    ] o.a.s.SolrTestCaseJ4 ###Ending testLogBeforeExecuteWithRequestLogger
   [junit4]   2> NOTE: reproduce with: ant test  -Dtestcase=RequestLoggingTest -Dtests.method=testLogBeforeExecuteWithRequestLogger -Dtests.seed=2A0D120E25F7C83E -Dtests.slow=true -Dtests.locale=ur -Dtests.timezone=America/Maceio -Dtests.asserts=true -Dtests.file.encoding=Cp1252
   [junit4] FAILURE 0.02s J1 | RequestLoggingTest.testLogBeforeExecuteWithRequestLogger <<<
   [junit4]    > Throwable #1: java.lang.AssertionError
   [junit4]    > 	at __randomizedtesting.SeedInfo.seed([2A0D120E25F7C83E:9B64320188017070]:0)
   [junit4]    > 	at org.apache.solr.handler.RequestLoggingTest.testLogBeforeExecute(RequestLoggingTest.java:88)
   [junit4]    > 	at org.apache.solr.handler.RequestLoggingTest.testLogBeforeExecuteWithRequestLogger(RequestLoggingTest.java:71)
   [junit4]    > 	at java.base/jdk.internal.reflect.NativeMethodAccessorImpl.invoke0(Native Method)
   [junit4]    > 	at java.base/jdk.internal.reflect.NativeMethodAccessorImpl.invoke(NativeMethodAccessorImpl.java:62)
   [junit4]    > 	at java.base/jdk.internal.reflect.DelegatingMethodAccessorImpl.invoke(DelegatingMethodAccessorImpl.java:43)
   [junit4]    > 	at java.base/java.lang.reflect.Method.invoke(Method.java:564)
   [junit4]    > 	at java.base/java.lang.Thread.run(Thread.java:844)
   [junit4]   2> 3759123 INFO  (TEST-RequestLoggingTest.testLogBeforeExecuteWithCoreLogger-seed#[2A0D120E25F7C83E]) [    ] o.a.s.SolrTestCaseJ4 ###Starting testLogBeforeExecuteWithCoreLogger
   [junit4]   2> 3759125 DEBUG (TEST-RequestLoggingTest.testLogBeforeExecuteWithCoreLogger-seed#[2A0D120E25F7C83E]) [    ] o.a.s.c.S.Request [collection1]  webapp=null path=null params={q=*:*&wt=xml}
   [junit4]   2> 3759125 DEBUG (TEST-RequestLoggingTest.testLogBeforeExecuteWithCoreLogger-seed#[2A0D120E25F7C83E]) [    ] o.a.s.h.c.QueryComponent process: q=*:*&df=text&wt=xml&indent=off
   [junit4]   2> 3759125 DEBUG (TEST-RequestLoggingTest.testLogBeforeExecuteWithCoreLogger-seed#[2A0D120E25F7C83E]) [    ] o.a.s.s.s.LocalStatsCache ## GET LocalSolrQueryRequest{q=*:*&df=text&wt=xml&indent=off}
   [junit4]   2> 3759125 INFO  (TEST-RequestLoggingTest.testLogBeforeExecuteWithCoreLogger-seed#[2A0D120E25F7C83E]) [    ] o.a.s.c.S.Request [collection1]  webapp=null path=null params={q=*:*&wt=xml} hits=0 status=0 QTime=0
   [junit4]   2> 3759126 INFO  (TEST-RequestLoggingTest.testLogBeforeExecuteWithCoreLogger-seed#[2A0D120E25F7C83E]) [    ] o.a.s.SolrTestCaseJ4 ###Ending testLogBeforeExecuteWithCoreLogger
   [junit4]   2> NOTE: reproduce with: ant test  -Dtestcase=RequestLoggingTest -Dtests.method=testLogBeforeExecuteWithCoreLogger -Dtests.seed=2A0D120E25F7C83E -Dtests.slow=true -Dtests.locale=ur -Dtests.timezone=America/Maceio -Dtests.asserts=true -Dtests.file.encoding=Cp1252
   [junit4] FAILURE 0.01s J1 | RequestLoggingTest.testLogBeforeExecuteWithCoreLogger <<<
   [junit4]    > Throwable #1: java.lang.AssertionError
   [junit4]    > 	at __randomizedtesting.SeedInfo.seed([2A0D120E25F7C83E:E68B1280DB3EA3A8]:0)
   [junit4]    > 	at org.apache.solr.handler.RequestLoggingTest.testLogBeforeExecute(RequestLoggingTest.java:88)
   [junit4]    > 	at org.apache.solr.handler.RequestLoggingTest.testLogBeforeExecuteWithCoreLogger(RequestLoggingTest.java:65)
   [junit4]    > 	at java.base/jdk.internal.reflect.NativeMethodAccessorImpl.invoke0(Native Method)
   [junit4]    > 	at java.base/jdk.internal.reflect.NativeMethodAccessorImpl.invoke(NativeMethodAccessorImpl.java:62)
   [junit4]    > 	at java.base/jdk.internal.reflect.DelegatingMethodAccessorImpl.invoke(DelegatingMethodAccessorImpl.java:43)
   [junit4]    > 	at java.base/java.lang.reflect.Method.invoke(Method.java:564)
   [junit4]    > 	at java.base/java.lang.Thread.run(Thread.java:844)
   [junit4]   2> 3759127 INFO  (SUITE-RequestLoggingTest-seed#[2A0D120E25F7C83E]-worker) [    ] o.a.s.SolrTestCaseJ4 ###deleteCore
   [junit4]   2> 3759127 INFO  (SUITE-RequestLoggingTest-seed#[2A0D120E25F7C83E]-worker) [    ] o.a.s.c.CoreContainer Shutting down CoreContainer instance=379546159
   [junit4]   2> 3759127 INFO  (SUITE-RequestLoggingTest-seed#[2A0D120E25F7C83E]-worker) [    ] o.a.s.m.SolrMetricManager Closing metric reporters for registry=solr.node, tag=null
   [junit4]   2> 3759127 INFO  (SUITE-RequestLoggingTest-seed#[2A0D120E25F7C83E]-worker) [    ] o.a.s.m.r.SolrJmxReporter Closing reporter [org.apache.solr.metrics.reporters.SolrJmxReporter@103cbd4c: rootName = null, domain = solr.node, service url = null, agent id = null] for registry solr.node / com.codahale.metrics.MetricRegistry@1115a2ce
   [junit4]   2> 3759129 INFO  (SUITE-RequestLoggingTest-seed#[2A0D120E25F7C83E]-worker) [    ] o.a.s.m.SolrMetricManager Closing metric reporters for registry=solr.jvm, tag=null
   [junit4]   2> 3759129 INFO  (SUITE-RequestLoggingTest-seed#[2A0D120E25F7C83E]-worker) [    ] o.a.s.m.r.SolrJmxReporter Closing reporter [org.apache.solr.metrics.reporters.SolrJmxReporter@5dae93a5: rootName = null, domain = solr.jvm, service url = null, agent id = null] for registry solr.jvm / com.codahale.metrics.MetricRegistry@4590b915
   [junit4]   2> 3759133 INFO  (SUITE-RequestLoggingTest-seed#[2A0D120E25F7C83E]-worker) [    ] o.a.s.m.SolrMetricManager Closing metric reporters for registry=solr.jetty, tag=null
   [junit4]   2> 3759134 INFO  (SUITE-RequestLoggingTest-seed#[2A0D120E25F7C83E]-worker) [    ] o.a.s.m.r.SolrJmxReporter Closing reporter [org.apache.solr.metrics.reporters.SolrJmxReporter@54fe90a7: rootName = null, domain = solr.jetty, service url = null, agent id = null] for registry solr.jetty / com.codahale.metrics.MetricRegistry@7b7e228f
   [junit4]   2> 3759134 INFO  (coreCloseExecutor-12339-thread-1) [    x:collection1] o.a.s.c.SolrCore [collection1]  CLOSING SolrCore org.apache.solr.core.SolrCore@27372afa
   [junit4]   2> 3759134 INFO  (coreCloseExecutor-12339-thread-1) [    x:collection1] o.a.s.m.SolrMetricManager Closing metric reporters for registry=solr.core.collection1, tag=27372afa
   [junit4]   2> 3759134 INFO  (coreCloseExecutor-12339-thread-1) [    x:collection1] o.a.s.m.r.SolrJmxReporter Closing reporter [org.apache.solr.metrics.reporters.SolrJmxReporter@75f90d39: rootName = null, domain = solr.core.collection1, service url = null, agent id = null] for registry solr.core.collection1 / com.codahale.metrics.MetricRegistry@5b7bf26
   [junit4]   2> NOTE: leaving temporary files on disk at: C:\Users\jenkins\workspace\Lucene-Solr-7.x-Windows\solr\build\solr-core\test\J1\temp\solr.handler.RequestLoggingTest_2A0D120E25F7C83E-001
   [junit4]   2> NOTE: test params are: codec=Asserting(Lucene70): {}, docValues:{}, maxPointsInLeafNode=58, maxMBSortInHeap=5.068270964106848, sim=RandomSimilarity(queryNorm=true): {}, locale=ur, timezone=America/Maceio
   [junit4]   2> NOTE: Windows 10 10.0 amd64/Oracle Corporation 10.0.1 (64-bit)/cpus=3,threads=1,free=100881448,total=518979584
   [junit4]   2> NOTE: All tests run in this JVM: [TestDistribDocBasedVersion, NoCacheHeaderTest, LIROnShardRestartTest, RuleEngineTest, TestStressLucene, TestMaxScoreQueryParser, MoveReplicaHDFSTest, CollectionPropsTest, StatsReloadRaceTest, TestSubQueryTransformerCrossCore, DistributedUpdateProcessorTest, CreateCollectionCleanupTest, HdfsDirectoryTest, TestRandomFlRTGCloud, SimpleFacetsTest, TestNestedUpdateProcessor, TestExportWriter, RecoveryAfterSoftCommitTest, Tagger2Test, TestTolerantSearch, SolrCoreCheckLockOnStartupTest, DistributedFacetPivotLongTailTest, ConfigureRecoveryStrategyTest, LeaderFailureAfterFreshStartTest, CursorPagingTest, SolrPluginUtilsTest, SpellingQueryConverterTest, TestReload, TestSort, TestHalfAndHalfDocValues, ZkControllerTest, TestExactStatsCache, TestLegacyFieldCache, WrapperMergePolicyFactoryTest, TestHighlightDedupGrouping, TestJsonFacetsWithNestedObjects, TestClusterProperties, TestXmlQParser, TestFoldingMultitermQuery, TestGeoJSONResponseWriter, TestDownShardTolerantSearch, TestSolrQueryResponse, DistributedDebugComponentTest, TestPostingsSolrHighlighter, CdcrRequestHandlerTest, TestOrdValues, TestSolrCoreParser, TestSolr4Spatial, DirectoryFactoryTest, FieldAnalysisRequestHandlerTest, CoreAdminHandlerTest, TimeZoneUtilsTest, TestCollapseQParserPlugin, AutoscalingHistoryHandlerTest, EmbeddedSolrNoSerializeTest, MaxSizeAutoCommitTest, TestQueryTypes, HdfsBasicDistributedZk2Test, TestConfigSetProperties, TestClassicSimilarityFactory, AssignBackwardCompatibilityTest, PeerSyncWithBufferUpdatesTest, TestPhraseSuggestions, BasicZkTest, TestShortCircuitedRequests, XsltUpdateRequestHandlerTest, TestManagedResource, TestSchemaVersionResource, ScheduledTriggerIntegrationTest, TestCloudNestedDocsSort, TestRandomDVFaceting, TestJsonFacets, DirectSolrConnectionTest, TestPayloadScoreQParserPlugin, TestPKIAuthenticationPlugin, SuggesterWFSTTest, TestAuthenticationFramework, TestReqParamsAPI, InfixSuggestersTest, DistributedVersionInfoTest, TestRTimerTree, CdcrUpdateLogTest, TestCustomSort, TestCSVResponseWriter, IndexSchemaTest, TestPushWriter, MetricsConfigTest, MetricsHistoryIntegrationTest, BlockJoinFacetSimpleTest, TestLMDirichletSimilarityFactory, TestCoreBackup, ExternalFileFieldSortTest, LeaderElectionTest, TestConfigOverlay, TermVectorComponentDistributedTest, TermsComponentTest, TestMacros, AnalyticsMergeStrategyTest, AutoAddReplicasPlanActionTest, BooleanFieldTest, SSLMigrationTest, TestIntervalFaceting, TestSimLargeCluster, SegmentsInfoRequestHandlerTest, TestChildDocTransformerHierarchy, NodeMutatorTest, TestReloadAndDeleteDocs, TriggerCooldownIntegrationTest, TestRebalanceLeaders, TestJavabinTupleStreamParser, VMParamsZkACLAndCredentialsProvidersTest, TaggingAttributeTest, TestFastLRUCache, TestFieldCache, TestDocumentBuilder, TestMaxTokenLenTokenizer, SchemaVersionSpecificBehaviorTest, TestCloudRecovery, TestSimDistribStateManager, TestManagedSynonymFilterFactory, WordBreakSolrSpellCheckerTest, TestFileDictionaryLookup, SolrXmlInZkTest, RestartWhileUpdatingTest, TestNonDefinedSimilarityFactory, TestCopyFieldCollectionResource, SystemLogListenerTest, OverseerStatusTest, DirectSolrSpellCheckerTest, ComputePlanActionTest, TestDistributedMissingSort, SuggesterTSTTest, CopyFieldTest, TestTrieFacet, HdfsCollectionsAPIDistributedZkTest, TestLocalFSCloudBackupRestore, TestDocBasedVersionConstraints, AtomicUpdatesTest, ExplicitHLLTest, HdfsAutoAddReplicasIntegrationTest, HdfsSyncSliceTest, HdfsChaosMonkeyNothingIsSafeTest, SolrCloudReportersTest, TestSchemaManager, DistributedMLTComponentTest, SearchHandlerTest, TestDirectoryFactory, SuggestComponentContextFilterQueryTest, HttpPartitionOnCommitTest, CollectionsAPISolrJTest, InfoHandlerTest, IndexBasedSpellCheckerTest, ScriptEngineTest, TestStressCloudBlindAtomicUpdates, TestSimpleTrackingShardHandler, RestoreTriggerStateTest, HLLSerializationTest, DistributedFacetPivotSmallTest, DocValuesTest, TestPartialUpdateDeduplication, TestSolrCLIRunExample, DistributedFacetSimpleRefinementLongTailTest, SmileWriterTest, BlockDirectoryTest, HdfsWriteToMultipleCollectionsTest, TestJsonRequest, TestDocTermOrds, TestDynamicURP, TestCursorMarkWithoutUniqueKey, SearchRateTriggerIntegrationTest, ReplicaListTransformerTest, ConfigSetsAPITest, FieldMutatingUpdateProcessorTest, PolyFieldTest, TolerantUpdateProcessorTest, CollectionsAPIAsyncDistributedZkTest, CdcrWithNodesRestartsTest, SignificantTermsQParserPluginTest, TestNumericRangeQuery64, NumericFieldsTest, SolrIndexConfigTest, OverriddenZkACLAndCredentialsProvidersTest, TestReplicationHandler, UUIDUpdateProcessorFallbackTest, ZkStateWriterTest, TestDistribIDF, ForceLeaderTest, AddBlockUpdateTest, CollectionReloadTest, DistributedTermsComponentTest, OverseerModifyCollectionTest, DistanceFunctionTest, SolrGraphiteReporterTest, ShardRoutingCustomTest, LargeFieldTest, QueryEqualityTest, AlternateDirectoryTest, TestCharFilters, TestSearchPerf, HdfsTlogReplayBufferedWhileIndexingTest, TestFuzzyAnalyzedSuggestions, ChaosMonkeySafeLeaderWithPullReplicasTest, CleanupOldIndexTest, ClusterStateTest, ClusterStateUpdateTest, DeleteInactiveReplicaTest, DeleteReplicaTest, FullSolrCloudDistribCmdsTest, HttpPartitionTest, LeaderElectionContextKeyTest, LegacyCloudClusterPropTest, MigrateRouteKeyTest, MissingSegmentRecoveryTest, OverseerTest, PeerSyncReplicationTest, SharedFSAutoReplicaFailoverTest, SliceStateTest, SolrCLIZkUtilsTest, SolrCloudExampleTest, TestCloudConsistency, TestCloudPivotFacet, TestDistributedMap, TestHashPartitioner, TestLeaderElectionZkExpiry, TestLockTree, TestMiniSolrCloudClusterSSL, TestPullReplica, TestRequestForwarding, TestSSLRandomization, TestSegmentSorting, TestSkipOverseerOperations, TestTolerantUpdateProcessorCloud, TestUtilizeNode, ZkCLITest, ZkFailoverTest, ConcurrentDeleteAndCreateCollectionTest, ShardSplitTest, CdcrBootstrapTest, HDFSCollectionsAPITest, HdfsNNFailoverTest, HdfsRecoveryZkTest, HdfsRestartWhileUpdatingTest, TestClusterStateMutator, BlobRepositoryCloudTest, CachingDirectoryFactoryTest, HdfsDirectoryFactoryTest, OpenCloseCoreStressTest, PluginInfoTest, QueryResultKeyTest, RAMDirectoryFactoryTest, ResourceLoaderTest, SOLR749Test, TestBackupRepositoryFactory, TestCodecSupport, TestConfig, TestConfigSetImmutable, TestConfigSets, TestCoreContainer, TestCorePropertiesReload, TestDynamicLoading, TestImplicitCoreProperties, TestInfoStreamLogging, TestInitParams, TestJmxIntegration, TestLazyCores, TestMergePolicyConfig, TestQuerySenderListener, TestQuerySenderNoQuery, TestShardHandlerFactory, TestSimpleTextCodec, TestSolrDeletionPolicy1, TestSolrDeletionPolicy2, TestSolrIndexConfig, TestSolrXml, TestXIncludeConfig, TestSolrCoreSnapshots, CSVRequestHandlerTest, DocumentAnalysisRequestHandlerTest, JsonLoaderTest, MoreLikeThisHandlerTest, PingRequestHandlerTest, RequestLoggingTest]
   [junit4] Completed [587/831 (1!)] on J1 in 0.60s, 2 tests, 2 failures <<< FAILURES!

[...truncated 43093 lines...]
[repro] Jenkins log URL: https://jenkins.thetaphi.de/job/Lucene-Solr-7.x-Windows/768/consoleText

[repro] Revision: d35b615c66e8974363b7a938abc0d74a85a798dd

[repro] Ant options: "-Dargs=-XX:+UseCompressedOops -XX:+UseSerialGC"

[repro] ant clean

[...truncated 6 lines...]
[repro] Test suites by module:
[repro]    solr\core
[repro]       RequestLoggingTest
[repro] ant compile-test

[...truncated 3460 lines...]
[repro] ant test-nocompile -Dtests.dups=5 -Dtests.maxfailures=5 -Dtests.class="*.RequestLoggingTest" -Dtests.showOutput=onerror "-Dargs=-XX:+UseCompressedOops -XX:+UseSerialGC" -Dtests.seed=2A0D120E25F7C83E -Dtests.slow=true -Dtests.locale=ur -Dtests.timezone=America/Maceio -Dtests.asserts=true -Dtests.file.encoding=Cp1252

[...truncated 43 lines...]
   [junit4] Suite: org.apache.solr.handler.RequestLoggingTest
   [junit4]   2> 15913 INFO  (SUITE-RequestLoggingTest-seed#[2A0D120E25F7C83E]-worker) [    ] o.a.s.SolrTestCaseJ4 SecureRandom sanity checks: test.solr.allowed.securerandom=null & java.security.egd=file:/dev/./urandom
   [junit4]   2> Creating dataDir: C:\Users\jenkins\workspace\Lucene-Solr-7.x-Windows\solr\build\solr-core\test\J0\temp\solr.handler.RequestLoggingTest_2A0D120E25F7C83E-001\init-core-data-001
   [junit4]   2> 15914 WARN  (SUITE-RequestLoggingTest-seed#[2A0D120E25F7C83E]-worker) [    ] o.a.s.SolrTestCaseJ4 startTrackingSearchers: numOpens=1 numCloses=1
   [junit4]   2> 15914 INFO  (SUITE-RequestLoggingTest-seed#[2A0D120E25F7C83E]-worker) [    ] o.a.s.SolrTestCaseJ4 Using PointFields (NUMERIC_POINTS_SYSPROP=true) w/NUMERIC_DOCVALUES_SYSPROP=false
   [junit4]   2> 15916 INFO  (SUITE-RequestLoggingTest-seed#[2A0D120E25F7C83E]-worker) [    ] o.a.s.SolrTestCaseJ4 Randomized ssl (false) and clientAuth (false) via: @org.apache.solr.util.RandomizeSSL(reason="", value=0.0/0.0, ssl=0.0/0.0, clientAuth=0.0/0.0)
   [junit4]   2> 15916 INFO  (SUITE-RequestLoggingTest-seed#[2A0D120E25F7C83E]-worker) [    ] o.a.s.SolrTestCaseJ4 ####initCore
   [junit4]   2> 15918 INFO  (SUITE-RequestLoggingTest-seed#[2A0D120E25F7C83E]-worker) [    ] o.a.s.c.SolrResourceLoader [null] Added 2 libs to classloader, from paths: [/C:/Users/jenkins/workspace/Lucene-Solr-7.x-Windows/solr/core/src/test-files/solr/collection1/lib, /C:/Users/jenkins/workspace/Lucene-Solr-7.x-Windows/solr/core/src/test-files/solr/collection1/lib/classes]
   [junit4]   2> 15959 INFO  (SUITE-RequestLoggingTest-seed#[2A0D120E25F7C83E]-worker) [    ] o.a.s.c.SolrConfig Using Lucene MatchVersion: 7.5.0
   [junit4]   2> 15981 INFO  (SUITE-RequestLoggingTest-seed#[2A0D120E25F7C83E]-worker) [    ] o.a.s.s.IndexSchema [null] Schema name=test
   [junit4]   2> 16127 INFO  (SUITE-RequestLoggingTest-seed#[2A0D120E25F7C83E]-worker) [    ] o.a.s.s.IndexSchema Loaded schema test/1.0 with uniqueid field id
   [junit4]   2> 16326 INFO  (SUITE-RequestLoggingTest-seed#[2A0D120E25F7C83E]-worker) [    ] o.a.s.c.TransientSolrCoreCacheDefault Allocating transient cache for 2147483647 transient cores
   [junit4]   2> 16327 INFO  (SUITE-RequestLoggingTest-seed#[2A0D120E25F7C83E]-worker) [    ] o.a.s.h.a.MetricsHistoryHandler No .system collection, keeping metrics history in memory.
   [junit4]   2> 16343 INFO  (SUITE-RequestLoggingTest-seed#[2A0D120E25F7C83E]-worker) [    ] o.a.s.m.r.SolrJmxReporter JMX monitoring for 'solr.node' (registry 'solr.node') enabled at server: com.sun.jmx.mbeanserver.JmxMBeanServer@1487c47b
   [junit4]   2> 16343 INFO  (SUITE-RequestLoggingTest-seed#[2A0D120E25F7C83E]-worker) [    ] o.a.s.m.r.SolrJmxReporter JMX monitoring for 'solr.jvm' (registry 'solr.jvm') enabled at server: com.sun.jmx.mbeanserver.JmxMBeanServer@1487c47b
   [junit4]   2> 16343 INFO  (SUITE-RequestLoggingTest-seed#[2A0D120E25F7C83E]-worker) [    ] o.a.s.m.r.SolrJmxReporter JMX monitoring for 'solr.jetty' (registry 'solr.jetty') enabled at server: com.sun.jmx.mbeanserver.JmxMBeanServer@1487c47b
   [junit4]   2> 16345 INFO  (coreLoadExecutor-25-thread-1) [    x:collection1] o.a.s.c.SolrResourceLoader [null] Added 2 libs to classloader, from paths: [/C:/Users/jenkins/workspace/Lucene-Solr-7.x-Windows/solr/core/src/test-files/solr/collection1/lib, /C:/Users/jenkins/workspace/Lucene-Solr-7.x-Windows/solr/core/src/test-files/solr/collection1/lib/classes]
   [junit4]   2> 16381 INFO  (coreLoadExecutor-25-thread-1) [    x:collection1] o.a.s.c.SolrConfig Using Lucene MatchVersion: 7.5.0
   [junit4]   2> 16403 INFO  (coreLoadExecutor-25-thread-1) [    x:collection1] o.a.s.s.IndexSchema [collection1] Schema name=test
   [junit4]   2> 16477 INFO  (coreLoadExecutor-25-thread-1) [    x:collection1] o.a.s.s.IndexSchema Loaded schema test/1.0 with uniqueid field id
   [junit4]   2> 16495 INFO  (coreLoadExecutor-25-thread-1) [    x:collection1] o.a.s.c.CoreContainer Creating SolrCore 'collection1' using configuration from instancedir C:\Users\jenkins\workspace\Lucene-Solr-7.x-Windows\solr\core\src\test-files\solr\collection1, trusted=true
   [junit4]   2> 16496 INFO  (coreLoadExecutor-25-thread-1) [    x:collection1] o.a.s.m.r.SolrJmxReporter JMX monitoring for 'solr.core.collection1' (registry 'solr.core.collection1') enabled at server: com.sun.jmx.mbeanserver.JmxMBeanServer@1487c47b
   [junit4]   2> 16496 INFO  (coreLoadExecutor-25-thread-1) [    x:collection1] o.a.s.c.SolrCore solr.RecoveryStrategy.Builder
   [junit4]   2> 16496 INFO  (coreLoadExecutor-25-thread-1) [    x:collection1] o.a.s.c.SolrCore [[collection1] ] Opening new SolrCore at [C:\Users\jenkins\workspace\Lucene-Solr-7.x-Windows\solr\core\src\test-files\solr\collection1], dataDir=[C:\Users\jenkins\workspace\Lucene-Solr-7.x-Windows\solr\build\solr-core\test\J0\temp\solr.handler.RequestLoggingTest_2A0D120E25F7C83E-001\init-core-data-001\]
   [junit4]   2> 16498 INFO  (coreLoadExecutor-25-thread-1) [    x:collection1] o.a.s.u.RandomMergePolicy RandomMergePolicy wrapping class org.apache.lucene.index.LogByteSizeMergePolicy: [LogByteSizeMergePolicy: minMergeSize=1677721, mergeFactor=16, maxMergeSize=2147483648, maxMergeSizeForForcedMerge=9223372036854775807, calibrateSizeByDeletes=false, maxMergeDocs=2147483647, maxCFSSegmentSizeMB=8.796093022207999E12, noCFSRatio=0.0]
   [junit4]   2> 16641 INFO  (coreLoadExecutor-25-thread-1) [    x:collection1] o.a.s.u.UpdateHandler Using UpdateLog implementation: org.apache.solr.update.UpdateLog
   [junit4]   2> 16641 INFO  (coreLoadExecutor-25-thread-1) [    x:collection1] o.a.s.u.UpdateLog Initializing UpdateLog: dataDir= defaultSyncLevel=FLUSH numRecordsToKeep=100 maxNumLogsToKeep=10 numVersionBuckets=65536
   [junit4]   2> 16643 INFO  (coreLoadExecutor-25-thread-1) [    x:collection1] o.a.s.u.CommitTracker Hard AutoCommit: disabled
   [junit4]   2> 16643 INFO  (coreLoadExecutor-25-thread-1) [    x:collection1] o.a.s.u.CommitTracker Soft AutoCommit: disabled
   [junit4]   2> 16644 INFO  (coreLoadExecutor-25-thread-1) [    x:collection1] o.a.s.u.RandomMergePolicy RandomMergePolicy wrapping class org.apache.lucene.index.TieredMergePolicy: [TieredMergePolicy: maxMergeAtOnce=31, maxMergeAtOnceExplicit=43, maxMergedSegmentMB=17.8173828125, floorSegmentMB=1.6103515625, forceMergeDeletesPctAllowed=6.096856967838161, segmentsPerTier=30.0, maxCFSSegmentSizeMB=8.796093022207999E12, noCFSRatio=0.0, deletesPctAllowed=29.725323755564027
   [junit4]   2> 16656 INFO  (coreLoadExecutor-25-thread-1) [    x:collection1] o.a.s.s.SolrIndexSearcher Opening [Searcher@7e185a7a[collection1] main]
   [junit4]   2> 16658 INFO  (coreLoadExecutor-25-thread-1) [    x:collection1] o.a.s.h.c.SpellCheckComponent Initializing spell checkers
   [junit4]   2> 16747 INFO  (coreLoadExecutor-25-thread-1) [    x:collection1] o.a.s.s.DirectSolrSpellChecker init: {name=direct,classname=DirectSolrSpellChecker,field=lowerfilt,minQueryLength=3}
   [junit4]   2> 16832 INFO  (coreLoadExecutor-25-thread-1) [    x:collection1] o.a.s.h.ReplicationHandler Commits will be reserved for 10000ms.
   [junit4]   2> 16833 INFO  (searcherExecutor-26-thread-1-processing-x:collection1) [    x:collection1] o.a.s.h.c.SpellCheckComponent Loading spell index for spellchecker: default
   [junit4]   2> 16835 INFO  (coreLoadExecutor-25-thread-1) [    x:collection1] o.a.s.u.UpdateLog Could not find max version in index or recent updates, using new clock 1610497124304158720
   [junit4]   2> 16839 INFO  (searcherExecutor-26-thread-1-processing-x:collection1) [    x:collection1] o.a.s.h.c.SpellCheckComponent Loading spell index for spellchecker: direct
   [junit4]   2> 16839 INFO  (searcherExecutor-26-thread-1-processing-x:collection1) [    x:collection1] o.a.s.h.c.SpellCheckComponent Loading spell index for spellchecker: wordbreak
   [junit4]   2> 16839 INFO  (searcherExecutor-26-thread-1-processing-x:collection1) [    x:collection1] o.a.s.h.c.SpellCheckComponent Loading spell index for spellchecker: multipleFields
   [junit4]   2> 16840 INFO  (SUITE-RequestLoggingTest-seed#[2A0D120E25F7C83E]-worker) [    ] o.a.s.SolrTestCaseJ4 ####initCore end
   [junit4]   2> 16841 INFO  (searcherExecutor-26-thread-1-processing-x:collection1) [    x:collection1] o.a.s.h.c.SpellCheckComponent Loading spell index for spellchecker: jarowinkler
   [junit4]   2> 16844 INFO  (TEST-RequestLoggingTest.testLogBeforeExecuteWithRequestLogger-seed#[2A0D120E25F7C83E]) [    ] o.a.s.SolrTestCaseJ4 ###Starting testLogBeforeExecuteWithRequestLogger
   [junit4]   2> 16846 DEBUG (TEST-RequestLoggingTest.testLogBeforeExecuteWithRequestLogger-seed#[2A0D120E25F7C83E]) [    ] o.a.s.c.S.Request [collection1]  webapp=null path=null params={q=*:*&wt=xml}
   [junit4]   2> 16846 DEBUG (TEST-RequestLoggingTest.testLogBeforeExecuteWithRequestLogger-seed#[2A0D120E25F7C83E]) [    ] o.a.s.h.c.SearchHandler Adding  component:org.apache.solr.handler.component.QueryComponent@afe618c
   [junit4]   2> 16846 DEBUG (TEST-RequestLoggingTest.testLogBeforeExecuteWithRequestLogger-seed#[2A0D120E25F7C83E]) [    ] o.a.s.h.c.SearchHandler Adding  component:org.apache.solr.handler.component.FacetComponent@6920f269
   [junit4]   2> 16846 DEBUG (TEST-RequestLoggingTest.testLogBeforeExecuteWithRequestLogger-seed#[2A0D120E25F7C83E]) [    ] o.a.s.h.c.SearchHandler Adding  component:org.apache.solr.search.facet.FacetModule@12d0285b
   [junit4]   2> 16846 DEBUG (TEST-RequestLoggingTest.testLogBeforeExecuteWithRequestLogger-seed#[2A0D120E25F7C83E]) [    ] o.a.s.h.c.SearchHandler Adding  component:org.apache.solr.handler.component.MoreLikeThisComponent@40d16336
   [junit4]   2> 16847 DEBUG (TEST-RequestLoggingTest.testLogBeforeExecuteWithRequestLogger-seed#[2A0D120E25F7C83E]) [    ] o.a.s.h.c.SearchHandler Adding  component:org.apache.solr.handler.component.HighlightComponent@39da88a1
   [junit4]   2> 16847 DEBUG (TEST-RequestLoggingTest.testLogBeforeExecuteWithRequestLogger-seed#[2A0D120E25F7C83E]) [    ] o.a.s.h.c.SearchHandler Adding  component:org.apache.solr.handler.component.StatsComponent@57078649
   [junit4]   2> 16847 DEBUG (TEST-RequestLoggingTest.testLogBeforeExecuteWithRequestLogger-seed#[2A0D120E25F7C83E]) [    ] o.a.s.h.c.SearchHandler Adding  component:org.apache.solr.handler.component.ExpandComponent@4406ee02
   [junit4]   2> 16847 DEBUG (TEST-RequestLoggingTest.testLogBeforeExecuteWithRequestLogger-seed#[2A0D120E25F7C83E]) [    ] o.a.s.h.c.SearchHandler Adding  component:org.apache.solr.handler.component.TermsComponent@f85ed67
   [junit4]   2> 16847 DEBUG (TEST-RequestLoggingTest.testLogBeforeExecuteWithRequestLogger-seed#[2A0D120E25F7C83E]) [    ] o.a.s.h.c.SearchHandler Adding  debug component:org.apache.solr.handler.component.DebugComponent@62f7e3b6
   [junit4]   2> 16847 DEBUG (TEST-RequestLoggingTest.testLogBeforeExecuteWithRequestLogger-seed#[2A0D120E25F7C83E]) [    ] o.a.s.h.c.QueryComponent process: q=*:*&df=text&wt=xml&indent=off
   [junit4]   2> 16847 DEBUG (TEST-RequestLoggingTest.testLogBeforeExecuteWithRequestLogger-seed#[2A0D120E25F7C83E]) [    ] o.a.s.s.s.LocalStatsCache ## GET LocalSolrQueryRequest{q=*:*&df=text&wt=xml&indent=off}
   [junit4]   2> 16849 INFO  (searcherExecutor-26-thread-1-processing-x:collection1) [    x:collection1] o.a.s.h.c.SpellCheckComponent Loading spell index for spellchecker: external
   [junit4]   2> 16852 INFO  (searcherExecutor-26-thread-1-processing-x:collection1) [    x:collection1] o.a.s.h.c.SpellCheckComponent Loading spell index for spellchecker: freq
   [junit4]   2> 16861 INFO  (searcherExecutor-26-thread-1-processing-x:collection1) [    x:collection1] o.a.s.h.c.SpellCheckComponent Loading spell index for spellchecker: fqcn
   [junit4]   2> 16863 INFO  (searcherExecutor-26-thread-1-processing-x:collection1) [    x:collection1] o.a.s.h.c.SpellCheckComponent Loading spell index for spellchecker: perDict
   [junit4]   2> 16865 DEBUG (searcherExecutor-26-thread-1-processing-x:collection1) [    x:collection1] o.a.s.m.r.j.JmxMetricsReporter ## registered solr:category=CACHE,dom1=core,dom2=collection1,name=fieldValueCache,scope=searcher, tag=679ad86d
   [junit4]   2> 16865 DEBUG (searcherExecutor-26-thread-1-processing-x:collection1) [    x:collection1] o.a.s.m.r.j.JmxMetricsReporter ## registered solr:category=CACHE,dom1=core,dom2=collection1,name=filterCache,scope=searcher, tag=679ad86d
   [junit4]   2> 16865 DEBUG (searcherExecutor-26-thread-1-processing-x:collection1) [    x:collection1] o.a.s.m.r.j.JmxMetricsReporter ## registered solr:category=CACHE,dom1=core,dom2=collection1,name=queryResultCache,scope=searcher, tag=679ad86d
   [junit4]   2> 16865 DEBUG (searcherExecutor-26-thread-1-processing-x:collection1) [    x:collection1] o.a.s.m.r.j.JmxMetricsReporter ## registered solr:category=CACHE,dom1=core,dom2=collection1,name=documentCache,scope=searcher, tag=679ad86d
   [junit4]   2> 16866 DEBUG (searcherExecutor-26-thread-1-processing-x:collection1) [    x:collection1] o.a.s.m.r.j.JmxMetricsReporter ## registered solr:category=CACHE,dom1=core,dom2=collection1,name=perSegFilter,scope=searcher, tag=679ad86d
   [junit4]   2> 16867 DEBUG (searcherExecutor-26-thread-1-processing-x:collection1) [    x:collection1] o.a.s.m.r.j.JmxMetricsReporter ## registered solr:category=SEARCHER,dom1=core,dom2=collection1,name=searcherName,scope=searcher, tag=679ad86d
   [junit4]   2> 16867 DEBUG (searcherExecutor-26-thread-1-processing-x:collection1) [    x:collection1] o.a.s.m.r.j.JmxMetricsReporter ## registered solr:category=SEARCHER,dom1=core,dom2=collection1,name=caching,scope=searcher, tag=679ad86d
   [junit4]   2> 16867 DEBUG (searcherExecutor-26-thread-1-processing-x:collection1) [    x:collection1] o.a.s.m.r.j.JmxMetricsReporter ## registered solr:category=SEARCHER,dom1=core,dom2=collection1,name=openedAt,scope=searcher, tag=679ad86d
   [junit4]   2> 16868 DEBUG (searcherExecutor-26-thread-1-processing-x:collection1) [    x:collection1] o.a.s.m.r.j.JmxMetricsReporter ## registered solr:category=SEARCHER,dom1=core,dom2=collection1,name=warmupTime,scope=searcher, tag=679ad86d
   [junit4]   2> 16868 DEBUG (searcherExecutor-26-thread-1-processing-x:collection1) [    x:collection1] o.a.s.m.r.j.JmxMetricsReporter ## registered solr:category=SEARCHER,dom1=core,dom2=collection1,name=registeredAt,scope=searcher, tag=679ad86d
   [junit4]   2> 16869 DEBUG (searcherExecutor-26-thread-1-processing-x:collection1) [    x:collection1] o.a.s.m.r.j.JmxMetricsReporter ## registered solr:category=SEARCHER,dom1=core,dom2=collection1,name=numDocs,scope=searcher, tag=679ad86d
   [junit4]   2> 16869 DEBUG (searcherExecutor-26-thread-1-processing-x:collection1) [    x:collection1] o.a.s.m.r.j.JmxMetricsReporter ## registered solr:category=SEARCHER,dom1=core,dom2=collection1,name=maxDoc,scope=searcher, tag=679ad86d
   [junit4]   2> 16877 DEBUG (searcherExecutor-26-thread-1-processing-x:collection1) [    x:collection1] o.a.s.m.r.j.JmxMetricsReporter ## registered solr:category=SEARCHER,dom1=core,dom2=collection1,name=deletedDocs,scope=searcher, tag=679ad86d
   [junit4]   2> 16877 DEBUG (searcherExecutor-26-thread-1-processing-x:collection1) [    x:collection1] o.a.s.m.r.j.JmxMetricsReporter ## registered solr:category=SEARCHER,dom1=core,dom2=collection1,name=reader,scope=searcher, tag=679ad86d
   [junit4]   2> 16878 DEBUG (searcherExecutor-26-thread-1-processing-x:collection1) [    x:collection1] o.a.s.m.r.j.JmxMetricsReporter ## registered solr:category=SEARCHER,dom1=core,dom2=collection1,name=readerDir,scope=searcher, tag=679ad86d
   [junit4]   2> 16878 DEBUG (searcherExecutor-26-thread-1-processing-x:collection1) [    x:collection1] o.a.s.m.r.j.JmxMetricsReporter ## registered solr:category=SEARCHER,dom1=core,dom2=collection1,name=indexVersion,scope=searcher, tag=679ad86d
   [junit4]   2> 16878 INFO  (searcherExecutor-26-thread-1-processing-x:collection1) [    x:collection1] o.a.s.c.SolrCore [collection1] Registered new searcher Searcher@7e185a7a[collection1] main{ExitableDirectoryReader(UninvertingDirectoryReader())}
   [junit4] OK      0.04s J0 | RequestLoggingTest.testLogBeforeExecuteWithRequestLogger
   [junit4]   2> 16878 INFO  (TEST-RequestLoggingTest.testLogBeforeExecuteWithRequestLogger-seed#[2A0D120E25F7C83E]) [    ] o.a.s.c.S.Request [collection1]  webapp=null path=null params={q=*:*&wt=xml} hits=0 status=0 QTime=32
   [junit4]   2> 16879 INFO  (TEST-RequestLoggingTest.testLogBeforeExecuteWithRequestLogger-seed#[2A0D120E25F7C83E]) [    ] o.a.s.SolrTestCaseJ4 ###Ending testLogBeforeExecuteWithRequestLogger
   [junit4]   2> 16934 INFO  (TEST-RequestLoggingTest.testLogBeforeExecuteWithCoreLogger-seed#[2A0D120E25F7C83E]) [    ] o.a.s.SolrTestCaseJ4 ###Starting testLogBeforeExecuteWithCoreLogger
   [junit4]   2> 16941 DEBUG (TEST-RequestLoggingTest.testLogBeforeExecuteWithCoreLogger-seed#[2A0D120E25F7C83E]) [    ] o.a.s.c.S.Request [collection1]  webapp=null path=null params={q=*:*&wt=xml}
   [junit4]   2> 16942 DEBUG (TEST-RequestLoggingTest.testLogBeforeExecuteWithCoreLogger-seed#[2A0D120E25F7C83E]) [    ] o.a.s.h.c.QueryComponent process: q=*:*&df=text&wt=xml&indent=off
   [junit4]   2> 16942 DEBUG (TEST-RequestLoggingTest.testLogBeforeExecuteWithCoreLogger-seed#[2A0D120E25F7C83E]) [    ] o.a.s.s.s.LocalStatsCache ## GET LocalSolrQueryRequest{q=*:*&df=text&wt=xml&indent=off}
   [junit4]   2> 16942 INFO  (TEST-RequestLoggingTest.testLogBeforeExecuteWithCoreLogger-seed#[2A0D120E25F7C83E]) [    ] o.a.s.c.S.Request [collection1]  webapp=null path=null params={q=*:*&wt=xml} hits=0 status=0 QTime=0
   [junit4]   2> 16943 INFO  (TEST-RequestLoggingTest.testLogBeforeExecuteWithCoreLogger-seed#[2A0D120E25F7C83E]) [    ] o.a.s.SolrTestCaseJ4 ###Ending testLogBeforeExecuteWithCoreLogger
   [junit4]   2> NOTE: reproduce with: ant test  -Dtestcase=RequestLoggingTest -Dtests.method=testLogBeforeExecuteWithCoreLogger -Dtests.seed=2A0D120E25F7C83E -Dtests.slow=true -Dtests.badapples=true -Dtests.locale=ur -Dtests.timezone=America/Maceio -Dtests.asserts=true -Dtests.file.encoding=Cp1252
   [junit4] FAILURE 0.08s J0 | RequestLoggingTest.testLogBeforeExecuteWithCoreLogger <<<
   [junit4]    > Throwable #1: java.lang.AssertionError
   [junit4]    > 	at __randomizedtesting.SeedInfo.seed([2A0D120E25F7C83E:E68B1280DB3EA3A8]:0)
   [junit4]    > 	at org.apache.solr.handler.RequestLoggingTest.testLogBeforeExecute(RequestLoggingTest.java:88)
   [junit4]    > 	at org.apache.solr.handler.RequestLoggingTest.testLogBeforeExecuteWithCoreLogger(RequestLoggingTest.java:65)
   [junit4]    > 	at java.base/jdk.internal.reflect.NativeMethodAccessorImpl.invoke0(Native Method)
   [junit4]    > 	at java.base/jdk.internal.reflect.NativeMethodAccessorImpl.invoke(NativeMethodAccessorImpl.java:62)
   [junit4]    > 	at java.base/jdk.internal.reflect.DelegatingMethodAccessorImpl.invoke(DelegatingMethodAccessorImpl.java:43)
   [junit4]    > 	at java.base/java.lang.reflect.Method.invoke(Method.java:564)
   [junit4]    > 	at java.base/java.lang.Thread.run(Thread.java:844)
   [junit4]   2> 16956 INFO  (SUITE-RequestLoggingTest-seed#[2A0D120E25F7C83E]-worker) [    ] o.a.s.SolrTestCaseJ4 ###deleteCore
   [junit4]   2> 16956 INFO  (SUITE-RequestLoggingTest-seed#[2A0D120E25F7C83E]-worker) [    ] o.a.s.c.CoreContainer Shutting down CoreContainer instance=185570132
   [junit4]   2> 16956 INFO  (SUITE-RequestLoggingTest-seed#[2A0D120E25F7C83E]-worker) [    ] o.a.s.m.SolrMetricManager Closing metric reporters for registry=solr.node, tag=null
   [junit4]   2> 16956 INFO  (SUITE-RequestLoggingTest-seed#[2A0D120E25F7C83E]-worker) [    ] o.a.s.m.r.SolrJmxReporter Closing reporter [org.apache.solr.metrics.reporters.SolrJmxReporter@7268ceb3: rootName = null, domain = solr.node, service url = null, agent id = null] for registry solr.node / com.codahale.metrics.MetricRegistry@1fb457f2
   [junit4]   2> 16975 INFO  (SUITE-RequestLoggingTest-seed#[2A0D120E25F7C83E]-worker) [    ] o.a.s.m.SolrMetricManager Closing metric reporters for registry=solr.jvm, tag=null
   [junit4]   2> 16975 INFO  (SUITE-RequestLoggingTest-seed#[2A0D120E25F7C83E]-worker) [    ] o.a.s.m.r.SolrJmxReporter Closing reporter [org.apache.solr.metrics.reporters.SolrJmxReporter@3e390c50: rootName = null, domain = solr.jvm, service url = null, agent id = null] for registry solr.jvm / com.codahale.metrics.MetricRegistry@bf449ac
   [junit4]   2> 16975 INFO  (SUITE-RequestLoggingTest-seed#[2A0D120E25F7C83E]-worker) [    ] o.a.s.m.SolrMetricManager Closing metric reporters for registry=solr.jetty, tag=null
   [junit4]   2> 16975 INFO  (SUITE-RequestLoggingTest-seed#[2A0D120E25F7C83E]-worker) [    ] o.a.s.m.r.SolrJmxReporter Closing reporter [org.apache.solr.metrics.reporters.SolrJmxReporter@4fd06134: rootName = null, domain = solr.jetty, service url = null, agent id = null] for registry solr.jetty / com.codahale.metrics.MetricRegistry@2ed0a4fb
   [junit4]   2> 17040 INFO  (coreCloseExecutor-31-thread-1) [    x:collection1] o.a.s.c.SolrCore [collection1]  CLOSING SolrCore org.apache.solr.core.SolrCore@1b151be3
   [junit4]   2> 17041 INFO  (coreCloseExecutor-31-thread-1) [    x:collection1] o.a.s.m.SolrMetricManager Closing metric reporters for registry=solr.core.collection1, tag=1b151be3
   [junit4]   2> 17041 INFO  (coreCloseExecutor-31-thread-1) [    x:collection1] o.a.s.m.r.SolrJmxReporter Closing reporter [org.apache.solr.metrics.reporters.SolrJmxReporter@679ad86d: rootName = null, domain = solr.core.collection1, service url = null, agent id = null] for registry solr.core.collection1 / com.codahale.metrics.MetricRegistry@5c248a78
   [junit4]   2> NOTE: leaving temporary files on disk at: C:\Users\jenkins\workspace\Lucene-Solr-7.x-Windows\solr\build\solr-core\test\J0\temp\solr.handler.RequestLoggingTest_2A0D120E25F7C83E-001
   [junit4]   2> NOTE: test params are: codec=Asserting(Lucene70): {}, docValues:{}, maxPointsInLeafNode=58, maxMBSortInHeap=5.068270964106848, sim=RandomSimilarity(queryNorm=true): {}, locale=ur, timezone=America/Maceio
   [junit4]   2> NOTE: Windows 10 10.0 amd64/Oracle Corporation 10.0.1 (64-bit)/cpus=3,threads=1,free=32310712,total=97386496
   [junit4]   2> NOTE: All tests run in this JVM: [RequestLoggingTest, RequestLoggingTest]
   [junit4] Completed [3/5 (1!)] on J0 in 1.17s, 2 tests, 1 failure <<< FAILURES!

[...truncated 1 lines...]
   [junit4] Suite: org.apache.solr.handler.RequestLoggingTest
   [junit4]   2> 16676 INFO  (SUITE-RequestLoggingTest-seed#[2A0D120E25F7C83E]-worker) [    ] o.a.s.SolrTestCaseJ4 SecureRandom sanity checks: test.solr.allowed.securerandom=null & java.security.egd=file:/dev/./urandom
   [junit4]   2> Creating dataDir: C:\Users\jenkins\workspace\Lucene-Solr-7.x-Windows\solr\build\solr-core\test\J1\temp\solr.handler.RequestLoggingTest_2A0D120E25F7C83E-001\init-core-data-001
   [junit4]   2> 16737 WARN  (SUITE-RequestLoggingTest-seed#[2A0D120E25F7C83E]-worker) [    ] o.a.s.SolrTestCaseJ4 startTrackingSearchers: numOpens=1 numCloses=1
   [junit4]   2> 16737 INFO  (SUITE-RequestLoggingTest-seed#[2A0D120E25F7C83E]-worker) [    ] o.a.s.SolrTestCaseJ4 Using PointFields (NUMERIC_POINTS_SYSPROP=true) w/NUMERIC_DOCVALUES_SYSPROP=false
   [junit4]   2> 16739 INFO  (SUITE-RequestLoggingTest-seed#[2A0D120E25F7C83E]-worker) [    ] o.a.s.SolrTestCaseJ4 Randomized ssl (false) and clientAuth (false) via: @org.apache.solr.util.RandomizeSSL(reason="", value=0.0/0.0, ssl=0.0/0.0, clientAuth=0.0/0.0)
   [junit4]   2> 16739 INFO  (SUITE-RequestLoggingTest-seed#[2A0D120E25F7C83E]-worker) [    ] o.a.s.SolrTestCaseJ4 ####initCore
   [junit4]   2> 16741 INFO  (SUITE-RequestLoggingTest-seed#[2A0D120E25F7C83E]-worker) [    ] o.a.s.c.SolrResourceLoader [null] Added 2 libs to classloader, from paths: [/C:/Users/jenkins/workspace/Lucene-Solr-7.x-Windows/solr/core/src/test-files/solr/collection1/lib, /C:/Users/jenkins/workspace/Lucene-Solr-7.x-Windows/solr/core/src/test-files/solr/collection1/lib/classes]
   [junit4]   2> 16770 INFO  (SUITE-RequestLoggingTest-seed#[2A0D120E25F7C83E]-worker) [    ] o.a.s.c.SolrConfig Using Lucene MatchVersion: 7.5.0
   [junit4]   2> 16795 INFO  (SUITE-RequestLoggingTest-seed#[2A0D120E25F7C83E]-worker) [    ] o.a.s.s.IndexSchema [null] Schema name=test
   [junit4]   2> 16903 INFO  (SUITE-RequestLoggingTest-seed#[2A0D120E25F7C83E]-worker) [    ] o.a.s.s.IndexSchema Loaded schema test/1.0 with uniqueid field id
   [junit4]   2> 17095 INFO  (SUITE-RequestLoggingTest-seed#[2A0D120E25F7C83E]-worker) [    ] o.a.s.c.TransientSolrCoreCacheDefault Allocating transient cache for 2147483647 transient cores
   [junit4]   2> 17095 INFO  (SUITE-RequestLoggingTest-seed#[2A0D120E25F7C83E]-worker) [    ] o.a.s.h.a.MetricsHistoryHandler No .system collection, keeping metrics history in memory.
   [junit4]   2> 17111 INFO  (SUITE-RequestLoggingTest-seed#[2A0D120E25F7C83E]-worker) [    ] o.a.s.m.r.SolrJmxReporter JMX monitoring for 'solr.node' (registry 'solr.node') enabled at server: com.sun.jmx.mbeanserver.JmxMBeanServer@6b949477
   [junit4]   2> 17112 INFO  (SUITE-RequestLoggingTest-seed#[2A0D120E25F7C83E]-worker) [    ] o.a.s.m.r.SolrJmxReporter JMX monitoring for 'solr.jvm' (registry 'solr.jvm') enabled at server: com.sun.jmx.mbeanserver.JmxMBeanServer@6b949477
   [junit4]   2> 17112 INFO  (SUITE-RequestLoggingTest-seed#[2A0D120E25F7C83E]-worker) [    ] o.a.s.m.r.SolrJmxReporter JMX monitoring for 'solr.jetty' (registry 'solr.jetty') enabled at server: com.sun.jmx.mbeanserver.JmxMBeanServer@6b949477
   [junit4]   2> 17114 INFO  (coreLoadExecutor-25-thread-1) [    x:collection1] o.a.s.c.SolrResourceLoader [null] Added 2 libs to classloader, from paths: [/C:/Users/jenkins/workspace/Lucene-Solr-7.x-Windows/solr/core/src/test-files/solr/collection1/lib, /C:/Users/jenkins/workspace/Lucene-Solr-7.x-Windows/solr/core/src/test-files/solr/collection1/lib/classes]
   [junit4]   2> 17148 INFO  (coreLoadExecutor-25-thread-1) [    x:collection1] o.a.s.c.SolrConfig Using Lucene MatchVersion: 7.5.0
   [junit4]   2> 17172 INFO  (coreLoadExecutor-25-thread-1) [    x:collection1] o.a.s.s.IndexSchema [collection1] Schema name=test
   [junit4]   2> 17259 INFO  (coreLoadExecutor-25-thread-1) [    x:collection1] o.a.s.s.IndexSchema Loaded schema test/1.0 with uniqueid field id
   [junit4]   2> 17275 INFO  (coreLoadExecutor-25-thread-1) [    x:collection1] o.a.s.c.CoreContainer Creating SolrCore 'collection1' using configuration from instancedir C:\Users\jenkins\workspace\Lucene-Solr-7.x-Windows\solr\core\src\test-files\solr\collection1, trusted=true
   [junit4]   2> 17276 INFO  (coreLoadExecutor-25-thread-1) [    x:collection1] o.a.s.m.r.SolrJmxReporter JMX monitoring for 'solr.core.collection1' (registry 'solr.core.collection1') enabled at server: com.sun.jmx.mbeanserver.JmxMBeanServer@6b949477
   [junit4]   2> 17276 INFO  (coreLoadExecutor-25-thread-1) [    x:collection1] o.a.s.c.SolrCore solr.RecoveryStrategy.Builder
   [junit4]   2> 17276 INFO  (coreLoadExecutor-25-thread-1) [    x:collection1] o.a.s.c.SolrCore [[collection1] ] Opening new SolrCore at [C:\Users\jenkins\workspace\Lucene-Solr-7.x-Windows\solr\core\src\test-files\solr\collection1], dataDir=[C:\Users\jenkins\workspace\Lucene-Solr-7.x-Windows\solr\build\solr-core\test\J1\temp\solr.handler.RequestLoggingTest_2A0D120E25F7C83E-001\init-core-data-001\]
   [junit4]   2> 17277 INFO  (coreLoadExecutor-25-thread-1) [    x:collection1] o.a.s.u.RandomMergePolicy RandomMergePolicy wrapping class org.apache.lucene.index.LogByteSizeMergePolicy: [LogByteSizeMergePolicy: minMergeSize=1677721, mergeFactor=16, maxMergeSize=2147483648, maxMergeSizeForForcedMerge=9223372036854775807, calibrateSizeByDeletes=false, maxMergeDocs=2147483647, maxCFSSegmentSizeMB=8.796093022207999E12, noCFSRatio=0.0]
   [junit4]   2> 17463 INFO  (coreLoadExecutor-25-thread-1) [    x:collection1] o.a.s.u.UpdateHandler Using UpdateLog implementation: org.apache.solr.update.UpdateLog
   [junit4]   2> 17463 INFO  (coreLoadExecutor-25-thread-1) [    x:collection1] o.a.s.u.UpdateLog Initializing UpdateLog: dataDir= defaultSyncLevel=FLUSH numRecordsToKeep=100 maxNumLogsToKeep=10 numVersionBuckets=65536
   [junit4]   2> 17465 INFO  (coreLoadExecutor-25-thread-1) [    x:collection1] o.a.s.u.CommitTracker Hard AutoCommit: disabled
   [junit4]   2> 17465 INFO  (coreLoadExecutor-25-thread-1) [    x:collection1] o.a.s.u.CommitTracker Soft AutoCommit: disabled
   [junit4]   2> 17522 INFO  (coreLoadExecutor-25-thread-1) [    x:collection1] o.a.s.u.RandomMergePolicy RandomMergePolicy wrapping class org.apache.lucene.index.TieredMergePolicy: [TieredMergePolicy: maxMergeAtOnce=31, maxMergeAtOnceExplicit=43, maxMergedSegmentMB=17.8173828125, floorSegmentMB=1.6103515625, forceMergeDeletesPctAllowed=6.096856967838161, segmentsPerTier=30.0, maxCFSSegmentSizeMB=8.796093022207999E12, noCFSRatio=0.0, deletesPctAllowed=29.725323755564027
   [junit4]   2> 17524 INFO  (coreLoadExecutor-25-thread-1) [    x:collection1] o.a.s.s.SolrIndexSearcher Opening [Searcher@7c967c50[collection1] main]
   [junit4]   2> 17526 INFO  (coreLoadExecutor-25-thread-1) [    x:collection1] o.a.s.h.c.SpellCheckComponent Initializing spell checkers
   [junit4]   2> 17740 INFO  (coreLoadExecutor-25-thread-1) [    x:collection1] o.a.s.s.DirectSolrSpellChecker init: {name=direct,classname=DirectSolrSpellChecker,field=lowerfilt,minQueryLength=3}
   [junit4]   2> 17826 INFO  (coreLoadExecutor-25-thread-1) [    x:collection1] o.a.s.h.ReplicationHandler Commits will be reserved for 10000ms.
   [junit4]   2> 17826 INFO  (searcherExecutor-26-thread-1-processing-x:collection1) [    x:collection1] o.a.s.h.c.SpellCheckComponent Loading spell index for spellchecker: default
   [junit4]   2> 17828 INFO  (coreLoadExecutor-25-thread-1) [    x:collection1] o.a.s.u.UpdateLog Could not find max version in index or recent updates, using new clock 1610497125345394688
   [junit4]   2> 17836 INFO  (SUITE-RequestLoggingTest-seed#[2A0D120E25F7C83E]-worker) [    ] o.a.s.SolrTestCaseJ4 ####initCore end
   [junit4]   2> 17840 INFO  (searcherExecutor-26-thread-1-processing-x:collection1) [    x:collection1] o.a.s.h.c.SpellCheckComponent Loading spell index for spellchecker: direct
   [junit4]   2> 17840 INFO  (searcherExecutor-26-thread-1-processing-x:collection1) [    x:collection1] o.a.s.h.c.SpellCheckComponent Loading spell index for spellchecker: wordbreak
   [junit4]   2> 17840 INFO  (searcherExecutor-26-thread-1-processing-x:collection1) [    x:collection1] o.a.s.h.c.SpellCheckComponent Loading spell index for spellchecker: multipleFields
   [junit4]   2> 17842 INFO  (searcherExecutor-26-thread-1-processing-x:collection1) [    x:collection1] o.a.s.h.c.SpellCheckComponent Loading spell index for spellchecker: jarowinkler
   [junit4]   2> 17843 INFO  (TEST-RequestLoggingTest.testLogBeforeExecuteWithRequestLogger-seed#[2A0D120E25F7C83E]) [    ] o.a.s.SolrTestCaseJ4 ###Starting testLogBeforeExecuteWithRequestLogger
   [junit4]   2> 17845 DEBUG (TEST-RequestLoggingTest.testLogBeforeExecuteWithRequestLogger-seed#[2A0D120E25F7C83E]) [    ] o.a.s.c.S.Request [collection1]  webapp=null path=null params={q=*:*&wt=xml}
   [junit4]   2> 17845 DEBUG (TEST-RequestLoggingTest.testLogBeforeExecuteWithRequestLogger-seed#[2A0D120E25F7C83E]) [    ] o.a.s.h.c.SearchHandler Adding  component:org.apache.solr.handler.component.QueryComponent@42d1021a
   [junit4]   2> 17845 DEBUG (TEST-RequestLoggingTest.testLogBeforeExecuteWithRequestLogger-seed#[2A0D120E25F7C83E]) [    ] o.a.s.h.c.SearchHandler Adding  component:org.apache.solr.handler.component.FacetComponent@2b761a02
   [junit4]   2> 17845 DEBUG (TEST-RequestLoggingTest.testLogBeforeExecuteWithRequestLogger-seed#[2A0D120E25F7C83E]) [    ] o.a.s.h.c.SearchHandler Adding  component:org.apache.solr.search.facet.FacetModule@7f28fdd4
   [junit4]   2> 17845 DEBUG (TEST-RequestLoggingTest.testLogBeforeExecuteWithRequestLogger-seed#[2A0D120E25F7C83E]) [    ] o.a.s.h.c.SearchHandler Adding  component:org.apache.solr.handler.component.MoreLikeThisComponent@21936670
   [junit4]   2> 17845 DEBUG (TEST-RequestLoggingTest.testLogBeforeExecuteWithRequestLogger-seed#[2A0D120E25F7C83E]) [    ] o.a.s.h.c.SearchHandler Adding  component:org.apache.solr.handler.component.HighlightComponent@6b18618a
   [junit4]   2> 17845 DEBUG (TEST-RequestLoggingTest.testLogBeforeExecuteWithRequestLogger-seed#[2A0D120E25F7C83E]) [    ] o.a.s.h.c.SearchHandler Adding  component:org.apache.solr.handler.component.StatsComponent@7025d0e1
   [junit4]   2> 17845 DEBUG (TEST-RequestLoggingTest.testLogBeforeExecuteWithRequestLogger-seed#[2A0D120E25F7C83E]) [    ] o.a.s.h.c.SearchHandler Adding  component:org.apache.solr.handler.component.ExpandComponent@485b456c
   [junit4]   2> 17845 DEBUG (TEST-RequestLoggingTest.testLogBeforeExecuteWithRequestLogger-seed#[2A0D120E25F7C83E]) [    ] o.a.s.h.c.SearchHandler Adding  component:org.apache.solr.handler.component.TermsComponent@72c11af1
   [junit4]   2> 17845 DEBUG (TEST-RequestLoggingTest.testLogBeforeExecuteWithRequestLogger-seed#[2A0D120E25F7C83E]) [    ] o.a.s.h.c.SearchHandler Adding  debug component:org.apache.solr.handler.component.DebugComponent@5afd2112
   [junit4]   2> 17845 DEBUG (TEST-RequestLoggingTest.testLogBeforeExecuteWithRequestLogger-seed#[2A0D120E25F7C83E]) [    ] o.a.s.h.c.QueryComponent process: q=*:*&df=text&wt=xml&indent=off
   [junit4]   2> 17846 DEBUG (TEST-RequestLoggingTest.testLogBeforeExecuteWithRequestLogger-seed#[2A0D120E25F7C83E]) [    ] o.a.s.s.s.LocalStatsCache ## GET LocalSolrQueryRequest{q=*:*&df=text&wt=xml&indent=off}
   [junit4]   2> 17847 INFO  (searcherExecutor-26-thread-1-processing-x:collection1) [    x:collection1] o.a.s.h.c.SpellCheckComponent Loading spell index for spellchecker: external
   [junit4]   2> 17850 INFO  (searcherExecutor-26-thread-1-processing-x:collection1) [    x:collection1] o.a.s.h.c.SpellCheckComponent Loading spell index for spellchecker: freq
   [junit4]   2> 17852 INFO  (searcherExecutor-26-thread-1-processing-x:collection1) [    x:collection1] o.a.s.h.c.SpellCheckComponent Loading spell index for spellchecker: fqcn
   [junit4]   2> 17853 INFO  (searcherExecutor-26-thread-1-processing-x:collection1) [    x:collection1] o.a.s.h.c.SpellCheckComponent Loading spell index for spellchecker: perDict
   [junit4]   2> 17853 DEBUG (searcherExecutor-26-thread-1-processing-x:collection1) [    x:collection1] o.a.s.m.r.j.JmxMetricsReporter ## registered solr:category=CACHE,dom1=core,dom2=collection1,name=fieldValueCache,scope=searcher, tag=5245fd54
   [junit4]   2> 17854 DEBUG (searcherExecutor-26-thread-1-processing-x:collection1) [    x:collection1] o.a.s.m.r.j.JmxMetricsReporter ## registered solr:category=CACHE,dom1=core,dom2=collection1,name=filterCache,scope=searcher, tag=5245fd54
   [junit4]   2> 17854 DEBUG (searcherExecutor-26-thread-1-processing-x:collection1) [    x:collection1] o.a.s.m.r.j.JmxMetricsReporter ## registered solr:category=CACHE,dom1=core,dom2=collection1,name=queryResultCache,scope=searcher, tag=5245fd54
   [junit4]   2> 17854 DEBUG (searcherExecutor-26-thread-1-processing-x:collection1) [    x:collection1] o.a.s.m.r.j.JmxMetricsReporter ## registered solr:category=CACHE,dom1=core,dom2=collection1,name=documentCache,scope=searcher, tag=5245fd54
   [junit4]   2> 17854 DEBUG (searcherExecutor-26-thread-1-processing-x:collection1) [    x:collection1] o.a.s.m.r.j.JmxMetricsReporter ## registered solr:category=CACHE,dom1=core,dom2=collection1,name=perSegFilter,scope=searcher, tag=5245fd54
   [junit4]   2> 17854 DEBUG (searcherExecutor-26-thread-1-processing-x:collection1) [    x:collection1] o.a.s.m.r.j.JmxMetricsReporter ## registered solr:category=SEARCHER,dom1=core,dom2=collection1,name=searcherName,scope=searcher, tag=5245fd54
   [junit4]   2> 17854 DEBUG (searcherExecutor-26-thread-1-processing-x:collection1) [    x:collection1] o.a.s.m.r.j.JmxMetricsReporter ## registered solr:category=SEARCHER,dom1=core,dom2=collection1,name=caching,scope=searcher, tag=5245fd54
   [junit4]   2> 17854 DEBUG (searcherExecutor-26-thread-1-processing-x:collection1) [    x:collection1] o.a.s.m.r.j.JmxMetricsReporter ## registered solr:category=SEARCHER,dom1=core,dom2=collection1,name=openedAt,scope=searcher, tag=5245fd54
   [junit4]   2> 17854 DEBUG (searcherExecutor-26-thread-1-processing-x:collection1) [    x:collection1] o.a.s.m.r.j.JmxMetricsReporter ## registered solr:category=SEARCHER,dom1=core,dom2=collection1,name=warmupTime,scope=searcher, tag=5245fd54
   [junit4]   2> 17854 DEBUG (searcherExecutor-26-thread-1-processing-x:collection1) [    x:collection1] o.a.s.m.r.j.JmxMetricsReporter ## registered solr:category=SEARCHER,dom1=core,dom2=collection1,name=registeredAt,scope=searcher, tag=5245fd54
   [junit4]   2> 17855 DEBUG (searcherExecutor-26-thread-1-processing-x:collection1) [    x:collection1] o.a.s.m.r.j.JmxMetricsReporter ## registered solr:category=SEARCHER,dom1=core,dom2=collection1,name=numDocs,scope=searcher, tag=5245fd54
   [junit4]   2> 17855 DEBUG (searcherExecutor-26-thread-1-processing-x:collection1) [    x:collection1] o.a.s.m.r.j.JmxMetricsReporter ## registered solr:category=SEARCHER,dom1=core,dom2=collection1,name=maxDoc,scope=searcher, tag=5245fd54
   [junit4]   2> 17855 DEBUG (searcherExecutor-26-thread-1-processing-x:collection1) [    x:collection1] o.a.s.m.r.j.JmxMetricsReporter ## registered solr:category=SEARCHER,dom1=core,dom2=collection1,name=deletedDocs,scope=searcher, tag=5245fd54
   [junit4]   2> 17855 DEBUG (searcherExecutor-26-thread-1-processing-x:collection1) [    x:collection1] o.a.s.m.r.j.JmxMetricsReporter ## registered solr:category=SEARCHER,dom1=core,dom2=collection1,name=reader,scope=searcher, tag=5245fd54
   [junit4]   2> 17855 DEBUG (searcherExecutor-26-thread-1-processing-x:collection1) [    x:collection1] o.a.s.m.r.j.JmxMetricsReporter ## registered solr:category=SEARCHER,dom1=core,dom2=collection1,name=readerDir,scope=searcher, tag=5245fd54
   [junit4]   2> 17855 DEBUG (searcherExecutor-26-thread-1-processing-x:collection1) [    x:collection1] o.a.s.m.r.j.JmxMetricsReporter ## registered solr:category=SEARCHER,dom1=core,dom2=collection1,name=indexVersion,scope=searcher, tag=5245fd54
   [junit4]   2> 17855 INFO  (searcherExecutor-26-thread-1-processing-x:collection1) [    x:collection1] o.a.s.c.SolrCore [collection1] Registered new searcher Searcher@7c967c50[collection1] main{ExitableDirectoryReader(UninvertingDirectoryReader())}
   [junit4] OK      0.02s J1 | RequestLoggingTest.testLogBeforeExecuteWithRequestLogger
   [junit4]   2> NOTE: reproduce with: ant test  -Dtestcase=RequestLoggingTest -Dtests.method=testLogBeforeExecuteWithCoreLogger -Dtests.seed=2A0D120E25F7C83E -Dtests.slow=true -Dtests.badapples=true -Dtests.locale=ur -Dtests.timezone=America/Maceio -Dtests.asserts=true -Dtests.file.encoding=Cp1252
   [junit4] FAILURE 0.02s J1 | RequestLoggingTest.testLogBeforeExecuteWithCoreLogger <<<
   [junit4]    > Throwable #1: java.lang.AssertionError
   [junit4]    > 	at __randomizedtesting.SeedInfo.seed([2A0D120E25F7C83E:E68B1280DB3EA3A8]:0)
   [junit4]    > 	at org.apache.solr.handler.RequestLoggingTest.testLogBeforeExecute(RequestLoggingTest.java:88)
   [junit4]    > 	at org.apache.solr.handler.RequestLoggingTest.testLogBeforeExecuteWithCoreLogger(RequestLoggingTest.java:65)
   [junit4]    > 	at java.base/jdk.internal.reflect.NativeMethodAccessorImpl.invoke0(Native Method)
   [junit4]    > 	at java.base/jdk.internal.reflect.NativeMethodAccessorImpl.invoke(NativeMethodAccessorImpl.java:62)
   [junit4]    > 	at java.base/jdk.internal.reflect.DelegatingMethodAccessorImpl.invoke(DelegatingMethodAccessorImpl.java:43)
   [junit4]    > 	at java.base/java.lang.reflect.Method.invoke(Method.java:564)
   [junit4]    > 	at java.base/java.lang.Thread.run(Thread.java:844)
   [junit4]   2> 17857 INFO  (TEST-RequestLoggingTest.testLogBeforeExecuteWithRequestLogger-seed#[2A0D120E25F7C83E]) [    ] o.a.s.c.S.Request [collection1]  webapp=null path=null params={q=*:*&wt=xml} hits=0 status=0 QTime=12
   [junit4]   2> 17858 INFO  (TEST-RequestLoggingTest.testLogBeforeExecuteWithRequestLogger-seed#[2A0D120E25F7C83E]) [    ] o.a.s.SolrTestCaseJ4 ###Ending testLogBeforeExecuteWithRequestLogger
   [junit4]   2> 17860 INFO  (TEST-RequestLoggingTest.testLogBeforeExecuteWithCoreLogger-seed#[2A0D120E25F7C83E]) [    ] o.a.s.SolrTestCaseJ4 ###Starting testLogBeforeExecuteWithCoreLogger
   [junit4]   2> 17868 DEBUG (TEST-RequestLoggingTest.testLogBeforeExecuteWithCoreLogger-seed#[2A0D120E25F7C83E]) [    ] o

[...truncated too long message...]

dom1=core,dom2=collection1,name=deletedDocs,scope=searcher, tag=4eb78ff1
   [junit4]   2> 18756 DEBUG (searcherExecutor-42-thread-1-processing-x:collection1) [    x:collection1] o.a.s.m.r.j.JmxMetricsReporter ## registered solr:category=SEARCHER,dom1=core,dom2=collection1,name=reader,scope=searcher, tag=4eb78ff1
   [junit4]   2> 18756 DEBUG (searcherExecutor-42-thread-1-processing-x:collection1) [    x:collection1] o.a.s.m.r.j.JmxMetricsReporter ## registered solr:category=SEARCHER,dom1=core,dom2=collection1,name=readerDir,scope=searcher, tag=4eb78ff1
   [junit4]   2> 18756 DEBUG (searcherExecutor-42-thread-1-processing-x:collection1) [    x:collection1] o.a.s.m.r.j.JmxMetricsReporter ## registered solr:category=SEARCHER,dom1=core,dom2=collection1,name=indexVersion,scope=searcher, tag=4eb78ff1
   [junit4]   2> 18756 INFO  (searcherExecutor-42-thread-1-processing-x:collection1) [    x:collection1] o.a.s.c.SolrCore [collection1] Registered new searcher Searcher@59ca3a17[collection1] main{ExitableDirectoryReader(UninvertingDirectoryReader())}
   [junit4]   2> 18756 INFO  (TEST-RequestLoggingTest.testLogBeforeExecuteWithRequestLogger-seed#[2A0D120E25F7C83E]) [    ] o.a.s.c.S.Request [collection1]  webapp=null path=null params={q=*:*&wt=xml} hits=0 status=0 QTime=5
   [junit4] OK      0.01s J0 | RequestLoggingTest.testLogBeforeExecuteWithRequestLogger
   [junit4]   2> 18758 INFO  (TEST-RequestLoggingTest.testLogBeforeExecuteWithRequestLogger-seed#[2A0D120E25F7C83E]) [    ] o.a.s.SolrTestCaseJ4 ###Ending testLogBeforeExecuteWithRequestLogger
   [junit4]   2> 18759 INFO  (TEST-RequestLoggingTest.testLogBeforeExecuteWithCoreLogger-seed#[2A0D120E25F7C83E]) [    ] o.a.s.SolrTestCaseJ4 ###Starting testLogBeforeExecuteWithCoreLogger
   [junit4]   2> 18761 DEBUG (TEST-RequestLoggingTest.testLogBeforeExecuteWithCoreLogger-seed#[2A0D120E25F7C83E]) [    ] o.a.s.c.S.Request [collection1]  webapp=null path=null params={q=*:*&wt=xml}
   [junit4]   2> 18761 DEBUG (TEST-RequestLoggingTest.testLogBeforeExecuteWithCoreLogger-seed#[2A0D120E25F7C83E]) [    ] o.a.s.h.c.QueryComponent process: q=*:*&df=text&wt=xml&indent=off
   [junit4]   2> 18761 DEBUG (TEST-RequestLoggingTest.testLogBeforeExecuteWithCoreLogger-seed#[2A0D120E25F7C83E]) [    ] o.a.s.s.s.LocalStatsCache ## GET LocalSolrQueryRequest{q=*:*&df=text&wt=xml&indent=off}
   [junit4]   2> 18761 INFO  (TEST-RequestLoggingTest.testLogBeforeExecuteWithCoreLogger-seed#[2A0D120E25F7C83E]) [    ] o.a.s.c.S.Request [collection1]  webapp=null path=null params={q=*:*&wt=xml} hits=0 status=0 QTime=0
   [junit4]   2> NOTE: reproduce with: ant test  -Dtestcase=RequestLoggingTest -Dtests.method=testLogBeforeExecuteWithCoreLogger -Dtests.seed=2A0D120E25F7C83E -Dtests.slow=true -Dtests.badapples=true -Dtests.locale=ur -Dtests.timezone=America/Maceio -Dtests.asserts=true -Dtests.file.encoding=Cp1252
   [junit4] FAILURE 0.01s J0 | RequestLoggingTest.testLogBeforeExecuteWithCoreLogger <<<
   [junit4]    > Throwable #1: java.lang.AssertionError
   [junit4]    > 	at __randomizedtesting.SeedInfo.seed([2A0D120E25F7C83E:E68B1280DB3EA3A8]:0)
   [junit4]    > 	at org.apache.solr.handler.RequestLoggingTest.testLogBeforeExecute(RequestLoggingTest.java:88)
   [junit4]    > 	at org.apache.solr.handler.RequestLoggingTest.testLogBeforeExecuteWithCoreLogger(RequestLoggingTest.java:65)
   [junit4]    > 	at java.base/jdk.internal.reflect.NativeMethodAccessorImpl.invoke0(Native Method)
   [junit4]    > 	at java.base/jdk.internal.reflect.NativeMethodAccessorImpl.invoke(NativeMethodAccessorImpl.java:62)
   [junit4]    > 	at java.base/jdk.internal.reflect.DelegatingMethodAccessorImpl.invoke(DelegatingMethodAccessorImpl.java:43)
   [junit4]    > 	at java.base/java.lang.reflect.Method.invoke(Method.java:564)
   [junit4]    > 	at java.base/java.lang.Thread.run(Thread.java:844)
   [junit4]   2> 18762 INFO  (TEST-RequestLoggingTest.testLogBeforeExecuteWithCoreLogger-seed#[2A0D120E25F7C83E]) [    ] o.a.s.SolrTestCaseJ4 ###Ending testLogBeforeExecuteWithCoreLogger
   [junit4]   2> 18763 INFO  (SUITE-RequestLoggingTest-seed#[2A0D120E25F7C83E]-worker) [    ] o.a.s.SolrTestCaseJ4 ###deleteCore
   [junit4]   2> 18763 INFO  (SUITE-RequestLoggingTest-seed#[2A0D120E25F7C83E]-worker) [    ] o.a.s.c.CoreContainer Shutting down CoreContainer instance=1927864672
   [junit4]   2> 18763 INFO  (SUITE-RequestLoggingTest-seed#[2A0D120E25F7C83E]-worker) [    ] o.a.s.m.SolrMetricManager Closing metric reporters for registry=solr.node, tag=null
   [junit4]   2> 18763 INFO  (SUITE-RequestLoggingTest-seed#[2A0D120E25F7C83E]-worker) [    ] o.a.s.m.r.SolrJmxReporter Closing reporter [org.apache.solr.metrics.reporters.SolrJmxReporter@25454782: rootName = null, domain = solr.node, service url = null, agent id = null] for registry solr.node / com.codahale.metrics.MetricRegistry@3aa80d6d
   [junit4]   2> 18767 INFO  (SUITE-RequestLoggingTest-seed#[2A0D120E25F7C83E]-worker) [    ] o.a.s.m.SolrMetricManager Closing metric reporters for registry=solr.jvm, tag=null
   [junit4]   2> 18767 INFO  (SUITE-RequestLoggingTest-seed#[2A0D120E25F7C83E]-worker) [    ] o.a.s.m.r.SolrJmxReporter Closing reporter [org.apache.solr.metrics.reporters.SolrJmxReporter@397c6f0: rootName = null, domain = solr.jvm, service url = null, agent id = null] for registry solr.jvm / com.codahale.metrics.MetricRegistry@bf449ac
   [junit4]   2> 18767 INFO  (SUITE-RequestLoggingTest-seed#[2A0D120E25F7C83E]-worker) [    ] o.a.s.m.SolrMetricManager Closing metric reporters for registry=solr.jetty, tag=null
   [junit4]   2> 18767 INFO  (SUITE-RequestLoggingTest-seed#[2A0D120E25F7C83E]-worker) [    ] o.a.s.m.r.SolrJmxReporter Closing reporter [org.apache.solr.metrics.reporters.SolrJmxReporter@1a22e771: rootName = null, domain = solr.jetty, service url = null, agent id = null] for registry solr.jetty / com.codahale.metrics.MetricRegistry@2ed0a4fb
   [junit4]   2> 18769 INFO  (coreCloseExecutor-47-thread-1) [    x:collection1] o.a.s.c.SolrCore [collection1]  CLOSING SolrCore org.apache.solr.core.SolrCore@722059b2
   [junit4]   2> 18769 INFO  (coreCloseExecutor-47-thread-1) [    x:collection1] o.a.s.m.SolrMetricManager Closing metric reporters for registry=solr.core.collection1, tag=722059b2
   [junit4]   2> 18769 INFO  (coreCloseExecutor-47-thread-1) [    x:collection1] o.a.s.m.r.SolrJmxReporter Closing reporter [org.apache.solr.metrics.reporters.SolrJmxReporter@4eb78ff1: rootName = null, domain = solr.core.collection1, service url = null, agent id = null] for registry solr.core.collection1 / com.codahale.metrics.MetricRegistry@5062dece
   [junit4]   2> NOTE: leaving temporary files on disk at: C:\Users\jenkins\workspace\Lucene-Solr-7.x-Windows\solr\build\solr-core\test\J0\temp\solr.handler.RequestLoggingTest_2A0D120E25F7C83E-002
   [junit4]   2> Sep 02, 2018 12:02:26 PM com.carrotsearch.randomizedtesting.ThreadLeakControl checkThreadLeaks
   [junit4]   2> WARNING: Will linger awaiting termination of 4 leaked thread(s).
   [junit4]   2> NOTE: test params are: codec=Asserting(Lucene70): {}, docValues:{}, maxPointsInLeafNode=58, maxMBSortInHeap=5.068270964106848, sim=RandomSimilarity(queryNorm=true): {}, locale=ur, timezone=America/Maceio
   [junit4]   2> NOTE: Windows 10 10.0 amd64/Oracle Corporation 10.0.1 (64-bit)/cpus=3,threads=1,free=28972232,total=97386496
   [junit4]   2> NOTE: All tests run in this JVM: [RequestLoggingTest, RequestLoggingTest, RequestLoggingTest]
   [junit4] Completed [5/5 (3!)] on J0 in 1.54s, 2 tests, 1 failure <<< FAILURES!

[...truncated 12 lines...]
BUILD FAILED
C:\Users\jenkins\workspace\Lucene-Solr-7.x-Windows\lucene\common-build.xml:1568: The following error occurred while executing this line:
C:\Users\jenkins\workspace\Lucene-Solr-7.x-Windows\lucene\common-build.xml:1092: There were test failures: 5 suites, 10 tests, 3 failures [seed: 2A0D120E25F7C83E]

Total time: 21 seconds

[repro] Setting last failure code to 1

[repro] Failures:
[repro]   3/5 failed: org.apache.solr.handler.RequestLoggingTest
[repro] Exiting with code 1

C:\Users\jenkins\workspace\Lucene-Solr-7.x-Windows>IF EXIST lucene\build move /y lucene\build lucene\build.repro 
        1 dir(s) moved.

C:\Users\jenkins\workspace\Lucene-Solr-7.x-Windows>IF EXIST solr\build move /y solr\build solr\build.repro 
        1 dir(s) moved.

C:\Users\jenkins\workspace\Lucene-Solr-7.x-Windows>IF EXIST lucene\build.orig move /y lucene\build.orig lucene\build 
        1 dir(s) moved.

C:\Users\jenkins\workspace\Lucene-Solr-7.x-Windows>IF EXIST solr\build.orig move /y solr\build.orig solr\build 
        1 dir(s) moved.

C:\Users\jenkins\workspace\Lucene-Solr-7.x-Windows>exit 0 
Archiving artifacts
Setting ANT_1_8_2_HOME=C:\Users\jenkins\tools\hudson.tasks.Ant_AntInstallation\ANT_1.8.2
[WARNINGS] Parsing warnings in console log with parser Java Compiler (javac)
Setting ANT_1_8_2_HOME=C:\Users\jenkins\tools\hudson.tasks.Ant_AntInstallation\ANT_1.8.2
Setting ANT_1_8_2_HOME=C:\Users\jenkins\tools\hudson.tasks.Ant_AntInstallation\ANT_1.8.2
<Git Blamer> Using GitBlamer to create author and commit information for all warnings.
<Git Blamer> GIT_COMMIT=d35b615c66e8974363b7a938abc0d74a85a798dd, workspace=C:\Users\jenkins\workspace\Lucene-Solr-7.x-Windows
[WARNINGS] Computing warning deltas based on reference build #766
Recording test results
Setting ANT_1_8_2_HOME=C:\Users\jenkins\tools\hudson.tasks.Ant_AntInstallation\ANT_1.8.2
Build step 'Publish JUnit test result report' changed build result to UNSTABLE
Email was triggered for: Unstable (Test Failures)
Sending email for trigger: Unstable (Test Failures)
Setting ANT_1_8_2_HOME=C:\Users\jenkins\tools\hudson.tasks.Ant_AntInstallation\ANT_1.8.2
Setting ANT_1_8_2_HOME=C:\Users\jenkins\tools\hudson.tasks.Ant_AntInstallation\ANT_1.8.2
Setting ANT_1_8_2_HOME=C:\Users\jenkins\tools\hudson.tasks.Ant_AntInstallation\ANT_1.8.2
Setting ANT_1_8_2_HOME=C:\Users\jenkins\tools\hudson.tasks.Ant_AntInstallation\ANT_1.8.2

Mime
View raw message