lucene-dev mailing list archives

Site index · List index
Message view « Date » · « Thread »
Top « Date » · « Thread »
From Policeman Jenkins Server <jenk...@thetaphi.de>
Subject [JENKINS] Lucene-Solr-master-MacOSX (64bit/jdk1.8.0) - Build # 4836 - Unstable!
Date Mon, 17 Sep 2018 15:15:35 GMT
Build: https://jenkins.thetaphi.de/job/Lucene-Solr-master-MacOSX/4836/
Java: 64bit/jdk1.8.0 -XX:-UseCompressedOops -XX:+UseConcMarkSweepGC

1 tests failed.
FAILED:  org.apache.solr.cloud.autoscaling.sim.TestSimPolicyCloud.testCreateCollectionAddReplica

Error Message:
Timeout waiting for collection to become active Live Nodes: [127.0.0.1:10001_solr, 127.0.0.1:10004_solr, 127.0.0.1:10000_solr, 127.0.0.1:10002_solr, 127.0.0.1:10003_solr] Last available state: DocCollection(testCreateCollectionAddReplica//clusterstate.json/23)={   "replicationFactor":"1",   "pullReplicas":"0",   "router":{"name":"compositeId"},   "maxShardsPerNode":"1",   "autoAddReplicas":"false",   "nrtReplicas":"1",   "tlogReplicas":"0",   "autoCreated":"true",   "policy":"c1",   "shards":{"shard1":{       "replicas":{"core_node1":{           "core":"testCreateCollectionAddReplica_shard1_replica_n1",           "SEARCHER.searcher.maxDoc":0,           "SEARCHER.searcher.deletedDocs":0,           "INDEX.sizeInBytes":10240,           "node_name":"127.0.0.1:10001_solr",           "state":"active",           "type":"NRT",           "INDEX.sizeInGB":9.5367431640625E-6,           "SEARCHER.searcher.numDocs":0}},       "range":"80000000-7fffffff",       "state":"active"}}}

Stack Trace:
java.lang.AssertionError: Timeout waiting for collection to become active
Live Nodes: [127.0.0.1:10001_solr, 127.0.0.1:10004_solr, 127.0.0.1:10000_solr, 127.0.0.1:10002_solr, 127.0.0.1:10003_solr]
Last available state: DocCollection(testCreateCollectionAddReplica//clusterstate.json/23)={
  "replicationFactor":"1",
  "pullReplicas":"0",
  "router":{"name":"compositeId"},
  "maxShardsPerNode":"1",
  "autoAddReplicas":"false",
  "nrtReplicas":"1",
  "tlogReplicas":"0",
  "autoCreated":"true",
  "policy":"c1",
  "shards":{"shard1":{
      "replicas":{"core_node1":{
          "core":"testCreateCollectionAddReplica_shard1_replica_n1",
          "SEARCHER.searcher.maxDoc":0,
          "SEARCHER.searcher.deletedDocs":0,
          "INDEX.sizeInBytes":10240,
          "node_name":"127.0.0.1:10001_solr",
          "state":"active",
          "type":"NRT",
          "INDEX.sizeInGB":9.5367431640625E-6,
          "SEARCHER.searcher.numDocs":0}},
      "range":"80000000-7fffffff",
      "state":"active"}}}
	at __randomizedtesting.SeedInfo.seed([7C056A298B5F7FEC:FC250F079A1C974A]:0)
	at org.apache.solr.cloud.CloudTestUtils.waitForState(CloudTestUtils.java:70)
	at org.apache.solr.cloud.autoscaling.sim.TestSimPolicyCloud.testCreateCollectionAddReplica(TestSimPolicyCloud.java:123)
	at sun.reflect.NativeMethodAccessorImpl.invoke0(Native Method)
	at sun.reflect.NativeMethodAccessorImpl.invoke(NativeMethodAccessorImpl.java:62)
	at sun.reflect.DelegatingMethodAccessorImpl.invoke(DelegatingMethodAccessorImpl.java:43)
	at java.lang.reflect.Method.invoke(Method.java:498)
	at com.carrotsearch.randomizedtesting.RandomizedRunner.invoke(RandomizedRunner.java:1742)
	at com.carrotsearch.randomizedtesting.RandomizedRunner$8.evaluate(RandomizedRunner.java:935)
	at com.carrotsearch.randomizedtesting.RandomizedRunner$9.evaluate(RandomizedRunner.java:971)
	at com.carrotsearch.randomizedtesting.RandomizedRunner$10.evaluate(RandomizedRunner.java:985)
	at org.junit.rules.ExpectedException$ExpectedExceptionStatement.evaluate(ExpectedException.java:110)
	at com.carrotsearch.randomizedtesting.rules.SystemPropertiesRestoreRule$1.evaluate(SystemPropertiesRestoreRule.java:57)
	at org.apache.lucene.util.TestRuleSetupTeardownChained$1.evaluate(TestRuleSetupTeardownChained.java:49)
	at org.apache.lucene.util.AbstractBeforeAfterRule$1.evaluate(AbstractBeforeAfterRule.java:45)
	at org.apache.lucene.util.TestRuleThreadAndTestName$1.evaluate(TestRuleThreadAndTestName.java:48)
	at org.apache.lucene.util.TestRuleIgnoreAfterMaxFailures$1.evaluate(TestRuleIgnoreAfterMaxFailures.java:64)
	at org.apache.lucene.util.TestRuleMarkFailure$1.evaluate(TestRuleMarkFailure.java:47)
	at com.carrotsearch.randomizedtesting.rules.StatementAdapter.evaluate(StatementAdapter.java:36)
	at com.carrotsearch.randomizedtesting.ThreadLeakControl$StatementRunner.run(ThreadLeakControl.java:368)
	at com.carrotsearch.randomizedtesting.ThreadLeakControl.forkTimeoutingTask(ThreadLeakControl.java:817)
	at com.carrotsearch.randomizedtesting.ThreadLeakControl$3.evaluate(ThreadLeakControl.java:468)
	at com.carrotsearch.randomizedtesting.RandomizedRunner.runSingleTest(RandomizedRunner.java:944)
	at com.carrotsearch.randomizedtesting.RandomizedRunner$5.evaluate(RandomizedRunner.java:830)
	at com.carrotsearch.randomizedtesting.RandomizedRunner$6.evaluate(RandomizedRunner.java:880)
	at com.carrotsearch.randomizedtesting.RandomizedRunner$7.evaluate(RandomizedRunner.java:891)
	at com.carrotsearch.randomizedtesting.rules.StatementAdapter.evaluate(StatementAdapter.java:36)
	at com.carrotsearch.randomizedtesting.rules.SystemPropertiesRestoreRule$1.evaluate(SystemPropertiesRestoreRule.java:57)
	at org.apache.lucene.util.AbstractBeforeAfterRule$1.evaluate(AbstractBeforeAfterRule.java:45)
	at com.carrotsearch.randomizedtesting.rules.StatementAdapter.evaluate(StatementAdapter.java:36)
	at org.apache.lucene.util.TestRuleStoreClassName$1.evaluate(TestRuleStoreClassName.java:41)
	at com.carrotsearch.randomizedtesting.rules.NoShadowingOrOverridesOnMethodsRule$1.evaluate(NoShadowingOrOverridesOnMethodsRule.java:40)
	at com.carrotsearch.randomizedtesting.rules.NoShadowingOrOverridesOnMethodsRule$1.evaluate(NoShadowingOrOverridesOnMethodsRule.java:40)
	at com.carrotsearch.randomizedtesting.rules.StatementAdapter.evaluate(StatementAdapter.java:36)
	at com.carrotsearch.randomizedtesting.rules.StatementAdapter.evaluate(StatementAdapter.java:36)
	at com.carrotsearch.randomizedtesting.rules.StatementAdapter.evaluate(StatementAdapter.java:36)
	at org.apache.lucene.util.TestRuleAssertionsRequired$1.evaluate(TestRuleAssertionsRequired.java:53)
	at org.apache.lucene.util.TestRuleMarkFailure$1.evaluate(TestRuleMarkFailure.java:47)
	at org.apache.lucene.util.TestRuleIgnoreAfterMaxFailures$1.evaluate(TestRuleIgnoreAfterMaxFailures.java:64)
	at org.apache.lucene.util.TestRuleIgnoreTestSuites$1.evaluate(TestRuleIgnoreTestSuites.java:54)
	at com.carrotsearch.randomizedtesting.rules.StatementAdapter.evaluate(StatementAdapter.java:36)
	at com.carrotsearch.randomizedtesting.ThreadLeakControl$StatementRunner.run(ThreadLeakControl.java:368)
	at java.lang.Thread.run(Thread.java:748)
Caused by: java.util.concurrent.TimeoutException: last state: DocCollection(testCreateCollectionAddReplica//clusterstate.json/23)={
  "replicationFactor":"1",
  "pullReplicas":"0",
  "router":{"name":"compositeId"},
  "maxShardsPerNode":"1",
  "autoAddReplicas":"false",
  "nrtReplicas":"1",
  "tlogReplicas":"0",
  "autoCreated":"true",
  "policy":"c1",
  "shards":{"shard1":{
      "replicas":{"core_node1":{
          "core":"testCreateCollectionAddReplica_shard1_replica_n1",
          "SEARCHER.searcher.maxDoc":0,
          "SEARCHER.searcher.deletedDocs":0,
          "INDEX.sizeInBytes":10240,
          "node_name":"127.0.0.1:10001_solr",
          "state":"active",
          "type":"NRT",
          "INDEX.sizeInGB":9.5367431640625E-6,
          "SEARCHER.searcher.numDocs":0}},
      "range":"80000000-7fffffff",
      "state":"active"}}}
	at org.apache.solr.cloud.CloudTestUtils.waitForState(CloudTestUtils.java:112)
	at org.apache.solr.cloud.CloudTestUtils.waitForState(CloudTestUtils.java:64)
	... 41 more




Build Log:
[...truncated 12868 lines...]
   [junit4] Suite: org.apache.solr.cloud.autoscaling.sim.TestSimPolicyCloud
   [junit4]   2> Creating dataDir: /Users/jenkins/workspace/Lucene-Solr-master-MacOSX/solr/build/solr-core/test/J0/temp/solr.cloud.autoscaling.sim.TestSimPolicyCloud_7C056A298B5F7FEC-001/init-core-data-001
   [junit4]   2> 1131472 WARN  (SUITE-TestSimPolicyCloud-seed#[7C056A298B5F7FEC]-worker) [    ] o.a.s.SolrTestCaseJ4 startTrackingSearchers: numOpens=18 numCloses=18
   [junit4]   2> 1131472 INFO  (SUITE-TestSimPolicyCloud-seed#[7C056A298B5F7FEC]-worker) [    ] o.a.s.SolrTestCaseJ4 Using TrieFields (NUMERIC_POINTS_SYSPROP=false) w/NUMERIC_DOCVALUES_SYSPROP=false
   [junit4]   2> 1131476 INFO  (SUITE-TestSimPolicyCloud-seed#[7C056A298B5F7FEC]-worker) [    ] o.a.s.SolrTestCaseJ4 Randomized ssl (false) and clientAuth (false) via: @org.apache.solr.util.RandomizeSSL(reason=, value=NaN, ssl=NaN, clientAuth=NaN) w/ MAC_OS_X supressed clientAuth
   [junit4]   2> 1131476 INFO  (SUITE-TestSimPolicyCloud-seed#[7C056A298B5F7FEC]-worker) [    ] o.a.s.SolrTestCaseJ4 SecureRandom sanity checks: test.solr.allowed.securerandom=null & java.security.egd=file:/dev/./urandom
   [junit4]   2> 1131522 DEBUG (Simulated OverseerAutoScalingTriggerThread) [    ] o.a.s.c.a.OverseerTriggerThread Adding .auto_add_replicas and .scheduled_maintenance triggers
   [junit4]   2> 1131522 DEBUG (Simulated OverseerAutoScalingTriggerThread) [    ] o.a.s.c.a.OverseerTriggerThread Refreshing /autoscaling.json with znode version 0
   [junit4]   2> 1131522 DEBUG (SUITE-TestSimPolicyCloud-seed#[7C056A298B5F7FEC]-worker) [    ] o.a.s.c.a.s.SimClusterStateProvider --- new Overseer leader: 127.0.0.1:10000_solr
   [junit4]   2> 1131522 DEBUG (Simulated OverseerAutoScalingTriggerThread) [    ] o.a.s.c.a.OverseerTriggerThread Current znodeVersion 0, lastZnodeVersion -1
   [junit4]   2> 1131522 DEBUG (Simulated OverseerAutoScalingTriggerThread) [    ] o.a.s.c.a.OverseerTriggerThread Processed trigger updates upto znodeVersion 0
   [junit4]   2> 1131523 DEBUG (Simulated OverseerAutoScalingTriggerThread) [    ] o.a.s.c.a.NodeLostTrigger NodeLostTrigger .auto_add_replicas - Initial livenodes: [127.0.0.1:10000_solr]
   [junit4]   2> 1131523 DEBUG (Simulated OverseerAutoScalingTriggerThread) [    ] o.a.s.c.a.OverseerTriggerThread -- clean old nodeAdded markers
   [junit4]   2> 1131523 DEBUG (Simulated OverseerAutoScalingTriggerThread) [    ] o.a.s.c.a.OverseerTriggerThread Current znodeVersion 0, lastZnodeVersion 0
   [junit4]   2> 1131523 DEBUG (ScheduledTrigger-4366-thread-2) [    ] o.a.s.c.a.NodeLostTrigger Running NodeLostTrigger: .auto_add_replicas with currently live nodes: 1
   [junit4]   2> 1131525 INFO  (SUITE-TestSimPolicyCloud-seed#[7C056A298B5F7FEC]-worker) [    ] o.a.s.h.a.MetricsHistoryHandler No .system collection, keeping metrics history in memory.
   [junit4]   2> 1131532 INFO  (TEST-TestSimPolicyCloud.testDataProvider-seed#[7C056A298B5F7FEC]) [    ] o.a.s.SolrTestCaseJ4 ###Starting testDataProvider
   [junit4]   2> 1131533 DEBUG (TEST-TestSimPolicyCloud.testDataProvider-seed#[7C056A298B5F7FEC]) [    ] o.a.s.c.a.OverseerTriggerThread Refreshing /autoscaling.json with znode version 1
   [junit4]   2> 1131533 DEBUG (Simulated OverseerAutoScalingTriggerThread) [    ] o.a.s.c.a.OverseerTriggerThread Processed trigger updates upto znodeVersion 1
   [junit4]   2> 1131533 DEBUG (Simulated OverseerAutoScalingTriggerThread) [    ] o.a.s.c.a.OverseerTriggerThread -- clean old nodeLost markers
   [junit4]   2> 1131533 DEBUG (Simulated OverseerAutoScalingTriggerThread) [    ] o.a.s.c.a.OverseerTriggerThread -- clean old nodeAdded markers
   [junit4]   2> 1131533 DEBUG (Simulated OverseerAutoScalingTriggerThread) [    ] o.a.s.c.a.OverseerTriggerThread Current znodeVersion 1, lastZnodeVersion 1
   [junit4]   2> 1131534 INFO  (TEST-TestSimPolicyCloud.testDataProvider-seed#[7C056A298B5F7FEC]) [    ] o.a.s.c.a.s.SimCloudManager === Restarting OverseerTriggerThread and clearing object cache...
   [junit4]   2> 1131535 DEBUG (TEST-TestSimPolicyCloud.testDataProvider-seed#[7C056A298B5F7FEC]) [    ] o.a.s.c.a.ScheduledTriggers Shutting down scheduled thread pool executor now
   [junit4]   2> 1131534 WARN  (Simulated OverseerAutoScalingTriggerThread) [    ] o.a.s.c.a.OverseerTriggerThread Interrupted
   [junit4]   2> java.lang.InterruptedException: null
   [junit4]   2> 	at java.util.concurrent.locks.AbstractQueuedSynchronizer$ConditionObject.reportInterruptAfterWait(AbstractQueuedSynchronizer.java:2014) ~[?:1.8.0_172]
   [junit4]   2> 	at java.util.concurrent.locks.AbstractQueuedSynchronizer$ConditionObject.await(AbstractQueuedSynchronizer.java:2048) ~[?:1.8.0_172]
   [junit4]   2> 	at org.apache.solr.cloud.autoscaling.OverseerTriggerThread.run(OverseerTriggerThread.java:189) [java/:?]
   [junit4]   2> 	at java.lang.Thread.run(Thread.java:748) [?:1.8.0_172]
   [junit4]   2> 1131535 DEBUG (TEST-TestSimPolicyCloud.testDataProvider-seed#[7C056A298B5F7FEC]) [    ] o.a.s.c.a.ScheduledTriggers Shutting down action executor now
   [junit4]   2> 1131535 DEBUG (TEST-TestSimPolicyCloud.testDataProvider-seed#[7C056A298B5F7FEC]) [    ] o.a.s.c.a.ScheduledTriggers Awaiting termination for action executor
   [junit4]   2> 1131535 DEBUG (TEST-TestSimPolicyCloud.testDataProvider-seed#[7C056A298B5F7FEC]) [    ] o.a.s.c.a.ScheduledTriggers Awaiting termination for scheduled thread pool executor
   [junit4]   2> 1131535 DEBUG (TEST-TestSimPolicyCloud.testDataProvider-seed#[7C056A298B5F7FEC]) [    ] o.a.s.c.a.ScheduledTriggers ScheduledTriggers closed completely
   [junit4]   2> 1131536 DEBUG (TEST-TestSimPolicyCloud.testDataProvider-seed#[7C056A298B5F7FEC]) [    ] o.a.s.c.a.OverseerTriggerThread OverseerTriggerThread has been closed explicitly
   [junit4]   2> 1131536 DEBUG (Simulated OverseerAutoScalingTriggerThread) [    ] o.a.s.c.a.OverseerTriggerThread Adding .auto_add_replicas and .scheduled_maintenance triggers
   [junit4]   2> 1131536 DEBUG (Simulated OverseerAutoScalingTriggerThread) [    ] o.a.s.c.a.OverseerTriggerThread Refreshing /autoscaling.json with znode version 2
   [junit4]   2> 1131536 DEBUG (Simulated OverseerAutoScalingTriggerThread) [    ] o.a.s.c.a.OverseerTriggerThread Current znodeVersion 2, lastZnodeVersion -1
   [junit4]   2> 1131536 DEBUG (Simulated OverseerAutoScalingTriggerThread) [    ] o.a.s.c.a.OverseerTriggerThread Processed trigger updates upto znodeVersion 2
   [junit4]   2> 1131537 DEBUG (Simulated OverseerAutoScalingTriggerThread) [    ] o.a.s.c.a.NodeLostTrigger NodeLostTrigger .auto_add_replicas - Initial livenodes: [127.0.0.1:10001_solr, 127.0.0.1:10004_solr, 127.0.0.1:10000_solr, 127.0.0.1:10002_solr, 127.0.0.1:10003_solr]
   [junit4]   2> 1131537 DEBUG (Simulated OverseerAutoScalingTriggerThread) [    ] o.a.s.c.a.OverseerTriggerThread -- clean old nodeAdded markers
   [junit4]   2> 1131537 DEBUG (Simulated OverseerAutoScalingTriggerThread) [    ] o.a.s.c.a.OverseerTriggerThread Current znodeVersion 2, lastZnodeVersion 2
   [junit4]   2> 1131537 DEBUG (ScheduledTrigger-4371-thread-2) [    ] o.a.s.c.a.NodeLostTrigger Running NodeLostTrigger: .auto_add_replicas with currently live nodes: 5
   [junit4]   2> 1131567 DEBUG (ScheduledTrigger-4371-thread-3) [    ] o.a.s.c.a.NodeLostTrigger Running NodeLostTrigger: .auto_add_replicas with currently live nodes: 5
   [junit4]   2> 1131597 DEBUG (ScheduledTrigger-4371-thread-1) [    ] o.a.s.c.a.NodeLostTrigger Running NodeLostTrigger: .auto_add_replicas with currently live nodes: 5
   [junit4]   2> 1131627 DEBUG (ScheduledTrigger-4371-thread-3) [    ] o.a.s.c.a.NodeLostTrigger Running NodeLostTrigger: .auto_add_replicas with currently live nodes: 5
   [junit4]   2> 1131658 DEBUG (ScheduledTrigger-4371-thread-3) [    ] o.a.s.c.a.NodeLostTrigger Running NodeLostTrigger: .auto_add_replicas with currently live nodes: 5
   [junit4]   2> 1131680 DEBUG (ScheduledTrigger-4371-thread-3) [    ] o.a.s.c.a.NodeLostTrigger Running NodeLostTrigger: .auto_add_replicas with currently live nodes: 5
   [junit4]   2> 1131680 DEBUG (simCloudManagerPool-4370-thread-2) [    ] o.a.s.c.a.s.SimClusterStateProvider -- submit leader election for policiesTest / shard1
   [junit4]   2> 1131680 DEBUG (simCloudManagerPool-4370-thread-4) [    ] o.a.s.c.a.s.SimClusterStateProvider Running leader election for policiesTest / shard1
   [junit4]   2> 1131685 DEBUG (simCloudManagerPool-4370-thread-4) [    ] o.a.s.c.a.s.SimClusterStateProvider -- elected new leader for policiesTest / shard1: core_node1
   [junit4]   2> 1131696 DEBUG (simCloudManagerPool-4370-thread-3) [    ] o.a.s.c.a.s.SimClusterStateProvider -- already has leader policiesTest / shard1
   [junit4]   2> 1131707 DEBUG (ScheduledTrigger-4371-thread-3) [    ] o.a.s.c.a.NodeLostTrigger Running NodeLostTrigger: .auto_add_replicas with currently live nodes: 5
   [junit4]   2> 1131732 INFO  (TEST-TestSimPolicyCloud.testDataProvider-seed#[7C056A298B5F7FEC]) [    ] o.a.s.SolrTestCaseJ4 ###Ending testDataProvider
   [junit4]   2> 1131735 INFO  (TEST-TestSimPolicyCloud.testDataProvider-seed#[7C056A298B5F7FEC]) [    ] o.a.s.c.a.s.SimSolrCloudTestCase #######################################
   [junit4]   2> ############ CLUSTER STATE ############
   [junit4]   2> #######################################
   [junit4]   2> ## Live nodes:		5
   [junit4]   2> ## Empty nodes:	3
   [junit4]   2> ## Dead nodes:		0
   [junit4]   2> ## Collections:	[policiesTest]
   [junit4]   2> ## Max replicas per node:	1
   [junit4]   2> ## Min replicas per node:	0
   [junit4]   2> ## Total replicas:		2
   [junit4]   2> ## * policiesTest		2
   [junit4]   2> ##		- active           2
   [junit4]   2> ######### Solr op counts ##########
   [junit4]   2> ##		- ADDROLE            1
   [junit4]   2> ##		- CREATE             1
   [junit4]   2> ######### Autoscaling event counts ###########
   [junit4]   2> 
   [junit4]   2> 1131736 DEBUG (ScheduledTrigger-4371-thread-3) [    ] o.a.s.c.a.NodeLostTrigger Running NodeLostTrigger: .auto_add_replicas with currently live nodes: 5
   [junit4]   2> 1131740 INFO  (TEST-TestSimPolicyCloud.testCreateCollectionAddShardWithReplicaTypeUsingPolicy-seed#[7C056A298B5F7FEC]) [    ] o.a.s.SolrTestCaseJ4 ###Starting testCreateCollectionAddShardWithReplicaTypeUsingPolicy
   [junit4]   2> 1131740 DEBUG (TEST-TestSimPolicyCloud.testCreateCollectionAddShardWithReplicaTypeUsingPolicy-seed#[7C056A298B5F7FEC]) [    ] o.a.s.c.a.OverseerTriggerThread Refreshing /autoscaling.json with znode version 3
   [junit4]   2> 1131740 DEBUG (Simulated OverseerAutoScalingTriggerThread) [    ] o.a.s.c.a.OverseerTriggerThread Processed trigger updates upto znodeVersion 3
   [junit4]   2> 1131740 INFO  (TEST-TestSimPolicyCloud.testCreateCollectionAddShardWithReplicaTypeUsingPolicy-seed#[7C056A298B5F7FEC]) [    ] o.a.s.c.a.s.SimCloudManager === Restarting OverseerTriggerThread and clearing object cache...
   [junit4]   2> 1131740 DEBUG (Simulated OverseerAutoScalingTriggerThread) [    ] o.a.s.c.a.OverseerTriggerThread -- clean old nodeLost markers
   [junit4]   2> 1131740 DEBUG (Simulated OverseerAutoScalingTriggerThread) [    ] o.a.s.c.a.OverseerTriggerThread -- clean old nodeAdded markers
   [junit4]   2> 1131741 DEBUG (TEST-TestSimPolicyCloud.testCreateCollectionAddShardWithReplicaTypeUsingPolicy-seed#[7C056A298B5F7FEC]) [    ] o.a.s.c.a.ScheduledTriggers Shutting down scheduled thread pool executor now
   [junit4]   2> 1131740 WARN  (Simulated OverseerAutoScalingTriggerThread) [    ] o.a.s.c.a.OverseerTriggerThread Interrupted
   [junit4]   2> java.lang.InterruptedException: null
   [junit4]   2> 	at java.util.concurrent.locks.AbstractQueuedSynchronizer.acquireInterruptibly(AbstractQueuedSynchronizer.java:1220) ~[?:1.8.0_172]
   [junit4]   2> 	at java.util.concurrent.locks.ReentrantLock.lockInterruptibly(ReentrantLock.java:335) ~[?:1.8.0_172]
   [junit4]   2> 	at org.apache.solr.cloud.autoscaling.OverseerTriggerThread.run(OverseerTriggerThread.java:177) [java/:?]
   [junit4]   2> 	at java.lang.Thread.run(Thread.java:748) [?:1.8.0_172]
   [junit4]   2> 1131741 DEBUG (TEST-TestSimPolicyCloud.testCreateCollectionAddShardWithReplicaTypeUsingPolicy-seed#[7C056A298B5F7FEC]) [    ] o.a.s.c.a.ScheduledTriggers Shutting down action executor now
   [junit4]   2> 1131741 DEBUG (TEST-TestSimPolicyCloud.testCreateCollectionAddShardWithReplicaTypeUsingPolicy-seed#[7C056A298B5F7FEC]) [    ] o.a.s.c.a.ScheduledTriggers Awaiting termination for action executor
   [junit4]   2> 1131741 DEBUG (TEST-TestSimPolicyCloud.testCreateCollectionAddShardWithReplicaTypeUsingPolicy-seed#[7C056A298B5F7FEC]) [    ] o.a.s.c.a.ScheduledTriggers Awaiting termination for scheduled thread pool executor
   [junit4]   2> 1131741 DEBUG (TEST-TestSimPolicyCloud.testCreateCollectionAddShardWithReplicaTypeUsingPolicy-seed#[7C056A298B5F7FEC]) [    ] o.a.s.c.a.ScheduledTriggers ScheduledTriggers closed completely
   [junit4]   2> 1131741 DEBUG (TEST-TestSimPolicyCloud.testCreateCollectionAddShardWithReplicaTypeUsingPolicy-seed#[7C056A298B5F7FEC]) [    ] o.a.s.c.a.OverseerTriggerThread OverseerTriggerThread has been closed explicitly
   [junit4]   2> 1131743 DEBUG (Simulated OverseerAutoScalingTriggerThread) [    ] o.a.s.c.a.OverseerTriggerThread Adding .auto_add_replicas and .scheduled_maintenance triggers
   [junit4]   2> 1131743 DEBUG (Simulated OverseerAutoScalingTriggerThread) [    ] o.a.s.c.a.OverseerTriggerThread Refreshing /autoscaling.json with znode version 4
   [junit4]   2> 1131743 DEBUG (Simulated OverseerAutoScalingTriggerThread) [    ] o.a.s.c.a.OverseerTriggerThread Current znodeVersion 4, lastZnodeVersion -1
   [junit4]   2> 1131743 DEBUG (Simulated OverseerAutoScalingTriggerThread) [    ] o.a.s.c.a.OverseerTriggerThread Processed trigger updates upto znodeVersion 4
   [junit4]   2> 1131744 DEBUG (Simulated OverseerAutoScalingTriggerThread) [    ] o.a.s.c.a.NodeLostTrigger NodeLostTrigger .auto_add_replicas - Initial livenodes: [127.0.0.1:10001_solr, 127.0.0.1:10004_solr, 127.0.0.1:10000_solr, 127.0.0.1:10002_solr, 127.0.0.1:10003_solr]
   [junit4]   2> 1131744 DEBUG (Simulated OverseerAutoScalingTriggerThread) [    ] o.a.s.c.a.OverseerTriggerThread -- clean old nodeAdded markers
   [junit4]   2> 1131744 DEBUG (Simulated OverseerAutoScalingTriggerThread) [    ] o.a.s.c.a.OverseerTriggerThread Current znodeVersion 4, lastZnodeVersion 4
   [junit4]   2> 1131744 DEBUG (ScheduledTrigger-4374-thread-2) [    ] o.a.s.c.a.NodeLostTrigger Running NodeLostTrigger: .auto_add_replicas with currently live nodes: 5
   [junit4]   2> 1131767 DEBUG (ScheduledTrigger-4374-thread-3) [    ] o.a.s.c.a.NodeLostTrigger Running NodeLostTrigger: .auto_add_replicas with currently live nodes: 5
   [junit4]   2> 1131796 DEBUG (ScheduledTrigger-4374-thread-1) [    ] o.a.s.c.a.NodeLostTrigger Running NodeLostTrigger: .auto_add_replicas with currently live nodes: 5
   [junit4]   2> 1131827 DEBUG (ScheduledTrigger-4374-thread-3) [    ] o.a.s.c.a.NodeLostTrigger Running NodeLostTrigger: .auto_add_replicas with currently live nodes: 5
   [junit4]   2> 1131846 INFO  (TEST-TestSimPolicyCloud.testCreateCollectionAddShardWithReplicaTypeUsingPolicy-seed#[7C056A298B5F7FEC]) [    ] o.a.s.c.a.s.TestSimPolicyCloud NRT 127.0.0.1:10001_solr PULL 127.0.0.1:10004_solr , TLOG 127.0.0.1:10004_solr 
   [junit4]   2> 1131848 DEBUG (simCloudManagerPool-4373-thread-1) [    ] o.a.s.c.a.AutoScalingHandler Verified autoscaling configuration
   [junit4]   2> 1131848 DEBUG (simCloudManagerPool-4373-thread-1) [    ] o.a.s.c.a.OverseerTriggerThread Refreshing /autoscaling.json with znode version 5
   [junit4]   2> 1131849 DEBUG (Simulated OverseerAutoScalingTriggerThread) [    ] o.a.s.c.a.OverseerTriggerThread Processed trigger updates upto znodeVersion 5
   [junit4]   2> 1131849 DEBUG (ScheduledTrigger-4374-thread-3) [    ] o.a.s.c.a.NodeLostTrigger Running NodeLostTrigger: .auto_add_replicas with currently live nodes: 5
   [junit4]   2> 1131849 DEBUG (Simulated OverseerAutoScalingTriggerThread) [    ] o.a.s.c.a.OverseerTriggerThread -- clean old nodeAdded markers
   [junit4]   2> 1131849 DEBUG (Simulated OverseerAutoScalingTriggerThread) [    ] o.a.s.c.a.OverseerTriggerThread Current znodeVersion 5, lastZnodeVersion 5
   [junit4]   2> 1131869 INFO  (simCloudManagerPool-4373-thread-2) [    ] o.a.s.c.s.c.a.PolicyHelper returnSession, curr-time 4494252240 sessionWrapper.createTime 4494252105923838, this.sessionWrapper.createTime 4494252105923838 
   [junit4]   2> 1131879 DEBUG (ScheduledTrigger-4374-thread-2) [    ] o.a.s.c.a.NodeLostTrigger Running NodeLostTrigger: .auto_add_replicas with currently live nodes: 5
   [junit4]   2> 1131880 DEBUG (simCloudManagerPool-4373-thread-3) [    ] o.a.s.c.a.s.SimClusterStateProvider -- submit leader election for policiesTest / s1
   [junit4]   2> 1131880 DEBUG (simCloudManagerPool-4373-thread-6) [    ] o.a.s.c.a.s.SimClusterStateProvider Running leader election for policiesTest / s1
   [junit4]   2> 1131880 DEBUG (simCloudManagerPool-4373-thread-6) [    ] o.a.s.c.a.s.SimClusterStateProvider -- elected new leader for policiesTest / s1: core_node3
   [junit4]   2> 1131895 DEBUG (simCloudManagerPool-4373-thread-4) [    ] o.a.s.c.a.s.SimClusterStateProvider -- already has leader policiesTest / s1
   [junit4]   2> 1131900 DEBUG (ScheduledTrigger-4374-thread-4) [    ] o.a.s.c.a.NodeLostTrigger Running NodeLostTrigger: .auto_add_replicas with currently live nodes: 5
   [junit4]   2> 1131908 DEBUG (simCloudManagerPool-4373-thread-5) [    ] o.a.s.c.a.s.SimClusterStateProvider -- already has leader policiesTest / s1
   [junit4]   2> 1131926 DEBUG (ScheduledTrigger-4374-thread-3) [    ] o.a.s.c.a.NodeLostTrigger Running NodeLostTrigger: .auto_add_replicas with currently live nodes: 5
   [junit4]   2> 1131956 DEBUG (ScheduledTrigger-4374-thread-1) [    ] o.a.s.c.a.NodeLostTrigger Running NodeLostTrigger: .auto_add_replicas with currently live nodes: 5
   [junit4]   2> 1131986 DEBUG (ScheduledTrigger-4374-thread-4) [    ] o.a.s.c.a.NodeLostTrigger Running NodeLostTrigger: .auto_add_replicas with currently live nodes: 5
   [junit4]   2> 1132016 DEBUG (ScheduledTrigger-4374-thread-1) [    ] o.a.s.c.a.NodeLostTrigger Running NodeLostTrigger: .auto_add_replicas with currently live nodes: 5
   [junit4]   2> 1132022 INFO  (simCloudManagerPool-4373-thread-7) [    ] o.a.s.c.s.c.a.PolicyHelper returnSession, curr-time 4494259905 sessionWrapper.createTime 4494259738949388, this.sessionWrapper.createTime 4494259738949388 
   [junit4]   2> 1132042 DEBUG (ScheduledTrigger-4374-thread-2) [    ] o.a.s.c.a.NodeLostTrigger Running NodeLostTrigger: .auto_add_replicas with currently live nodes: 5
   [junit4]   2> 1132067 DEBUG (ScheduledTrigger-4374-thread-3) [    ] o.a.s.c.a.NodeLostTrigger Running NodeLostTrigger: .auto_add_replicas with currently live nodes: 5
   [junit4]   2> 1132067 DEBUG (simCloudManagerPool-4373-thread-7) [    ] o.a.s.c.a.s.SimClusterStateProvider -- submit leader election for policiesTest / s3
   [junit4]   2> 1132068 DEBUG (simCloudManagerPool-4373-thread-7) [    ] o.a.s.c.a.s.SimClusterStateProvider -- already has leader policiesTest / s1
   [junit4]   2> 1132068 DEBUG (simCloudManagerPool-4373-thread-8) [    ] o.a.s.c.a.s.SimClusterStateProvider Running leader election for policiesTest / s3
   [junit4]   2> 1132069 DEBUG (simCloudManagerPool-4373-thread-8) [    ] o.a.s.c.a.s.SimClusterStateProvider -- elected new leader for policiesTest / s3: core_node6
   [junit4]   2> 1132069 INFO  (TEST-TestSimPolicyCloud.testCreateCollectionAddShardWithReplicaTypeUsingPolicy-seed#[7C056A298B5F7FEC]) [    ] o.a.s.SolrTestCaseJ4 ###Ending testCreateCollectionAddShardWithReplicaTypeUsingPolicy
   [junit4]   2> 1132069 INFO  (TEST-TestSimPolicyCloud.testCreateCollectionAddShardWithReplicaTypeUsingPolicy-seed#[7C056A298B5F7FEC]) [    ] o.a.s.c.a.s.SimSolrCloudTestCase #######################################
   [junit4]   2> ############ CLUSTER STATE ############
   [junit4]   2> #######################################
   [junit4]   2> ## Live nodes:		5
   [junit4]   2> ## Empty nodes:	3
   [junit4]   2> ## Dead nodes:		0
   [junit4]   2> ## Collections:	[policiesTest]
   [junit4]   2> ## Max replicas per node:	4
   [junit4]   2> ## Min replicas per node:	0
   [junit4]   2> ## Total replicas:		6
   [junit4]   2> ## * policiesTest		6
   [junit4]   2> ##		- active           6
   [junit4]   2> ######### Solr op counts ##########
   [junit4]   2> ##		- CREATE             1
   [junit4]   2> ##		- CREATESHARD        1
   [junit4]   2> ##		- autoscaling        1
   [junit4]   2> ######### Autoscaling event counts ###########
   [junit4]   2> 
   [junit4]   2> 1132076 INFO  (TEST-TestSimPolicyCloud.testCreateCollectionAddShardUsingPolicy-seed#[7C056A298B5F7FEC]) [    ] o.a.s.SolrTestCaseJ4 ###Starting testCreateCollectionAddShardUsingPolicy
   [junit4]   2> 1132076 DEBUG (TEST-TestSimPolicyCloud.testCreateCollectionAddShardUsingPolicy-seed#[7C056A298B5F7FEC]) [    ] o.a.s.c.a.OverseerTriggerThread Refreshing /autoscaling.json with znode version 6
   [junit4]   2> 1132076 DEBUG (Simulated OverseerAutoScalingTriggerThread) [    ] o.a.s.c.a.OverseerTriggerThread Processed trigger updates upto znodeVersion 6
   [junit4]   2> 1132076 INFO  (TEST-TestSimPolicyCloud.testCreateCollectionAddShardUsingPolicy-seed#[7C056A298B5F7FEC]) [    ] o.a.s.c.a.s.SimCloudManager === Restarting OverseerTriggerThread and clearing object cache...
   [junit4]   2> 1132077 DEBUG (TEST-TestSimPolicyCloud.testCreateCollectionAddShardUsingPolicy-seed#[7C056A298B5F7FEC]) [    ] o.a.s.c.a.ScheduledTriggers Shutting down scheduled thread pool executor now
   [junit4]   2> 1132077 DEBUG (Simulated OverseerAutoScalingTriggerThread) [    ] o.a.s.c.a.OverseerTriggerThread -- clean old nodeLost markers
   [junit4]   2> 1132077 DEBUG (Simulated OverseerAutoScalingTriggerThread) [    ] o.a.s.c.a.OverseerTriggerThread -- clean old nodeAdded markers
   [junit4]   2> 1132077 DEBUG (TEST-TestSimPolicyCloud.testCreateCollectionAddShardUsingPolicy-seed#[7C056A298B5F7FEC]) [    ] o.a.s.c.a.ScheduledTriggers Shutting down action executor now
   [junit4]   2> 1132077 DEBUG (TEST-TestSimPolicyCloud.testCreateCollectionAddShardUsingPolicy-seed#[7C056A298B5F7FEC]) [    ] o.a.s.c.a.ScheduledTriggers Awaiting termination for action executor
   [junit4]   2> 1132077 DEBUG (TEST-TestSimPolicyCloud.testCreateCollectionAddShardUsingPolicy-seed#[7C056A298B5F7FEC]) [    ] o.a.s.c.a.ScheduledTriggers Awaiting termination for scheduled thread pool executor
   [junit4]   2> 1132077 WARN  (Simulated OverseerAutoScalingTriggerThread) [    ] o.a.s.c.a.OverseerTriggerThread Interrupted
   [junit4]   2> java.lang.InterruptedException: null
   [junit4]   2> 	at java.util.concurrent.locks.AbstractQueuedSynchronizer.acquireInterruptibly(AbstractQueuedSynchronizer.java:1220) ~[?:1.8.0_172]
   [junit4]   2> 	at java.util.concurrent.locks.ReentrantLock.lockInterruptibly(ReentrantLock.java:335) ~[?:1.8.0_172]
   [junit4]   2> 	at org.apache.solr.cloud.autoscaling.OverseerTriggerThread.run(OverseerTriggerThread.java:177) [java/:?]
   [junit4]   2> 	at java.lang.Thread.run(Thread.java:748) [?:1.8.0_172]
   [junit4]   2> 1132077 DEBUG (TEST-TestSimPolicyCloud.testCreateCollectionAddShardUsingPolicy-seed#[7C056A298B5F7FEC]) [    ] o.a.s.c.a.ScheduledTriggers ScheduledTriggers closed completely
   [junit4]   2> 1132077 DEBUG (TEST-TestSimPolicyCloud.testCreateCollectionAddShardUsingPolicy-seed#[7C056A298B5F7FEC]) [    ] o.a.s.c.a.OverseerTriggerThread OverseerTriggerThread has been closed explicitly
   [junit4]   2> 1132079 DEBUG (Simulated OverseerAutoScalingTriggerThread) [    ] o.a.s.c.a.OverseerTriggerThread Adding .auto_add_replicas and .scheduled_maintenance triggers
   [junit4]   2> 1132079 DEBUG (Simulated OverseerAutoScalingTriggerThread) [    ] o.a.s.c.a.OverseerTriggerThread Refreshing /autoscaling.json with znode version 7
   [junit4]   2> 1132080 DEBUG (Simulated OverseerAutoScalingTriggerThread) [    ] o.a.s.c.a.OverseerTriggerThread Current znodeVersion 7, lastZnodeVersion -1
   [junit4]   2> 1132080 DEBUG (Simulated OverseerAutoScalingTriggerThread) [    ] o.a.s.c.a.OverseerTriggerThread Processed trigger updates upto znodeVersion 7
   [junit4]   2> 1132080 DEBUG (Simulated OverseerAutoScalingTriggerThread) [    ] o.a.s.c.a.NodeLostTrigger NodeLostTrigger .auto_add_replicas - Initial livenodes: [127.0.0.1:10001_solr, 127.0.0.1:10004_solr, 127.0.0.1:10000_solr, 127.0.0.1:10002_solr, 127.0.0.1:10003_solr]
   [junit4]   2> 1132080 DEBUG (Simulated OverseerAutoScalingTriggerThread) [    ] o.a.s.c.a.OverseerTriggerThread -- clean old nodeAdded markers
   [junit4]   2> 1132080 DEBUG (Simulated OverseerAutoScalingTriggerThread) [    ] o.a.s.c.a.OverseerTriggerThread Current znodeVersion 7, lastZnodeVersion 7
   [junit4]   2> 1132081 DEBUG (ScheduledTrigger-4377-thread-2) [    ] o.a.s.c.a.NodeLostTrigger Running NodeLostTrigger: .auto_add_replicas with currently live nodes: 5
   [junit4]   2> 1132111 DEBUG (ScheduledTrigger-4377-thread-1) [    ] o.a.s.c.a.NodeLostTrigger Running NodeLostTrigger: .auto_add_replicas with currently live nodes: 5
   [junit4]   2> 1132138 DEBUG (ScheduledTrigger-4377-thread-4) [    ] o.a.s.c.a.NodeLostTrigger Running NodeLostTrigger: .auto_add_replicas with currently live nodes: 5
   [junit4]   2> 1132163 DEBUG (ScheduledTrigger-4377-thread-4) [    ] o.a.s.c.a.NodeLostTrigger Running NodeLostTrigger: .auto_add_replicas with currently live nodes: 5
   [junit4]   2> 1132187 DEBUG (ScheduledTrigger-4377-thread-4) [    ] o.a.s.c.a.NodeLostTrigger Running NodeLostTrigger: .auto_add_replicas with currently live nodes: 5
   [junit4]   2> 1132188 DEBUG (simCloudManagerPool-4376-thread-1) [    ] o.a.s.c.a.AutoScalingHandler Verified autoscaling configuration
   [junit4]   2> 1132188 DEBUG (simCloudManagerPool-4376-thread-1) [    ] o.a.s.c.a.OverseerTriggerThread Refreshing /autoscaling.json with znode version 8
   [junit4]   2> 1132189 DEBUG (Simulated OverseerAutoScalingTriggerThread) [    ] o.a.s.c.a.OverseerTriggerThread Processed trigger updates upto znodeVersion 8
   [junit4]   2> 1132189 DEBUG (Simulated OverseerAutoScalingTriggerThread) [    ] o.a.s.c.a.OverseerTriggerThread -- clean old nodeAdded markers
   [junit4]   2> 1132189 DEBUG (Simulated OverseerAutoScalingTriggerThread) [    ] o.a.s.c.a.OverseerTriggerThread Current znodeVersion 8, lastZnodeVersion 8
   [junit4]   2> 1132207 DEBUG (ScheduledTrigger-4377-thread-4) [    ] o.a.s.c.a.NodeLostTrigger Running NodeLostTrigger: .auto_add_replicas with currently live nodes: 5
   [junit4]   2> 1132207 INFO  (simCloudManagerPool-4376-thread-2) [    ] o.a.s.c.s.c.a.PolicyHelper returnSession, curr-time 4494269156 sessionWrapper.createTime 4494269051306138, this.sessionWrapper.createTime 4494269051306138 
   [junit4]   2> 1132224 DEBUG (simCloudManagerPool-4376-thread-3) [    ] o.a.s.c.a.s.SimClusterStateProvider -- submit leader election for policiesTest / s1
   [junit4]   2> 1132224 DEBUG (simCloudManagerPool-4376-thread-3) [    ] o.a.s.c.a.s.SimClusterStateProvider -- no replicas in policiesTest / s2
   [junit4]   2> 1132224 DEBUG (simCloudManagerPool-4376-thread-5) [    ] o.a.s.c.a.s.SimClusterStateProvider Running leader election for policiesTest / s1
   [junit4]   2> 1132224 DEBUG (simCloudManagerPool-4376-thread-5) [    ] o.a.s.c.a.s.SimClusterStateProvider -- elected new leader for policiesTest / s1: core_node9
   [junit4]   2> 1132228 DEBUG (ScheduledTrigger-4377-thread-4) [    ] o.a.s.c.a.NodeLostTrigger Running NodeLostTrigger: .auto_add_replicas with currently live nodes: 5
   [junit4]   2> 1132240 DEBUG (simCloudManagerPool-4376-thread-4) [    ] o.a.s.c.a.s.SimClusterStateProvider -- already has leader policiesTest / s1
   [junit4]   2> 1132240 DEBUG (simCloudManagerPool-4376-thread-4) [    ] o.a.s.c.a.s.SimClusterStateProvider -- submit leader election for policiesTest / s2
   [junit4]   2> 1132241 DEBUG (simCloudManagerPool-4376-thread-6) [    ] o.a.s.c.a.s.SimClusterStateProvider Running leader election for policiesTest / s2
   [junit4]   2> 1132241 DEBUG (simCloudManagerPool-4376-thread-6) [    ] o.a.s.c.a.s.SimClusterStateProvider -- elected new leader for policiesTest / s2: core_node10
   [junit4]   2> 1132258 DEBUG (ScheduledTrigger-4377-thread-4) [    ] o.a.s.c.a.NodeLostTrigger Running NodeLostTrigger: .auto_add_replicas with currently live nodes: 5
   [junit4]   2> 1132280 DEBUG (ScheduledTrigger-4377-thread-4) [    ] o.a.s.c.a.NodeLostTrigger Running NodeLostTrigger: .auto_add_replicas with currently live nodes: 5
   [junit4]   2> 1132300 DEBUG (ScheduledTrigger-4377-thread-4) [    ] o.a.s.c.a.NodeLostTrigger Running NodeLostTrigger: .auto_add_replicas with currently live nodes: 5
   [junit4]   2> 1132330 DEBUG (ScheduledTrigger-4377-thread-3) [    ] o.a.s.c.a.NodeLostTrigger Running NodeLostTrigger: .auto_add_replicas with currently live nodes: 5
   [junit4]   2> 1132352 DEBUG (ScheduledTrigger-4377-thread-2) [    ] o.a.s.c.a.NodeLostTrigger Running NodeLostTrigger: .auto_add_replicas with currently live nodes: 5
   [junit4]   2> 1132354 INFO  (simCloudManagerPool-4376-thread-7) [    ] o.a.s.c.s.c.a.PolicyHelper returnSession, curr-time 4494276479 sessionWrapper.createTime 4494276441884738, this.sessionWrapper.createTime 4494276441884738 
   [junit4]   2> 1132369 DEBUG (simCloudManagerPool-4376-thread-7) [    ] o.a.s.c.a.s.SimClusterStateProvider -- submit leader election for policiesTest / s3
   [junit4]   2> 1132370 DEBUG (simCloudManagerPool-4376-thread-7) [    ] o.a.s.c.a.s.SimClusterStateProvider -- already has leader policiesTest / s1
   [junit4]   2> 1132370 DEBUG (simCloudManagerPool-4376-thread-7) [    ] o.a.s.c.a.s.SimClusterStateProvider -- already has leader policiesTest / s2
   [junit4]   2> 1132370 DEBUG (simCloudManagerPool-4376-thread-8) [    ] o.a.s.c.a.s.SimClusterStateProvider Running leader election for policiesTest / s3
   [junit4]   2> 1132370 DEBUG (simCloudManagerPool-4376-thread-8) [    ] o.a.s.c.a.s.SimClusterStateProvider -- elected new leader for policiesTest / s3: core_node11
   [junit4]   2> 1132371 INFO  (TEST-TestSimPolicyCloud.testCreateCollectionAddShardUsingPolicy-seed#[7C056A298B5F7FEC]) [    ] o.a.s.SolrTestCaseJ4 ###Ending testCreateCollectionAddShardUsingPolicy
   [junit4]   2> 1132371 INFO  (TEST-TestSimPolicyCloud.testCreateCollectionAddShardUsingPolicy-seed#[7C056A298B5F7FEC]) [    ] o.a.s.c.a.s.SimSolrCloudTestCase #######################################
   [junit4]   2> ############ CLUSTER STATE ############
   [junit4]   2> #######################################
   [junit4]   2> ## Live nodes:		5
   [junit4]   2> ## Empty nodes:	4
   [junit4]   2> ## Dead nodes:		0
   [junit4]   2> ## Collections:	[policiesTest]
   [junit4]   2> ## Max replicas per node:	3
   [junit4]   2> ## Min replicas per node:	0
   [junit4]   2> ## Total replicas:		3
   [junit4]   2> ## * policiesTest		3
   [junit4]   2> ##		- active           3
   [junit4]   2> ######### Solr op counts ##########
   [junit4]   2> ##		- CREATE             1
   [junit4]   2> ##		- CREATESHARD        1
   [junit4]   2> ##		- autoscaling        1
   [junit4]   2> ######### Autoscaling event counts ###########
   [junit4]   2> 
   [junit4]   2> 1132372 DEBUG (ScheduledTrigger-4377-thread-1) [    ] o.a.s.c.a.NodeLostTrigger Running NodeLostTrigger: .auto_add_replicas with currently live nodes: 5
   [junit4]   2> 1132376 INFO  (TEST-TestSimPolicyCloud.testCreateCollectionAddReplica-seed#[7C056A298B5F7FEC]) [    ] o.a.s.SolrTestCaseJ4 ###Starting testCreateCollectionAddReplica
   [junit4]   2> 1132376 DEBUG (TEST-TestSimPolicyCloud.testCreateCollectionAddReplica-seed#[7C056A298B5F7FEC]) [    ] o.a.s.c.a.OverseerTriggerThread Refreshing /autoscaling.json with znode version 9
   [junit4]   2> 1132376 DEBUG (Simulated OverseerAutoScalingTriggerThread) [    ] o.a.s.c.a.OverseerTriggerThread Processed trigger updates upto znodeVersion 9
   [junit4]   2> 1132376 INFO  (TEST-TestSimPolicyCloud.testCreateCollectionAddReplica-seed#[7C056A298B5F7FEC]) [    ] o.a.s.c.a.s.SimCloudManager === Restarting OverseerTriggerThread and clearing object cache...
   [junit4]   2> 1132376 DEBUG (Simulated OverseerAutoScalingTriggerThread) [    ] o.a.s.c.a.OverseerTriggerThread -- clean old nodeLost markers
   [junit4]   2> 1132376 DEBUG (Simulated OverseerAutoScalingTriggerThread) [    ] o.a.s.c.a.OverseerTriggerThread -- clean old nodeAdded markers
   [junit4]   2> 1132377 DEBUG (TEST-TestSimPolicyCloud.testCreateCollectionAddReplica-seed#[7C056A298B5F7FEC]) [    ] o.a.s.c.a.ScheduledTriggers Shutting down scheduled thread pool executor now
   [junit4]   2> 1132377 DEBUG (TEST-TestSimPolicyCloud.testCreateCollectionAddReplica-seed#[7C056A298B5F7FEC]) [    ] o.a.s.c.a.ScheduledTriggers Shutting down action executor now
   [junit4]   2> 1132377 DEBUG (TEST-TestSimPolicyCloud.testCreateCollectionAddReplica-seed#[7C056A298B5F7FEC]) [    ] o.a.s.c.a.ScheduledTriggers Awaiting termination for action executor
   [junit4]   2> 1132377 DEBUG (TEST-TestSimPolicyCloud.testCreateCollectionAddReplica-seed#[7C056A298B5F7FEC]) [    ] o.a.s.c.a.ScheduledTriggers Awaiting termination for scheduled thread pool executor
   [junit4]   2> 1132376 WARN  (Simulated OverseerAutoScalingTriggerThread) [    ] o.a.s.c.a.OverseerTriggerThread Interrupted
   [junit4]   2> java.lang.InterruptedException: null
   [junit4]   2> 	at java.util.concurrent.locks.AbstractQueuedSynchronizer.acquireInterruptibly(AbstractQueuedSynchronizer.java:1220) ~[?:1.8.0_172]
   [junit4]   2> 	at java.util.concurrent.locks.ReentrantLock.lockInterruptibly(ReentrantLock.java:335) ~[?:1.8.0_172]
   [junit4]   2> 	at org.apache.solr.cloud.autoscaling.OverseerTriggerThread.run(OverseerTriggerThread.java:177) [java/:?]
   [junit4]   2> 	at java.lang.Thread.run(Thread.java:748) [?:1.8.0_172]
   [junit4]   2> 1132378 DEBUG (TEST-TestSimPolicyCloud.testCreateCollectionAddReplica-seed#[7C056A298B5F7FEC]) [    ] o.a.s.c.a.ScheduledTriggers ScheduledTriggers closed completely
   [junit4]   2> 1132378 DEBUG (TEST-TestSimPolicyCloud.testCreateCollectionAddReplica-seed#[7C056A298B5F7FEC]) [    ] o.a.s.c.a.OverseerTriggerThread OverseerTriggerThread has been closed explicitly
   [junit4]   2> 1132379 DEBUG (Simulated OverseerAutoScalingTriggerThread) [    ] o.a.s.c.a.OverseerTriggerThread Adding .auto_add_replicas and .scheduled_maintenance triggers
   [junit4]   2> 1132380 DEBUG (Simulated OverseerAutoScalingTriggerThread) [    ] o.a.s.c.a.OverseerTriggerThread Refreshing /autoscaling.json with znode version 10
   [junit4]   2> 1132380 DEBUG (Simulated OverseerAutoScalingTriggerThread) [    ] o.a.s.c.a.OverseerTriggerThread Current znodeVersion 10, lastZnodeVersion -1
   [junit4]   2> 1132380 DEBUG (Simulated OverseerAutoScalingTriggerThread) [    ] o.a.s.c.a.OverseerTriggerThread Processed trigger updates upto znodeVersion 10
   [junit4]   2> 1132380 DEBUG (Simulated OverseerAutoScalingTriggerThread) [    ] o.a.s.c.a.NodeLostTrigger NodeLostTrigger .auto_add_replicas - Initial livenodes: [127.0.0.1:10001_solr, 127.0.0.1:10004_solr, 127.0.0.1:10000_solr, 127.0.0.1:10002_solr, 127.0.0.1:10003_solr]
   [junit4]   2> 1132380 DEBUG (Simulated OverseerAutoScalingTriggerThread) [    ] o.a.s.c.a.OverseerTriggerThread -- clean old nodeAdded markers
   [junit4]   2> 1132380 DEBUG (Simulated OverseerAutoScalingTriggerThread) [    ] o.a.s.c.a.OverseerTriggerThread Current znodeVersion 10, lastZnodeVersion 10
   [junit4]   2> 1132380 DEBUG (ScheduledTrigger-4380-thread-2) [    ] o.a.s.c.a.NodeLostTrigger Running NodeLostTrigger: .auto_add_replicas with currently live nodes: 5
   [junit4]   2> 1132403 DEBUG (ScheduledTrigger-4380-thread-3) [    ] o.a.s.c.a.NodeLostTrigger Running NodeLostTrigger: .auto_add_replicas with currently live nodes: 5
   [junit4]   2> 1132433 DEBUG (ScheduledTrigger-4380-thread-4) [    ] o.a.s.c.a.NodeLostTrigger Running NodeLostTrigger: .auto_add_replicas with currently live nodes: 5
   [junit4]   2> 1132456 DEBUG (ScheduledTrigger-4380-thread-3) [    ] o.a.s.c.a.NodeLostTrigger Running NodeLostTrigger: .auto_add_replicas with currently live nodes: 5
   [junit4]   2> 1132477 DEBUG (ScheduledTrigger-4380-thread-4) [    ] o.a.s.c.a.NodeLostTrigger Running NodeLostTrigger: .auto_add_replicas with currently live nodes: 5
   [junit4]   2> 1132483 DEBUG (simCloudManagerPool-4379-thread-1) [    ] o.a.s.c.a.AutoScalingHandler Verified autoscaling configuration
   [junit4]   2> 1132483 DEBUG (simCloudManagerPool-4379-thread-1) [    ] o.a.s.c.a.OverseerTriggerThread Refreshing /autoscaling.json with znode version 11
   [junit4]   2> 1132484 DEBUG (Simulated OverseerAutoScalingTriggerThread) [    ] o.a.s.c.a.OverseerTriggerThread Processed trigger updates upto znodeVersion 11
   [junit4]   2> 1132484 DEBUG (Simulated OverseerAutoScalingTriggerThread) [    ] o.a.s.c.a.OverseerTriggerThread -- clean old nodeAdded markers
   [junit4]   2> 1132484 DEBUG (Simulated OverseerAutoScalingTriggerThread) [    ] o.a.s.c.a.OverseerTriggerThread Current znodeVersion 11, lastZnodeVersion 11
   [junit4]   2> 1132498 DEBUG (ScheduledTrigger-4380-thread-3) [    ] o.a.s.c.a.NodeLostTrigger Running NodeLostTrigger: .auto_add_replicas with currently live nodes: 5
   [junit4]   2> 1132503 INFO  (simCloudManagerPool-4379-thread-2) [    ] o.a.s.c.s.c.a.PolicyHelper returnSession, curr-time 4494283956 sessionWrapper.createTime 4494283886701988, this.sessionWrapper.createTime 4494283886701988 
   [junit4]   2> 1132519 DEBUG (ScheduledTrigger-4380-thread-4) [    ] o.a.s.c.a.NodeLostTrigger Running NodeLostTrigger: .auto_add_replicas with currently live nodes: 5
   [junit4]   2> 1132519 DEBUG (simCloudManagerPool-4379-thread-3) [    ] o.a.s.c.a.s.SimClusterStateProvider -- submit leader election for testCreateCollectionAddReplica / shard1
   [junit4]   2> 1132520 DEBUG (simCloudManagerPool-4379-thread-4) [    ] o.a.s.c.a.s.SimClusterStateProvider Running leader election for testCreateCollectionAddReplica / shard1
   [junit4]   2> 1132520 DEBUG (simCloudManagerPool-4379-thread-4) [    ] o.a.s.c.a.s.SimClusterStateProvider -- elected new leader for testCreateCollectionAddReplica / shard1: core_node1
   [junit4]   2> 1132539 DEBUG (ScheduledTrigger-4380-thread-3) [    ] o.a.s.c.a.NodeLostTrigger Running NodeLostTrigger: .auto_add_replicas with currently live nodes: 5
   [junit4]   2> 1132567 DEBUG (ScheduledTrigger-4380-thread-4) [    ] o.a.s.c.a.NodeLostTrigger Running NodeLostTrigger: .auto_add_replicas with currently live nodes: 5
   [junit4]   2> 1132588 DEBUG (ScheduledTrigger-4380-thread-1) [    ] o.a.s.c.a.NodeLostTrigger Running NodeLostTrigger: .auto_add_replicas with currently live nodes: 5
   [junit4]   2> 1132609 DEBUG (ScheduledTrigger-4380-thread-1) [    ] o.a.s.c.a.NodeLostTrigger Running NodeLostTrigger: .auto_add_replicas with currently live nodes: 5
   [junit4]   2> 1132629 DEBUG (ScheduledTrigger-4380-thread-2) [    ] o.a.s.c.a.NodeLostTrigger Running NodeLostTrigger: .auto_add_replicas with currently live nodes: 5
   [junit4]   2> 1132659 DEBUG (ScheduledTrigger-4380-thread-3) [    ] o.a.s.c.a.NodeLostTrigger Running NodeLostTrigger: .auto_add_replicas with currently live nodes: 5
   [junit4]   2> 1132679 DEBUG (ScheduledTrigger-4380-thread-2) [    ] o.a.s.c.a.NodeLostTrigger Running NodeLostTrigger: .auto_add_replicas with currently live nodes: 5
   [junit4]   2> 1132700 DEBUG (ScheduledTrigger-4380-thread-3) [    ] o.a.s.c.a.NodeLostTrigger Running NodeLostTrigger: .auto_add_replicas with currently live nodes: 5
   [junit4]   2> 1132721 DEBUG (ScheduledTrigger-4380-thread-2) [    ] o.a.s.c.a.NodeLostTrigger Running NodeLostTrigger: .auto_add_replicas with currently live nodes: 5
   [junit4]   2> 1132744 DEBUG (ScheduledTrigger-4380-thread-1) [    ] o.a.s.c.a.NodeLostTrigger Running NodeLostTrigger: .auto_add_replicas with currently live nodes: 5
   [junit4]   2> 1132765 DEBUG (ScheduledTrigger-4380-thread-4) [    ] o.a.s.c.a.NodeLostTrigger Running NodeLostTrigger: .auto_add_replicas with currently live nodes: 5
   [junit4]   2> 1132787 DEBUG (ScheduledTrigger-4380-thread-1) [    ] o.a.s.c.a.NodeLostTrigger Running NodeLostTrigger: .auto_add_replicas with currently live nodes: 5
   [junit4]   2> 1132808 DEBUG (ScheduledTrigger-4380-thread-1) [    ] o.a.s.c.a.NodeLostTrigger Running NodeLostTrigger: .auto_add_replicas with currently live nodes: 5
   [junit4]   2> 1132837 DEBUG (ScheduledTrigger-4380-thread-1) [    ] o.a.s.c.a.NodeLostTrigger Running NodeLostTrigger: .auto_add_replicas with currently live nodes: 5
   [junit4]   2> 1132858 DEBUG (ScheduledTrigger-4380-thread-1) [    ] o.a.s.c.a.NodeLostTrigger Running NodeLostTrigger: .auto_add_replicas with currently live nodes: 5
   [junit4]   2> 1132885 DEBUG (ScheduledTrigger-4380-thread-1) [    ] o.a.s.c.a.NodeLostTrigger Running NodeLostTrigger: .auto_add_replicas with currently live nodes: 5
   [junit4]   2> 1132914 DEBUG (ScheduledTrigger-4380-thread-3) [    ] o.a.s.c.a.NodeLostTrigger Running NodeLostTrigger: .auto_add_replicas with currently live nodes: 5
   [junit4]   2> 1132936 DEBUG (ScheduledTrigger-4380-thread-3) [    ] o.a.s.c.a.NodeLostTrigger Running NodeLostTrigger: .auto_add_replicas with currently live nodes: 5
   [junit4]   2> 1132958 DEBUG (ScheduledTrigger-4380-thread-3) [    ] o.a.s.c.a.NodeLostTrigger Running NodeLostTrigger: .auto_add_replicas with currently live nodes: 5
   [junit4]   2> 1132985 DEBUG (ScheduledTrigger-4380-thread-3) [    ] o.a.s.c.a.NodeLostTrigger Running NodeLostTrigger: .auto_add_replicas with currently live nodes: 5
   [junit4]   2> 1133014 DEBUG (ScheduledTrigger-4380-thread-3) [    ] o.a.s.c.a.NodeLostTrigger Running NodeLostTrigger: .auto_add_replicas with currently live nodes: 5
   [junit4]   2> 1133041 DEBUG (ScheduledTrigger-4380-thread-3) [    ] o.a.s.c.a.NodeLostTrigger Running NodeLostTrigger: .auto_add_replicas with currently live nodes: 5
   [junit4]   2> 1133068 DEBUG (ScheduledTrigger-4380-thread-3) [    ] o.a.s.c.a.NodeLostTrigger Running NodeLostTrigger: .auto_add_replicas with currently live nodes: 5
   [junit4]   2> 1133088 DEBUG (ScheduledTrigger-4380-thread-3) [    ] o.a.s.c.a.NodeLostTrigger Running NodeLostTrigger: .auto_add_replicas with currently live nodes: 5
   [junit4]   2> 1133118 DEBUG (ScheduledTrigger-4380-thread-1) [    ] o.a.s.c.a.NodeLostTrigger Running NodeLostTrigger: .auto_add_replicas with currently live nodes: 5
   [junit4]   2> 1133138 DEBUG (ScheduledTrigger-4380-thread-2) [    ] o.a.s.c.a.NodeLostTrigger Running NodeLostTrigger: .auto_add_replicas with currently live nodes: 5
   [junit4]   2> 1133165 DEBUG (ScheduledTrigger-4380-thread-1) [    ] o.a.s.c.a.NodeLostTrigger Running NodeLostTrigger: .auto_add_replicas with currently live nodes: 5
   [junit4]   2> 1133191 DEBUG (ScheduledTrigger-4380-thread-2) [    ] o.a.s.c.a.NodeLostTrigger Running NodeLostTrigger: .auto_add_replicas with currently live nodes: 5
   [junit4]   2> 1133212 DEBUG (ScheduledTrigger-4380-thread-4) [    ] o.a.s.c.a.NodeLostTrigger Running NodeLostTrigger: .auto_add_replicas with currently live nodes: 5
   [junit4]   2> 1133236 DEBUG (ScheduledTrigger-4380-thread-3) [    ] o.a.s.c.a.NodeLostTrigger Running NodeLostTrigger: .auto_add_replicas with currently live nodes: 5
   [junit4]   2> 1133256 DEBUG (ScheduledTrigger-4380-thread-4) [    ] o.a.s.c.a.NodeLostTrigger Running NodeLostTrigger: .auto_add_replicas with currently live nodes: 5
   [junit4]   2> 1133278 DEBUG (ScheduledTrigger-4380-thread-3) [    ] o.a.s.c.a.NodeLostTrigger Running NodeLostTrigger: .auto_add_replicas with currently live nodes: 5
   [junit4]   2> 1133300 DEBUG (ScheduledTrigger-4380-thread-2) [    ] o.a.s.c.a.NodeLostTrigger Running NodeLostTrigger: .auto_add_replicas with currently live nodes: 5
   [junit4]   2> 1133321 DEBUG (ScheduledTrigger-4380-thread-2) [    ] o.a.s.c.a.NodeLostTrigger Running NodeLostTrigger: .auto_add_replicas with currently live nodes: 5
   [junit4]   2> 1133343 DEBUG (ScheduledTrigger-4380-thread-2) [    ] o.a.s.c.a.NodeLostTrigger Running NodeLostTrigger: .auto_add_replicas with currently live nodes: 5
   [junit4]   2> 1133364 DEBUG (ScheduledTrigger-4380-thread-4) [    ] o.a.s.c.a.NodeLostTrigger Running NodeLostTrigger: .auto_add_replicas with currently live nodes: 5
   [junit4]   2> 1133388 DEBUG (ScheduledTrigger-4380-thread-3) [    ] o.a.s.c.a.NodeLostTrigger Running NodeLostTrigger: .auto_add_replicas with currently live nodes: 5
   [junit4]   2> 1133409 DEBUG (ScheduledTrigger-4380-thread-1) [    ] o.a.s.c.a.NodeLostTrigger Running NodeLostTrigger: .auto_add_replicas with currently live nodes: 5
   [junit4]   2> 1133429 DEBUG (ScheduledTrigger-4380-thread-2) [    ] o.a.s.c.a.NodeLostTrigger Running NodeLostTrigger: .auto_add_replicas with currently live nodes: 5
   [junit4]   2> 1133453 DEBUG (ScheduledTrigger-4380-thread-1) [    ] o.a.s.c.a.NodeLostTrigger Running NodeLostTrigger: .auto_add_replicas with currently live nodes: 5
   [junit4]   2> 1133474 DEBUG (ScheduledTrigger-4380-thread-3) [    ] o.a.s.c.a.NodeLostTrigger Running NodeLostTrigger: .auto_add_replicas with currently live nodes: 5
   [junit4]   2> 1133503 DEBUG (ScheduledTrigger-4380-thread-4) [    ] o.a.s.c.a.NodeLostTrigger Running NodeLostTrigger: .auto_add_replicas with currently live nodes: 5
   [junit4]   2> 1133528 DEBUG (ScheduledTrigger-4380-thread-3) [    ] o.a.s.c.a.NodeLostTrigger Running NodeLostTrigger: .auto_add_replicas with currently live nodes: 5
   [junit4]   2> 1133549 DEBUG (ScheduledTrigger-4380-thread-4) [    ] o.a.s.c.a.NodeLostTrigger Running NodeLostTrigger: .auto_add_replicas with currently live nodes: 5
   [junit4]   2> 1133575 DEBUG (ScheduledTrigger-4380-thread-3) [    ] o.a.s.c.a.NodeLostTrigger Running NodeLostTrigger: .auto_add_replicas with currently live nodes: 5
   [junit4]   2> 1133595 DEBUG (ScheduledTrigger-4380-thread-1) [    ] o.a.s.c.a.NodeLostTrigger Running NodeLostTrigger: .auto_add_replicas with currently live nodes: 5
   [junit4]   2> 1133615 DEBUG (ScheduledTrigger-4380-thread-3) [    ] o.a.s.c.a.NodeLostTrigger Running NodeLostTrigger: .auto_add_replicas with currently live nodes: 5
   [junit4]   2> 1133637 DEBUG (ScheduledTrigger-4380-thread-1) [    ] o.a.s.c.a.NodeLostTrigger Running NodeLostTrigger: .auto_add_replicas with currently live nodes: 5
   [junit4]   2> 1133658 DEBUG (ScheduledTrigger-4380-thread-3) [    ] o.a.s.c.a.NodeLostTrigger Running NodeLostTrigger: .auto_add_replicas with currently live nodes: 5
   [junit4]   2> 1133679 DEBUG (ScheduledTrigger-4380-thread-4) [    ] o.a.s.c.a.NodeLostTrigger Running NodeLostTrigger: .auto_add_replicas with currently live nodes: 5
   [junit4]   2> 1133706 DEBUG (ScheduledTrigger-4380-thread-3) [    ] o.a.s.c.a.NodeLostTrigger Running NodeLostTrigger: .auto_add_replicas with currently live nodes: 5
   [junit4]   2> 1133726 DEBUG (ScheduledTrigger-4380-thread-4) [    ] o.a.s.c.a.NodeLostTrigger Running NodeLostTrigger: .auto_add_replicas with currently live nodes: 5
   [junit4]   2> 1133747 DEBUG (ScheduledTrigger-4380-thread-3) [    ] o.a.s.c.a.NodeLostTrigger Running NodeLostTrigger: .auto_add_replicas with currently live nodes: 5
   [junit4]   2> 1133767 DEBUG (ScheduledTrigger-4380-thread-4) [    ] o.a.s.c.a.NodeLostTrigger Running NodeLostTrigger: .auto_add_replicas with currently live nodes: 5
   [junit4]   2> 1133788 DEBUG (ScheduledTrigger-4380-thread-3) [    ] o.a.s.c.a.NodeLostTrigger Running NodeLostTrigger: .auto_add_replicas with currently live nodes: 5
   [junit4]   2> 1133809 DEBUG (ScheduledTrigger-4380-thread-4) [    ] o.a.s.c.a.NodeLostTrigger Running NodeLostTrigger: .auto_add_replicas with currently live nodes: 5
   [junit4]   2> 1133847 DEBUG (ScheduledTrigger-4380-thread-2) [    ] o.a.s.c.a.NodeLostTrigger Running NodeLostTrigger: .auto_add_replicas with currently live nodes: 5
   [junit4]   2> 1133867 DEBUG (ScheduledTrigger-4380-thread-4) [    ] o.a.s.c.a.NodeLostTrigger Running NodeLostTrigger: .auto_add_replicas with currently live nodes: 5
   [junit4]   2> 1133888 DEBUG (ScheduledTrigger-4380-thread-1) [    ] o.a.s.c.a.NodeLostTrigger Running NodeLostTrigger: .auto_add_replicas with currently live nodes: 5
   [junit4]   2> 1133909 DEBUG (ScheduledTrigger-4380-thread-3) [    ] o.a.s.c.a.NodeLostTrigger Running NodeLostTrigger: .auto_add_replicas with currently live nodes: 5
   [junit4]   2> 1133929 DEBUG (ScheduledTrigger-4380-thread-4) [    ] o.a.s.c.a.NodeLostTrigger Running NodeLostTrigger: .auto_add_replicas with currently live nodes: 5
   [junit4]   2> 1133949 DEBUG (ScheduledTrigger-4380-thread-3) [    ] o.a.s.c.a.NodeLostTrigger Running NodeLostTrigger: .auto_add_replicas with currently live nodes: 5
   [junit4]   2> 1133971 DEBUG (ScheduledTrigger-4380-thread-4) [    ] o.a.s.c.a.NodeLostTrigger Running NodeLostTrigger: .auto_add_replicas with currently live nodes: 5
   [junit4]   2> 1133992 DEBUG (ScheduledTrigger-4380-thread-1) [    ] o.a.s.c.a.NodeLostTrigger Running NodeLostTrigger: .auto_add_replicas with currently live nodes: 5
   [junit4]   2> 1134015 DEBUG (ScheduledTrigger-4380-thread-3) [    ] o.a.s.c.a.NodeLostTrigger Running NodeLostTrigger: .auto_add_replicas with currently live nodes: 5
   [junit4]   2> 1134036 DEBUG (ScheduledTrigger-4380-thread-1) [    ] o.a.s.c.a.NodeLostTrigger Running NodeLostTrigger: .auto_add_replicas with currently live nodes: 5
   [junit4]   2> 1134056 DEBUG (ScheduledTrigger-4380-thread-3) [    ] o.a.s.c.a.NodeLostTrigger Running NodeLostTrigger: .auto_add_replicas with currently live nodes: 5
   [junit4]   2> 1134076 DEBUG (ScheduledTrigger-4380-thread-1) [    ] o.a.s.c.a.NodeLostTrigger Running NodeLostTrigger: .auto_add_replicas with currently live nodes: 5
   [junit4]   2> 1134097 DEBUG (ScheduledTrigger-4380-thread-3) [    ] o.a.s.c.a.NodeLostTrigger Running NodeLostTrigger: .auto_add_replicas with currently live nodes: 5
   [junit4]   2> 1134120 DEBUG (ScheduledTrigger-4380-thread-4) [    ] o.a.s.c.a.NodeLostTrigger Running NodeLostTrigger: .auto_add_replicas with currently live nodes: 5
   [junit4]   2> 1134140 DEBUG (ScheduledTrigger-4380-thread-3) [    ] o.a.s.c.a.NodeLostTrigger Running NodeLostTrigger: .auto_add_replicas with currently live nodes: 5
   [junit4]   2> 1134161 DEBUG (ScheduledTrigger-4380-thread-4) [    ] o.a.s.c.a.NodeLostTrigger Running NodeLostTrigger: .auto_add_replicas with currently live nodes: 5
   [junit4]   2> 1134181 DEBUG (ScheduledTrigger-4380-thread-1) [    ] o.a.s.c.a.NodeLostTrigger Running NodeLostTrigger: .auto_add_replicas with currently live nodes: 5
   [junit4]   2> 1134208 DEBUG (ScheduledTrigger-4380-thread-4) [    ] o.a.s.c.a.NodeLostTrigger Running NodeLostTrigger: .auto_add_replicas with currently live nodes: 5
   [junit4]   2> 1134229 DEBUG (ScheduledTrigger-4380-thread-1) [    ] o.a.s.c.a.NodeLostTrigger Running NodeLostTrigger: .auto_add_replicas with currently live nodes: 5
   [junit4]   2> 1134249 DEBUG (ScheduledTrigger-4380-thread-4) [    ] o.a.s.c.a.NodeLostTrigger Running NodeLostTrigger: .auto_add_replicas with currently live nodes: 5
   [junit4]   2> 1134270 DEBUG (ScheduledTrigger-4380-thread-1) [    ] o.a.s.c.a.NodeLostTrigger Running NodeLostTrigger: .auto_add_replicas with currently live nodes: 5
   [junit4]   2> 1134296 DEBUG (ScheduledTrigger-4380-thread-4) [    ] o.a.s.c.a.NodeLostTrigger Running NodeLostTrigger: .auto_add_replicas with currently live nodes: 5
   [junit4]   2> 1134307 INFO  (TEST-TestSimPolicyCloud.testCreateCollectionAddReplica-seed#[7C056A298B5F7FEC]) [    ] o.a.s.SolrTestCaseJ4 ###Ending testCreateCollectionAddReplica
   [junit4]   2> 1134307 INFO  (TEST-TestSimPolicyCloud.testCreateCollectionAddReplica-seed#[7C056A298B5F7FEC]) [    ] o.a.s.c.a.s.SimSolrCloudTestCase #######################################
   [junit4]   2> ############ CLUSTER STATE ############
   [junit4]   2> #######################################
   [junit4]   2> ## Live nodes:		5
   [junit4]   2> ## Empty nodes:	4
   [junit4]   2> ## Dead nodes:		0
   [junit4]   2> ## Collections:	[testCreateCollectionAddReplica]
   [junit4]   2> ## Max replicas per node:	1
   [junit4]   2> ## Min replicas per node:	0
   [junit4]   2> ## Total replicas:		1
   [junit4]   2> ## * testCreateCollectionAddReplica		1
   [junit4]   2> ##		- active           1
   [junit4]   2> ######### Solr op counts ##########
   [junit4]   2> ##		- CREATE             1
   [junit4]   2> ##		- autoscaling        1
   [junit4]   2> ######### Autoscaling event counts ###########
   [junit4]   2> 
   [junit4]   2> NOTE: reproduce with: ant test  -Dtestcase=TestSimPolicyCloud -Dtests.method=testCreateCollectionAddReplica -Dtests.seed=7C056A298B5F7FEC -Dtests.slow=true -Dtests.locale=en-NZ -Dtests.timezone=SystemV/HST10 -Dtests.asserts=true -Dtests.file.encoding=UTF-8
   [junit4] FAILURE 1.94s J0 | TestSimPolicyCloud.testCreateCollectionAddReplica <<<
   [junit4]    > Throwable #1: java.lang.AssertionError: Timeout waiting for collection to become active
   [junit4]    > Live Nodes: [127.0.0.1:10001_solr, 127.0.0.1:10004_solr, 127.0.0.1:10000_solr, 127.0.0.1:10002_solr, 127.0.0.1:10003_solr]
   [junit4]    > Last available state: DocCollection(testCreateCollectionAddReplica//clusterstate.json/23)={
   [junit4]    >   "replicationFactor":"1",
   [junit4]    >   "pullReplicas":"0",
   [junit4]    >   "router":{"name":"compositeId"},
   [junit4]    >   "maxShardsPerNode":"1",
   [junit4]    >   "autoAddReplicas":"false",
   [junit4]    >   "nrtReplicas":"1",
   [junit4]    >   "tlogReplicas":"0",
   [junit4]    >   "autoCreated":"true",
   [junit4]    >   "policy":"c1",
   [junit4]    >   "shards":{"shard1":{
   [junit4]    >       "replicas":{"core_node1":{
   [junit4]    >           "core":"testCreateCollectionAddReplica_shard1_replica_n1",
   [junit4]    >           "SEARCHER.searcher.maxDoc":0,
   [junit4]    >           "SEARCHER.searcher.deletedDocs":0,
   [junit4]    >           "INDEX.sizeInBytes":10240,
   [junit4]    >           "node_name":"127.0.0.1:10001_solr",
   [junit4]    >           "state":"active",
   [junit4]    >           "type":"NRT",
   [junit4]    >           "INDEX.sizeInGB":9.5367431640625E-6,
   [junit4]    >           "SEARCHER.searcher.numDocs":0}},
   [junit4]    >       "range":"80000000-7fffffff",
   [junit4]    >       "state":"active"}}}
   [junit4]    > 	at __randomizedtesting.SeedInfo.seed([7C056A298B5F7FEC:FC250F079A1C974A]:0)
   [junit4]    > 	at org.apache.solr.cloud.CloudTestUtils.waitForState(CloudTestUtils.java:70)
   [junit4]    > 	at org.apache.solr.cloud.autoscaling.sim.TestSimPolicyCloud.testCreateCollectionAddReplica(TestSimPolicyCloud.java:123)
   [junit4]    > 	at java.lang.Thread.run(Thread.java:748)
   [junit4]    > Caused by: java.util.concurrent.TimeoutException: last state: DocCollection(testCreateCollectionAddReplica//clusterstate.json/23)={
   [junit4]    >   "replicationFactor":"1",
   [junit4]    >   "pullReplicas":"0",
   [junit4]    >   "router":{"name":"compositeId"},
   [junit4]    >   "maxShardsPerNode":"1",
   [junit4]    >   "autoAddReplicas":"false",
   [junit4]    >   "nrtReplicas":"1",
   [junit4]    >   "tlogReplicas":"0",
   [junit4]    >   "autoCreated":"true",
   [junit4]    >   "policy":"c1",
   [junit4]    >   "shards":{"shard1":{
   [junit4]    >       "replicas":{"core_node1":{
   [junit4]    >           "core":"testCreateCollectionAddReplica_shard1_replica_n1",
   [junit4]    >           "SEARCHER.searcher.maxDoc":0,
   [junit4]    >           "SEARCHER.searcher.deletedDocs":0,
   [junit4]    >           "INDEX.sizeInBytes":10240,
   [junit4]    >           "node_name":"127.0.0.1:10001_solr",
   [junit4]    >           "state":"active",
   [junit4]    >           "type":"NRT",
   [junit4]    >           "INDEX.sizeInGB":9.5367431640625E-6,
   [junit4]    >           "SEARCHER.searcher.numDocs":0}},
   [junit4]    >       "range":"80000000-7fffffff",
   [junit4]    >       "state":"active"}}}
   [junit4]    > 	at org.apache.solr.cloud.CloudTestUtils.waitForState(CloudTestUtils.java:112)
   [junit4]    > 	at org.apache.solr.cloud.CloudTestUtils.waitForState(CloudTestUtils.java:64)
   [junit4]    > 	... 41 more
   [junit4]   2> 1134316 DEBUG (ScheduledTrigger-4380-thread-1) [    ] o.a.s.c.a.NodeLostTrigger Running NodeLostTrigger: .auto_add_replicas with currently live nodes: 5
   [junit4]   2> 1134318 INFO  (TEST-TestSimPolicyCloud.testMetricsTag-seed#[7C056A298B5F7FEC]) [    ] o.a.s.SolrTestCaseJ4 ###Starting testMetricsTag
   [junit4]   2> 1134318 DEBUG (TEST-TestSimPolicyCloud.testMetricsTag-seed#[7C056A298B5F7FEC]) [    ] o.a.s.c.a.OverseerTriggerThread Refreshing /autoscaling.json with znode version 12
   [junit4]   2> 1134318 DEBUG (Simulated OverseerAutoScalingTriggerThread) [    ] o.a.s.c.a.OverseerTriggerThread Processed trigger updates upto znodeVersion 12
   [junit4]   2> 1134318 DEBUG (Simulated OverseerAutoScalingTriggerThread) [    ] o.a.s.c.a.OverseerTriggerThread -- clean old nodeLost markers
   [junit4]   2> 1134318 DEBUG (Simulated OverseerAutoScalingTriggerThread) [    ] o.a.s.c.a.OverseerTriggerThread -- clean old nodeAdded markers
   [junit4]   2> 1134318 DEBUG (Simulated OverseerAutoScalingTriggerThread) [    ] o.a.s.c.a.OverseerTriggerThread Current znodeVersion 12, lastZnodeVersion 12
   [junit4]   2> 1134318 INFO  (TEST-TestSimPolicyCloud.testMetricsTag-seed#[7C056A298B5F7FEC]) [    ] o.a.s.c.a.s.SimCloudManager === Restarting OverseerTriggerThread and clearing object cache...
   [junit4]   2> 1134319 WARN  (Simulated OverseerAutoScalingTriggerThread) [    ] o.a.s.c.a.OverseerTriggerThread OverseerTriggerThread woken up but we are closed, exiting.
   [junit4]   2> 1134319 DEBUG (TEST-TestSimPolicyCloud.testMetricsTag-seed#[7C056A298B5F7FEC]) [    ] o.a.s.c.a.ScheduledTriggers Shutting down scheduled thread pool executor now
   [junit4]   2> 1134319 DEBUG (TEST-TestSimPolicyCloud.testMetricsTag-seed#[7C056A298B5F7FEC]) [    ] o.a.s.c.a.ScheduledTriggers Shutting down action executor now
   [junit4]   2> 1134319 DEBUG (TEST-TestSimPolicyCloud.testMetricsTag-seed#[7C056A298B5F7FEC]) [    ] o.a.s.c.a.ScheduledTriggers Awaiting termination for action executor
   [junit4]   2> 1134319 DEBUG (TEST-TestSimPolicyCloud.testMetricsTag-seed#[7C056A298B5F7FEC]) [    ] o.a.s.c.a.ScheduledTriggers Awaiting termination for scheduled thread pool executor
   [junit4]   2> 1134319 DEBUG (TEST-TestSimPolicyCloud.testMetricsTag-seed#[7C056A298B5F7FEC]) [    ] o.a.s.c.a.ScheduledTriggers ScheduledTriggers closed completely
   [junit4]   2> 1134319 DEBUG (TEST-TestSimPolicyCloud.testMetricsTag-seed#[7C056A298B5F7FEC]) [    ] o.a.s.c.a.OverseerTriggerThread OverseerTriggerThread has been closed explicitly
   [junit4]   2> 1134320 DEBUG (Simulated OverseerAutoScalingTriggerThread) [    ] o.a.s.c.a.OverseerTriggerThread Adding .auto_add_replicas and .scheduled_maintenance triggers
   [junit4]   2> 1134320 DEBUG (Simulated OverseerAutoScalingTriggerThread) [    ] o.a.s.c.a.OverseerTriggerThread Refreshing /autoscaling.json with znode version 13
   [junit4]   2> 1134320 DEBUG (Simulated OverseerAutoScalingTriggerThread) [    ] o.a.s.c.a.OverseerTriggerThread Current znodeVersion 13, lastZnodeVersion -1
   [junit4]   2> 1134320 DEBUG (Simulated OverseerAutoScalingTriggerThread) [    ] o.a.s.c.a.OverseerTriggerThread Processed trigger updates upto znodeVersion 13
   [junit4]   2> 1134321 DEBUG (Simulated OverseerAutoScalingTriggerThread) [    ] o.a.s.c.a.NodeLostTrigger NodeLostTrigger .auto_add_replicas - Initial livenodes: [127.0.0.1:10001_solr, 127.0.0.1:10004_solr, 127.0.0.1:10000_solr, 127.0.0.1:10002_solr, 127.0.0.1:10003_solr]
   [junit4]   2> 1134321 DEBUG (Simulated OverseerAutoScalingTriggerThread) [    ] o.a.s.c.a.OverseerTriggerThread -- clean old nodeAdded markers
   [junit4]   2> 1134321 DEBUG (Simulated OverseerAutoScalingTriggerThread) [    ] o.a.s.c.a.OverseerTriggerThread Current znodeVersion 13, lastZnodeVersion 13
   [junit4]   2> 1134321 DEBUG (ScheduledTrigger-4383-thread-2) [    ] o.a.s.c.a.NodeLostTrigger Running NodeLostTrigger: .auto_add_replicas with currently live nodes: 5
   [junit4]   2> 1134345 DEBUG (ScheduledTrigger-4383-thread-3) [    ] o.a.s.c.a.NodeLostTrigger Running NodeLostTrigger: .auto_add_replicas with currently live nodes: 5
   [junit4]   2> 1134365 DEBUG (ScheduledTrigger-4383-thread-1) [    ] o.a.s.c.a.NodeLostTrigger Running NodeLostTrigger: .auto_add_replicas with currently live nodes: 5
   [junit4]   2> 1134386 DEBUG (ScheduledTrigger-4383-thread-2) [    ] o.a.s.c.a.NodeLostTrigger Running NodeLostTrigger: .auto_add_replicas with currently live nodes: 5
   [junit4]   2> 1134414 DEBUG (ScheduledTrigger-4383-thread-2) [    ] o.a.s.c.a.NodeLostTrigger Running NodeLostTrigger: .auto_add_replicas with currently live nodes: 5
   [junit4]   2> 1134422 ERROR (simCloudManagerPool-4382-thread-1) [    ] o.a.s.h.RequestHandlerBase org.apache.solr.api.ApiBag$ExceptionWithErrObject: Error in command payload, errors: [{set-cluster-policy=[{cores=<10, node=#ANY}, {replica=<2, shard=#EACH, node=#ANY}, {metrics:abc=overseer, replica=0}], errorMessages=[Invalid metrics: param in {
   [junit4]   2>   "metrics:abc":"overseer",
   [junit4]   2>   "replica":0} must have at 2 or 3 segments after 'metrics:' separated by ':']}], 
   [junit4]   2> 	at org.apache.solr.cloud.autoscaling.AutoScalingHandler.processOps(AutoScalingHandler.java:210)
   [junit4]   2> 	at org.apache.solr.cloud.autoscaling.AutoScalingHandler.handleRequestBody(AutoScalingHandler.java:148)
   [junit4]   2> 	at org.apache.solr.handler.RequestHandlerBase.handleRequest(RequestHandlerBase.java:199)
   [junit4]   2> 	at org.apache.solr.cloud.autoscaling.sim.SimCloudManager.simHandleSolrRequest(SimCloudManager.java:684)
   [junit4]   2> 	at org.apache.solr.cloud.autoscaling.sim.SimCloudManager.lambda$request$15(SimCloudManager.java:629)
   [junit4]   2> 	at java.util.concurrent.FutureTask.run(FutureTask.java:266)
   [junit4]   2> 	at org.apache.solr.common.util.ExecutorUtil$MDCAwareThreadPoolExecutor.lambda$execute$0(ExecutorUtil.java:209)
   [junit4]   2> 	at java.util.concurrent.ThreadPoolExecutor.runWorker(ThreadPoolExecutor.java:1149)
   [junit4]   2> 	at java.util.concurrent.ThreadPoolExecutor$Worker.run(ThreadPoolExecutor.java:624)
   [junit4]   2> 	at java.lang.Thread.run(Thread.java:748)
   [junit4]   2> 
   [junit4]   2> 1134422 DEBUG (simCloudManagerPool-4382-thread-1) [    ] o.a.s.c.a.s.SimCloudManager -- exception handling request
   [junit4]   2> org.apache.solr.api.ApiBag$ExceptionWithErrObject: Error in command payload
   [junit4]   2> 	at org.apache.solr.cloud.autoscaling.AutoScalingHandler.processOps(AutoScalingHandler.java:210) ~[java/:?]
   [junit4]   2> 	at org.apache.solr.cloud.autoscaling.AutoScalingHandler.handleRequestBody(AutoScalingHandler.java:148) ~[java/:?]
   [junit4]   2> 	at org.apache.solr.handler.RequestHandlerBase.handleRequest(RequestHandlerBase.java:199) ~[java/:?]
   [junit4]   2> 	at org.apache.solr.cloud.autoscaling.sim.SimCloudManager.simHandleSolrRequest(SimCloudManager.java:684) ~[test/:?]
   [junit4]   2> 	at org.apache.solr.cloud.autoscaling.sim.SimCloudManager.lambda$request$15(SimCloudManager.java:629) ~[test/:?]
   [junit4]   2> 	at java.util.concurrent.FutureTask.run(FutureTask.java:266) ~[?:1.8.0_172]
   [junit4]   2> 	at org.apache.solr.common.util.ExecutorUtil$MDCAwareThreadPoolExecutor.lambda$execute$0(ExecutorUtil.java:209) ~[java/:?]
   [junit4]   2> 	at java.util.concurrent.ThreadPoolExecutor.runWorker(ThreadPoolExecutor.java:1149) [?:1.8.0_172]
   [junit4]   2> 	at java.util.concurrent.ThreadPoolExecutor$Worker.run(ThreadPoolExecutor.java:624) [?:1.8.0_172]
   [junit4]   2> 	at java.lang.Thread.run(Thread.java:748) [?:1.8.0_172]
   [junit4]   2> 1134428 DEBUG (simCloudManagerPool-4382-thread-2) [    ] o.a.s.c.a.AutoScalingHandler Verified autoscaling configuration
   [junit4]   2> 1134428 DEBUG (simCloudManagerPool-4382-thread-2) [    ] o.a.s.c.a.OverseerTriggerThread Refreshing /autoscaling.json with znode version 14
   [junit4]   2> 1134429 DEBUG (Simulated OverseerAutoScalingTriggerThread) [    ] o.a.s.c.a.OverseerTriggerThread Processed trigger updates upto znodeVersion 14
   [junit4]   2> 1134429 DEBUG (Simulated OverseerAutoScalingTriggerThread) [    ] o.a.s.c.a.OverseerTriggerThread -- clean old nodeAdded markers
   [junit4]   2> 1134429 DEBUG (Simulated OverseerAutoScalingTriggerThread) [    ] o.a.s.c.a.OverseerTriggerThread Current znodeVersion 14, lastZnodeVersion 14
   [junit4]   2> 1134439 DEBUG (ScheduledTrigger-4383-thread-4) [    ] o.a.s.c.a.NodeLostTrigger Running NodeLostTrigger: .auto_add_replicas with currently live nodes: 5
   [junit4]   2> 1134445 INFO  (simCloudManagerPool-4382-thread-3) [    ] o.a.s.c.s.c.a.PolicyHelper returnSession, curr-time 4494381065 sessionWrapper.createTime 4494381016431988, this.sessionWrapper.createTime 4494381016431988 
   [junit4]   2> 1134457 DEBUG (simCloudManagerPool-4382-thread-4) [    ] o.a.s.c.a.s.SimClusterStateProvider -- submit leader election for metricsTest / shard1
   [junit4]   2> 1134457 DEBUG (simCloudManagerPool-4382-thread-5) [    ] o.a.s.c.a.s.SimClusterStateProvider Running leader election for metricsTest / shard1
   [junit4]   2> 1134457 DEBUG (simCloudManagerPool-4382-thread-5) [    ] o.a.s.c.a.s.SimClusterStateProvider -- elected new leader for metricsTest / shard1: core_node1
   [junit4]   2> 1134458 INFO  (TEST-TestSimPolicyCloud.testMetricsTag-seed#[7C056A298B5F7FEC]) [    ] o.a.s.SolrTestCaseJ4 ###Ending testMetricsTag
   [junit4]   2> 1134458 INFO  (TEST-TestSimPolicyCloud.testMetricsTag-seed#[7C056A298B5F7FEC]) [    ] o.a.s.c.a.s.SimSolrCloudTestCase #######################################
   [junit4]   2> ############ CLUSTER STATE ############
   [junit4]   2> #######################################
   [junit4]   2> ## Live nodes:		5
   [junit4]   2> ## Empty nodes:	4
   [junit4]   2> ## Dead nodes:		0
   [junit4]   2> ## Collections:	[metricsTest]
   [junit4]   2> ## Max replicas per node:	1
   [junit4]   2> ## Min replicas per node:	0
   [junit4]   2> ## Total replicas:		1
   [junit4]   2> ## * metricsTest		1
   [junit4]   2> ##		- active           1
   [junit4]   2> ######### Solr op counts ##########
   [junit4]   2> ##		- CREATE             1
   [junit4]   2> ##		- autoscaling        2
   [junit4]   2> ######### Autoscaling event counts ###########
   [junit4]   2> 
   [junit4]   2> 1134460 DEBUG (ScheduledTrigger-4383-thread-3) [    ] o.a.s.c.a.NodeLostTrigger Running NodeLostTrigger: .auto_add_replicas with currently live nodes: 5
   [junit4]   2> 1134463 INFO  (TEST-TestSimPolicyCloud.testDataProviderPerReplicaDetails-seed#[7C056A298B5F7FEC]) [    ] o.a.s.SolrTestCaseJ4 ###Starting testDataProviderPerReplicaDetails
   [junit4]   2> 1134463 DEBUG (TEST-TestSimPolicyCloud.testDataProviderPerReplicaDetails-seed#[7C056A298B5F7FEC]) [    ] o.a.s.c.a.OverseerTriggerThread Refreshing /autoscaling.json with znode version 15
   [junit4]   2> 1134463 DEBUG (Simulated OverseerAutoScalingTriggerThread) [    ] o.a.s.c.a.OverseerTriggerThread Processed trigger updates upto znodeVersion 15
   [junit4]   2> 1134463 INFO  (TEST-TestSimPolicyCloud.testDataProviderPerReplicaDetails-seed#[7C056A298B5F7FEC]) [    ] o.a.s.c.a.s.SimCloudManager === Restarting OverseerTriggerThread and clearing object cache...
   [junit4]   2> 1134463 DEBUG (Simulated OverseerAutoScalingTriggerThread) [    ] o.a.s.c.a.OverseerTriggerThread -- clean old nodeLost markers
   [junit4]   2> 1134463 DEBUG (Simulated OverseerAutoScalingTriggerThread) [    ] o.a.s.c.a.OverseerTriggerThread -- clean old nodeAdded markers
   [junit4]   2> 1134464 DEBUG (TEST-TestSimPolicyCloud.testDataProviderPerReplicaDetails-seed#[7C056A298B5F7FEC]) [    ] o.a.s.c.a.ScheduledTriggers Shutting down scheduled thread pool executor now
   [junit4]   2> 1134464 DEBUG (TEST-TestSimPolicyCloud.testDataProviderPerReplicaDetails-seed#[7C056A298B5F7FEC]) [    ] o.a.s.c.a.ScheduledTriggers Shutting down action executor now
   [junit4]   2> 1134464 DEBUG (TEST-TestSimPolicyCloud.testDataProviderPerReplicaDetails-seed#[7C056A298B5F7FEC]) [    ] o.a.s.c.a.ScheduledTriggers Awaiting termination for action executor
   [junit4]   2> 1134464 DEBUG (TEST-TestSimPolicyCloud.testDataProviderPerReplicaDetails-seed#[7C056A298B5F7FEC]) [    ] o.a.s.c.a.ScheduledTriggers Awaiting termination for scheduled thread pool executor
   [junit4]   2> 1134463 WARN  (Simulated OverseerAutoScalingTriggerThread) [    ] o.a.s.c.a.OverseerTriggerThread Interrupted
   [junit4]   2> java.lang.InterruptedException: null
   [junit4]   2> 	at java.util.concurrent.locks.AbstractQueuedSynchronizer.acquireInterruptibly(AbstractQueuedSynchronizer.java:1220) ~[?:1.8.0_172]
   [junit4]   2> 	at java.util.concurrent.locks.ReentrantLock.lockInterruptibly(ReentrantLock.java:335) ~[?:1.8.0_172]
   [junit4]   2> 	at org.apache.solr.cloud.autoscaling.OverseerTriggerThread.run(OverseerTriggerThread.java:177) [java/:?]
   [junit4]   2> 	at java.lang.Thread.run(Thread.java:748) [?:1.8.0_172]
   [junit4]   2> 1134464 DEBUG (TEST-TestSimPolicyCloud.testDataProviderPerReplicaDetails-seed#[7C056A298B5F7FEC]) [    ] o.a.s.c.a.ScheduledTriggers ScheduledTriggers closed completely
   [junit4]   2> 1134464 DEBUG (TEST-TestSimPolicyCloud.testDataProviderPerReplicaDetails-seed#[7C056A298B5F7FEC]) [    ] o.a.s.c.a.OverseerTriggerThread OverseerTriggerThread has been closed explicitly
   [junit4]   2> 1134465 DEBUG (Simulated OverseerAutoScalingTriggerThread) [    ] o.a.s.c.a.OverseerTriggerThread Adding .auto_add_replicas and .scheduled_maintenance triggers
   [junit4]   2> 1134465 DEBUG (Simulated OverseerAutoScalingTriggerThread) [    ] o.a.s.c.a.OverseerTriggerThread Refreshing /autoscaling.json with znode version 16
   [junit4]   2> 1134466 DEBUG (Simulated OverseerAutoScalingTriggerThread) [    ] o.a.s.c.a.OverseerTriggerThread Current znodeVersion 16, lastZnodeVersion -1
   [junit4]   2> 1134466 DEBUG (Simulated OverseerAutoScalingTriggerThread) [    ] o.a.s.c.a.OverseerTriggerThread Processed trigger updates upto znodeVersion 16
   [junit4]   2> 1134466 DEBUG (Simulated OverseerAutoScalingTriggerThread) [    ] o.a.s.c.a.NodeLostTrigger NodeLostTrigger .auto_add_replicas - Initial livenodes: [127.0.0.1:10001_solr, 127.0.0.1:10004_solr, 127.0.0.1:10000_solr, 127.0.0.1:10002_solr, 127.0.0.1:10003_solr]
   [junit4]   2> 1134466 DEBUG (Simulated OverseerAutoScalingTriggerThread) [    ] o.a.s.c.a.OverseerTriggerThread -- clean old nodeAdded markers
   [junit4]   2> 1134466 DEBUG (Simulated OverseerAutoScalingTriggerThread) [    ] o.a.s.c.a.OverseerTriggerThread Current znodeVersion 16, lastZnodeVersion 16
   [junit4]   2> 1134467 DEBUG (ScheduledTrigger-4386-thread-2) [    ] o.a.s.c.a.NodeLostTrigger Running NodeLostTrigger: .auto_add_replicas with currently live nodes: 5
   [junit4]   2> 1134490 DEBUG (ScheduledTrigger-4386-thread-3) [    ] o.a.s.c.a.NodeLostTrigger Running NodeLostTrigger: .auto_add_replicas with currently live nodes: 5
   [junit4]   2> 1134513 DEBUG (ScheduledTrigger-4386-thread-4) [    ] o.a.s.c.a.NodeLostTrigger Running NodeLostTrigger: .auto_add_replicas with currently live nodes: 5
   [junit4]   2> 1134542 DEBUG (ScheduledTrigger-4386-thread-3) [    ] o.a.s.c.a.NodeLostTrigger Running NodeLostTrigger: .auto_add_replicas with currently live nodes: 5
   [junit4]   2> 1134569 DEBUG (ScheduledTrigger-4386-thread-4) [    ] o.a.s.c.a.NodeLostTrigger Running NodeLostTrigger: .auto_add_replicas with currently live nodes: 5
   [junit4]   2> 1134593 DEBUG (simCloudManagerPool-4385-thread-2) [    ] o.a.s.c.a.s.SimClusterStateProvider -- submit leader election for perReplicaDataColl / shard1
   [junit4]   2> 1134596 DEBUG (simCloudManagerPool-4385-thread-7) [    ] o.a.s.c.a.s.SimClusterStateProvider Running leader election for perReplicaDataColl / shard1
   [junit4]   2> 1134596 DEBUG (simCloudManagerPool-4385-thread-7) [    ] o.a.s.c.a.s.SimClusterStateProvider -- elected new leader for perReplicaDataColl / shard1: core_node1
   [junit4]   2> 1134598 DEBUG (ScheduledTrigger-4386-thread-2) [    ] o.a.s.c.a.NodeLostTrigger Running NodeLostTrigger: .auto_add_replicas with currently live nodes: 5
   [junit4]   2> 1134606 DEBUG (simCloudManagerPool-4385-thread-3) [    ] o.a.s.c.a.s.SimClusterStateProvider -- already has leader perReplicaDataColl / shard1
   [junit4]   2> 1134619 DEBUG (ScheduledTrigger-4386-thread-2) [    ] o.a.s.c.a.NodeLostTrigger Running NodeLostTrigger: .auto_add_replicas with currently live nodes: 5
   [junit4]   2> 1134622 DEBUG (simCloudManagerPool-4385-thread-4) [    ] o.a.s.c.a.s.SimClusterStateProvider -- already has leader perReplicaDataColl / shard1
   [junit4]   2> 1134637 DEBUG (simCloudManagerPool-4385-thread-5) [    ] o.a.s.c.a.s.SimClusterStateProvider -- already has leader perReplicaDataColl / shard1
   [junit4]   2> 1134641 DEBUG (ScheduledTrigger-4386-thread-3) [    ] o.a.s.c.a.NodeLostTrigger Running NodeLostTrigger: .auto_add_replicas with currently live nodes: 5
   [junit4]   2> 1134650 DEBUG (simCloudManagerPool-4385-thread-6) [    ] o.a.s.c.a.s.SimClusterStateProvider -- already has leader perReplicaDataColl / shard1
   [junit4]   2> 1134662 DEBUG (ScheduledTrigger-4386-thread-3) [    ] o.a.s.c.a.NodeLostTrigger Running NodeLostTrigger: .auto_add_replicas with currently live nodes: 5
   [junit4]   2> 1134687 DEBUG (ScheduledTrigger-4386-thread-3) [    ] o.a.s.c.a.NodeLostTrigger Running NodeLostTrigger: .auto_add_replicas with currently live nodes: 5
   [junit4]   2> 1134708 DEBUG (ScheduledTrigger-4386-thread-4) [    ] o.a.s.c.a.NodeLostTrigger Running NodeLostTrigger: .auto_add_replicas with currently live nodes: 5
   [junit4]   2> 1134738 DEBUG (ScheduledTrigger-4386-thread-2) [    ] o.a.s.c.a.NodeLostTrigger Running NodeLostTrigger: .auto_add_replicas with currently live nodes: 5
   [junit4]   2> 1134758 DEBUG (ScheduledTrigger-4386-thread-4) [    ] o.a.s.c.a.NodeLostTrigger Running NodeLostTrigger: .auto_add_replicas with currently live nodes: 5
   [junit4]   2> 1134762 INFO  (TEST-TestSimPolicyCloud.testDataProviderPerReplicaDetails-seed#[7C056A298B5F7FEC]) [    ] o.a.s.SolrTestCaseJ4 ###Ending testDataProviderPerReplicaDetails
   [junit4]   2> 1134762 INFO  (TEST-TestSimPolicyCloud.testDataProviderPerReplicaDetails-seed#[7C056A298B5F7FEC]) [    ] o.a.s.c.a.s.SimSolrCloudTestCase #######################################
   [junit4]   2> ############ CLUSTER STATE ############
   [junit4]   2> #######################################
   [junit4]   2> ## Live nodes:		5
   [junit4]   2> ## Empty nodes:	5
   [junit4]   2> ## Dead nodes:		0
   [junit4]   2> ## Collections:	[]
   [junit4]   2> ## Max replicas per node:	0
   [junit4]   2> ## Min replicas per node:	0
   [junit4]   2> ## Total replicas:		0
   [junit4]   2> ######### Solr op counts ##########
   [junit4]   2> ##		- CREATE             1
   [junit4]   2> ##		- DELETE             1
   [junit4]   2> ######### Autoscaling event counts ###########
   [junit4]   2> 
   [junit4]   2> 1134766 INFO  (TEST-TestSimPolicyCloud.testCreateCollectionSplitShard-seed#[7C056A298B5F7FEC]) [    ] o.a.s.SolrTestCaseJ4 ###Starting testCreateCollectionSplitShard
   [junit4]   2> 1134766 DEBUG (TEST-TestSimPolicyCloud.testCreateCollectionSplitShard-seed#[7C056A298B5F7FEC]) [    ] o.a.s.c.a.OverseerTriggerThread Refreshing /autoscaling.json with znode version 17
   [junit4]   2> 1134766 DEBUG (Simulated OverseerAutoScalingTriggerThread) [    ] o.a.s.c.a.OverseerTriggerThread Processed trigger updates upto znodeVersion 17
   [junit4]   2> 1134766 INFO  (TEST-TestSimPolicyCloud.testCreateCollectionSplitShard-seed#[7C056A298B5F7FEC]) [    ] o.a.s.c.a.s.SimCloudManager === Restarting OverseerTriggerThread and clearing object cache...
   [junit4]   2> 1134767 DEBUG (Simulated OverseerAutoScalingTriggerThread) [    ] o.a.s.c.a.OverseerTriggerThread -- clean old nodeLost markers
   [junit4]   2> 1134767 DEBUG (Simulated OverseerAutoScalingTriggerThread) [    ] o.a.s.c.a.OverseerTriggerThread -- clean old nodeAdded markers
   [junit4]   2> 1134767 WARN  (Simulated OverseerAutoScalingTriggerThread) [    ] o.a.s.c.a.OverseerTriggerThread Interrupted
   [junit4]   2> java.lang.InterruptedException: null
   [junit4]   2> 	at java.util.concurrent.locks.AbstractQueuedSynchronizer.acquireInterruptibly(AbstractQueuedSynchronizer.java:1220) ~[?:1.8.0_172]
   [junit4]   2> 	at java.util.concurrent.locks.ReentrantLock.lockInterruptibly(ReentrantLock.java:335) ~[?:1.8.0_172]
   [junit4]   2> 	at org.apache.solr.cloud.autoscaling.OverseerTriggerThread.run(OverseerTriggerThread.java:177) [java/:?]
   [junit4]   2> 	at java.lang.Thread.run(Thread.java:748) [?:1.8.0_172]
   [junit4]   2> 1134767 DEBUG (TEST-TestSimPolicyCloud.testCreateCollectionSplitShard-seed#[7C056A298B5F7FEC]) [    ] o.a.s.c.a.ScheduledTriggers Shutting down scheduled thread pool executor now
   [junit4]   2> 1134767 DEBUG (TEST-TestSimPolicyCloud.testCreateCollectionSplitShard-seed#[7C056A298B5F7FEC]) [    ] o.a.s.c.a.ScheduledTriggers Shutting down action executor now
   [junit4]   2> 1134767 DEBUG (TEST-TestSimPolicyCloud.testCreateCollectionSplitShard-seed#[7C056A298B5F7FEC]) [    ] o.a.s.c.a.ScheduledTriggers Awaiting termination for action executor
   [junit4]   2> 1134767 DEBUG (TEST-TestSimPolicyCloud.testCreateCollectionSplitShard-seed#[7C056A298B5F7FEC]) [    ] o.a.s.c.a.ScheduledTriggers Awaiting termination for scheduled thread pool executor
   [junit4]   2> 1134768 DEBUG (TEST-TestSimPolicyCloud.testCreateCollectionSplitShard-seed#[7C056A298B5F7FEC]) [    ] o.a.s.c.a.ScheduledTriggers ScheduledTriggers closed completely
   [junit4]   2> 1134768 DEBUG (TEST-TestSimPolicyCloud.testCreateCollectionSplitShard-seed#[7C056A298B5F7FEC]) [    ] o.a.s.c.a.OverseerTriggerThread OverseerTriggerThread has been closed explicitly
   [junit4]   2> 1134769 DEBUG (Simulated OverseerAutoScalingTriggerThread) [    ] o.a.s.c.a.OverseerTriggerThread Adding .auto_add_replicas and .scheduled_maintenance triggers
   [junit4]   2> 1134769 DEBUG (Simulated OverseerAutoScalingTriggerThread) [    ] o.a.s.c.a.OverseerTriggerThread Refreshing /autoscaling.json with znode version 18
   [junit4]   2> 1134769 DEBUG (Simulated OverseerAutoScalingTriggerThread) [    ] o.a.s.c.a.OverseerTriggerThread Current znodeVersion 18, lastZnodeVersion -1
   [junit4]   2> 1134769 DEBUG (Simulated OverseerAutoScalingTriggerThread) [    ] o.a.s.c.a.OverseerTriggerThread Processed trigger updates upto znodeVersion 18
   [junit4]   2> 1134769 DEBUG (Simulated OverseerAutoScalingTriggerThread) [    ] o.a.s.c.a.NodeLostTrigger NodeLostTrigger .auto_add_replicas - Initial livenodes: [127.0.0.1:10001_solr, 127.0.0.1:10004_solr, 127.0.0.1:10000_solr, 127.0.0.1:10002_solr, 127.0.0.1:10003_solr]
   [junit4]   2> 1134770 DEBUG (Simulated OverseerAutoScalingTriggerThread) [    ] o.a.s.c.a.OverseerTriggerThread -- clean old nodeAdded markers
   [junit4]   2> 1134770 DEBUG (Simulated OverseerAutoScalingTriggerThread) [    ] o.a.s.c.a.OverseerTriggerThread Current znodeVersion 18, lastZnodeVersion 18
   [junit4]   2> 1134770 DEBUG (ScheduledTrigger-4389-thread-2) [    ] o.a.s.c.a.NodeLostTrigger Running NodeLostTrigger: .auto_add_replicas with currently live nodes: 5
   [junit4]   2> 1134791 DEBUG (ScheduledTrigger-4389-thread-3) [    ] o.a.s.c.a.NodeLostTrigger Running NodeLostTrigger: .auto_add_replicas with currently live nodes: 5
   [junit4]   2> 1134813 DEBUG (ScheduledTrigger-4389-thread-4) [    ] o.a.s.c.a.NodeLostTrigger Running NodeLostTrigger: .auto_add_replicas with currently live nodes: 5
   [junit4]   2> 1134834 DEBUG (ScheduledTrigger-4389-thread-3) [    ] o.a.s.c.a.NodeLostTrigger Running NodeLostTrigger: .auto_add_replicas with currently live nodes: 5
   [junit4]   2> 1134854 DEBUG (ScheduledTrigger-4389-thread-4) [    ] o.a.s.c.a.NodeLostTrigger Running NodeLostTrigger: .auto_add_replicas with currently live nodes: 5
   [junit4]   2> 1134872 DEBUG (simCloudManagerPool-4388-thread-1) [    ] o.a.s.c.a.AutoScalingHandler Verified autoscaling configuration
   [junit4]   2> 1134872 DEBUG (simCloudManagerPool-4388-thread-1) [    ] o.a.s.c.a.OverseerTriggerThread Refreshing /autoscaling.json with znode version 19
   [junit4]   2> 1134872 DEBUG (Simulated OverseerAutoScalingTriggerThread) [    ] o.a.s.c.a.OverseerTriggerThread Processed trigger updates upto znodeVersion 19
   [junit4]   2> 1134872 DEBUG (Simulated OverseerAutoScalingTriggerThread) [    ] o.a.s.c.a.OverseerTriggerThread -- clean old nodeAdded markers
   [junit4]   2> 1134872 DEBUG (Simulated OverseerAutoScalingTriggerThread) [    ] o.a.s.c.a.OverseerTriggerThread Current znodeVersion 19, lastZnodeVersion 19
   [junit4]   2> 1134875 DEBUG (ScheduledTrigger-4389-thread-3) [    ] o.a.s.c.a.NodeLostTrigger Running NodeLostTrigger: .auto_add_replicas with currently live nodes: 5
   [junit4]   2> 1134886 INFO  (simCloudManagerPool-4388-thread-2) [    ] o.a.s.c.s.c.a.PolicyHelper returnSession, curr-time 4494403070 sessionWrapper.createTime 4494403001379238, this.sessionWrapper.createTime 4494403001379238 
   [junit4]   2> 1134898 DEBUG (ScheduledTrigger-4389-thread-4) [    ] o.a.s.c.a.NodeLostTrigger Running NodeLostTrigger: .auto_add_replicas with currently live nodes: 5
   [junit4]   2> 1134903 DEBUG (simCloudManagerPool-4388-thread-3) [    ] o.a.s.c.a.s.SimClusterStateProvider -- submit leader election for testCreateCollectionSplitShard / shard1
   [junit4]   2> 1134904 DEBUG (simCloudManagerPool-4388-thread-5) [    ] o.a.s.c.a.s.SimClusterStateProvider Running leader election for testCreateCollectionSplitShard / shard1
   [junit4]   2> 1134904 DEBUG (simCloudManagerPool-4388-thread-5) [    ] o.a.s.c.a.s.SimClusterStateProvider -- elected new leader for testCreateCollectionSplitShard / shard1: core_node1
   [junit4]   2> 1134914 DEBUG (simCloudManagerPool-4388-thread-4) [    ] o.a.s.c.a.s.SimClusterStateProvider -- already has leader testCreateCollectionSplitShard / shard1
   [junit4]   2> 1134919 DEBUG (ScheduledTrigger-4389-thread-2) [    ] o.a.s.c.a.NodeLostTrigger Running NodeLostTrigger: .auto_add_replicas with currently live nodes: 5
   [junit4]   2> 1134940 DEBUG (ScheduledTrigger-4389-thread-3) [    ] o.a.s.c.a.NodeLostTrigger Running NodeLostTrigger: .auto_add_replicas with currently 

[...truncated too long message...]

e).
   [junit4] Started J1 PID(40785@serv1-vm2.sd-datasolutions.de).
   [junit4] Suite: org.apache.solr.cloud.autoscaling.sim.TestSimPolicyCloud
   [junit4] OK      0.81s J0 | TestSimPolicyCloud.testDataProvider
   [junit4] OK      0.67s J0 | TestSimPolicyCloud.testCreateCollectionAddShardWithReplicaTypeUsingPolicy
   [junit4] OK      0.30s J0 | TestSimPolicyCloud.testCreateCollectionAddShardUsingPolicy
   [junit4] OK      0.17s J0 | TestSimPolicyCloud.testCreateCollectionAddReplica
   [junit4] OK      0.16s J0 | TestSimPolicyCloud.testMetricsTag
   [junit4] OK      0.28s J0 | TestSimPolicyCloud.testDataProviderPerReplicaDetails
   [junit4] OK      0.45s J0 | TestSimPolicyCloud.testCreateCollectionSplitShard
   [junit4] Completed [1/5] on J0 in 9.79s, 7 tests
   [junit4] 
   [junit4] Suite: org.apache.solr.cloud.autoscaling.sim.TestSimPolicyCloud
   [junit4] OK      1.45s J1 | TestSimPolicyCloud.testDataProvider
   [junit4] OK      0.57s J1 | TestSimPolicyCloud.testCreateCollectionAddShardWithReplicaTypeUsingPolicy
   [junit4] OK      0.27s J1 | TestSimPolicyCloud.testCreateCollectionAddShardUsingPolicy
   [junit4] OK      0.17s J1 | TestSimPolicyCloud.testCreateCollectionAddReplica
   [junit4] OK      0.15s J1 | TestSimPolicyCloud.testMetricsTag
   [junit4] OK      0.29s J1 | TestSimPolicyCloud.testDataProviderPerReplicaDetails
   [junit4] OK      0.46s J1 | TestSimPolicyCloud.testCreateCollectionSplitShard
   [junit4] Completed [2/5] on J1 in 10.52s, 7 tests
   [junit4] 
   [junit4] Duplicate suite name used with XML reports: org.apache.solr.cloud.autoscaling.sim.TestSimPolicyCloud. This may confuse tools that process XML reports. Set 'ignoreDuplicateSuites' to true to skip this message.
   [junit4] Suite: org.apache.solr.cloud.autoscaling.sim.TestSimPolicyCloud
   [junit4] OK      0.19s J0 | TestSimPolicyCloud.testDataProvider
   [junit4] OK      0.32s J0 | TestSimPolicyCloud.testCreateCollectionAddShardWithReplicaTypeUsingPolicy
   [junit4] OK      0.28s J0 | TestSimPolicyCloud.testCreateCollectionAddShardUsingPolicy
   [junit4] OK      0.17s J0 | TestSimPolicyCloud.testCreateCollectionAddReplica
   [junit4] OK      0.14s J0 | TestSimPolicyCloud.testMetricsTag
   [junit4] OK      0.28s J0 | TestSimPolicyCloud.testDataProviderPerReplicaDetails
   [junit4] OK      0.42s J0 | TestSimPolicyCloud.testCreateCollectionSplitShard
   [junit4] Completed [3/5] on J0 in 1.86s, 7 tests
   [junit4] 
   [junit4] Suite: org.apache.solr.cloud.autoscaling.sim.TestSimPolicyCloud
   [junit4] OK      0.19s J1 | TestSimPolicyCloud.testDataProvider
   [junit4] OK      0.31s J1 | TestSimPolicyCloud.testCreateCollectionAddShardWithReplicaTypeUsingPolicy
   [junit4] OK      0.27s J1 | TestSimPolicyCloud.testCreateCollectionAddShardUsingPolicy
   [junit4] OK      0.15s J1 | TestSimPolicyCloud.testCreateCollectionAddReplica
   [junit4] OK      0.13s J1 | TestSimPolicyCloud.testMetricsTag
   [junit4] OK      0.30s J1 | TestSimPolicyCloud.testDataProviderPerReplicaDetails
   [junit4] OK      0.42s J1 | TestSimPolicyCloud.testCreateCollectionSplitShard
   [junit4] Completed [4/5] on J1 in 1.82s, 7 tests
   [junit4] 
   [junit4] Suite: org.apache.solr.cloud.autoscaling.sim.TestSimPolicyCloud
   [junit4] OK      0.18s J0 | TestSimPolicyCloud.testDataProvider
   [junit4] OK      0.31s J0 | TestSimPolicyCloud.testCreateCollectionAddShardWithReplicaTypeUsingPolicy
   [junit4] OK      0.26s J0 | TestSimPolicyCloud.testCreateCollectionAddShardUsingPolicy
   [junit4] OK      0.16s J0 | TestSimPolicyCloud.testCreateCollectionAddReplica
   [junit4] OK      0.14s J0 | TestSimPolicyCloud.testMetricsTag
   [junit4] OK      0.28s J0 | TestSimPolicyCloud.testDataProviderPerReplicaDetails
   [junit4] OK      0.43s J0 | TestSimPolicyCloud.testCreateCollectionSplitShard
   [junit4] Completed [5/5] on J0 in 1.80s, 7 tests
   [junit4] 
   [junit4] JVM J0:     0.69 ..    16.14 =    15.45s
   [junit4] JVM J1:     0.70 ..    14.96 =    14.26s
   [junit4] Execution time total: 16 seconds
   [junit4] Tests summary: 5 suites, 35 tests
   [junit4] Could not remove temporary path: /Users/jenkins/workspace/Lucene-Solr-master-MacOSX/solr/build/solr-core/test/J0 (java.nio.file.DirectoryNotEmptyException: Remaining files: [/Users/jenkins/workspace/Lucene-Solr-master-MacOSX/solr/build/solr-core/test/J0/temp])
   [junit4] Could not remove temporary path: /Users/jenkins/workspace/Lucene-Solr-master-MacOSX/solr/build/solr-core/test/J1 (java.nio.file.DirectoryNotEmptyException: Remaining files: [/Users/jenkins/workspace/Lucene-Solr-master-MacOSX/solr/build/solr-core/test/J1/temp])
     [echo] 5 slowest tests:
[junit4:tophints] 385.63s | org.apache.solr.cloud.api.collections.ShardSplitTest
[junit4:tophints] 271.62s | org.apache.solr.cloud.cdcr.CdcrWithNodesRestartsTest
[junit4:tophints] 181.84s | org.apache.solr.cloud.cdcr.CdcrOpsAndBoundariesTest
[junit4:tophints] 130.65s | org.apache.solr.cloud.autoscaling.IndexSizeTriggerTest
[junit4:tophints] 117.48s | org.apache.solr.update.SoftAutoCommitTest

-check-totals:

test-nocompile:

BUILD SUCCESSFUL
Total time: 19 seconds
[repro] Failures:
[repro]   0/5 failed: org.apache.solr.cloud.autoscaling.sim.TestSimPolicyCloud
[repro] Exiting with code 0
+ mv lucene/build lucene/build.repro
+ mv solr/build solr/build.repro
+ mv lucene/build.orig lucene/build
+ mv solr/build.orig solr/build
Archiving artifacts
Setting ANT_1_8_2_HOME=/Users/jenkins/tools/hudson.tasks.Ant_AntInstallation/ANT_1.8.2
java.lang.InterruptedException: no matches found within 10000
	at hudson.FilePath$ValidateAntFileMask.hasMatch(FilePath.java:2845)
	at hudson.FilePath$ValidateAntFileMask.invoke(FilePath.java:2724)
	at hudson.FilePath$ValidateAntFileMask.invoke(FilePath.java:2705)
	at hudson.FilePath$FileCallableWrapper.call(FilePath.java:3084)
Also:   hudson.remoting.Channel$CallSiteStackTrace: Remote call to MacOSX VBOX
		at hudson.remoting.Channel.attachCallSiteStackTrace(Channel.java:1741)
		at hudson.remoting.UserRequest$ExceptionResponse.retrieve(UserRequest.java:357)
		at hudson.remoting.Channel.call(Channel.java:955)
		at hudson.FilePath.act(FilePath.java:1070)
		at hudson.FilePath.act(FilePath.java:1059)
		at hudson.FilePath.validateAntFileMask(FilePath.java:2703)
		at hudson.tasks.ArtifactArchiver.perform(ArtifactArchiver.java:243)
		at hudson.tasks.BuildStepCompatibilityLayer.perform(BuildStepCompatibilityLayer.java:81)
		at hudson.tasks.BuildStepMonitor$1.perform(BuildStepMonitor.java:20)
		at hudson.model.AbstractBuild$AbstractBuildExecution.perform(AbstractBuild.java:744)
		at hudson.model.AbstractBuild$AbstractBuildExecution.performAllBuildSteps(AbstractBuild.java:690)
		at hudson.model.Build$BuildExecution.post2(Build.java:186)
		at hudson.model.AbstractBuild$AbstractBuildExecution.post(AbstractBuild.java:635)
		at hudson.model.Run.execute(Run.java:1840)
		at hudson.model.FreeStyleBuild.run(FreeStyleBuild.java:43)
		at hudson.model.ResourceController.execute(ResourceController.java:97)
		at hudson.model.Executor.run(Executor.java:429)
Caused: hudson.FilePath$TunneledInterruptedException
	at hudson.FilePath$FileCallableWrapper.call(FilePath.java:3086)
	at hudson.remoting.UserRequest.perform(UserRequest.java:212)
	at hudson.remoting.UserRequest.perform(UserRequest.java:54)
	at hudson.remoting.Request$2.run(Request.java:369)
	at hudson.remoting.InterceptingExecutorService$1.call(InterceptingExecutorService.java:72)
	at java.util.concurrent.FutureTask.run(FutureTask.java:266)
	at java.util.concurrent.ThreadPoolExecutor.runWorker(ThreadPoolExecutor.java:1149)
	at java.util.concurrent.ThreadPoolExecutor$Worker.run(ThreadPoolExecutor.java:624)
	at java.lang.Thread.run(Thread.java:748)
Caused: java.lang.InterruptedException: java.lang.InterruptedException: no matches found within 10000
	at hudson.FilePath.act(FilePath.java:1072)
	at hudson.FilePath.act(FilePath.java:1059)
	at hudson.FilePath.validateAntFileMask(FilePath.java:2703)
	at hudson.tasks.ArtifactArchiver.perform(ArtifactArchiver.java:243)
	at hudson.tasks.BuildStepCompatibilityLayer.perform(BuildStepCompatibilityLayer.java:81)
	at hudson.tasks.BuildStepMonitor$1.perform(BuildStepMonitor.java:20)
	at hudson.model.AbstractBuild$AbstractBuildExecution.perform(AbstractBuild.java:744)
	at hudson.model.AbstractBuild$AbstractBuildExecution.performAllBuildSteps(AbstractBuild.java:690)
	at hudson.model.Build$BuildExecution.post2(Build.java:186)
	at hudson.model.AbstractBuild$AbstractBuildExecution.post(AbstractBuild.java:635)
	at hudson.model.Run.execute(Run.java:1840)
	at hudson.model.FreeStyleBuild.run(FreeStyleBuild.java:43)
	at hudson.model.ResourceController.execute(ResourceController.java:97)
	at hudson.model.Executor.run(Executor.java:429)
No artifacts found that match the file pattern "**/*.events,heapdumps/**,**/*_pid*.log". Configuration error?
[WARNINGS] Parsing warnings in console log with parser Java Compiler (javac)
Setting ANT_1_8_2_HOME=/Users/jenkins/tools/hudson.tasks.Ant_AntInstallation/ANT_1.8.2
Setting ANT_1_8_2_HOME=/Users/jenkins/tools/hudson.tasks.Ant_AntInstallation/ANT_1.8.2
<Git Blamer> Using GitBlamer to create author and commit information for all warnings.
<Git Blamer> GIT_COMMIT=ac7969e3c05cf9db28dbe52d0911d64a864d8c97, workspace=/Users/jenkins/workspace/Lucene-Solr-master-MacOSX
[WARNINGS] Computing warning deltas based on reference build #4835
Recording test results
Setting ANT_1_8_2_HOME=/Users/jenkins/tools/hudson.tasks.Ant_AntInstallation/ANT_1.8.2
Build step 'Publish JUnit test result report' changed build result to UNSTABLE
Email was triggered for: Unstable (Test Failures)
Sending email for trigger: Unstable (Test Failures)
Setting ANT_1_8_2_HOME=/Users/jenkins/tools/hudson.tasks.Ant_AntInstallation/ANT_1.8.2
Setting ANT_1_8_2_HOME=/Users/jenkins/tools/hudson.tasks.Ant_AntInstallation/ANT_1.8.2
Setting ANT_1_8_2_HOME=/Users/jenkins/tools/hudson.tasks.Ant_AntInstallation/ANT_1.8.2
Setting ANT_1_8_2_HOME=/Users/jenkins/tools/hudson.tasks.Ant_AntInstallation/ANT_1.8.2

Mime
View raw message