lucene-dev mailing list archives

Site index · List index
Message view « Date » · « Thread »
Top « Date » · « Thread »
From Policeman Jenkins Server <jenk...@thetaphi.de>
Subject [JENKINS] Lucene-Solr-master-Linux (64bit/jdk-9.0.4) - Build # 22782 - Still Unstable!
Date Sat, 01 Sep 2018 11:04:04 GMT
Build: https://jenkins.thetaphi.de/job/Lucene-Solr-master-Linux/22782/
Java: 64bit/jdk-9.0.4 -XX:-UseCompressedOops -XX:+UseSerialGC

2 tests failed.
FAILED:  org.apache.solr.handler.RequestLoggingTest.testLogBeforeExecuteWithRequestLogger

Error Message:


Stack Trace:
java.lang.AssertionError
	at __randomizedtesting.SeedInfo.seed([65B5438E9AAD0CD7:D4DC6381375BB499]:0)
	at org.junit.Assert.fail(Assert.java:92)
	at org.junit.Assert.assertTrue(Assert.java:43)
	at org.junit.Assert.assertTrue(Assert.java:54)
	at org.apache.solr.handler.RequestLoggingTest.testLogBeforeExecute(RequestLoggingTest.java:88)
	at org.apache.solr.handler.RequestLoggingTest.testLogBeforeExecuteWithRequestLogger(RequestLoggingTest.java:71)
	at java.base/jdk.internal.reflect.NativeMethodAccessorImpl.invoke0(Native Method)
	at java.base/jdk.internal.reflect.NativeMethodAccessorImpl.invoke(NativeMethodAccessorImpl.java:62)
	at java.base/jdk.internal.reflect.DelegatingMethodAccessorImpl.invoke(DelegatingMethodAccessorImpl.java:43)
	at java.base/java.lang.reflect.Method.invoke(Method.java:564)
	at com.carrotsearch.randomizedtesting.RandomizedRunner.invoke(RandomizedRunner.java:1737)
	at com.carrotsearch.randomizedtesting.RandomizedRunner$8.evaluate(RandomizedRunner.java:934)
	at com.carrotsearch.randomizedtesting.RandomizedRunner$9.evaluate(RandomizedRunner.java:970)
	at com.carrotsearch.randomizedtesting.RandomizedRunner$10.evaluate(RandomizedRunner.java:984)
	at com.carrotsearch.randomizedtesting.rules.SystemPropertiesRestoreRule$1.evaluate(SystemPropertiesRestoreRule.java:57)
	at org.apache.lucene.util.TestRuleSetupTeardownChained$1.evaluate(TestRuleSetupTeardownChained.java:49)
	at org.apache.lucene.util.AbstractBeforeAfterRule$1.evaluate(AbstractBeforeAfterRule.java:45)
	at org.apache.lucene.util.TestRuleThreadAndTestName$1.evaluate(TestRuleThreadAndTestName.java:48)
	at org.apache.lucene.util.TestRuleIgnoreAfterMaxFailures$1.evaluate(TestRuleIgnoreAfterMaxFailures.java:64)
	at org.apache.lucene.util.TestRuleMarkFailure$1.evaluate(TestRuleMarkFailure.java:47)
	at com.carrotsearch.randomizedtesting.rules.StatementAdapter.evaluate(StatementAdapter.java:36)
	at com.carrotsearch.randomizedtesting.ThreadLeakControl$StatementRunner.run(ThreadLeakControl.java:368)
	at com.carrotsearch.randomizedtesting.ThreadLeakControl.forkTimeoutingTask(ThreadLeakControl.java:817)
	at com.carrotsearch.randomizedtesting.ThreadLeakControl$3.evaluate(ThreadLeakControl.java:468)
	at com.carrotsearch.randomizedtesting.RandomizedRunner.runSingleTest(RandomizedRunner.java:943)
	at com.carrotsearch.randomizedtesting.RandomizedRunner$5.evaluate(RandomizedRunner.java:829)
	at com.carrotsearch.randomizedtesting.RandomizedRunner$6.evaluate(RandomizedRunner.java:879)
	at com.carrotsearch.randomizedtesting.RandomizedRunner$7.evaluate(RandomizedRunner.java:890)
	at com.carrotsearch.randomizedtesting.rules.StatementAdapter.evaluate(StatementAdapter.java:36)
	at com.carrotsearch.randomizedtesting.rules.SystemPropertiesRestoreRule$1.evaluate(SystemPropertiesRestoreRule.java:57)
	at org.apache.lucene.util.AbstractBeforeAfterRule$1.evaluate(AbstractBeforeAfterRule.java:45)
	at com.carrotsearch.randomizedtesting.rules.StatementAdapter.evaluate(StatementAdapter.java:36)
	at org.apache.lucene.util.TestRuleStoreClassName$1.evaluate(TestRuleStoreClassName.java:41)
	at com.carrotsearch.randomizedtesting.rules.NoShadowingOrOverridesOnMethodsRule$1.evaluate(NoShadowingOrOverridesOnMethodsRule.java:40)
	at com.carrotsearch.randomizedtesting.rules.NoShadowingOrOverridesOnMethodsRule$1.evaluate(NoShadowingOrOverridesOnMethodsRule.java:40)
	at com.carrotsearch.randomizedtesting.rules.StatementAdapter.evaluate(StatementAdapter.java:36)
	at com.carrotsearch.randomizedtesting.rules.StatementAdapter.evaluate(StatementAdapter.java:36)
	at org.apache.lucene.util.TestRuleAssertionsRequired$1.evaluate(TestRuleAssertionsRequired.java:53)
	at org.apache.lucene.util.TestRuleMarkFailure$1.evaluate(TestRuleMarkFailure.java:47)
	at org.apache.lucene.util.TestRuleIgnoreAfterMaxFailures$1.evaluate(TestRuleIgnoreAfterMaxFailures.java:64)
	at org.apache.lucene.util.TestRuleIgnoreTestSuites$1.evaluate(TestRuleIgnoreTestSuites.java:54)
	at com.carrotsearch.randomizedtesting.rules.StatementAdapter.evaluate(StatementAdapter.java:36)
	at com.carrotsearch.randomizedtesting.ThreadLeakControl$StatementRunner.run(ThreadLeakControl.java:368)
	at java.base/java.lang.Thread.run(Thread.java:844)


FAILED:  org.apache.solr.handler.RequestLoggingTest.testLogBeforeExecuteWithCoreLogger

Error Message:


Stack Trace:
java.lang.AssertionError
	at __randomizedtesting.SeedInfo.seed([65B5438E9AAD0CD7:A933430064646741]:0)
	at org.junit.Assert.fail(Assert.java:92)
	at org.junit.Assert.assertTrue(Assert.java:43)
	at org.junit.Assert.assertTrue(Assert.java:54)
	at org.apache.solr.handler.RequestLoggingTest.testLogBeforeExecute(RequestLoggingTest.java:88)
	at org.apache.solr.handler.RequestLoggingTest.testLogBeforeExecuteWithCoreLogger(RequestLoggingTest.java:65)
	at java.base/jdk.internal.reflect.NativeMethodAccessorImpl.invoke0(Native Method)
	at java.base/jdk.internal.reflect.NativeMethodAccessorImpl.invoke(NativeMethodAccessorImpl.java:62)
	at java.base/jdk.internal.reflect.DelegatingMethodAccessorImpl.invoke(DelegatingMethodAccessorImpl.java:43)
	at java.base/java.lang.reflect.Method.invoke(Method.java:564)
	at com.carrotsearch.randomizedtesting.RandomizedRunner.invoke(RandomizedRunner.java:1737)
	at com.carrotsearch.randomizedtesting.RandomizedRunner$8.evaluate(RandomizedRunner.java:934)
	at com.carrotsearch.randomizedtesting.RandomizedRunner$9.evaluate(RandomizedRunner.java:970)
	at com.carrotsearch.randomizedtesting.RandomizedRunner$10.evaluate(RandomizedRunner.java:984)
	at com.carrotsearch.randomizedtesting.rules.SystemPropertiesRestoreRule$1.evaluate(SystemPropertiesRestoreRule.java:57)
	at org.apache.lucene.util.TestRuleSetupTeardownChained$1.evaluate(TestRuleSetupTeardownChained.java:49)
	at org.apache.lucene.util.AbstractBeforeAfterRule$1.evaluate(AbstractBeforeAfterRule.java:45)
	at org.apache.lucene.util.TestRuleThreadAndTestName$1.evaluate(TestRuleThreadAndTestName.java:48)
	at org.apache.lucene.util.TestRuleIgnoreAfterMaxFailures$1.evaluate(TestRuleIgnoreAfterMaxFailures.java:64)
	at org.apache.lucene.util.TestRuleMarkFailure$1.evaluate(TestRuleMarkFailure.java:47)
	at com.carrotsearch.randomizedtesting.rules.StatementAdapter.evaluate(StatementAdapter.java:36)
	at com.carrotsearch.randomizedtesting.ThreadLeakControl$StatementRunner.run(ThreadLeakControl.java:368)
	at com.carrotsearch.randomizedtesting.ThreadLeakControl.forkTimeoutingTask(ThreadLeakControl.java:817)
	at com.carrotsearch.randomizedtesting.ThreadLeakControl$3.evaluate(ThreadLeakControl.java:468)
	at com.carrotsearch.randomizedtesting.RandomizedRunner.runSingleTest(RandomizedRunner.java:943)
	at com.carrotsearch.randomizedtesting.RandomizedRunner$5.evaluate(RandomizedRunner.java:829)
	at com.carrotsearch.randomizedtesting.RandomizedRunner$6.evaluate(RandomizedRunner.java:879)
	at com.carrotsearch.randomizedtesting.RandomizedRunner$7.evaluate(RandomizedRunner.java:890)
	at com.carrotsearch.randomizedtesting.rules.StatementAdapter.evaluate(StatementAdapter.java:36)
	at com.carrotsearch.randomizedtesting.rules.SystemPropertiesRestoreRule$1.evaluate(SystemPropertiesRestoreRule.java:57)
	at org.apache.lucene.util.AbstractBeforeAfterRule$1.evaluate(AbstractBeforeAfterRule.java:45)
	at com.carrotsearch.randomizedtesting.rules.StatementAdapter.evaluate(StatementAdapter.java:36)
	at org.apache.lucene.util.TestRuleStoreClassName$1.evaluate(TestRuleStoreClassName.java:41)
	at com.carrotsearch.randomizedtesting.rules.NoShadowingOrOverridesOnMethodsRule$1.evaluate(NoShadowingOrOverridesOnMethodsRule.java:40)
	at com.carrotsearch.randomizedtesting.rules.NoShadowingOrOverridesOnMethodsRule$1.evaluate(NoShadowingOrOverridesOnMethodsRule.java:40)
	at com.carrotsearch.randomizedtesting.rules.StatementAdapter.evaluate(StatementAdapter.java:36)
	at com.carrotsearch.randomizedtesting.rules.StatementAdapter.evaluate(StatementAdapter.java:36)
	at org.apache.lucene.util.TestRuleAssertionsRequired$1.evaluate(TestRuleAssertionsRequired.java:53)
	at org.apache.lucene.util.TestRuleMarkFailure$1.evaluate(TestRuleMarkFailure.java:47)
	at org.apache.lucene.util.TestRuleIgnoreAfterMaxFailures$1.evaluate(TestRuleIgnoreAfterMaxFailures.java:64)
	at org.apache.lucene.util.TestRuleIgnoreTestSuites$1.evaluate(TestRuleIgnoreTestSuites.java:54)
	at com.carrotsearch.randomizedtesting.rules.StatementAdapter.evaluate(StatementAdapter.java:36)
	at com.carrotsearch.randomizedtesting.ThreadLeakControl$StatementRunner.run(ThreadLeakControl.java:368)
	at java.base/java.lang.Thread.run(Thread.java:844)




Build Log:
[...truncated 14541 lines...]
   [junit4] Suite: org.apache.solr.handler.RequestLoggingTest
   [junit4]   2> Creating dataDir: /home/jenkins/workspace/Lucene-Solr-master-Linux/solr/build/solr-core/test/J1/temp/solr.handler.RequestLoggingTest_65B5438E9AAD0CD7-001/init-core-data-001
   [junit4]   2> 2667415 WARN  (SUITE-RequestLoggingTest-seed#[65B5438E9AAD0CD7]-worker) [    ] o.a.s.SolrTestCaseJ4 startTrackingSearchers: numOpens=5 numCloses=5
   [junit4]   2> 2667415 INFO  (SUITE-RequestLoggingTest-seed#[65B5438E9AAD0CD7]-worker) [    ] o.a.s.SolrTestCaseJ4 Using PointFields (NUMERIC_POINTS_SYSPROP=true) w/NUMERIC_DOCVALUES_SYSPROP=true
   [junit4]   2> 2667415 INFO  (SUITE-RequestLoggingTest-seed#[65B5438E9AAD0CD7]-worker) [    ] o.a.s.SolrTestCaseJ4 Randomized ssl (false) and clientAuth (true) via: @org.apache.solr.util.RandomizeSSL(reason="", ssl=0.0/0.0, value=0.0/0.0, clientAuth=0.0/0.0)
   [junit4]   2> 2667415 INFO  (SUITE-RequestLoggingTest-seed#[65B5438E9AAD0CD7]-worker) [    ] o.a.s.SolrTestCaseJ4 SecureRandom sanity checks: test.solr.allowed.securerandom=null & java.security.egd=file:/dev/./urandom
   [junit4]   2> 2667415 INFO  (SUITE-RequestLoggingTest-seed#[65B5438E9AAD0CD7]-worker) [    ] o.a.s.SolrTestCaseJ4 ####initCore
   [junit4]   2> 2667415 INFO  (SUITE-RequestLoggingTest-seed#[65B5438E9AAD0CD7]-worker) [    ] o.a.s.c.SolrResourceLoader [null] Added 2 libs to classloader, from paths: [/home/jenkins/workspace/Lucene-Solr-master-Linux/solr/core/src/test-files/solr/collection1/lib, /home/jenkins/workspace/Lucene-Solr-master-Linux/solr/core/src/test-files/solr/collection1/lib/classes]
   [junit4]   2> 2667430 INFO  (SUITE-RequestLoggingTest-seed#[65B5438E9AAD0CD7]-worker) [    ] o.a.s.c.SolrConfig Using Lucene MatchVersion: 8.0.0
   [junit4]   2> 2667444 INFO  (SUITE-RequestLoggingTest-seed#[65B5438E9AAD0CD7]-worker) [    ] o.a.s.s.IndexSchema [null] Schema name=test
   [junit4]   2> 2667519 INFO  (SUITE-RequestLoggingTest-seed#[65B5438E9AAD0CD7]-worker) [    ] o.a.s.s.IndexSchema Loaded schema test/1.0 with uniqueid field id
   [junit4]   2> 2667605 INFO  (SUITE-RequestLoggingTest-seed#[65B5438E9AAD0CD7]-worker) [    ] o.a.s.c.TransientSolrCoreCacheDefault Allocating transient cache for 2147483647 transient cores
   [junit4]   2> 2667605 INFO  (SUITE-RequestLoggingTest-seed#[65B5438E9AAD0CD7]-worker) [    ] o.a.s.h.a.MetricsHistoryHandler No .system collection, keeping metrics history in memory.
   [junit4]   2> 2667614 INFO  (SUITE-RequestLoggingTest-seed#[65B5438E9AAD0CD7]-worker) [    ] o.a.s.m.r.SolrJmxReporter JMX monitoring for 'solr.node' (registry 'solr.node') enabled at server: com.sun.jmx.mbeanserver.JmxMBeanServer@3d7b7db1
   [junit4]   2> 2667619 INFO  (SUITE-RequestLoggingTest-seed#[65B5438E9AAD0CD7]-worker) [    ] o.a.s.m.r.SolrJmxReporter JMX monitoring for 'solr.jvm' (registry 'solr.jvm') enabled at server: com.sun.jmx.mbeanserver.JmxMBeanServer@3d7b7db1
   [junit4]   2> 2667619 INFO  (SUITE-RequestLoggingTest-seed#[65B5438E9AAD0CD7]-worker) [    ] o.a.s.m.r.SolrJmxReporter JMX monitoring for 'solr.jetty' (registry 'solr.jetty') enabled at server: com.sun.jmx.mbeanserver.JmxMBeanServer@3d7b7db1
   [junit4]   2> 2667620 INFO  (coreLoadExecutor-7736-thread-1) [    x:collection1] o.a.s.c.SolrResourceLoader [null] Added 2 libs to classloader, from paths: [/home/jenkins/workspace/Lucene-Solr-master-Linux/solr/core/src/test-files/solr/collection1/lib, /home/jenkins/workspace/Lucene-Solr-master-Linux/solr/core/src/test-files/solr/collection1/lib/classes]
   [junit4]   2> 2667639 INFO  (coreLoadExecutor-7736-thread-1) [    x:collection1] o.a.s.c.SolrConfig Using Lucene MatchVersion: 8.0.0
   [junit4]   2> 2667669 INFO  (coreLoadExecutor-7736-thread-1) [    x:collection1] o.a.s.s.IndexSchema [collection1] Schema name=test
   [junit4]   2> 2667738 INFO  (coreLoadExecutor-7736-thread-1) [    x:collection1] o.a.s.s.IndexSchema Loaded schema test/1.0 with uniqueid field id
   [junit4]   2> 2667742 INFO  (coreLoadExecutor-7736-thread-1) [    x:collection1] o.a.s.c.CoreContainer Creating SolrCore 'collection1' using configuration from instancedir /home/jenkins/workspace/Lucene-Solr-master-Linux/solr/core/src/test-files/solr/collection1, trusted=true
   [junit4]   2> 2667742 INFO  (coreLoadExecutor-7736-thread-1) [    x:collection1] o.a.s.m.r.SolrJmxReporter JMX monitoring for 'solr.core.collection1' (registry 'solr.core.collection1') enabled at server: com.sun.jmx.mbeanserver.JmxMBeanServer@3d7b7db1
   [junit4]   2> 2667743 INFO  (coreLoadExecutor-7736-thread-1) [    x:collection1] o.a.s.c.SolrCore solr.RecoveryStrategy.Builder
   [junit4]   2> 2667743 INFO  (coreLoadExecutor-7736-thread-1) [    x:collection1] o.a.s.c.SolrCore [[collection1] ] Opening new SolrCore at [/home/jenkins/workspace/Lucene-Solr-master-Linux/solr/core/src/test-files/solr/collection1], dataDir=[/home/jenkins/workspace/Lucene-Solr-master-Linux/solr/build/solr-core/test/J1/temp/solr.handler.RequestLoggingTest_65B5438E9AAD0CD7-001/init-core-data-001/]
   [junit4]   2> 2667743 INFO  (coreLoadExecutor-7736-thread-1) [    x:collection1] o.a.s.u.RandomMergePolicy RandomMergePolicy wrapping class org.apache.lucene.index.LogByteSizeMergePolicy: [LogByteSizeMergePolicy: minMergeSize=1677721, mergeFactor=14, maxMergeSize=2147483648, maxMergeSizeForForcedMerge=9223372036854775807, calibrateSizeByDeletes=true, maxMergeDocs=2147483647, maxCFSSegmentSizeMB=8.796093022207999E12, noCFSRatio=1.0]
   [junit4]   2> 2667782 INFO  (coreLoadExecutor-7736-thread-1) [    x:collection1] o.a.s.u.UpdateHandler Using UpdateLog implementation: org.apache.solr.update.UpdateLog
   [junit4]   2> 2667782 INFO  (coreLoadExecutor-7736-thread-1) [    x:collection1] o.a.s.u.UpdateLog Initializing UpdateLog: dataDir= defaultSyncLevel=FLUSH numRecordsToKeep=100 maxNumLogsToKeep=10 numVersionBuckets=65536
   [junit4]   2> 2667782 INFO  (coreLoadExecutor-7736-thread-1) [    x:collection1] o.a.s.u.CommitTracker Hard AutoCommit: disabled
   [junit4]   2> 2667782 INFO  (coreLoadExecutor-7736-thread-1) [    x:collection1] o.a.s.u.CommitTracker Soft AutoCommit: disabled
   [junit4]   2> 2667783 INFO  (coreLoadExecutor-7736-thread-1) [    x:collection1] o.a.s.u.RandomMergePolicy RandomMergePolicy wrapping class org.apache.lucene.index.TieredMergePolicy: [TieredMergePolicy: maxMergeAtOnce=50, maxMergeAtOnceExplicit=45, maxMergedSegmentMB=35.552734375, floorSegmentMB=0.2451171875, forceMergeDeletesPctAllowed=26.356993003222378, segmentsPerTier=46.0, maxCFSSegmentSizeMB=8.796093022207999E12, noCFSRatio=1.0, deletesPctAllowed=21.505605178040103
   [junit4]   2> 2667783 INFO  (coreLoadExecutor-7736-thread-1) [    x:collection1] o.a.s.s.SolrIndexSearcher Opening [Searcher@6a907ec6[collection1] main]
   [junit4]   2> 2667783 INFO  (coreLoadExecutor-7736-thread-1) [    x:collection1] o.a.s.h.c.SpellCheckComponent Initializing spell checkers
   [junit4]   2> 2667966 INFO  (coreLoadExecutor-7736-thread-1) [    x:collection1] o.a.s.s.DirectSolrSpellChecker init: {name=direct,classname=DirectSolrSpellChecker,field=lowerfilt,minQueryLength=3}
   [junit4]   2> 2668265 INFO  (coreLoadExecutor-7736-thread-1) [    x:collection1] o.a.s.h.ReplicationHandler Commits will be reserved for 10000ms.
   [junit4]   2> 2668265 INFO  (searcherExecutor-7737-thread-1-processing-x:collection1) [    x:collection1] o.a.s.h.c.SpellCheckComponent Loading spell index for spellchecker: default
   [junit4]   2> 2668265 INFO  (coreLoadExecutor-7736-thread-1) [    x:collection1] o.a.s.u.UpdateLog Could not find max version in index or recent updates, using new clock 1610401346102493184
   [junit4]   2> 2668265 INFO  (searcherExecutor-7737-thread-1-processing-x:collection1) [    x:collection1] o.a.s.h.c.SpellCheckComponent Loading spell index for spellchecker: direct
   [junit4]   2> 2668265 INFO  (searcherExecutor-7737-thread-1-processing-x:collection1) [    x:collection1] o.a.s.h.c.SpellCheckComponent Loading spell index for spellchecker: wordbreak
   [junit4]   2> 2668265 INFO  (searcherExecutor-7737-thread-1-processing-x:collection1) [    x:collection1] o.a.s.h.c.SpellCheckComponent Loading spell index for spellchecker: multipleFields
   [junit4]   2> 2668266 INFO  (searcherExecutor-7737-thread-1-processing-x:collection1) [    x:collection1] o.a.s.h.c.SpellCheckComponent Loading spell index for spellchecker: jarowinkler
   [junit4]   2> 2668266 INFO  (searcherExecutor-7737-thread-1-processing-x:collection1) [    x:collection1] o.a.s.h.c.SpellCheckComponent Loading spell index for spellchecker: external
   [junit4]   2> 2668266 INFO  (searcherExecutor-7737-thread-1-processing-x:collection1) [    x:collection1] o.a.s.h.c.SpellCheckComponent Loading spell index for spellchecker: freq
   [junit4]   2> 2668266 INFO  (searcherExecutor-7737-thread-1-processing-x:collection1) [    x:collection1] o.a.s.h.c.SpellCheckComponent Loading spell index for spellchecker: fqcn
   [junit4]   2> 2668266 INFO  (searcherExecutor-7737-thread-1-processing-x:collection1) [    x:collection1] o.a.s.h.c.SpellCheckComponent Loading spell index for spellchecker: perDict
   [junit4]   2> 2668267 INFO  (searcherExecutor-7737-thread-1-processing-x:collection1) [    x:collection1] o.a.s.c.SolrCore [collection1] Registered new searcher Searcher@6a907ec6[collection1] main{ExitableDirectoryReader(UninvertingDirectoryReader())}
   [junit4]   2> 2668267 INFO  (SUITE-RequestLoggingTest-seed#[65B5438E9AAD0CD7]-worker) [    ] o.a.s.SolrTestCaseJ4 ####initCore end
   [junit4]   2> 2668269 INFO  (TEST-RequestLoggingTest.testLogBeforeExecuteWithCoreLogger-seed#[65B5438E9AAD0CD7]) [    ] o.a.s.SolrTestCaseJ4 ###Starting testLogBeforeExecuteWithCoreLogger
   [junit4]   2> 2668274 DEBUG (TEST-RequestLoggingTest.testLogBeforeExecuteWithCoreLogger-seed#[65B5438E9AAD0CD7]) [    ] o.a.s.c.S.Request [collection1]  webapp=null path=null params={q=*:*&wt=xml}
   [junit4]   2> 2668274 DEBUG (TEST-RequestLoggingTest.testLogBeforeExecuteWithCoreLogger-seed#[65B5438E9AAD0CD7]) [    ] o.a.s.h.c.SearchHandler Adding  component:org.apache.solr.handler.component.QueryComponent@58bce041
   [junit4]   2> 2668274 DEBUG (TEST-RequestLoggingTest.testLogBeforeExecuteWithCoreLogger-seed#[65B5438E9AAD0CD7]) [    ] o.a.s.h.c.SearchHandler Adding  component:org.apache.solr.handler.component.FacetComponent@7c7565ad
   [junit4]   2> 2668274 DEBUG (TEST-RequestLoggingTest.testLogBeforeExecuteWithCoreLogger-seed#[65B5438E9AAD0CD7]) [    ] o.a.s.h.c.SearchHandler Adding  component:org.apache.solr.search.facet.FacetModule@ff963a1
   [junit4]   2> 2668274 DEBUG (TEST-RequestLoggingTest.testLogBeforeExecuteWithCoreLogger-seed#[65B5438E9AAD0CD7]) [    ] o.a.s.h.c.SearchHandler Adding  component:org.apache.solr.handler.component.MoreLikeThisComponent@7def494e
   [junit4]   2> 2668274 DEBUG (TEST-RequestLoggingTest.testLogBeforeExecuteWithCoreLogger-seed#[65B5438E9AAD0CD7]) [    ] o.a.s.h.c.SearchHandler Adding  component:org.apache.solr.handler.component.HighlightComponent@42ee005a
   [junit4]   2> 2668274 DEBUG (TEST-RequestLoggingTest.testLogBeforeExecuteWithCoreLogger-seed#[65B5438E9AAD0CD7]) [    ] o.a.s.h.c.SearchHandler Adding  component:org.apache.solr.handler.component.StatsComponent@15e15da7
   [junit4]   2> 2668274 DEBUG (TEST-RequestLoggingTest.testLogBeforeExecuteWithCoreLogger-seed#[65B5438E9AAD0CD7]) [    ] o.a.s.h.c.SearchHandler Adding  component:org.apache.solr.handler.component.ExpandComponent@5141d0d1
   [junit4]   2> 2668274 DEBUG (TEST-RequestLoggingTest.testLogBeforeExecuteWithCoreLogger-seed#[65B5438E9AAD0CD7]) [    ] o.a.s.h.c.SearchHandler Adding  component:org.apache.solr.handler.component.TermsComponent@5663468e
   [junit4]   2> 2668274 DEBUG (TEST-RequestLoggingTest.testLogBeforeExecuteWithCoreLogger-seed#[65B5438E9AAD0CD7]) [    ] o.a.s.h.c.SearchHandler Adding  debug component:org.apache.solr.handler.component.DebugComponent@64bd60c8
   [junit4]   2> 2668274 DEBUG (TEST-RequestLoggingTest.testLogBeforeExecuteWithCoreLogger-seed#[65B5438E9AAD0CD7]) [    ] o.a.s.h.c.QueryComponent process: q=*:*&df=text&wt=xml&indent=off
   [junit4]   2> 2668274 DEBUG (TEST-RequestLoggingTest.testLogBeforeExecuteWithCoreLogger-seed#[65B5438E9AAD0CD7]) [    ] o.a.s.s.s.LocalStatsCache ## GET LocalSolrQueryRequest{q=*:*&df=text&wt=xml&indent=off}
   [junit4]   2> 2668274 INFO  (TEST-RequestLoggingTest.testLogBeforeExecuteWithCoreLogger-seed#[65B5438E9AAD0CD7]) [    ] o.a.s.c.S.Request [collection1]  webapp=null path=null params={q=*:*&wt=xml} hits=0 status=0 QTime=0
   [junit4]   2> 2668276 INFO  (TEST-RequestLoggingTest.testLogBeforeExecuteWithCoreLogger-seed#[65B5438E9AAD0CD7]) [    ] o.a.s.SolrTestCaseJ4 ###Ending testLogBeforeExecuteWithCoreLogger
   [junit4]   2> NOTE: reproduce with: ant test  -Dtestcase=RequestLoggingTest -Dtests.method=testLogBeforeExecuteWithCoreLogger -Dtests.seed=65B5438E9AAD0CD7 -Dtests.multiplier=3 -Dtests.slow=true -Dtests.locale=bs -Dtests.timezone=US/Alaska -Dtests.asserts=true -Dtests.file.encoding=UTF-8
   [junit4] FAILURE 0.01s J1 | RequestLoggingTest.testLogBeforeExecuteWithCoreLogger <<<
   [junit4]    > Throwable #1: java.lang.AssertionError
   [junit4]    > 	at __randomizedtesting.SeedInfo.seed([65B5438E9AAD0CD7:A933430064646741]:0)
   [junit4]    > 	at org.apache.solr.handler.RequestLoggingTest.testLogBeforeExecute(RequestLoggingTest.java:88)
   [junit4]    > 	at org.apache.solr.handler.RequestLoggingTest.testLogBeforeExecuteWithCoreLogger(RequestLoggingTest.java:65)
   [junit4]    > 	at java.base/jdk.internal.reflect.NativeMethodAccessorImpl.invoke0(Native Method)
   [junit4]    > 	at java.base/jdk.internal.reflect.NativeMethodAccessorImpl.invoke(NativeMethodAccessorImpl.java:62)
   [junit4]    > 	at java.base/jdk.internal.reflect.DelegatingMethodAccessorImpl.invoke(DelegatingMethodAccessorImpl.java:43)
   [junit4]    > 	at java.base/java.lang.reflect.Method.invoke(Method.java:564)
   [junit4]    > 	at java.base/java.lang.Thread.run(Thread.java:844)
   [junit4]   2> 2668278 INFO  (TEST-RequestLoggingTest.testLogBeforeExecuteWithRequestLogger-seed#[65B5438E9AAD0CD7]) [    ] o.a.s.SolrTestCaseJ4 ###Starting testLogBeforeExecuteWithRequestLogger
   [junit4]   2> 2668280 DEBUG (TEST-RequestLoggingTest.testLogBeforeExecuteWithRequestLogger-seed#[65B5438E9AAD0CD7]) [    ] o.a.s.c.S.Request [collection1]  webapp=null path=null params={q=*:*&wt=xml}
   [junit4]   2> 2668280 DEBUG (TEST-RequestLoggingTest.testLogBeforeExecuteWithRequestLogger-seed#[65B5438E9AAD0CD7]) [    ] o.a.s.h.c.QueryComponent process: q=*:*&df=text&wt=xml&indent=off
   [junit4]   2> 2668280 DEBUG (TEST-RequestLoggingTest.testLogBeforeExecuteWithRequestLogger-seed#[65B5438E9AAD0CD7]) [    ] o.a.s.s.s.LocalStatsCache ## GET LocalSolrQueryRequest{q=*:*&df=text&wt=xml&indent=off}
   [junit4]   2> 2668280 INFO  (TEST-RequestLoggingTest.testLogBeforeExecuteWithRequestLogger-seed#[65B5438E9AAD0CD7]) [    ] o.a.s.c.S.Request [collection1]  webapp=null path=null params={q=*:*&wt=xml} hits=0 status=0 QTime=0
   [junit4]   2> 2668281 INFO  (TEST-RequestLoggingTest.testLogBeforeExecuteWithRequestLogger-seed#[65B5438E9AAD0CD7]) [    ] o.a.s.SolrTestCaseJ4 ###Ending testLogBeforeExecuteWithRequestLogger
   [junit4]   2> 2668281 INFO  (SUITE-RequestLoggingTest-seed#[65B5438E9AAD0CD7]-worker) [    ] o.a.s.SolrTestCaseJ4 ###deleteCore
   [junit4]   2> 2668281 INFO  (SUITE-RequestLoggingTest-seed#[65B5438E9AAD0CD7]-worker) [    ] o.a.s.c.CoreContainer Shutting down CoreContainer instance=226210915
   [junit4]   2> 2668281 INFO  (SUITE-RequestLoggingTest-seed#[65B5438E9AAD0CD7]-worker) [    ] o.a.s.m.SolrMetricManager Closing metric reporters for registry=solr.node, tag=null
   [junit4]   2> 2668281 INFO  (SUITE-RequestLoggingTest-seed#[65B5438E9AAD0CD7]-worker) [    ] o.a.s.m.r.SolrJmxReporter Closing reporter [org.apache.solr.metrics.reporters.SolrJmxReporter@4639af78: rootName = null, domain = solr.node, service url = null, agent id = null] for registry solr.node / com.codahale.metrics.MetricRegistry@5ac019b
   [junit4]   2> 2668285 INFO  (SUITE-RequestLoggingTest-seed#[65B5438E9AAD0CD7]-worker) [    ] o.a.s.m.SolrMetricManager Closing metric reporters for registry=solr.jvm, tag=null
   [junit4]   2> 2668285 INFO  (SUITE-RequestLoggingTest-seed#[65B5438E9AAD0CD7]-worker) [    ] o.a.s.m.r.SolrJmxReporter Closing reporter [org.apache.solr.metrics.reporters.SolrJmxReporter@1099bc80: rootName = null, domain = solr.jvm, service url = null, agent id = null] for registry solr.jvm / com.codahale.metrics.MetricRegistry@239833ed
   [junit4]   2> 2668288 INFO  (SUITE-RequestLoggingTest-seed#[65B5438E9AAD0CD7]-worker) [    ] o.a.s.m.SolrMetricManager Closing metric reporters for registry=solr.jetty, tag=null
   [junit4]   2> 2668288 INFO  (SUITE-RequestLoggingTest-seed#[65B5438E9AAD0CD7]-worker) [    ] o.a.s.m.r.SolrJmxReporter Closing reporter [org.apache.solr.metrics.reporters.SolrJmxReporter@4269caa: rootName = null, domain = solr.jetty, service url = null, agent id = null] for registry solr.jetty / com.codahale.metrics.MetricRegistry@4343e3c
   [junit4]   2> 2668288 INFO  (coreCloseExecutor-7742-thread-1) [    x:collection1] o.a.s.c.SolrCore [collection1]  CLOSING SolrCore org.apache.solr.core.SolrCore@199e59d7
   [junit4]   2> 2668288 INFO  (coreCloseExecutor-7742-thread-1) [    x:collection1] o.a.s.m.SolrMetricManager Closing metric reporters for registry=solr.core.collection1, tag=199e59d7
   [junit4]   2> 2668288 INFO  (coreCloseExecutor-7742-thread-1) [    x:collection1] o.a.s.m.r.SolrJmxReporter Closing reporter [org.apache.solr.metrics.reporters.SolrJmxReporter@6fe13cdc: rootName = null, domain = solr.core.collection1, service url = null, agent id = null] for registry solr.core.collection1 / com.codahale.metrics.MetricRegistry@5acbb3d2
   [junit4]   2> NOTE: leaving temporary files on disk at: /home/jenkins/workspace/Lucene-Solr-master-Linux/solr/build/solr-core/test/J1/temp/solr.handler.RequestLoggingTest_65B5438E9AAD0CD7-001
   [junit4]   2> NOTE: test params are: codec=Asserting(Lucene80): {}, docValues:{}, maxPointsInLeafNode=1142, maxMBSortInHeap=5.730617462558189, sim=Asserting(org.apache.lucene.search.similarities.AssertingSimilarity@79b20795), locale=bs, timezone=US/Alaska
   [junit4]   2> NOTE: Linux 4.15.0-32-generic amd64/Oracle Corporation 9.0.4 (64-bit)/cpus=8,threads=1,free=127001792,total=518979584
   [junit4]   2> NOTE: All tests run in this JVM: [TestDynamicFieldResource, TestQuerySenderNoQuery, TestJsonFacetsWithNestedObjects, LeaderElectionIntegrationTest, TestSchemalessBufferedUpdates, SSLMigrationTest, TestRangeQuery, TestOmitPositions, DisMaxRequestHandlerTest, XmlInterpolationTest, TestManagedSynonymFilterFactory, ScheduledTriggerTest, StatsReloadRaceTest, TestBlendedInfixSuggestions, TestStressVersions, TestSerializedLuceneMatchVersion, QueryParsingTest, CopyFieldTest, TestCollectionAPI, TermVectorComponentDistributedTest, NumberUtilsTest, RulesTest, JavabinLoaderTest, TestSimDistributedQueue, SimpleMLTQParserTest, SolrMetricManagerTest, TestRawResponseWriter, TestSimPolicyCloud, TestCustomStream, TestNumericTerms64, MetricsHandlerTest, BlockJoinFacetRandomTest, NodeLostTriggerIntegrationTest, TestSearcherReuse, TestCloudJSONFacetSKG, PreAnalyzedFieldTest, TestSimpleTextCodec, TestFuzzyAnalyzedSuggestions, BinaryUpdateRequestHandlerTest, SignificantTermsQParserPluginTest, StatsComponentTest, WrapperMergePolicyFactoryTest, DateMathParserTest, AssignBackwardCompatibilityTest, TestSha256AuthenticationProvider, DistributedFacetSimpleRefinementLongTailTest, UpdateRequestProcessorFactoryTest, TestFiltering, TestInPlaceUpdatesStandalone, SpatialRPTFieldTypeTest, OverseerCollectionConfigSetProcessorTest, ParsingFieldUpdateProcessorsTest, TestLocalFSCloudBackupRestore, TestRandomFaceting, TestTolerantSearch, DistributedFacetPivotSmallAdvancedTest, TestMinMaxOnMultiValuedField, CdcrReplicationHandlerTest, TestCloudNestedDocsSort, SuggesterWFSTTest, TestPartialUpdateDeduplication, AnalysisErrorHandlingTest, TestTolerantUpdateProcessorRandomCloud, SearchHandlerTest, ZkControllerTest, TestReload, URLClassifyProcessorTest, HdfsCollectionsAPIDistributedZkTest, TestRestoreCore, HdfsNNFailoverTest, CdcrBidirectionalTest, TriggerEventQueueTest, TestLuceneIndexBackCompat, NodeMutatorTest, ConfigSetsAPITest, SearchHandlerTest, TestRebalanceLeaders, TestQueryUtils, RemoteQueryErrorTest, DeleteStatusTest, ShardRoutingTest, SpellingQueryConverterTest, TestReversedWildcardFilterFactory, TestSchemaResource, DebugComponentTest, TestHashQParserPlugin, LeaderFailureAfterFreshStartTest, HdfsBasicDistributedZkTest, DistributedQueryElevationComponentTest, ClusterStateTest, MoveReplicaTest, CoreSorterTest, TestCryptoKeys, TestOnReconnectListenerSupport, StatelessScriptUpdateProcessorFactoryTest, TestMaxTokenLenTokenizer, TestDFISimilarityFactory, TestPullReplicaErrorHandling, CollectionStateFormat2Test, TestLegacyTerms, FieldAnalysisRequestHandlerTest, ZookeeperStatusHandlerTest, PeerSyncReplicationTest, TestUseDocValuesAsStored2, TestDistributedStatsComponentCardinality, UnloadDistributedZkTest, ChaosMonkeyNothingIsSafeWithPullReplicasTest, ResponseHeaderTest, TestMaxScoreQueryParser, BasicFunctionalityTest, BlockCacheTest, TestSegmentSorting, DirectSolrSpellCheckerTest, TestLMDirichletSimilarityFactory, TestSolrCloudWithHadoopAuthPlugin, CoreAdminCreateDiscoverTest, SolrJmxReporterTest, TestManagedSchema, TestSimLargeCluster, TestSubQueryTransformer, SimpleFacetsTest, SolrCmdDistributorTest, TestPerFieldSimilarity, HdfsDirectoryTest, DefaultValueUpdateProcessorTest, DistanceFunctionTest, TestPayloadScoreQParserPlugin, TestDynamicURP, TestXIncludeConfig, HLLUtilTest, TestFastLRUCache, SmileWriterTest, TestCustomDocTransformer, MissingSegmentRecoveryTest, AnalysisAfterCoreReloadTest, EchoParamsTest, MinimalSchemaTest, OutputWriterTest, SolrInfoBeanTest, SolrTestCaseJ4Test, TestCursorMarkWithoutUniqueKey, TestDistributedGrouping, TestDistributedMissingSort, TestDistributedSearch, TestDocumentBuilder, TestGroupingSearch, TestHighlightDedupGrouping, TestJoin, TestRandomDVFaceting, PathHierarchyTokenizerFactoryTest, ProtectedTermFilterFactoryTest, TestCharFilters, TestLuceneMatchVersion, TestEmbeddedSolrServerSchemaAPI, TestJettySolrRunner, ActionThrottleTest, AddReplicaTest, BasicDistributedZk2Test, BasicDistributedZkTest, TestInfoStreamLogging, TestInitParams, TestJmxIntegration, TestMergePolicyConfig, TestNRTOpen, TestSolrDeletionPolicy1, TestSolrDeletionPolicy2, TestSolrIndexConfig, DocumentAnalysisRequestHandlerTest, MoreLikeThisHandlerTest, PingRequestHandlerTest, RequestLoggingTest]
   [junit4] Completed [588/832 (1!)] on J1 in 0.89s, 2 tests, 1 failure <<< FAILURES!

[...truncated 42986 lines...]
[repro] Jenkins log URL: https://jenkins.thetaphi.de/job/Lucene-Solr-master-Linux/22782/consoleText

[repro] Revision: d55a81df849e093d043ac21f9e98532f091694d9

[repro] Ant options: "-Dargs=-XX:-UseCompressedOops -XX:+UseSerialGC"
[repro] Repro line:  ant test  -Dtestcase=RequestLoggingTest -Dtests.method=testLogBeforeExecuteWithCoreLogger -Dtests.seed=65B5438E9AAD0CD7 -Dtests.multiplier=3 -Dtests.slow=true -Dtests.locale=bs -Dtests.timezone=US/Alaska -Dtests.asserts=true -Dtests.file.encoding=UTF-8

[repro] ant clean

[...truncated 6 lines...]
[repro] Test suites by module:
[repro]    solr/core
[repro]       RequestLoggingTest
[repro] ant compile-test

[...truncated 3423 lines...]
[repro] ant test-nocompile -Dtests.dups=5 -Dtests.maxfailures=5 -Dtests.class="*.RequestLoggingTest" -Dtests.showOutput=onerror "-Dargs=-XX:-UseCompressedOops -XX:+UseSerialGC" -Dtests.seed=65B5438E9AAD0CD7 -Dtests.multiplier=3 -Dtests.slow=true -Dtests.locale=bs -Dtests.timezone=US/Alaska -Dtests.asserts=true -Dtests.file.encoding=UTF-8

[...truncated 42 lines...]
   [junit4] Suite: org.apache.solr.handler.RequestLoggingTest
   [junit4]   2> Creating dataDir: /home/jenkins/workspace/Lucene-Solr-master-Linux/solr/build/solr-core/test/J1/temp/solr.handler.RequestLoggingTest_65B5438E9AAD0CD7-001/init-core-data-001
   [junit4]   2> 2868 INFO  (SUITE-RequestLoggingTest-seed#[65B5438E9AAD0CD7]-worker) [    ] o.a.s.SolrTestCaseJ4 Using PointFields (NUMERIC_POINTS_SYSPROP=true) w/NUMERIC_DOCVALUES_SYSPROP=true
   [junit4]   2> 2932 INFO  (SUITE-RequestLoggingTest-seed#[65B5438E9AAD0CD7]-worker) [    ] o.e.j.u.log Logging initialized @2974ms to org.eclipse.jetty.util.log.Slf4jLog
   [junit4]   2> 2941 INFO  (SUITE-RequestLoggingTest-seed#[65B5438E9AAD0CD7]-worker) [    ] o.a.s.SolrTestCaseJ4 Randomized ssl (false) and clientAuth (true) via: @org.apache.solr.util.RandomizeSSL(reason="", ssl=0.0/0.0, value=0.0/0.0, clientAuth=0.0/0.0)
   [junit4]   2> 2948 INFO  (SUITE-RequestLoggingTest-seed#[65B5438E9AAD0CD7]-worker) [    ] o.a.s.SolrTestCaseJ4 SecureRandom sanity checks: test.solr.allowed.securerandom=null & java.security.egd=file:/dev/./urandom
   [junit4]   2> 2959 INFO  (SUITE-RequestLoggingTest-seed#[65B5438E9AAD0CD7]-worker) [    ] o.a.s.SolrTestCaseJ4 ####initCore
   [junit4]   2> 3049 INFO  (SUITE-RequestLoggingTest-seed#[65B5438E9AAD0CD7]-worker) [    ] o.a.s.c.SolrResourceLoader Using system property solr.solr.home: /home/jenkins/workspace/Lucene-Solr-master-Linux/solr/core/src/test-files/solr
   [junit4]   2> 3052 INFO  (SUITE-RequestLoggingTest-seed#[65B5438E9AAD0CD7]-worker) [    ] o.a.s.c.SolrResourceLoader [null] Added 2 libs to classloader, from paths: [/home/jenkins/workspace/Lucene-Solr-master-Linux/solr/core/src/test-files/solr/collection1/lib, /home/jenkins/workspace/Lucene-Solr-master-Linux/solr/core/src/test-files/solr/collection1/lib/classes]
   [junit4]   2> 3417 INFO  (SUITE-RequestLoggingTest-seed#[65B5438E9AAD0CD7]-worker) [    ] o.a.s.c.SolrConfig Using Lucene MatchVersion: 8.0.0
   [junit4]   2> 3718 INFO  (SUITE-RequestLoggingTest-seed#[65B5438E9AAD0CD7]-worker) [    ] o.a.s.s.IndexSchema [null] Schema name=test
   [junit4]   2> 4157 WARN  (SUITE-RequestLoggingTest-seed#[65B5438E9AAD0CD7]-worker) [    ] o.a.s.c.SolrResourceLoader Solr loaded a deprecated plugin/analysis class [solr.WordDelimiterFilterFactory]. Please consult documentation how to replace it accordingly.
   [junit4]   2> 4343 WARN  (SUITE-RequestLoggingTest-seed#[65B5438E9AAD0CD7]-worker) [    ] o.a.s.c.SolrResourceLoader Solr loaded a deprecated plugin/analysis class [solr.GeoHashField]. Please consult documentation how to replace it accordingly.
   [junit4]   2> 4347 WARN  (SUITE-RequestLoggingTest-seed#[65B5438E9AAD0CD7]-worker) [    ] o.a.s.c.SolrResourceLoader Solr loaded a deprecated plugin/analysis class [solr.LatLonType]. Please consult documentation how to replace it accordingly.
   [junit4]   2> 4362 WARN  (SUITE-RequestLoggingTest-seed#[65B5438E9AAD0CD7]-worker) [    ] o.a.s.c.SolrResourceLoader Solr loaded a deprecated plugin/analysis class [solr.CurrencyField]. Please consult documentation how to replace it accordingly.
   [junit4]   2> 4526 INFO  (SUITE-RequestLoggingTest-seed#[65B5438E9AAD0CD7]-worker) [    ] o.a.s.s.IndexSchema Loaded schema test/1.0 with uniqueid field id
   [junit4]   2> 5922 INFO  (SUITE-RequestLoggingTest-seed#[65B5438E9AAD0CD7]-worker) [    ] o.a.s.c.TransientSolrCoreCacheDefault Allocating transient cache for 2147483647 transient cores
   [junit4]   2> 5926 INFO  (SUITE-RequestLoggingTest-seed#[65B5438E9AAD0CD7]-worker) [    ] o.a.s.h.a.MetricsHistoryHandler No .system collection, keeping metrics history in memory.
   [junit4]   2> 6043 INFO  (SUITE-RequestLoggingTest-seed#[65B5438E9AAD0CD7]-worker) [    ] o.a.s.m.r.SolrJmxReporter JMX monitoring for 'solr.node' (registry 'solr.node') enabled at server: com.sun.jmx.mbeanserver.JmxMBeanServer@2f81fc8d
   [junit4]   2> 6044 INFO  (SUITE-RequestLoggingTest-seed#[65B5438E9AAD0CD7]-worker) [    ] o.a.s.m.r.SolrJmxReporter JMX monitoring for 'solr.jvm' (registry 'solr.jvm') enabled at server: com.sun.jmx.mbeanserver.JmxMBeanServer@2f81fc8d
   [junit4]   2> 6045 INFO  (SUITE-RequestLoggingTest-seed#[65B5438E9AAD0CD7]-worker) [    ] o.a.s.m.r.SolrJmxReporter JMX monitoring for 'solr.jetty' (registry 'solr.jetty') enabled at server: com.sun.jmx.mbeanserver.JmxMBeanServer@2f81fc8d
   [junit4]   2> 6071 INFO  (coreLoadExecutor-9-thread-1) [    x:collection1] o.a.s.c.SolrResourceLoader [null] Added 2 libs to classloader, from paths: [/home/jenkins/workspace/Lucene-Solr-master-Linux/solr/core/src/test-files/solr/collection1/lib, /home/jenkins/workspace/Lucene-Solr-master-Linux/solr/core/src/test-files/solr/collection1/lib/classes]
   [junit4]   2> 6111 INFO  (coreLoadExecutor-9-thread-1) [    x:collection1] o.a.s.c.SolrConfig Using Lucene MatchVersion: 8.0.0
   [junit4]   2> 6212 INFO  (coreLoadExecutor-9-thread-1) [    x:collection1] o.a.s.s.IndexSchema [collection1] Schema name=test
   [junit4]   2> 6409 INFO  (coreLoadExecutor-9-thread-1) [    x:collection1] o.a.s.s.IndexSchema Loaded schema test/1.0 with uniqueid field id
   [junit4]   2> 6442 INFO  (coreLoadExecutor-9-thread-1) [    x:collection1] o.a.s.c.CoreContainer Creating SolrCore 'collection1' using configuration from instancedir /home/jenkins/workspace/Lucene-Solr-master-Linux/solr/core/src/test-files/solr/collection1, trusted=true
   [junit4]   2> 6474 INFO  (coreLoadExecutor-9-thread-1) [    x:collection1] o.a.s.m.r.SolrJmxReporter JMX monitoring for 'solr.core.collection1' (registry 'solr.core.collection1') enabled at server: com.sun.jmx.mbeanserver.JmxMBeanServer@2f81fc8d
   [junit4]   2> 6481 INFO  (coreLoadExecutor-9-thread-1) [    x:collection1] o.a.s.c.SolrCore solr.RecoveryStrategy.Builder
   [junit4]   2> 6489 INFO  (coreLoadExecutor-9-thread-1) [    x:collection1] o.a.s.c.SolrCore [[collection1] ] Opening new SolrCore at [/home/jenkins/workspace/Lucene-Solr-master-Linux/solr/core/src/test-files/solr/collection1], dataDir=[/home/jenkins/workspace/Lucene-Solr-master-Linux/solr/build/solr-core/test/J1/temp/solr.handler.RequestLoggingTest_65B5438E9AAD0CD7-001/init-core-data-001/]
   [junit4]   2> 6532 INFO  (coreLoadExecutor-9-thread-1) [    x:collection1] o.a.s.u.RandomMergePolicy RandomMergePolicy wrapping class org.apache.lucene.index.LogByteSizeMergePolicy: [LogByteSizeMergePolicy: minMergeSize=1677721, mergeFactor=14, maxMergeSize=2147483648, maxMergeSizeForForcedMerge=9223372036854775807, calibrateSizeByDeletes=true, maxMergeDocs=2147483647, maxCFSSegmentSizeMB=8.796093022207999E12, noCFSRatio=1.0]
   [junit4]   2> 7060 INFO  (coreLoadExecutor-9-thread-1) [    x:collection1] o.a.s.u.UpdateHandler Using UpdateLog implementation: org.apache.solr.update.UpdateLog
   [junit4]   2> 7060 INFO  (coreLoadExecutor-9-thread-1) [    x:collection1] o.a.s.u.UpdateLog Initializing UpdateLog: dataDir= defaultSyncLevel=FLUSH numRecordsToKeep=100 maxNumLogsToKeep=10 numVersionBuckets=65536
   [junit4]   2> 7070 INFO  (coreLoadExecutor-9-thread-1) [    x:collection1] o.a.s.u.CommitTracker Hard AutoCommit: disabled
   [junit4]   2> 7070 INFO  (coreLoadExecutor-9-thread-1) [    x:collection1] o.a.s.u.CommitTracker Soft AutoCommit: disabled
   [junit4]   2> 7074 INFO  (coreLoadExecutor-9-thread-1) [    x:collection1] o.a.s.u.RandomMergePolicy RandomMergePolicy wrapping class org.apache.lucene.index.TieredMergePolicy: [TieredMergePolicy: maxMergeAtOnce=50, maxMergeAtOnceExplicit=45, maxMergedSegmentMB=35.552734375, floorSegmentMB=0.2451171875, forceMergeDeletesPctAllowed=26.356993003222378, segmentsPerTier=46.0, maxCFSSegmentSizeMB=8.796093022207999E12, noCFSRatio=1.0, deletesPctAllowed=21.505605178040103
   [junit4]   2> 7086 INFO  (coreLoadExecutor-9-thread-1) [    x:collection1] o.a.s.s.SolrIndexSearcher Opening [Searcher@72a986c7[collection1] main]
   [junit4]   2> 7121 INFO  (coreLoadExecutor-9-thread-1) [    x:collection1] o.a.s.h.c.SpellCheckComponent Initializing spell checkers
   [junit4]   2> 7181 INFO  (coreLoadExecutor-9-thread-1) [    x:collection1] o.a.s.s.DirectSolrSpellChecker init: {name=direct,classname=DirectSolrSpellChecker,field=lowerfilt,minQueryLength=3}
   [junit4]   2> 7340 INFO  (coreLoadExecutor-9-thread-1) [    x:collection1] o.a.s.h.ReplicationHandler Commits will be reserved for 10000ms.
   [junit4]   2> 7341 INFO  (searcherExecutor-10-thread-1-processing-x:collection1) [    x:collection1] o.a.s.h.c.SpellCheckComponent Loading spell index for spellchecker: default
   [junit4]   2> 7344 INFO  (searcherExecutor-10-thread-1-processing-x:collection1) [    x:collection1] o.a.s.h.c.SpellCheckComponent Loading spell index for spellchecker: direct
   [junit4]   2> 7344 INFO  (searcherExecutor-10-thread-1-processing-x:collection1) [    x:collection1] o.a.s.h.c.SpellCheckComponent Loading spell index for spellchecker: wordbreak
   [junit4]   2> 7344 INFO  (searcherExecutor-10-thread-1-processing-x:collection1) [    x:collection1] o.a.s.h.c.SpellCheckComponent Loading spell index for spellchecker: multipleFields
   [junit4]   2> 7344 INFO  (coreLoadExecutor-9-thread-1) [    x:collection1] o.a.s.u.UpdateLog Could not find max version in index or recent updates, using new clock 1610402470911016960
   [junit4]   2> 7345 INFO  (searcherExecutor-10-thread-1-processing-x:collection1) [    x:collection1] o.a.s.h.c.SpellCheckComponent Loading spell index for spellchecker: jarowinkler
   [junit4]   2> 7347 INFO  (searcherExecutor-10-thread-1-processing-x:collection1) [    x:collection1] o.a.s.h.c.SpellCheckComponent Loading spell index for spellchecker: external
   [junit4]   2> 7348 INFO  (searcherExecutor-10-thread-1-processing-x:collection1) [    x:collection1] o.a.s.h.c.SpellCheckComponent Loading spell index for spellchecker: freq
   [junit4]   2> 7349 INFO  (searcherExecutor-10-thread-1-processing-x:collection1) [    x:collection1] o.a.s.h.c.SpellCheckComponent Loading spell index for spellchecker: fqcn
   [junit4]   2> 7350 INFO  (searcherExecutor-10-thread-1-processing-x:collection1) [    x:collection1] o.a.s.h.c.SpellCheckComponent Loading spell index for spellchecker: perDict
   [junit4]   2> 7384 INFO  (searcherExecutor-10-thread-1-processing-x:collection1) [    x:collection1] o.a.s.c.SolrCore [collection1] Registered new searcher Searcher@72a986c7[collection1] main{ExitableDirectoryReader(UninvertingDirectoryReader())}
   [junit4]   2> 7385 INFO  (SUITE-RequestLoggingTest-seed#[65B5438E9AAD0CD7]-worker) [    ] o.a.s.SolrTestCaseJ4 ####initCore end
   [junit4]   2> 7399 INFO  (TEST-RequestLoggingTest.testLogBeforeExecuteWithCoreLogger-seed#[65B5438E9AAD0CD7]) [    ] o.a.s.SolrTestCaseJ4 ###Starting testLogBeforeExecuteWithCoreLogger
   [junit4]   2> 7407 DEBUG (TEST-RequestLoggingTest.testLogBeforeExecuteWithCoreLogger-seed#[65B5438E9AAD0CD7]) [    ] o.a.s.c.S.Request [collection1]  webapp=null path=null params={q=*:*&wt=xml}
   [junit4]   2> 7408 DEBUG (TEST-RequestLoggingTest.testLogBeforeExecuteWithCoreLogger-seed#[65B5438E9AAD0CD7]) [    ] o.a.s.h.c.SearchHandler Adding  component:org.apache.solr.handler.component.QueryComponent@28dd60cf
   [junit4]   2> 7408 DEBUG (TEST-RequestLoggingTest.testLogBeforeExecuteWithCoreLogger-seed#[65B5438E9AAD0CD7]) [    ] o.a.s.h.c.SearchHandler Adding  component:org.apache.solr.handler.component.FacetComponent@69783be9
   [junit4]   2> 7408 DEBUG (TEST-RequestLoggingTest.testLogBeforeExecuteWithCoreLogger-seed#[65B5438E9AAD0CD7]) [    ] o.a.s.h.c.SearchHandler Adding  component:org.apache.solr.search.facet.FacetModule@761bcf5b
   [junit4]   2> 7408 DEBUG (TEST-RequestLoggingTest.testLogBeforeExecuteWithCoreLogger-seed#[65B5438E9AAD0CD7]) [    ] o.a.s.h.c.SearchHandler Adding  component:org.apache.solr.handler.component.MoreLikeThisComponent@baee5e9
   [junit4]   2> 7408 DEBUG (TEST-RequestLoggingTest.testLogBeforeExecuteWithCoreLogger-seed#[65B5438E9AAD0CD7]) [    ] o.a.s.h.c.SearchHandler Adding  component:org.apache.solr.handler.component.HighlightComponent@48b6374b
   [junit4]   2> 7408 DEBUG (TEST-RequestLoggingTest.testLogBeforeExecuteWithCoreLogger-seed#[65B5438E9AAD0CD7]) [    ] o.a.s.h.c.SearchHandler Adding  component:org.apache.solr.handler.component.StatsComponent@60b9eac7
   [junit4]   2> 7409 DEBUG (TEST-RequestLoggingTest.testLogBeforeExecuteWithCoreLogger-seed#[65B5438E9AAD0CD7]) [    ] o.a.s.h.c.SearchHandler Adding  component:org.apache.solr.handler.component.ExpandComponent@4870809c
   [junit4]   2> 7409 DEBUG (TEST-RequestLoggingTest.testLogBeforeExecuteWithCoreLogger-seed#[65B5438E9AAD0CD7]) [    ] o.a.s.h.c.SearchHandler Adding  component:org.apache.solr.handler.component.TermsComponent@340da5d6
   [junit4]   2> 7409 DEBUG (TEST-RequestLoggingTest.testLogBeforeExecuteWithCoreLogger-seed#[65B5438E9AAD0CD7]) [    ] o.a.s.h.c.SearchHandler Adding  debug component:org.apache.solr.handler.component.DebugComponent@4df8d073
   [junit4]   2> 7431 DEBUG (TEST-RequestLoggingTest.testLogBeforeExecuteWithCoreLogger-seed#[65B5438E9AAD0CD7]) [    ] o.a.s.h.c.QueryComponent process: q=*:*&df=text&wt=xml&indent=off
   [junit4]   2> 7431 DEBUG (TEST-RequestLoggingTest.testLogBeforeExecuteWithCoreLogger-seed#[65B5438E9AAD0CD7]) [    ] o.a.s.s.s.LocalStatsCache ## GET LocalSolrQueryRequest{q=*:*&df=text&wt=xml&indent=off}
   [junit4]   2> 7438 INFO  (TEST-RequestLoggingTest.testLogBeforeExecuteWithCoreLogger-seed#[65B5438E9AAD0CD7]) [    ] o.a.s.c.S.Request [collection1]  webapp=null path=null params={q=*:*&wt=xml} hits=0 status=0 QTime=31
   [junit4]   2> 7445 INFO  (TEST-RequestLoggingTest.testLogBeforeExecuteWithCoreLogger-seed#[65B5438E9AAD0CD7]) [    ] o.a.s.SolrTestCaseJ4 ###Ending testLogBeforeExecuteWithCoreLogger
   [junit4] OK      0.06s J1 | RequestLoggingTest.testLogBeforeExecuteWithCoreLogger
   [junit4]   2> 7449 INFO  (TEST-RequestLoggingTest.testLogBeforeExecuteWithRequestLogger-seed#[65B5438E9AAD0CD7]) [    ] o.a.s.SolrTestCaseJ4 ###Starting testLogBeforeExecuteWithRequestLogger
   [junit4]   2> 7451 DEBUG (TEST-RequestLoggingTest.testLogBeforeExecuteWithRequestLogger-seed#[65B5438E9AAD0CD7]) [    ] o.a.s.c.S.Request [collection1]  webapp=null path=null params={q=*:*&wt=xml}
   [junit4]   2> 7452 DEBUG (TEST-RequestLoggingTest.testLogBeforeExecuteWithRequestLogger-seed#[65B5438E9AAD0CD7]) [    ] o.a.s.h.c.QueryComponent process: q=*:*&df=text&wt=xml&indent=off
   [junit4]   2> 7452 DEBUG (TEST-RequestLoggingTest.testLogBeforeExecuteWithRequestLogger-seed#[65B5438E9AAD0CD7]) [    ] o.a.s.s.s.LocalStatsCache ## GET LocalSolrQueryRequest{q=*:*&df=text&wt=xml&indent=off}
   [junit4]   2> 7452 INFO  (TEST-RequestLoggingTest.testLogBeforeExecuteWithRequestLogger-seed#[65B5438E9AAD0CD7]) [    ] o.a.s.c.S.Request [collection1]  webapp=null path=null params={q=*:*&wt=xml} hits=0 status=0 QTime=0
   [junit4]   2> 7453 INFO  (TEST-RequestLoggingTest.testLogBeforeExecuteWithRequestLogger-seed#[65B5438E9AAD0CD7]) [    ] o.a.s.SolrTestCaseJ4 ###Ending testLogBeforeExecuteWithRequestLogger
   [junit4]   2> NOTE: reproduce with: ant test  -Dtestcase=RequestLoggingTest -Dtests.method=testLogBeforeExecuteWithRequestLogger -Dtests.seed=65B5438E9AAD0CD7 -Dtests.multiplier=3 -Dtests.slow=true -Dtests.badapples=true -Dtests.locale=bs -Dtests.timezone=US/Alaska -Dtests.asserts=true -Dtests.file.encoding=UTF-8
   [junit4] FAILURE 0.01s J1 | RequestLoggingTest.testLogBeforeExecuteWithRequestLogger <<<
   [junit4]    > Throwable #1: java.lang.AssertionError
   [junit4]    > 	at __randomizedtesting.SeedInfo.seed([65B5438E9AAD0CD7:D4DC6381375BB499]:0)
   [junit4]    > 	at org.apache.solr.handler.RequestLoggingTest.testLogBeforeExecute(RequestLoggingTest.java:88)
   [junit4]    > 	at org.apache.solr.handler.RequestLoggingTest.testLogBeforeExecuteWithRequestLogger(RequestLoggingTest.java:71)
   [junit4]    > 	at java.base/jdk.internal.reflect.NativeMethodAccessorImpl.invoke0(Native Method)
   [junit4]    > 	at java.base/jdk.internal.reflect.NativeMethodAccessorImpl.invoke(NativeMethodAccessorImpl.java:62)
   [junit4]    > 	at java.base/jdk.internal.reflect.DelegatingMethodAccessorImpl.invoke(DelegatingMethodAccessorImpl.java:43)
   [junit4]    > 	at java.base/java.lang.reflect.Method.invoke(Method.java:564)
   [junit4]    > 	at java.base/java.lang.Thread.run(Thread.java:844)
   [junit4]   2> 7456 INFO  (SUITE-RequestLoggingTest-seed#[65B5438E9AAD0CD7]-worker) [    ] o.a.s.SolrTestCaseJ4 ###deleteCore
   [junit4]   2> 7456 INFO  (SUITE-RequestLoggingTest-seed#[65B5438E9AAD0CD7]-worker) [    ] o.a.s.c.CoreContainer Shutting down CoreContainer instance=1567098925
   [junit4]   2> 7457 INFO  (SUITE-RequestLoggingTest-seed#[65B5438E9AAD0CD7]-worker) [    ] o.a.s.m.SolrMetricManager Closing metric reporters for registry=solr.node, tag=null
   [junit4]   2> 7458 INFO  (SUITE-RequestLoggingTest-seed#[65B5438E9AAD0CD7]-worker) [    ] o.a.s.m.r.SolrJmxReporter Closing reporter [org.apache.solr.metrics.reporters.SolrJmxReporter@65f5f139: rootName = null, domain = solr.node, service url = null, agent id = null] for registry solr.node / com.codahale.metrics.MetricRegistry@7caf8caf
   [junit4]   2> 7471 INFO  (SUITE-RequestLoggingTest-seed#[65B5438E9AAD0CD7]-worker) [    ] o.a.s.m.SolrMetricManager Closing metric reporters for registry=solr.jvm, tag=null
   [junit4]   2> 7471 INFO  (SUITE-RequestLoggingTest-seed#[65B5438E9AAD0CD7]-worker) [    ] o.a.s.m.r.SolrJmxReporter Closing reporter [org.apache.solr.metrics.reporters.SolrJmxReporter@2f25e7e3: rootName = null, domain = solr.jvm, service url = null, agent id = null] for registry solr.jvm / com.codahale.metrics.MetricRegistry@3e120b24
   [junit4]   2> 7471 INFO  (SUITE-RequestLoggingTest-seed#[65B5438E9AAD0CD7]-worker) [    ] o.a.s.m.SolrMetricManager Closing metric reporters for registry=solr.jetty, tag=null
   [junit4]   2> 7471 INFO  (SUITE-RequestLoggingTest-seed#[65B5438E9AAD0CD7]-worker) [    ] o.a.s.m.r.SolrJmxReporter Closing reporter [org.apache.solr.metrics.reporters.SolrJmxReporter@287543c5: rootName = null, domain = solr.jetty, service url = null, agent id = null] for registry solr.jetty / com.codahale.metrics.MetricRegistry@67bf4e
   [junit4]   2> 7473 INFO  (coreCloseExecutor-15-thread-1) [    x:collection1] o.a.s.c.SolrCore [collection1]  CLOSING SolrCore org.apache.solr.core.SolrCore@61230e3a
   [junit4]   2> 7474 INFO  (coreCloseExecutor-15-thread-1) [    x:collection1] o.a.s.m.SolrMetricManager Closing metric reporters for registry=solr.core.collection1, tag=61230e3a
   [junit4]   2> 7474 INFO  (coreCloseExecutor-15-thread-1) [    x:collection1] o.a.s.m.r.SolrJmxReporter Closing reporter [org.apache.solr.metrics.reporters.SolrJmxReporter@585f4128: rootName = null, domain = solr.core.collection1, service url = null, agent id = null] for registry solr.core.collection1 / com.codahale.metrics.MetricRegistry@4d1ba4f8
   [junit4]   2> NOTE: leaving temporary files on disk at: /home/jenkins/workspace/Lucene-Solr-master-Linux/solr/build/solr-core/test/J1/temp/solr.handler.RequestLoggingTest_65B5438E9AAD0CD7-001
   [junit4]   2> Sep 01, 2018 10:57:55 AM com.carrotsearch.randomizedtesting.ThreadLeakControl checkThreadLeaks
   [junit4]   2> WARNING: Will linger awaiting termination of 1 leaked thread(s).
   [junit4]   2> NOTE: test params are: codec=Asserting(Lucene80): {}, docValues:{}, maxPointsInLeafNode=1142, maxMBSortInHeap=5.730617462558189, sim=Asserting(org.apache.lucene.search.similarities.AssertingSimilarity@6a254f04), locale=bs, timezone=US/Alaska
   [junit4]   2> NOTE: Linux 4.15.0-32-generic amd64/Oracle Corporation 9.0.4 (64-bit)/cpus=8,threads=2,free=365046496,total=518979584
   [junit4]   2> NOTE: All tests run in this JVM: [RequestLoggingTest]
   [junit4] Completed [3/5 (1!)] on J1 in 6.82s, 2 tests, 1 failure <<< FAILURES!

[...truncated 22 lines...]
BUILD FAILED
/home/jenkins/workspace/Lucene-Solr-master-Linux/lucene/common-build.xml:1568: The following error occurred while executing this line:
/home/jenkins/workspace/Lucene-Solr-master-Linux/lucene/common-build.xml:1092: There were test failures: 5 suites, 10 tests, 1 failure [seed: 65B5438E9AAD0CD7]

Total time: 12 seconds

[repro] Setting last failure code to 256

[repro] Failures:
[repro]   1/5 failed: org.apache.solr.handler.RequestLoggingTest
[repro] Exiting with code 256
+ mv lucene/build lucene/build.repro
+ mv solr/build solr/build.repro
+ mv lucene/build.orig lucene/build
+ mv solr/build.orig solr/build
Archiving artifacts
Setting ANT_1_8_2_HOME=/var/lib/jenkins/tools/hudson.tasks.Ant_AntInstallation/ANT_1.8.2
[WARNINGS] Parsing warnings in console log with parser Java Compiler (javac)
Setting ANT_1_8_2_HOME=/var/lib/jenkins/tools/hudson.tasks.Ant_AntInstallation/ANT_1.8.2
Setting ANT_1_8_2_HOME=/var/lib/jenkins/tools/hudson.tasks.Ant_AntInstallation/ANT_1.8.2
<Git Blamer> Using GitBlamer to create author and commit information for all warnings.
<Git Blamer> GIT_COMMIT=d55a81df849e093d043ac21f9e98532f091694d9, workspace=/var/lib/jenkins/workspace/Lucene-Solr-master-Linux
[WARNINGS] Computing warning deltas based on reference build #22781
Recording test results
Setting ANT_1_8_2_HOME=/var/lib/jenkins/tools/hudson.tasks.Ant_AntInstallation/ANT_1.8.2
Build step 'Publish JUnit test result report' changed build result to UNSTABLE
Email was triggered for: Unstable (Test Failures)
Sending email for trigger: Unstable (Test Failures)
Setting ANT_1_8_2_HOME=/var/lib/jenkins/tools/hudson.tasks.Ant_AntInstallation/ANT_1.8.2
Setting ANT_1_8_2_HOME=/var/lib/jenkins/tools/hudson.tasks.Ant_AntInstallation/ANT_1.8.2
Setting ANT_1_8_2_HOME=/var/lib/jenkins/tools/hudson.tasks.Ant_AntInstallation/ANT_1.8.2
Setting ANT_1_8_2_HOME=/var/lib/jenkins/tools/hudson.tasks.Ant_AntInstallation/ANT_1.8.2

Mime
View raw message