lucene-dev mailing list archives

Site index · List index
Message view « Date » · « Thread »
Top « Date » · « Thread »
From Policeman Jenkins Server <jenk...@thetaphi.de>
Subject [JENKINS] Lucene-Solr-master-Linux (64bit/jdk-10.0.1) - Build # 22887 - Unstable!
Date Wed, 19 Sep 2018 19:54:26 GMT
Build: https://jenkins.thetaphi.de/job/Lucene-Solr-master-Linux/22887/
Java: 64bit/jdk-10.0.1 -XX:+UseCompressedOops -XX:+UseParallelGC

2 tests failed.
FAILED:  org.apache.solr.cloud.autoscaling.ScheduledTriggerTest.testTrigger

Error Message:
expected:<3> but was:<2>

Stack Trace:
java.lang.AssertionError: expected:<3> but was:<2>
	at __randomizedtesting.SeedInfo.seed([A64108481CFDC09C:C58A3ECA8532B3B1]:0)
	at org.junit.Assert.fail(Assert.java:93)
	at org.junit.Assert.failNotEquals(Assert.java:647)
	at org.junit.Assert.assertEquals(Assert.java:128)
	at org.junit.Assert.assertEquals(Assert.java:472)
	at org.junit.Assert.assertEquals(Assert.java:456)
	at org.apache.solr.cloud.autoscaling.ScheduledTriggerTest.scheduledTriggerTest(ScheduledTriggerTest.java:113)
	at org.apache.solr.cloud.autoscaling.ScheduledTriggerTest.testTrigger(ScheduledTriggerTest.java:66)
	at java.base/jdk.internal.reflect.NativeMethodAccessorImpl.invoke0(Native Method)
	at java.base/jdk.internal.reflect.NativeMethodAccessorImpl.invoke(NativeMethodAccessorImpl.java:62)
	at java.base/jdk.internal.reflect.DelegatingMethodAccessorImpl.invoke(DelegatingMethodAccessorImpl.java:43)
	at java.base/java.lang.reflect.Method.invoke(Method.java:564)
	at com.carrotsearch.randomizedtesting.RandomizedRunner.invoke(RandomizedRunner.java:1742)
	at com.carrotsearch.randomizedtesting.RandomizedRunner$8.evaluate(RandomizedRunner.java:935)
	at com.carrotsearch.randomizedtesting.RandomizedRunner$9.evaluate(RandomizedRunner.java:971)
	at com.carrotsearch.randomizedtesting.RandomizedRunner$10.evaluate(RandomizedRunner.java:985)
	at com.carrotsearch.randomizedtesting.rules.SystemPropertiesRestoreRule$1.evaluate(SystemPropertiesRestoreRule.java:57)
	at org.apache.lucene.util.TestRuleSetupTeardownChained$1.evaluate(TestRuleSetupTeardownChained.java:49)
	at org.apache.lucene.util.AbstractBeforeAfterRule$1.evaluate(AbstractBeforeAfterRule.java:45)
	at org.apache.lucene.util.TestRuleThreadAndTestName$1.evaluate(TestRuleThreadAndTestName.java:48)
	at org.apache.lucene.util.TestRuleIgnoreAfterMaxFailures$1.evaluate(TestRuleIgnoreAfterMaxFailures.java:64)
	at org.apache.lucene.util.TestRuleMarkFailure$1.evaluate(TestRuleMarkFailure.java:47)
	at com.carrotsearch.randomizedtesting.rules.StatementAdapter.evaluate(StatementAdapter.java:36)
	at com.carrotsearch.randomizedtesting.ThreadLeakControl$StatementRunner.run(ThreadLeakControl.java:368)
	at com.carrotsearch.randomizedtesting.ThreadLeakControl.forkTimeoutingTask(ThreadLeakControl.java:817)
	at com.carrotsearch.randomizedtesting.ThreadLeakControl$3.evaluate(ThreadLeakControl.java:468)
	at com.carrotsearch.randomizedtesting.RandomizedRunner.runSingleTest(RandomizedRunner.java:944)
	at com.carrotsearch.randomizedtesting.RandomizedRunner$5.evaluate(RandomizedRunner.java:830)
	at com.carrotsearch.randomizedtesting.RandomizedRunner$6.evaluate(RandomizedRunner.java:880)
	at com.carrotsearch.randomizedtesting.RandomizedRunner$7.evaluate(RandomizedRunner.java:891)
	at com.carrotsearch.randomizedtesting.rules.StatementAdapter.evaluate(StatementAdapter.java:36)
	at com.carrotsearch.randomizedtesting.rules.SystemPropertiesRestoreRule$1.evaluate(SystemPropertiesRestoreRule.java:57)
	at org.apache.lucene.util.AbstractBeforeAfterRule$1.evaluate(AbstractBeforeAfterRule.java:45)
	at com.carrotsearch.randomizedtesting.rules.StatementAdapter.evaluate(StatementAdapter.java:36)
	at org.apache.lucene.util.TestRuleStoreClassName$1.evaluate(TestRuleStoreClassName.java:41)
	at com.carrotsearch.randomizedtesting.rules.NoShadowingOrOverridesOnMethodsRule$1.evaluate(NoShadowingOrOverridesOnMethodsRule.java:40)
	at com.carrotsearch.randomizedtesting.rules.NoShadowingOrOverridesOnMethodsRule$1.evaluate(NoShadowingOrOverridesOnMethodsRule.java:40)
	at com.carrotsearch.randomizedtesting.rules.StatementAdapter.evaluate(StatementAdapter.java:36)
	at com.carrotsearch.randomizedtesting.rules.StatementAdapter.evaluate(StatementAdapter.java:36)
	at org.apache.lucene.util.TestRuleAssertionsRequired$1.evaluate(TestRuleAssertionsRequired.java:53)
	at org.apache.lucene.util.TestRuleMarkFailure$1.evaluate(TestRuleMarkFailure.java:47)
	at org.apache.lucene.util.TestRuleIgnoreAfterMaxFailures$1.evaluate(TestRuleIgnoreAfterMaxFailures.java:64)
	at org.apache.lucene.util.TestRuleIgnoreTestSuites$1.evaluate(TestRuleIgnoreTestSuites.java:54)
	at com.carrotsearch.randomizedtesting.rules.StatementAdapter.evaluate(StatementAdapter.java:36)
	at com.carrotsearch.randomizedtesting.ThreadLeakControl$StatementRunner.run(ThreadLeakControl.java:368)
	at java.base/java.lang.Thread.run(Thread.java:844)


FAILED:  org.apache.solr.handler.component.TestDistributedStatsComponentCardinality.test

Error Message:
sanity check num matches, p=q=id_i1:[7760+TO+9466]&rows=0&stats=true&stats.field={!cardinality%3Dtrue+hllLog2m%3D6+hllRegwidth%3D8}int_i&stats.field={!cardinality%3Dtrue+hllLog2m%3D6+hllRegwidth%3D8+hllPreHashed%3Dtrue}int_i_prehashed_l&stats.field={!cardinality%3Dtrue+hllLog2m%3D6+hllRegwidth%3D8}long_l&stats.field={!cardinality%3Dtrue+hllLog2m%3D6+hllRegwidth%3D8+hllPreHashed%3Dtrue}long_l_prehashed_l&stats.field={!cardinality%3Dtrue+hllLog2m%3D6+hllRegwidth%3D8}string_s&stats.field={!cardinality%3Dtrue+hllLog2m%3D6+hllRegwidth%3D8+hllPreHashed%3Dtrue}string_s_prehashed_l expected:<1707> but was:<0>

Stack Trace:
java.lang.AssertionError: sanity check num matches, p=q=id_i1:[7760+TO+9466]&rows=0&stats=true&stats.field={!cardinality%3Dtrue+hllLog2m%3D6+hllRegwidth%3D8}int_i&stats.field={!cardinality%3Dtrue+hllLog2m%3D6+hllRegwidth%3D8+hllPreHashed%3Dtrue}int_i_prehashed_l&stats.field={!cardinality%3Dtrue+hllLog2m%3D6+hllRegwidth%3D8}long_l&stats.field={!cardinality%3Dtrue+hllLog2m%3D6+hllRegwidth%3D8+hllPreHashed%3Dtrue}long_l_prehashed_l&stats.field={!cardinality%3Dtrue+hllLog2m%3D6+hllRegwidth%3D8}string_s&stats.field={!cardinality%3Dtrue+hllLog2m%3D6+hllRegwidth%3D8+hllPreHashed%3Dtrue}string_s_prehashed_l expected:<1707> but was:<0>
	at __randomizedtesting.SeedInfo.seed([A64108481CFDC09C:2E153792B201AD64]:0)
	at org.junit.Assert.fail(Assert.java:93)
	at org.junit.Assert.failNotEquals(Assert.java:647)
	at org.junit.Assert.assertEquals(Assert.java:128)
	at org.junit.Assert.assertEquals(Assert.java:472)
	at org.apache.solr.handler.component.TestDistributedStatsComponentCardinality.test(TestDistributedStatsComponentCardinality.java:143)
	at java.base/jdk.internal.reflect.NativeMethodAccessorImpl.invoke0(Native Method)
	at java.base/jdk.internal.reflect.NativeMethodAccessorImpl.invoke(NativeMethodAccessorImpl.java:62)
	at java.base/jdk.internal.reflect.DelegatingMethodAccessorImpl.invoke(DelegatingMethodAccessorImpl.java:43)
	at java.base/java.lang.reflect.Method.invoke(Method.java:564)
	at com.carrotsearch.randomizedtesting.RandomizedRunner.invoke(RandomizedRunner.java:1742)
	at com.carrotsearch.randomizedtesting.RandomizedRunner$8.evaluate(RandomizedRunner.java:935)
	at com.carrotsearch.randomizedtesting.RandomizedRunner$9.evaluate(RandomizedRunner.java:971)
	at com.carrotsearch.randomizedtesting.RandomizedRunner$10.evaluate(RandomizedRunner.java:985)
	at org.apache.solr.BaseDistributedSearchTestCase$ShardsRepeatRule$ShardsFixedStatement.callStatement(BaseDistributedSearchTestCase.java:1008)
	at org.apache.solr.BaseDistributedSearchTestCase$ShardsRepeatRule$ShardsStatement.evaluate(BaseDistributedSearchTestCase.java:983)
	at com.carrotsearch.randomizedtesting.rules.SystemPropertiesRestoreRule$1.evaluate(SystemPropertiesRestoreRule.java:57)
	at org.apache.lucene.util.TestRuleSetupTeardownChained$1.evaluate(TestRuleSetupTeardownChained.java:49)
	at org.apache.lucene.util.AbstractBeforeAfterRule$1.evaluate(AbstractBeforeAfterRule.java:45)
	at org.apache.lucene.util.TestRuleThreadAndTestName$1.evaluate(TestRuleThreadAndTestName.java:48)
	at org.apache.lucene.util.TestRuleIgnoreAfterMaxFailures$1.evaluate(TestRuleIgnoreAfterMaxFailures.java:64)
	at org.apache.lucene.util.TestRuleMarkFailure$1.evaluate(TestRuleMarkFailure.java:47)
	at com.carrotsearch.randomizedtesting.rules.StatementAdapter.evaluate(StatementAdapter.java:36)
	at com.carrotsearch.randomizedtesting.ThreadLeakControl$StatementRunner.run(ThreadLeakControl.java:368)
	at com.carrotsearch.randomizedtesting.ThreadLeakControl.forkTimeoutingTask(ThreadLeakControl.java:817)
	at com.carrotsearch.randomizedtesting.ThreadLeakControl$3.evaluate(ThreadLeakControl.java:468)
	at com.carrotsearch.randomizedtesting.RandomizedRunner.runSingleTest(RandomizedRunner.java:944)
	at com.carrotsearch.randomizedtesting.RandomizedRunner$5.evaluate(RandomizedRunner.java:830)
	at com.carrotsearch.randomizedtesting.RandomizedRunner$6.evaluate(RandomizedRunner.java:880)
	at com.carrotsearch.randomizedtesting.RandomizedRunner$7.evaluate(RandomizedRunner.java:891)
	at com.carrotsearch.randomizedtesting.rules.StatementAdapter.evaluate(StatementAdapter.java:36)
	at com.carrotsearch.randomizedtesting.rules.SystemPropertiesRestoreRule$1.evaluate(SystemPropertiesRestoreRule.java:57)
	at org.apache.lucene.util.AbstractBeforeAfterRule$1.evaluate(AbstractBeforeAfterRule.java:45)
	at com.carrotsearch.randomizedtesting.rules.StatementAdapter.evaluate(StatementAdapter.java:36)
	at org.apache.lucene.util.TestRuleStoreClassName$1.evaluate(TestRuleStoreClassName.java:41)
	at com.carrotsearch.randomizedtesting.rules.NoShadowingOrOverridesOnMethodsRule$1.evaluate(NoShadowingOrOverridesOnMethodsRule.java:40)
	at com.carrotsearch.randomizedtesting.rules.NoShadowingOrOverridesOnMethodsRule$1.evaluate(NoShadowingOrOverridesOnMethodsRule.java:40)
	at com.carrotsearch.randomizedtesting.rules.StatementAdapter.evaluate(StatementAdapter.java:36)
	at com.carrotsearch.randomizedtesting.rules.StatementAdapter.evaluate(StatementAdapter.java:36)
	at org.apache.lucene.util.TestRuleAssertionsRequired$1.evaluate(TestRuleAssertionsRequired.java:53)
	at org.apache.lucene.util.TestRuleMarkFailure$1.evaluate(TestRuleMarkFailure.java:47)
	at org.apache.lucene.util.TestRuleIgnoreAfterMaxFailures$1.evaluate(TestRuleIgnoreAfterMaxFailures.java:64)
	at org.apache.lucene.util.TestRuleIgnoreTestSuites$1.evaluate(TestRuleIgnoreTestSuites.java:54)
	at com.carrotsearch.randomizedtesting.rules.StatementAdapter.evaluate(StatementAdapter.java:36)
	at com.carrotsearch.randomizedtesting.ThreadLeakControl$StatementRunner.run(ThreadLeakControl.java:368)
	at java.base/java.lang.Thread.run(Thread.java:844)




Build Log:
[...truncated 13066 lines...]
   [junit4] Suite: org.apache.solr.handler.component.TestDistributedStatsComponentCardinality
   [junit4]   2> 917251 INFO  (SUITE-TestDistributedStatsComponentCardinality-seed#[A64108481CFDC09C]-worker) [    ] o.a.s.SolrTestCaseJ4 SecureRandom sanity checks: test.solr.allowed.securerandom=null & java.security.egd=file:/dev/./urandom
   [junit4]   2> Creating dataDir: /home/jenkins/workspace/Lucene-Solr-master-Linux/solr/build/solr-core/test/J0/temp/solr.handler.component.TestDistributedStatsComponentCardinality_A64108481CFDC09C-001/init-core-data-001
   [junit4]   2> 917252 WARN  (SUITE-TestDistributedStatsComponentCardinality-seed#[A64108481CFDC09C]-worker) [    ] o.a.s.SolrTestCaseJ4 startTrackingSearchers: numOpens=4 numCloses=4
   [junit4]   2> 917252 INFO  (SUITE-TestDistributedStatsComponentCardinality-seed#[A64108481CFDC09C]-worker) [    ] o.a.s.SolrTestCaseJ4 Using PointFields (NUMERIC_POINTS_SYSPROP=true) w/NUMERIC_DOCVALUES_SYSPROP=false
   [junit4]   2> 917253 INFO  (SUITE-TestDistributedStatsComponentCardinality-seed#[A64108481CFDC09C]-worker) [    ] o.a.s.SolrTestCaseJ4 Randomized ssl (false) and clientAuth (false) via: @org.apache.solr.SolrTestCaseJ4$SuppressSSL(bugUrl="https://issues.apache.org/jira/browse/SOLR-9062")
   [junit4]   2> 917253 INFO  (SUITE-TestDistributedStatsComponentCardinality-seed#[A64108481CFDC09C]-worker) [    ] o.a.s.BaseDistributedSearchTestCase Setting hostContext system property: /
   [junit4]   2> 917330 INFO  (TEST-TestDistributedStatsComponentCardinality.test-seed#[A64108481CFDC09C]) [    ] o.a.s.SolrTestCaseJ4 Writing core.properties file to /home/jenkins/workspace/Lucene-Solr-master-Linux/solr/build/solr-core/test/J0/temp/solr.handler.component.TestDistributedStatsComponentCardinality_A64108481CFDC09C-001/tempDir-001/control/cores/collection1
   [junit4]   2> 917330 INFO  (TEST-TestDistributedStatsComponentCardinality.test-seed#[A64108481CFDC09C]) [    ] o.e.j.s.Server jetty-9.4.11.v20180605; built: 2018-06-05T18:24:03.829Z; git: d5fc0523cfa96bfebfbda19606cad384d772f04c; jvm 10.0.1+10
   [junit4]   2> 917331 INFO  (TEST-TestDistributedStatsComponentCardinality.test-seed#[A64108481CFDC09C]) [    ] o.e.j.s.session DefaultSessionIdManager workerName=node0
   [junit4]   2> 917331 INFO  (TEST-TestDistributedStatsComponentCardinality.test-seed#[A64108481CFDC09C]) [    ] o.e.j.s.session No SessionScavenger set, using defaults
   [junit4]   2> 917331 INFO  (TEST-TestDistributedStatsComponentCardinality.test-seed#[A64108481CFDC09C]) [    ] o.e.j.s.session node0 Scavenging every 600000ms
   [junit4]   2> 917331 INFO  (TEST-TestDistributedStatsComponentCardinality.test-seed#[A64108481CFDC09C]) [    ] o.e.j.s.h.ContextHandler Started o.e.j.s.ServletContextHandler@5997bff2{/,null,AVAILABLE}
   [junit4]   2> 917332 INFO  (TEST-TestDistributedStatsComponentCardinality.test-seed#[A64108481CFDC09C]) [    ] o.e.j.s.AbstractConnector Started ServerConnector@74a1128d{HTTP/1.1,[http/1.1]}{127.0.0.1:41697}
   [junit4]   2> 917332 INFO  (TEST-TestDistributedStatsComponentCardinality.test-seed#[A64108481CFDC09C]) [    ] o.e.j.s.Server Started @917359ms
   [junit4]   2> 917332 INFO  (TEST-TestDistributedStatsComponentCardinality.test-seed#[A64108481CFDC09C]) [    ] o.a.s.c.s.e.JettySolrRunner Jetty properties: {schema=schema-sql.xml, hostContext=/, hostPort=41697, coreRootDirectory=/home/jenkins/workspace/Lucene-Solr-master-Linux/solr/build/solr-core/test/J0/temp/solr.handler.component.TestDistributedStatsComponentCardinality_A64108481CFDC09C-001/tempDir-001/control/cores}
   [junit4]   2> 917332 ERROR (TEST-TestDistributedStatsComponentCardinality.test-seed#[A64108481CFDC09C]) [    ] o.a.s.u.StartupLoggingUtils Missing Java Option solr.log.dir. Logging may be missing or incomplete.
   [junit4]   2> 917332 INFO  (TEST-TestDistributedStatsComponentCardinality.test-seed#[A64108481CFDC09C]) [    ] o.a.s.s.SolrDispatchFilter Using logger factory org.apache.logging.slf4j.Log4jLoggerFactory
   [junit4]   2> 917332 INFO  (TEST-TestDistributedStatsComponentCardinality.test-seed#[A64108481CFDC09C]) [    ] o.a.s.s.SolrDispatchFilter  ___      _       Welcome to Apache Solr™ version 8.0.0
   [junit4]   2> 917332 INFO  (TEST-TestDistributedStatsComponentCardinality.test-seed#[A64108481CFDC09C]) [    ] o.a.s.s.SolrDispatchFilter / __| ___| |_ _   Starting in standalone mode on port null
   [junit4]   2> 917332 INFO  (TEST-TestDistributedStatsComponentCardinality.test-seed#[A64108481CFDC09C]) [    ] o.a.s.s.SolrDispatchFilter \__ \/ _ \ | '_|  Install dir: null
   [junit4]   2> 917332 INFO  (TEST-TestDistributedStatsComponentCardinality.test-seed#[A64108481CFDC09C]) [    ] o.a.s.s.SolrDispatchFilter |___/\___/_|_|    Start time: 2018-09-19T19:08:39.518757Z
   [junit4]   2> 917332 INFO  (TEST-TestDistributedStatsComponentCardinality.test-seed#[A64108481CFDC09C]) [    ] o.a.s.c.SolrXmlConfig Loading container configuration from /home/jenkins/workspace/Lucene-Solr-master-Linux/solr/build/solr-core/test/J0/temp/solr.handler.component.TestDistributedStatsComponentCardinality_A64108481CFDC09C-001/tempDir-001/control/solr.xml
   [junit4]   2> 917334 INFO  (TEST-TestDistributedStatsComponentCardinality.test-seed#[A64108481CFDC09C]) [    ] o.a.s.c.SolrXmlConfig Configuration parameter autoReplicaFailoverWorkLoopDelay is ignored
   [junit4]   2> 917334 INFO  (TEST-TestDistributedStatsComponentCardinality.test-seed#[A64108481CFDC09C]) [    ] o.a.s.c.SolrXmlConfig Configuration parameter autoReplicaFailoverBadNodeExpiration is ignored
   [junit4]   2> 917334 INFO  (TEST-TestDistributedStatsComponentCardinality.test-seed#[A64108481CFDC09C]) [    ] o.a.s.c.SolrXmlConfig MBean server found: com.sun.jmx.mbeanserver.JmxMBeanServer@3342185f, but no JMX reporters were configured - adding default JMX reporter.
   [junit4]   2> 917448 INFO  (TEST-TestDistributedStatsComponentCardinality.test-seed#[A64108481CFDC09C]) [    ] o.a.s.c.TransientSolrCoreCacheDefault Allocating transient cache for 4 transient cores
   [junit4]   2> 917448 INFO  (TEST-TestDistributedStatsComponentCardinality.test-seed#[A64108481CFDC09C]) [    ] o.a.s.h.a.MetricsHistoryHandler No .system collection, keeping metrics history in memory.
   [junit4]   2> 917456 INFO  (TEST-TestDistributedStatsComponentCardinality.test-seed#[A64108481CFDC09C]) [    ] o.a.s.m.r.SolrJmxReporter JMX monitoring for 'solr.node' (registry 'solr.node') enabled at server: com.sun.jmx.mbeanserver.JmxMBeanServer@3342185f
   [junit4]   2> 917461 INFO  (TEST-TestDistributedStatsComponentCardinality.test-seed#[A64108481CFDC09C]) [    ] o.a.s.m.r.SolrJmxReporter JMX monitoring for 'solr.jvm' (registry 'solr.jvm') enabled at server: com.sun.jmx.mbeanserver.JmxMBeanServer@3342185f
   [junit4]   2> 917461 INFO  (TEST-TestDistributedStatsComponentCardinality.test-seed#[A64108481CFDC09C]) [    ] o.a.s.m.r.SolrJmxReporter JMX monitoring for 'solr.jetty' (registry 'solr.jetty') enabled at server: com.sun.jmx.mbeanserver.JmxMBeanServer@3342185f
   [junit4]   2> 917462 INFO  (TEST-TestDistributedStatsComponentCardinality.test-seed#[A64108481CFDC09C]) [    ] o.a.s.c.CorePropertiesLocator Found 1 core definitions underneath /home/jenkins/workspace/Lucene-Solr-master-Linux/solr/build/solr-core/test/J0/temp/solr.handler.component.TestDistributedStatsComponentCardinality_A64108481CFDC09C-001/tempDir-001/control/cores
   [junit4]   2> 917462 INFO  (TEST-TestDistributedStatsComponentCardinality.test-seed#[A64108481CFDC09C]) [    ] o.a.s.c.CorePropertiesLocator Cores are: [collection1]
   [junit4]   2> 917463 INFO  (coreLoadExecutor-4221-thread-1) [    x:collection1] o.a.s.c.SolrResourceLoader [null] Added 2 libs to classloader, from paths: [/home/jenkins/workspace/Lucene-Solr-master-Linux/solr/core/src/test-files/solr/collection1/lib, /home/jenkins/workspace/Lucene-Solr-master-Linux/solr/core/src/test-files/solr/collection1/lib/classes]
   [junit4]   2> 917475 INFO  (coreLoadExecutor-4221-thread-1) [    x:collection1] o.a.s.c.SolrConfig Using Lucene MatchVersion: 8.0.0
   [junit4]   2> 917486 INFO  (coreLoadExecutor-4221-thread-1) [    x:collection1] o.a.s.s.IndexSchema [collection1] Schema name=test
   [junit4]   2> 917513 WARN  (coreLoadExecutor-4221-thread-1) [    x:collection1] o.a.s.s.IndexSchema Field lowerfilt1and2 is not multivalued and destination for multiple copyFields (2)
   [junit4]   2> 917513 WARN  (coreLoadExecutor-4221-thread-1) [    x:collection1] o.a.s.s.IndexSchema Field text is not multivalued and destination for multiple copyFields (3)
   [junit4]   2> 917513 INFO  (coreLoadExecutor-4221-thread-1) [    x:collection1] o.a.s.s.IndexSchema Loaded schema test/1.6 with uniqueid field id
   [junit4]   2> 917513 INFO  (coreLoadExecutor-4221-thread-1) [    x:collection1] o.a.s.c.CoreContainer Creating SolrCore 'collection1' using configuration from configset /home/jenkins/workspace/Lucene-Solr-master-Linux/solr/core/src/test-files/solr/collection1, trusted=true
   [junit4]   2> 917513 INFO  (coreLoadExecutor-4221-thread-1) [    x:collection1] o.a.s.m.r.SolrJmxReporter JMX monitoring for 'solr.core.collection1' (registry 'solr.core.collection1') enabled at server: com.sun.jmx.mbeanserver.JmxMBeanServer@3342185f
   [junit4]   2> 917513 INFO  (coreLoadExecutor-4221-thread-1) [    x:collection1] o.a.s.c.SolrCore [[collection1] ] Opening new SolrCore at [/home/jenkins/workspace/Lucene-Solr-master-Linux/solr/core/src/test-files/solr/collection1], dataDir=[/home/jenkins/workspace/Lucene-Solr-master-Linux/solr/build/solr-core/test/J0/temp/solr.handler.component.TestDistributedStatsComponentCardinality_A64108481CFDC09C-001/tempDir-001/control/cores/collection1/data/]
   [junit4]   2> 917514 INFO  (coreLoadExecutor-4221-thread-1) [    x:collection1] o.a.s.u.RandomMergePolicy RandomMergePolicy wrapping class org.apache.lucene.index.TieredMergePolicy: [TieredMergePolicy: maxMergeAtOnce=31, maxMergeAtOnceExplicit=25, maxMergedSegmentMB=14.328125, floorSegmentMB=1.2734375, forceMergeDeletesPctAllowed=20.257305603666964, segmentsPerTier=28.0, maxCFSSegmentSizeMB=8.796093022207999E12, noCFSRatio=0.6472708564583096, deletesPctAllowed=20.282455498955024
   [junit4]   2> 917546 INFO  (coreLoadExecutor-4221-thread-1) [    x:collection1] o.a.s.u.UpdateHandler Using UpdateLog implementation: org.apache.solr.update.UpdateLog
   [junit4]   2> 917546 INFO  (coreLoadExecutor-4221-thread-1) [    x:collection1] o.a.s.u.UpdateLog Initializing UpdateLog: dataDir= defaultSyncLevel=FLUSH numRecordsToKeep=100 maxNumLogsToKeep=10 numVersionBuckets=65536
   [junit4]   2> 917547 INFO  (coreLoadExecutor-4221-thread-1) [    x:collection1] o.a.s.u.CommitTracker Hard AutoCommit: disabled
   [junit4]   2> 917547 INFO  (coreLoadExecutor-4221-thread-1) [    x:collection1] o.a.s.u.CommitTracker Soft AutoCommit: disabled
   [junit4]   2> 917547 INFO  (coreLoadExecutor-4221-thread-1) [    x:collection1] o.a.s.u.RandomMergePolicy RandomMergePolicy wrapping class org.apache.lucene.index.TieredMergePolicy: [TieredMergePolicy: maxMergeAtOnce=3, maxMergeAtOnceExplicit=5, maxMergedSegmentMB=37.9169921875, floorSegmentMB=1.6435546875, forceMergeDeletesPctAllowed=24.10381085865487, segmentsPerTier=41.0, maxCFSSegmentSizeMB=8.796093022207999E12, noCFSRatio=0.0, deletesPctAllowed=35.43131712834598
   [junit4]   2> 917548 INFO  (coreLoadExecutor-4221-thread-1) [    x:collection1] o.a.s.s.SolrIndexSearcher Opening [Searcher@2a575ae9[collection1] main]
   [junit4]   2> 917548 INFO  (coreLoadExecutor-4221-thread-1) [    x:collection1] o.a.s.h.c.SpellCheckComponent Initializing spell checkers
   [junit4]   2> 917581 INFO  (coreLoadExecutor-4221-thread-1) [    x:collection1] o.a.s.s.DirectSolrSpellChecker init: {name=direct,classname=DirectSolrSpellChecker,field=lowerfilt,minQueryLength=3}
   [junit4]   2> 917663 INFO  (coreLoadExecutor-4221-thread-1) [    x:collection1] o.a.s.h.ReplicationHandler Commits will be reserved for 10000ms.
   [junit4]   2> 917663 INFO  (searcherExecutor-4222-thread-1-processing-x:collection1) [    x:collection1] o.a.s.h.c.SpellCheckComponent Loading spell index for spellchecker: default
   [junit4]   2> 917663 INFO  (coreLoadExecutor-4221-thread-1) [    x:collection1] o.a.s.u.UpdateLog Could not find max version in index or recent updates, using new clock 1612064090854785024
   [junit4]   2> 917664 INFO  (searcherExecutor-4222-thread-1-processing-x:collection1) [    x:collection1] o.a.s.h.c.SpellCheckComponent Loading spell index for spellchecker: direct
   [junit4]   2> 917664 INFO  (searcherExecutor-4222-thread-1-processing-x:collection1) [    x:collection1] o.a.s.h.c.SpellCheckComponent Loading spell index for spellchecker: wordbreak
   [junit4]   2> 917664 INFO  (searcherExecutor-4222-thread-1-processing-x:collection1) [    x:collection1] o.a.s.h.c.SpellCheckComponent Loading spell index for spellchecker: multipleFields
   [junit4]   2> 917664 INFO  (searcherExecutor-4222-thread-1-processing-x:collection1) [    x:collection1] o.a.s.h.c.SpellCheckComponent Loading spell index for spellchecker: jarowinkler
   [junit4]   2> 917664 INFO  (searcherExecutor-4222-thread-1-processing-x:collection1) [    x:collection1] o.a.s.h.c.SpellCheckComponent Loading spell index for spellchecker: external
   [junit4]   2> 917664 INFO  (searcherExecutor-4222-thread-1-processing-x:collection1) [    x:collection1] o.a.s.h.c.SpellCheckComponent Loading spell index for spellchecker: freq
   [junit4]   2> 917664 INFO  (searcherExecutor-4222-thread-1-processing-x:collection1) [    x:collection1] o.a.s.h.c.SpellCheckComponent Loading spell index for spellchecker: fqcn
   [junit4]   2> 917664 INFO  (searcherExecutor-4222-thread-1-processing-x:collection1) [    x:collection1] o.a.s.h.c.SpellCheckComponent Loading spell index for spellchecker: perDict
   [junit4]   2> 917665 INFO  (searcherExecutor-4222-thread-1-processing-x:collection1) [    x:collection1] o.a.s.c.SolrCore [collection1] Registered new searcher Searcher@2a575ae9[collection1] main{ExitableDirectoryReader(UninvertingDirectoryReader())}
   [junit4]   2> 917725 INFO  (TEST-TestDistributedStatsComponentCardinality.test-seed#[A64108481CFDC09C]) [    ] o.a.s.SolrTestCaseJ4 Writing core.properties file to /home/jenkins/workspace/Lucene-Solr-master-Linux/solr/build/solr-core/test/J0/temp/solr.handler.component.TestDistributedStatsComponentCardinality_A64108481CFDC09C-001/tempDir-001/shard0/cores/collection1
   [junit4]   2> 917725 INFO  (TEST-TestDistributedStatsComponentCardinality.test-seed#[A64108481CFDC09C]) [    ] o.e.j.s.Server jetty-9.4.11.v20180605; built: 2018-06-05T18:24:03.829Z; git: d5fc0523cfa96bfebfbda19606cad384d772f04c; jvm 10.0.1+10
   [junit4]   2> 917726 INFO  (TEST-TestDistributedStatsComponentCardinality.test-seed#[A64108481CFDC09C]) [    ] o.e.j.s.session DefaultSessionIdManager workerName=node0
   [junit4]   2> 917727 INFO  (TEST-TestDistributedStatsComponentCardinality.test-seed#[A64108481CFDC09C]) [    ] o.e.j.s.session No SessionScavenger set, using defaults
   [junit4]   2> 917727 INFO  (TEST-TestDistributedStatsComponentCardinality.test-seed#[A64108481CFDC09C]) [    ] o.e.j.s.session node0 Scavenging every 600000ms
   [junit4]   2> 917727 INFO  (TEST-TestDistributedStatsComponentCardinality.test-seed#[A64108481CFDC09C]) [    ] o.e.j.s.h.ContextHandler Started o.e.j.s.ServletContextHandler@378d3cb7{/,null,AVAILABLE}
   [junit4]   2> 917727 INFO  (TEST-TestDistributedStatsComponentCardinality.test-seed#[A64108481CFDC09C]) [    ] o.e.j.s.AbstractConnector Started ServerConnector@2fb0bf89{HTTP/1.1,[http/1.1]}{127.0.0.1:45651}
   [junit4]   2> 917727 INFO  (TEST-TestDistributedStatsComponentCardinality.test-seed#[A64108481CFDC09C]) [    ] o.e.j.s.Server Started @917754ms
   [junit4]   2> 917727 INFO  (TEST-TestDistributedStatsComponentCardinality.test-seed#[A64108481CFDC09C]) [    ] o.a.s.c.s.e.JettySolrRunner Jetty properties: {schema=schema-sql.xml, hostContext=/, hostPort=45651, coreRootDirectory=/home/jenkins/workspace/Lucene-Solr-master-Linux/solr/build/solr-core/test/J0/temp/solr.handler.component.TestDistributedStatsComponentCardinality_A64108481CFDC09C-001/tempDir-001/shard0/cores}
   [junit4]   2> 917727 ERROR (TEST-TestDistributedStatsComponentCardinality.test-seed#[A64108481CFDC09C]) [    ] o.a.s.u.StartupLoggingUtils Missing Java Option solr.log.dir. Logging may be missing or incomplete.
   [junit4]   2> 917727 INFO  (TEST-TestDistributedStatsComponentCardinality.test-seed#[A64108481CFDC09C]) [    ] o.a.s.s.SolrDispatchFilter Using logger factory org.apache.logging.slf4j.Log4jLoggerFactory
   [junit4]   2> 917727 INFO  (TEST-TestDistributedStatsComponentCardinality.test-seed#[A64108481CFDC09C]) [    ] o.a.s.s.SolrDispatchFilter  ___      _       Welcome to Apache Solr™ version 8.0.0
   [junit4]   2> 917727 INFO  (TEST-TestDistributedStatsComponentCardinality.test-seed#[A64108481CFDC09C]) [    ] o.a.s.s.SolrDispatchFilter / __| ___| |_ _   Starting in standalone mode on port null
   [junit4]   2> 917727 INFO  (TEST-TestDistributedStatsComponentCardinality.test-seed#[A64108481CFDC09C]) [    ] o.a.s.s.SolrDispatchFilter \__ \/ _ \ | '_|  Install dir: null
   [junit4]   2> 917728 INFO  (TEST-TestDistributedStatsComponentCardinality.test-seed#[A64108481CFDC09C]) [    ] o.a.s.s.SolrDispatchFilter |___/\___/_|_|    Start time: 2018-09-19T19:08:39.914008Z
   [junit4]   2> 917728 INFO  (TEST-TestDistributedStatsComponentCardinality.test-seed#[A64108481CFDC09C]) [    ] o.a.s.c.SolrXmlConfig Loading container configuration from /home/jenkins/workspace/Lucene-Solr-master-Linux/solr/build/solr-core/test/J0/temp/solr.handler.component.TestDistributedStatsComponentCardinality_A64108481CFDC09C-001/tempDir-001/shard0/solr.xml
   [junit4]   2> 917729 INFO  (TEST-TestDistributedStatsComponentCardinality.test-seed#[A64108481CFDC09C]) [    ] o.a.s.c.SolrXmlConfig Configuration parameter autoReplicaFailoverWorkLoopDelay is ignored
   [junit4]   2> 917729 INFO  (TEST-TestDistributedStatsComponentCardinality.test-seed#[A64108481CFDC09C]) [    ] o.a.s.c.SolrXmlConfig Configuration parameter autoReplicaFailoverBadNodeExpiration is ignored
   [junit4]   2> 917730 INFO  (TEST-TestDistributedStatsComponentCardinality.test-seed#[A64108481CFDC09C]) [    ] o.a.s.c.SolrXmlConfig MBean server found: com.sun.jmx.mbeanserver.JmxMBeanServer@3342185f, but no JMX reporters were configured - adding default JMX reporter.
   [junit4]   2> 917822 INFO  (TEST-TestDistributedStatsComponentCardinality.test-seed#[A64108481CFDC09C]) [    ] o.a.s.c.TransientSolrCoreCacheDefault Allocating transient cache for 4 transient cores
   [junit4]   2> 917822 INFO  (TEST-TestDistributedStatsComponentCardinality.test-seed#[A64108481CFDC09C]) [    ] o.a.s.h.a.MetricsHistoryHandler No .system collection, keeping metrics history in memory.
   [junit4]   2> 917831 INFO  (TEST-TestDistributedStatsComponentCardinality.test-seed#[A64108481CFDC09C]) [    ] o.a.s.m.r.SolrJmxReporter JMX monitoring for 'solr.node' (registry 'solr.node') enabled at server: com.sun.jmx.mbeanserver.JmxMBeanServer@3342185f
   [junit4]   2> 917838 INFO  (TEST-TestDistributedStatsComponentCardinality.test-seed#[A64108481CFDC09C]) [    ] o.a.s.m.r.SolrJmxReporter JMX monitoring for 'solr.jvm' (registry 'solr.jvm') enabled at server: com.sun.jmx.mbeanserver.JmxMBeanServer@3342185f
   [junit4]   2> 917838 INFO  (TEST-TestDistributedStatsComponentCardinality.test-seed#[A64108481CFDC09C]) [    ] o.a.s.m.r.SolrJmxReporter JMX monitoring for 'solr.jetty' (registry 'solr.jetty') enabled at server: com.sun.jmx.mbeanserver.JmxMBeanServer@3342185f
   [junit4]   2> 917839 INFO  (TEST-TestDistributedStatsComponentCardinality.test-seed#[A64108481CFDC09C]) [    ] o.a.s.c.CorePropertiesLocator Found 1 core definitions underneath /home/jenkins/workspace/Lucene-Solr-master-Linux/solr/build/solr-core/test/J0/temp/solr.handler.component.TestDistributedStatsComponentCardinality_A64108481CFDC09C-001/tempDir-001/shard0/cores
   [junit4]   2> 917839 INFO  (TEST-TestDistributedStatsComponentCardinality.test-seed#[A64108481CFDC09C]) [    ] o.a.s.c.CorePropertiesLocator Cores are: [collection1]
   [junit4]   2> 917839 INFO  (coreLoadExecutor-4235-thread-1) [    x:collection1] o.a.s.c.SolrResourceLoader [null] Added 2 libs to classloader, from paths: [/home/jenkins/workspace/Lucene-Solr-master-Linux/solr/core/src/test-files/solr/collection1/lib, /home/jenkins/workspace/Lucene-Solr-master-Linux/solr/core/src/test-files/solr/collection1/lib/classes]
   [junit4]   2> 917853 INFO  (coreLoadExecutor-4235-thread-1) [    x:collection1] o.a.s.c.SolrConfig Using Lucene MatchVersion: 8.0.0
   [junit4]   2> 917863 INFO  (coreLoadExecutor-4235-thread-1) [    x:collection1] o.a.s.s.IndexSchema [collection1] Schema name=test
   [junit4]   2> 917890 WARN  (coreLoadExecutor-4235-thread-1) [    x:collection1] o.a.s.s.IndexSchema Field lowerfilt1and2 is not multivalued and destination for multiple copyFields (2)
   [junit4]   2> 917890 WARN  (coreLoadExecutor-4235-thread-1) [    x:collection1] o.a.s.s.IndexSchema Field text is not multivalued and destination for multiple copyFields (3)
   [junit4]   2> 917890 INFO  (coreLoadExecutor-4235-thread-1) [    x:collection1] o.a.s.s.IndexSchema Loaded schema test/1.6 with uniqueid field id
   [junit4]   2> 917890 INFO  (coreLoadExecutor-4235-thread-1) [    x:collection1] o.a.s.c.CoreContainer Creating SolrCore 'collection1' using configuration from configset /home/jenkins/workspace/Lucene-Solr-master-Linux/solr/core/src/test-files/solr/collection1, trusted=true
   [junit4]   2> 917891 INFO  (coreLoadExecutor-4235-thread-1) [    x:collection1] o.a.s.m.r.SolrJmxReporter JMX monitoring for 'solr.core.collection1' (registry 'solr.core.collection1') enabled at server: com.sun.jmx.mbeanserver.JmxMBeanServer@3342185f
   [junit4]   2> 917891 INFO  (coreLoadExecutor-4235-thread-1) [    x:collection1] o.a.s.c.SolrCore [[collection1] ] Opening new SolrCore at [/home/jenkins/workspace/Lucene-Solr-master-Linux/solr/core/src/test-files/solr/collection1], dataDir=[/home/jenkins/workspace/Lucene-Solr-master-Linux/solr/build/solr-core/test/J0/temp/solr.handler.component.TestDistributedStatsComponentCardinality_A64108481CFDC09C-001/tempDir-001/shard0/cores/collection1/data/]
   [junit4]   2> 917892 INFO  (coreLoadExecutor-4235-thread-1) [    x:collection1] o.a.s.u.RandomMergePolicy RandomMergePolicy wrapping class org.apache.lucene.index.TieredMergePolicy: [TieredMergePolicy: maxMergeAtOnce=31, maxMergeAtOnceExplicit=25, maxMergedSegmentMB=14.328125, floorSegmentMB=1.2734375, forceMergeDeletesPctAllowed=20.257305603666964, segmentsPerTier=28.0, maxCFSSegmentSizeMB=8.796093022207999E12, noCFSRatio=0.6472708564583096, deletesPctAllowed=20.282455498955024
   [junit4]   2> 917920 INFO  (coreLoadExecutor-4235-thread-1) [    x:collection1] o.a.s.u.UpdateHandler Using UpdateLog implementation: org.apache.solr.update.UpdateLog
   [junit4]   2> 917920 INFO  (coreLoadExecutor-4235-thread-1) [    x:collection1] o.a.s.u.UpdateLog Initializing UpdateLog: dataDir= defaultSyncLevel=FLUSH numRecordsToKeep=100 maxNumLogsToKeep=10 numVersionBuckets=65536
   [junit4]   2> 917920 INFO  (coreLoadExecutor-4235-thread-1) [    x:collection1] o.a.s.u.CommitTracker Hard AutoCommit: disabled
   [junit4]   2> 917920 INFO  (coreLoadExecutor-4235-thread-1) [    x:collection1] o.a.s.u.CommitTracker Soft AutoCommit: disabled
   [junit4]   2> 917921 INFO  (coreLoadExecutor-4235-thread-1) [    x:collection1] o.a.s.u.RandomMergePolicy RandomMergePolicy wrapping class org.apache.lucene.index.TieredMergePolicy: [TieredMergePolicy: maxMergeAtOnce=3, maxMergeAtOnceExplicit=5, maxMergedSegmentMB=37.9169921875, floorSegmentMB=1.6435546875, forceMergeDeletesPctAllowed=24.10381085865487, segmentsPerTier=41.0, maxCFSSegmentSizeMB=8.796093022207999E12, noCFSRatio=0.0, deletesPctAllowed=35.43131712834598
   [junit4]   2> 917921 INFO  (coreLoadExecutor-4235-thread-1) [    x:collection1] o.a.s.s.SolrIndexSearcher Opening [Searcher@2b6c96ea[collection1] main]
   [junit4]   2> 917921 INFO  (coreLoadExecutor-4235-thread-1) [    x:collection1] o.a.s.h.c.SpellCheckComponent Initializing spell checkers
   [junit4]   2> 917946 INFO  (coreLoadExecutor-4235-thread-1) [    x:collection1] o.a.s.s.DirectSolrSpellChecker init: {name=direct,classname=DirectSolrSpellChecker,field=lowerfilt,minQueryLength=3}
   [junit4]   2> 918029 INFO  (coreLoadExecutor-4235-thread-1) [    x:collection1] o.a.s.h.ReplicationHandler Commits will be reserved for 10000ms.
   [junit4]   2> 918029 INFO  (searcherExecutor-4236-thread-1-processing-x:collection1) [    x:collection1] o.a.s.h.c.SpellCheckComponent Loading spell index for spellchecker: default
   [junit4]   2> 918029 INFO  (coreLoadExecutor-4235-thread-1) [    x:collection1] o.a.s.u.UpdateLog Could not find max version in index or recent updates, using new clock 1612064091238563840
   [junit4]   2> 918029 INFO  (searcherExecutor-4236-thread-1-processing-x:collection1) [    x:collection1] o.a.s.h.c.SpellCheckComponent Loading spell index for spellchecker: direct
   [junit4]   2> 918029 INFO  (searcherExecutor-4236-thread-1-processing-x:collection1) [    x:collection1] o.a.s.h.c.SpellCheckComponent Loading spell index for spellchecker: wordbreak
   [junit4]   2> 918029 INFO  (searcherExecutor-4236-thread-1-processing-x:collection1) [    x:collection1] o.a.s.h.c.SpellCheckComponent Loading spell index for spellchecker: multipleFields
   [junit4]   2> 918029 INFO  (searcherExecutor-4236-thread-1-processing-x:collection1) [    x:collection1] o.a.s.h.c.SpellCheckComponent Loading spell index for spellchecker: jarowinkler
   [junit4]   2> 918029 INFO  (searcherExecutor-4236-thread-1-processing-x:collection1) [    x:collection1] o.a.s.h.c.SpellCheckComponent Loading spell index for spellchecker: external
   [junit4]   2> 918030 INFO  (searcherExecutor-4236-thread-1-processing-x:collection1) [    x:collection1] o.a.s.h.c.SpellCheckComponent Loading spell index for spellchecker: freq
   [junit4]   2> 918030 INFO  (searcherExecutor-4236-thread-1-processing-x:collection1) [    x:collection1] o.a.s.h.c.SpellCheckComponent Loading spell index for spellchecker: fqcn
   [junit4]   2> 918030 INFO  (searcherExecutor-4236-thread-1-processing-x:collection1) [    x:collection1] o.a.s.h.c.SpellCheckComponent Loading spell index for spellchecker: perDict
   [junit4]   2> 918030 INFO  (searcherExecutor-4236-thread-1-processing-x:collection1) [    x:collection1] o.a.s.c.SolrCore [collection1] Registered new searcher Searcher@2b6c96ea[collection1] main{ExitableDirectoryReader(UninvertingDirectoryReader())}
   [junit4]   2> 918090 INFO  (TEST-TestDistributedStatsComponentCardinality.test-seed#[A64108481CFDC09C]) [    ] o.a.s.SolrTestCaseJ4 Writing core.properties file to /home/jenkins/workspace/Lucene-Solr-master-Linux/solr/build/solr-core/test/J0/temp/solr.handler.component.TestDistributedStatsComponentCardinality_A64108481CFDC09C-001/tempDir-001/shard1/cores/collection1
   [junit4]   2> 918091 INFO  (TEST-TestDistributedStatsComponentCardinality.test-seed#[A64108481CFDC09C]) [    ] o.e.j.s.Server jetty-9.4.11.v20180605; built: 2018-06-05T18:24:03.829Z; git: d5fc0523cfa96bfebfbda19606cad384d772f04c; jvm 10.0.1+10
   [junit4]   2> 918092 INFO  (TEST-TestDistributedStatsComponentCardinality.test-seed#[A64108481CFDC09C]) [    ] o.e.j.s.session DefaultSessionIdManager workerName=node0
   [junit4]   2> 918092 INFO  (TEST-TestDistributedStatsComponentCardinality.test-seed#[A64108481CFDC09C]) [    ] o.e.j.s.session No SessionScavenger set, using defaults
   [junit4]   2> 918092 INFO  (TEST-TestDistributedStatsComponentCardinality.test-seed#[A64108481CFDC09C]) [    ] o.e.j.s.session node0 Scavenging every 660000ms
   [junit4]   2> 918092 INFO  (TEST-TestDistributedStatsComponentCardinality.test-seed#[A64108481CFDC09C]) [    ] o.e.j.s.h.ContextHandler Started o.e.j.s.ServletContextHandler@dcfe045{/,null,AVAILABLE}
   [junit4]   2> 918092 INFO  (TEST-TestDistributedStatsComponentCardinality.test-seed#[A64108481CFDC09C]) [    ] o.e.j.s.AbstractConnector Started ServerConnector@465857df{HTTP/1.1,[http/1.1]}{127.0.0.1:43575}
   [junit4]   2> 918092 INFO  (TEST-TestDistributedStatsComponentCardinality.test-seed#[A64108481CFDC09C]) [    ] o.e.j.s.Server Started @918119ms
   [junit4]   2> 918092 INFO  (TEST-TestDistributedStatsComponentCardinality.test-seed#[A64108481CFDC09C]) [    ] o.a.s.c.s.e.JettySolrRunner Jetty properties: {schema=schema-sql.xml, hostContext=/, hostPort=43575, coreRootDirectory=/home/jenkins/workspace/Lucene-Solr-master-Linux/solr/build/solr-core/test/J0/temp/solr.handler.component.TestDistributedStatsComponentCardinality_A64108481CFDC09C-001/tempDir-001/shard1/cores}
   [junit4]   2> 918092 ERROR (TEST-TestDistributedStatsComponentCardinality.test-seed#[A64108481CFDC09C]) [    ] o.a.s.u.StartupLoggingUtils Missing Java Option solr.log.dir. Logging may be missing or incomplete.
   [junit4]   2> 918093 INFO  (TEST-TestDistributedStatsComponentCardinality.test-seed#[A64108481CFDC09C]) [    ] o.a.s.s.SolrDispatchFilter Using logger factory org.apache.logging.slf4j.Log4jLoggerFactory
   [junit4]   2> 918093 INFO  (TEST-TestDistributedStatsComponentCardinality.test-seed#[A64108481CFDC09C]) [    ] o.a.s.s.SolrDispatchFilter  ___      _       Welcome to Apache Solr™ version 8.0.0
   [junit4]   2> 918093 INFO  (TEST-TestDistributedStatsComponentCardinality.test-seed#[A64108481CFDC09C]) [    ] o.a.s.s.SolrDispatchFilter / __| ___| |_ _   Starting in standalone mode on port null
   [junit4]   2> 918093 INFO  (TEST-TestDistributedStatsComponentCardinality.test-seed#[A64108481CFDC09C]) [    ] o.a.s.s.SolrDispatchFilter \__ \/ _ \ | '_|  Install dir: null
   [junit4]   2> 918093 INFO  (TEST-TestDistributedStatsComponentCardinality.test-seed#[A64108481CFDC09C]) [    ] o.a.s.s.SolrDispatchFilter |___/\___/_|_|    Start time: 2018-09-19T19:08:40.279254Z
   [junit4]   2> 918093 INFO  (TEST-TestDistributedStatsComponentCardinality.test-seed#[A64108481CFDC09C]) [    ] o.a.s.c.SolrXmlConfig Loading container configuration from /home/jenkins/workspace/Lucene-Solr-master-Linux/solr/build/solr-core/test/J0/temp/solr.handler.component.TestDistributedStatsComponentCardinality_A64108481CFDC09C-001/tempDir-001/shard1/solr.xml
   [junit4]   2> 918094 INFO  (TEST-TestDistributedStatsComponentCardinality.test-seed#[A64108481CFDC09C]) [    ] o.a.s.c.SolrXmlConfig Configuration parameter autoReplicaFailoverWorkLoopDelay is ignored
   [junit4]   2> 918094 INFO  (TEST-TestDistributedStatsComponentCardinality.test-seed#[A64108481CFDC09C]) [    ] o.a.s.c.SolrXmlConfig Configuration parameter autoReplicaFailoverBadNodeExpiration is ignored
   [junit4]   2> 918095 INFO  (TEST-TestDistributedStatsComponentCardinality.test-seed#[A64108481CFDC09C]) [    ] o.a.s.c.SolrXmlConfig MBean server found: com.sun.jmx.mbeanserver.JmxMBeanServer@3342185f, but no JMX reporters were configured - adding default JMX reporter.
   [junit4]   2> 918170 INFO  (TEST-TestDistributedStatsComponentCardinality.test-seed#[A64108481CFDC09C]) [    ] o.a.s.c.TransientSolrCoreCacheDefault Allocating transient cache for 4 transient cores
   [junit4]   2> 918170 INFO  (TEST-TestDistributedStatsComponentCardinality.test-seed#[A64108481CFDC09C]) [    ] o.a.s.h.a.MetricsHistoryHandler No .system collection, keeping metrics history in memory.
   [junit4]   2> 918180 INFO  (TEST-TestDistributedStatsComponentCardinality.test-seed#[A64108481CFDC09C]) [    ] o.a.s.m.r.SolrJmxReporter JMX monitoring for 'solr.node' (registry 'solr.node') enabled at server: com.sun.jmx.mbeanserver.JmxMBeanServer@3342185f
   [junit4]   2> 918187 INFO  (TEST-TestDistributedStatsComponentCardinality.test-seed#[A64108481CFDC09C]) [    ] o.a.s.m.r.SolrJmxReporter JMX monitoring for 'solr.jvm' (registry 'solr.jvm') enabled at server: com.sun.jmx.mbeanserver.JmxMBeanServer@3342185f
   [junit4]   2> 918187 INFO  (TEST-TestDistributedStatsComponentCardinality.test-seed#[A64108481CFDC09C]) [    ] o.a.s.m.r.SolrJmxReporter JMX monitoring for 'solr.jetty' (registry 'solr.jetty') enabled at server: com.sun.jmx.mbeanserver.JmxMBeanServer@3342185f
   [junit4]   2> 918188 INFO  (TEST-TestDistributedStatsComponentCardinality.test-seed#[A64108481CFDC09C]) [    ] o.a.s.c.CorePropertiesLocator Found 1 core definitions underneath /home/jenkins/workspace/Lucene-Solr-master-Linux/solr/build/solr-core/test/J0/temp/solr.handler.component.TestDistributedStatsComponentCardinality_A64108481CFDC09C-001/tempDir-001/shard1/cores
   [junit4]   2> 918188 INFO  (TEST-TestDistributedStatsComponentCardinality.test-seed#[A64108481CFDC09C]) [    ] o.a.s.c.CorePropertiesLocator Cores are: [collection1]
   [junit4]   2> 918189 INFO  (coreLoadExecutor-4249-thread-1) [    x:collection1] o.a.s.c.SolrResourceLoader [null] Added 2 libs to classloader, from paths: [/home/jenkins/workspace/Lucene-Solr-master-Linux/solr/core/src/test-files/solr/collection1/lib, /home/jenkins/workspace/Lucene-Solr-master-Linux/solr/core/src/test-files/solr/collection1/lib/classes]
   [junit4]   2> 918203 INFO  (coreLoadExecutor-4249-thread-1) [    x:collection1] o.a.s.c.SolrConfig Using Lucene MatchVersion: 8.0.0
   [junit4]   2> 918214 INFO  (coreLoadExecutor-4249-thread-1) [    x:collection1] o.a.s.s.IndexSchema [collection1] Schema name=test
   [junit4]   2> 918242 WARN  (coreLoadExecutor-4249-thread-1) [    x:collection1] o.a.s.s.IndexSchema Field lowerfilt1and2 is not multivalued and destination for multiple copyFields (2)
   [junit4]   2> 918242 WARN  (coreLoadExecutor-4249-thread-1) [    x:collection1] o.a.s.s.IndexSchema Field text is not multivalued and destination for multiple copyFields (3)
   [junit4]   2> 918242 INFO  (coreLoadExecutor-4249-thread-1) [    x:collection1] o.a.s.s.IndexSchema Loaded schema test/1.6 with uniqueid field id
   [junit4]   2> 918242 INFO  (coreLoadExecutor-4249-thread-1) [    x:collection1] o.a.s.c.CoreContainer Creating SolrCore 'collection1' using configuration from configset /home/jenkins/workspace/Lucene-Solr-master-Linux/solr/core/src/test-files/solr/collection1, trusted=true
   [junit4]   2> 918242 INFO  (coreLoadExecutor-4249-thread-1) [    x:collection1] o.a.s.m.r.SolrJmxReporter JMX monitoring for 'solr.core.collection1' (registry 'solr.core.collection1') enabled at server: com.sun.jmx.mbeanserver.JmxMBeanServer@3342185f
   [junit4]   2> 918242 INFO  (coreLoadExecutor-4249-thread-1) [    x:collection1] o.a.s.c.SolrCore [[collection1] ] Opening new SolrCore at [/home/jenkins/workspace/Lucene-Solr-master-Linux/solr/core/src/test-files/solr/collection1], dataDir=[/home/jenkins/workspace/Lucene-Solr-master-Linux/solr/build/solr-core/test/J0/temp/solr.handler.component.TestDistributedStatsComponentCardinality_A64108481CFDC09C-001/tempDir-001/shard1/cores/collection1/data/]
   [junit4]   2> 918244 INFO  (coreLoadExecutor-4249-thread-1) [    x:collection1] o.a.s.u.RandomMergePolicy RandomMergePolicy wrapping class org.apache.lucene.index.TieredMergePolicy: [TieredMergePolicy: maxMergeAtOnce=31, maxMergeAtOnceExplicit=25, maxMergedSegmentMB=14.328125, floorSegmentMB=1.2734375, forceMergeDeletesPctAllowed=20.257305603666964, segmentsPerTier=28.0, maxCFSSegmentSizeMB=8.796093022207999E12, noCFSRatio=0.6472708564583096, deletesPctAllowed=20.282455498955024
   [junit4]   2> 918274 INFO  (coreLoadExecutor-4249-thread-1) [    x:collection1] o.a.s.u.UpdateHandler Using UpdateLog implementation: org.apache.solr.update.UpdateLog
   [junit4]   2> 918274 INFO  (coreLoadExecutor-4249-thread-1) [    x:collection1] o.a.s.u.UpdateLog Initializing UpdateLog: dataDir= defaultSyncLevel=FLUSH numRecordsToKeep=100 maxNumLogsToKeep=10 numVersionBuckets=65536
   [junit4]   2> 918274 INFO  (coreLoadExecutor-4249-thread-1) [    x:collection1] o.a.s.u.CommitTracker Hard AutoCommit: disabled
   [junit4]   2> 918274 INFO  (coreLoadExecutor-4249-thread-1) [    x:collection1] o.a.s.u.CommitTracker Soft AutoCommit: disabled
   [junit4]   2> 918275 INFO  (coreLoadExecutor-4249-thread-1) [    x:collection1] o.a.s.u.RandomMergePolicy RandomMergePolicy wrapping class org.apache.lucene.index.TieredMergePolicy: [TieredMergePolicy: maxMergeAtOnce=3, maxMergeAtOnceExplicit=5, maxMergedSegmentMB=37.9169921875, floorSegmentMB=1.6435546875, forceMergeDeletesPctAllowed=24.10381085865487, segmentsPerTier=41.0, maxCFSSegmentSizeMB=8.796093022207999E12, noCFSRatio=0.0, deletesPctAllowed=35.43131712834598
   [junit4]   2> 918275 INFO  (coreLoadExecutor-4249-thread-1) [    x:collection1] o.a.s.s.SolrIndexSearcher Opening [Searcher@49f992d2[collection1] main]
   [junit4]   2> 918276 INFO  (coreLoadExecutor-4249-thread-1) [    x:collection1] o.a.s.h.c.SpellCheckComponent Initializing spell checkers
   [junit4]   2> 918292 INFO  (coreLoadExecutor-4249-thread-1) [    x:collection1] o.a.s.s.DirectSolrSpellChecker init: {name=direct,classname=DirectSolrSpellChecker,field=lowerfilt,minQueryLength=3}
   [junit4]   2> 918371 INFO  (coreLoadExecutor-4249-thread-1) [    x:collection1] o.a.s.h.ReplicationHandler Commits will be reserved for 10000ms.
   [junit4]   2> 918371 INFO  (searcherExecutor-4250-thread-1-processing-x:collection1) [    x:collection1] o.a.s.h.c.SpellCheckComponent Loading spell index for spellchecker: default
   [junit4]   2> 918371 INFO  (coreLoadExecutor-4249-thread-1) [    x:collection1] o.a.s.u.UpdateLog Could not find max version in index or recent updates, using new clock 1612064091597176832
   [junit4]   2> 918372 INFO  (searcherExecutor-4250-thread-1-processing-x:collection1) [    x:collection1] o.a.s.h.c.SpellCheckComponent Loading spell index for spellchecker: direct
   [junit4]   2> 918372 INFO  (searcherExecutor-4250-thread-1-processing-x:collection1) [    x:collection1] o.a.s.h.c.SpellCheckComponent Loading spell index for spellchecker: wordbreak
   [junit4]   2> 918372 INFO  (searcherExecutor-4250-thread-1-processing-x:collection1) [    x:collection1] o.a.s.h.c.SpellCheckComponent Loading spell index for spellchecker: multipleFields
   [junit4]   2> 918372 INFO  (searcherExecutor-4250-thread-1-processing-x:collection1) [    x:collection1] o.a.s.h.c.SpellCheckComponent Loading spell index for spellchecker: jarowinkler
   [junit4]   2> 918372 INFO  (searcherExecutor-4250-thread-1-processing-x:collection1) [    x:collection1] o.a.s.h.c.SpellCheckComponent Loading spell index for spellchecker: external
   [junit4]   2> 918372 INFO  (searcherExecutor-4250-thread-1-processing-x:collection1) [    x:collection1] o.a.s.h.c.SpellCheckComponent Loading spell index for spellchecker: freq
   [junit4]   2> 918372 INFO  (searcherExecutor-4250-thread-1-processing-x:collection1) [    x:collection1] o.a.s.h.c.SpellCheckComponent Loading spell index for spellchecker: fqcn
   [junit4]   2> 918372 INFO  (searcherExecutor-4250-thread-1-processing-x:collection1) [    x:collection1] o.a.s.h.c.SpellCheckComponent Loading spell index for spellchecker: perDict
   [junit4]   2> 918373 INFO  (searcherExecutor-4250-thread-1-processing-x:collection1) [    x:collection1] o.a.s.c.SolrCore [collection1] Registered new searcher Searcher@49f992d2[collection1] main{ExitableDirectoryReader(UninvertingDirectoryReader())}
   [junit4]   2> 918373 INFO  (TEST-TestDistributedStatsComponentCardinality.test-seed#[A64108481CFDC09C]) [    ] o.a.s.SolrTestCaseJ4 ###Starting test
   [junit4]   2> 918373 INFO  (TEST-TestDistributedStatsComponentCardinality.test-seed#[A64108481CFDC09C]) [    ] o.a.s.h.c.TestDistributedStatsComponentCardinality Building an index of 14156 docs
   [junit4]   2> 918378 INFO  (qtp394060823-10201) [    x:collection1] o.a.s.u.p.LogUpdateProcessorFactory [collection1]  webapp= path=/update params={wt=javabin&version=2}{add=[1 (1612064091603468288)]} 0 1
   [junit4]   2> 918381 INFO  (qtp7777891-10241) [    x:collection1] o.a.s.u.p.LogUpdateProcessorFactory [collection1]  webapp= path=/update params={wt=javabin&version=2}{add=[1 (1612064091606614016)]} 0 1
   [junit4]   2> 918381 INFO  (qtp394060823-10195) [    x:collection1] o.a.s.u.p.LogUpdateProcessorFactory [collection1]  webapp= path=/update params={wt=javabin&version=2}{add=[2 (1612064091607662592)]} 0 0
   [junit4]   2> 918383 INFO  (qtp2074599002-10221) [    x:collection1] o.a.s.u.p.LogUpdateProcessorFactory [collection1]  webapp= path=/update params={wt=javabin&version=2}{add=[2 (1612064091608711168)]} 0 0
   [junit4]   2> 918384 INFO  (qtp394060823-10200) [    x:collection1] o.a.s.u.p.LogUpdateProcessorFactory [collection1]  webapp= path=/update params={wt=javabin&version=2}{add=[3 (1612064091610808320)]} 0 0
   [junit4]   2> 918384 INFO  (qtp7777891-10235) [    x:collection1] o.a.s.u.p.LogUpdateProcessorFactory [collection1]  webapp= path=/update params={wt=javabin&version=2}{add=[3 (1612064091610808320)]} 0 0
   [junit4]   2> 918385 INFO  (qtp394060823-10199) [    x:collection1] o.a.s.u.p.LogUpdateProcessorFactory [collection1]  webapp= path=/update params={wt=javabin&version=2}{add=[4 (1612064091611856896)]} 0 0
   [junit4]   2> 918385 INFO  (qtp2074599002-10215) [    x:collection1] o.a.s.u.p.LogUpdateProcessorFactory [collection1]  webapp= path=/update params={wt=javabin&version=2}{add=[4 (1612064091611856896)]} 0 0
   [junit4]   2> 918386 INFO  (qtp394060823-10200) [    x:collection1] o.a.s.u.p.LogUpdateProcessorFactory [collection1]  webapp= path=/update params={wt=javabin&version=2}{add=[5 (1612064091612905472)]} 0 0
   [junit4]   2> 918386 INFO  (qtp7777891-10240) [    x:collection1] o.a.s.u.p.LogUpdateProcessorFactory [collection1]  webapp= path=/update params={wt=javabin&version=2}{add=[5 (1612064091612905472)]} 0 0
   [junit4]   2> 918386 INFO  (qtp394060823-10199) [    x:collection1] o.a.s.u.p.LogUpdateProcessorFactory [collection1]  webapp= path=/update params={wt=javabin&version=2}{add=[6 (1612064091612905473)]} 0 0
   [junit4]   2> 918387 INFO  (qtp2074599002-10220) [    x:collection1] o.a.s.u.p.LogUpdateProcessorFactory [collection1]  webapp= path=/update params={wt=javabin&version=2}{add=[6 (1612064091613954048)]} 0 0
   [junit4]   2> 918387 INFO  (qtp394060823-10200) [    x:collection1] o.a.s.u.p.LogUpdateProcessorFactory [collection1]  webapp= path=/update params={wt=javabin&version=2}{add=[7 (1612064091613954048)]} 0 0
   [junit4]   2> 918388 INFO  (qtp7777891-10239) [    x:collection1] o.a.s.u.p.LogUpdateProcessorFactory [collection1]  webapp= path=/update params={wt=javabin&version=2}{add=[7 (1612064091615002624)]} 0 0
   [junit4]   2> 918388 INFO  (qtp394060823-10199) [    x:collection1] o.a.s.u.p.LogUpdateProcessorFactory [collection1]  webapp= path=/update params={wt=javabin&version=2}{add=[8 (1612064091615002624)]} 0 0
   [junit4]   2> 918388 INFO  (qtp2074599002-10219) [    x:collection1] o.a.s.u.p.LogUpdateProcessorFactory [collection1]  webapp= path=/update params={wt=javabin&version=2}{add=[8 (1612064091615002624)]} 0 0
   [junit4]   2> 918389 INFO  (qtp394060823-10200) [    x:collection1] o.a.s.u.p.LogUpdateProcessorFactory [collection1]  webapp= path=/update params={wt=javabin&version=2}{add=[9 (1612064091616051200)]} 0 0
   [junit4]   2> 918389 INFO  (qtp7777891-10240) [    x:collection1] o.a.s.u.p.LogUpdateProcessorFactory [collection1]  webapp= path=/update params={wt=javabin&version=2}{add=[9 (1612064091616051200)]} 0 0
   [junit4]   2> 918389 INFO  (qtp394060823-10199) [    x:collection1] o.a.s.u.p.LogUpdateProcessorFactory [collection1]  webapp= path=/update params={wt=javabin&version=2}{add=[10 (1612064091616051201)]} 0 0
   [junit4]   2> 918390 INFO  (qtp7777891-10239) [    x:collection1] o.a.s.u.p.LogUpdateProcessorFactory [collection1]  webapp= path=/update params={wt=javabin&version=2}{add=[10 (1612064091616051201)]} 0 0
   [junit4]   2> 918390 INFO  (qtp394060823-10200) [    x:collection1] o.a.s.u.p.LogUpdateProcessorFactory [collection1]  webapp= path=/update params={wt=javabin&version=2}{add=[11 (1612064091617099776)]} 0 0
   [junit4]   2> 918390 INFO  (qtp2074599002-10220) [    x:collection1] o.a.s.u.p.LogUpdateProcessorFactory [collection1]  webapp= path=/update params={wt=javabin&version=2}{add=[11 (1612064091617099776)]} 0 0
   [junit4]   2> 918391 INFO  (qtp394060823-10199) [    x:collection1] o.a.s.u.p.LogUpdateProcessorFactory [collection1]  webapp= path=/update params={wt=javabin&version=2}{add=[12 (1612064091617099777)]} 0 0
   [junit4]   2> 918391 INFO  (qtp7777891-10240) [    x:collection1] o.a.s.u.p.LogUpdateProcessorFactory [collection1]  webapp= path=/update params={wt=javabin&version=2}{add=[12 (1612064091618148352)]} 0 0
   [junit4]   2> 918391 INFO  (qtp394060823-10200) [    x:collection1] o.a.s.u.p.LogUpdateProcessorFactory [collection1]  webapp= path=/update params={wt=javabin&version=2}{add=[13 (1612064091618148352)]} 0 0
   [junit4]   2> 918391 INFO  (qtp2074599002-10219) [    x:collection1] o.a.s.u.p.LogUpdateProcessorFactory [collection1]  webapp= path=/update params={wt=javabin&version=2}{add=[13 (1612064091618148352)]} 0 0
   [junit4]   2> 918392 INFO  (qtp394060823-10199) [    x:collection1] o.a.s.u.p.LogUpdateProcessorFactory [collection1]  webapp= path=/update params={wt=javabin&version=2}{add=[14 (1612064091619196928)]} 0 0
   [junit4]   2> 918392 INFO  (qtp7777891-10239) [    x:collection1] o.a.s.u.p.LogUpdateProcessorFactory [collection1]  webapp= path=/update params={wt=javabin&version=2}{add=[14 (1612064091619196928)]} 0 0
   [junit4]   2> 918392 INFO  (qtp394060823-10200) [    x:collection1] o.a.s.u.p.LogUpdateProcessorFactory [collection1]  webapp= path=/update params={wt=javabin&version=2}{add=[15 (1612064091619196929)]} 0 0
   [junit4]   2> 918393 INFO  (qtp2074599002-10220) [    x:collection1] o.a.s.u.p.LogUpdateProcessorFactory [collection1]  webapp= path=/update params={wt=javabin&version=2}{add=[15 (1612064091620245504)]} 0 0
   [junit4]   2> 918393 INFO  (qtp394060823-10199) [    x:collection1] o.a.s.u.p.LogUpdateProcessorFactory [collection1]  webapp= path=/update params={wt=javabin&version=2}{add=[16 (1612064091620245504)]} 0 0
   [junit4]   2> 918393 INFO  (qtp7777891-10240) [    x:collection1] o.a.s.u.p.LogUpdateProcessorFactory [collection1]  webapp= path=/update params={wt=javabin&version=2}{add=[16 (1612064091620245504)]} 0 0
   [junit4]   2> 918394 INFO  (qtp394060823-10200) [    x:collection1] o.a.s.u.p.LogUpdateProcessorFactory [collection1]  webapp= path=/update params={wt=javabin&version=2}{add=[17 (1612064091620245505)]} 0 0
   [junit4]   2> 918394 INFO  (qtp2074599002-10219) [    x:collection1] o.a.s.u.p.LogUpdateProcessorFactory [collection1]  webapp= path=/update params={wt=javabin&version=2}{add=[17 (1612064091621294080)]} 0 0
   [junit4]   2> 918394 INFO  (qtp394060823-10199) [    x:collection1] o.a.s.u.p.LogUpdateProcessorFactory [collection1]  webapp= path=/update params={wt=javabin&version=2}{add=[18 (1612064091621294080)]} 0 0
   [junit4]   2> 918394 INFO  (qtp7777891-10239) [    x:collection1] o.a.s.u.p.LogUpdateProcessorFactory [collection1]  webapp= path=/update params={wt=javabin&version=2}{add=[18 (1612064091621294080)]} 0 0
   [junit4]   2> 918395 INFO  (qtp394060823-10200) [    x:collection1] o.a.s.u.p.LogUpdateProcessorFactory [collection1]  webapp= path=/update params={wt=javabin&version=2}{add=[19 (1612064091622342656)]} 0 0
   [junit4]   2> 918395 INFO  (qtp2074599002-10220) [    x:collection1] o.a.s.u.p.LogUpdateProcessorFactory [collection1]  webapp= path=/update params={wt=javabin&version=2}{add=[19 (1612064091622342656)]} 0 0
   [junit4]   2> 918395 INFO  (qtp394060823-10199) [    x:collection1] o.a.s.u.p.LogUpdateProcessorFactory [collection1]  webapp= path=/update params={wt=javabin&version=2}{add=[20 (1612064091622342657)]} 0 0
   [junit4]   2> 918396 INFO  (qtp2074599002-10219) [    x:collection1] o.a.s.u.p.LogUpdateProcessorFactory [collection1]  webapp= path=/update params={wt=javabin&version=2}{add=[20 (1612064091623391232)]} 0 0
   [junit4]   2> 918396 INFO  (qtp394060823-10200) [    x:collection1] o.a.s.u.p.LogUpdateProcessorFactory [collection1]  webapp= path=/update params={wt=javabin&version=2}{add=[21 (1612064091623391232)]} 0 0
   [junit4]   2> 918396 INFO  (qtp7777891-10240) [    x:collection1] o.a.s.u.p.LogUpdateProcessorFactory [collection1]  webapp= path=/update params={wt=javabin&version=2}{add=[21 (1612064091623391232)]} 0 0
   [junit4]   2> 918397 INFO  (qtp394060823-10199) [    x:collection1] o.a.s.u.p.LogUpdateProcessorFactory [collection1]  webapp= path=/update params={wt=javabin&version=2}{add=[22 (1612064091623391233)]} 0 0
   [junit4]   2> 918397 INFO  (qtp2074599002-10220) [    x:collection1] o.a.s.u.p.LogUpdateProcessorFactory [collection1]  webapp= path=/update params={wt=javabin&version=2}{add=[22 (1612064091624439808)]} 0 0
   [junit4]   2> 918397 INFO  (qtp394060823-10200) [    x:collection1] o.a.s.u.p.LogUpdateProcessorFactory [collection1]  webapp= path=/update params={wt=javabin&version=2}{add=[23 (1612064091624439808)]} 0 0
   [junit4]   2> 918397 INFO  (qtp7777891-10239) [    x:collection1] o.a.s.u.p.LogUpdateProcessorFactory [collection1]  webapp= path=/update params={wt=javabin&version=2}{add=[23 (1612064091624439808)]} 0 0
   [junit4]   2> 918398 INFO  (qtp394060823-10199) [    x:collection1] o.a.s.u.p.LogUpdateProcessorFactory [collection1]  webapp= path=/update params={wt=javabin&version=2}{add=[24 (1612064091625488384)]} 0 0
   [junit4]   2> 918398 INFO  (qtp2074599002-10219) [    x:collection1] o.a.s.u.p.LogUpdateProcessorFactory [collection1]  webapp= path=/update params={wt=javabin&version=2}{add=[24 (1612064091625488384)]} 0 0
   [junit4]   2> 918399 INFO  (qtp394060823-10200) [    x:collection1] o.a.s.u.p.LogUpdateProcessorFactory [collection1]  webapp= path=/update params={wt=javabin&version=2}{add=[25 (1612064091626536960)]} 0 0
   [junit4]   2> 918399 INFO  (qtp7777891-10240) [    x:collection1] o.a.s.u.p.LogUpdateProcessorFactory [collection1]  webapp= path=/update params={wt=javabin&version=2}{add=[25 (1612064091626536960)]} 0 0
   [junit4]   2> 918399 INFO  (qtp394060823-10199) [    x:collection1] o.a.s.u.p.LogUpdateProcessorFactory [collection1]  webapp= path=/update params={wt=javabin&version=2}{add=[26 (1612064091626536961)]} 0 0
   [junit4]   2> 918400 INFO  (qtp2074599002-10220) [    x:collection1] o.a.s.u.p.LogUpdateProcessorFactory [collection1]  webapp= path=/update params={wt=javabin&version=2}{add=[26 (1612064091627585536)]} 0 0
   [junit4]   2> 918400 INFO  (qtp394060823-10200) [    x:collection1] o.a.s.u.p.LogUpdateProcessorFactory [collection1]  webapp= path=/update params={wt=javabin&version=2}{add=[27 (1612064091627585536)]} 0 0
   [junit4]   2> 918400 INFO  (qtp7777891-10239) [    x:collection1] o.a.s.u.p.LogUpdateProcessorFactory [collection1]  webapp= path=/update params={wt=javabin&version=2}{add=[27 (1612064091627585536)]} 0 0
   [junit4]   2> 918401 INFO  (qtp394060823-10199) [    x:collection1] o.a.s.u.p.LogUpdateProcessorFactory [collection1]  webapp= path=/update params={wt=javabin&version=2}{add=[28 (1612064091628634112)]} 0 0
   [junit4]   2> 918401 INFO  (qtp2074599002-10219) [    x:collection1] o.a.s.u.p.LogUpdateProcessorFactory [collection1]  webapp= path=/update params={wt=javabin&version=2}{add=[28 (1612064091628634112)]} 0 0
   [junit4]   2> 918401 INFO  (qtp394060823-10200) [    x:collection1] o.a.s.u.p.LogUpdateProcessorFactory [collection1]  webapp= path=/update params={wt=javabin&version=2}{add=[29 (1612064091628634113)]} 0 0
   [junit4]   2> 918401 INFO  (qtp7777891-10240) [    x:collection1] o.a.s.u.p.LogUpdateProcessorFactory [collection1]  webapp= path=/update params={wt=javabin&version=2}{add=[29 (1612064091628634112)]} 0 0
   [junit4]   2> 918402 INFO  (qtp394060823-10199) [    x:collection1] o.a.s.u.p.LogUpdateProcessorFactory [collection1]  webapp= path=/update params={wt=javabin&version=2}{add=[30 (1612064091629682688)]} 0 0
   [junit4]   2> 918402 INFO  (qtp7777891-10239) [    x:collection1] o.a.s.u.p.LogUpdateProcessorFactory [collection1]  webapp= path=/update params={wt=javabin&version=2}{add=[30 (1612064091629682688)]} 0 0
   [junit4]   2> 918402 INFO  (qtp394060823-10200) [    x:collection1] o.a.s.u.p.LogUpdateProcessorFactory [collection1]  webapp= path=/update params={wt=javabin&version=2}{add=[31 (1612064091629682689)]} 0 0
   [junit4]   2> 918402 INFO  (qtp2074599002-10220) [    x:collection1] o.a.s.u.p.LogUpdateProcessorFactory [collection1]  webapp= path=/update params={wt=javabin&version=2}{add=[31 (1612064091629682688)]} 0 0
   [junit4]   2> 918403 INFO  (qtp394060823-10199) [    x:collection1] o.a.s.u.p.LogUpdateProcessorFactory [collection1]  webapp= path=/update params={wt=javabin&version=2}{add=[32 (1612064091630731264)]} 0 0
   [junit4]   2> 918403 INFO  (qtp7777891-10240) [    x:collection1] o.a.s.u.p.LogUpdateProcessorFactory [collection1]  webapp= path=/update params={wt=javabin&version=2}{add=[32 (1612064091630731264)]} 0 0
   [junit4]   2> 918403 INFO  (qtp394060823-10200) [    x:collection1] o.a.s.u.p.LogUpdateProcessorFactory [collection1]  webapp= path=/update params={wt=javabin&version=2}{add=[33 (1612064091630731265)]} 0 0
   [junit4]   2> 918404 INFO  (qtp2074599002-10219) [    x:collection1] o.a.s.u.p.LogUpdateProcessorFactory [collection1]  webapp= path=/update params={wt=javabin&version=2}{add=[33 (1612064091631779840)]} 0 0
   [junit4]   2> 918404 INFO  (qtp394060823-10199) [    x:collection1] o.a.s.u.p.LogUpdateProcessorFactory [collection1]  webapp= path=/update params={wt=javabin&version=2}{add=[34 (1612064091631779840)]} 0 0
   [junit4]   2> 918404 INFO  (qtp7777891-10239) [    x:collection1] o.a.s.u.p.LogUpdateProcessorFactory [collection1]  webapp= path=/update params={wt=javabin&version=2}{add=[34 (1612064091631779840)]} 0 0
   [junit4]   2> 918404 INFO  (qtp394060823-10200) [    x:collection1] o.a.s.u.p.LogUpdateProcessorFactory [collection1]  webapp= path=/update params={wt=javabin&version=2}{add=[35 (1612064091631779841)]} 0 0
   [junit4]   2> 918405 INFO  (qtp2074599002-10220) [    x:collection1] o.a.s.u.p.LogUpdateProcessorFactory [collection1]  webapp= path=/update params={wt=javabin&version=2}{add=[35 (1612064091632828416)]} 0 0
   [junit4]   2> 918405 INFO  (qtp394060823-10199) [    x:collection1] o.a.s.u.p.LogUpdateProcessorFactory [collection1]  webapp= path=/update params={wt=javabin&version=2}{add=[36 (1612064091632828416)]} 0 0
   [junit4]   2> 918405 INFO  (qtp7777891-10240) [    x:collection1] o.a.s.u.p.LogUpdateProcessorFactory [collection1]  webapp= path=/update params={wt=javabin&version=2}{add=[36 (1612064091632828416)]} 0 0
   [junit4]   2> 918406 INFO  (qtp394060823-10200) [    x:collection1] o.a.s.u.p.LogUpdateProcessorFactory [collection1]  webapp= path=/update params={wt=javabin&version=2}{add=[37 (1612064091633876992)]} 0 0
   [junit4]   2> 918406 INFO  (qtp2074599002-10219) [    x:collection1] o.a.s.u.p.LogUpdateProcessorFactory [collection1]  webapp= path=/update params={wt=javabin&version=2}{add=[37 (1612064091633876992)]} 0 0
   [junit4]   2> 918406 INFO  (qtp394060823-10199) [    x:collection1] o.a.s.u.p.LogUpdateProcessorFactory [collection1]  webapp= path=/update params={wt=javabin&version=2}{add=[38 (1612064091633876993)]} 0 0
   [junit4]   2> 918406 INFO  (qtp7777891-10239) [    x:collection1] o.a.s.u.p.LogUpdateProcessorFactory [collection1]  webapp= path=/update params={wt=javabin&version=2}{add=[38 (1612064091633876992)]} 0 0
   [junit4]   2> 918407 INFO  (qtp394060823-10200) [    x:collection1] o.a.s.u.p.LogUpdateProcessorFactory [collection1]  webapp= path=/update params={wt=javabin&version=2}{add=[39 (1612064091634925568)]} 0 0
   [junit4]   2> 918407 INFO  (qtp2074599002-10220) [    x:collection1] o.a.s.u.p.LogUpdateProcessorFactory [collection1]  webapp= path=/update params={wt=javabin&version=2}{add=[39 (1612064091634925568)]} 0 0
   [junit4]   2> 918407 INFO  (qtp394060823-10199) [    x:collection1] o.a.s.u.p.LogUpdateProcessorFactory [collection1]  webapp= path=/update params={wt=javabin&version=2}{add=[40 (1612064091634925569)]} 0 0
   [junit4]   2> 918407 INFO  (qtp2074599002-10219) [    x:collection1] o.a.s.u.p.LogUpdateProcessorFactory [collection1]  webapp= path=/update params={wt=javabin&version=2}{add=[40 (1612064091634925569)]} 0 0
   [junit4]   2> 918408 INFO  (qtp394060823-10200) [    x:collection1] o.a.s.u.p.LogUpdateProcessorFactory [collection1]  webapp= path=/update params={wt=javabin&version=2}{add=[41 (1612064091635974144)]} 0 0
   [junit4]   2> 918408 INFO  (qtp7777891-10240) [    x:collection1] o.a.s.u.p.LogUpdateProcessorFactory [collection1]  webapp= path=/update params={wt=javabin&version=2}{add=[41 (1612064091635974144)]} 0 0
   [junit4]   2> 918408 INFO  (qtp394060823-10199) [    x:collection1] o.a.s.u.p.LogUpdateProcessorFactory [collection1]  webapp= path=/update params={wt=javabin&version=2}{add=[42 (1612064091635974145)]} 0 0
   [junit4]   2> 918408 INFO  (qtp2074599002-10220) [    x:collection1] o.a.s.u.p.LogUpdateProcessorFactory [collection1]  webapp= path=/update params={wt=javabin&version=2}{add=[42 (1612064091635974144)]} 0 0
   [junit4]   2> 918409 INFO  (qtp394060823-10200) [    x:collection1] o.a.s.u.p.LogUpdateProcessorFactory [collection1]  webapp= path=/update params={wt=javabin&version=2}{add=[43 (1612064091635974146)]} 0 0
   [junit4]   2> 918409 INFO  (qtp7777891-10239) [    x:collection1] o.a.s.u.p.LogUpdateProcessorFactory [collection1]  webapp= path=/update params={wt=javabin&version=2}{add=[43 (1612064091637022720)]} 0 0
   [junit4]   2> 918409 INFO  (qtp394060823-10199) [    x:collection1] o.a.s.u.p.LogUpdateProcessorFactory [collection1]  webapp= path=/update params={wt=javabin&version=2}{add=[44 (1612064091637022720)]} 0 0
   [junit4]   2> 918409 INFO  (qtp2074599002-10219) [    x:collection1] o.a.s.u.p.LogUpdateProcessorFactory [collection1]  webapp= path=/update params={wt=javabin&version=2}{add=[44 (1612064091637022720)]} 0 0
   [junit4]   2> 918409 INFO  (qtp394060823-10200) [    x:collection1] o.a.s.u.p.LogUpdateProcessorFactory [collection1]  webapp= path=/update params={wt=javabin&version=2}{add=[45 (1612064091637022721)]} 0 0
   [junit4]   2> 918410 INFO  (qtp7777891-10240) [    x:collection1] o.a.s.u.p.LogUpdateProcessorFactory [collection1]  webapp= path=/update params={wt=javabin&version=2}{add=[45 (1612064091638071296)]} 0 0
   [junit4]   2> 918410 INFO  (qtp394060823-10199) [    x:collection1] o.a.s.u.p.LogUpdateProcessorFactory [collection1]  webapp= path=/update params={wt=javabin&version=2}{add=[46 (1612064091638071296)]} 0 0
   [junit4]   2> 918410 INFO  (qtp2074599002-10220) [    x:collection1] o.a.s.u.p.LogUpdateProcessorFactory [collection1]  webapp= path=/update params={wt=javabin&version=2}{add=[46 (1612064091638071296)]} 0 0
   [junit4]   2> 918410 INFO  (qtp394060823-10200) [    x:collection1] o.a.s.u.p.LogUpdateProcessorFactory [collection1]  webapp= path=/update params={wt=javabin&version=2}{add=[47 (1612064091638071297)]} 0 0
   [junit4]   2> 918411 INFO  (qtp7777891-10239) [    x:collection1] o.a.s.u.p.LogUpdateProcessorFactory [collection1]  webapp= path=/update params={wt=javabin&version=2}{add=[47 (1612064091638071297)]} 0 0
   [junit4]   2> 918411 INFO  (qtp394060823-10199) [    x:collection1] o.a.s.u.p.LogUpdateProcessorFactory [collection1]  webapp= path=/update params={wt=javabin&version=2}{add=[48 (1612064091639119872)]} 0 0
   [junit4]   2> 918411 INFO  (qtp2074599002-10219) [    x:collection1] o.a.s.u.p.LogUpdateProcessorFactory [collection1]  webapp= path=/update params={wt=javabin&version=2}{add=[48 (1612064091639119872)]} 0 0
   [junit4]   2> 918411 INFO  (qtp394060823-10200) [    x:collection1] o.a.s.u.p.LogUpdateProcessorFactory [collection1]  webapp= path=/update params={wt=javabin&version=2}{add=[49 (1612064091639119873)]} 0 0
   [junit4]   2> 918411 INFO  (qtp7777891-10240) [    x:collection1] o.a.s.u.p.LogUpdateProcessorFactory [collection1]  webapp= path=/update params={wt=javabin&version=2}{add=[49 (1612064091639119872)]} 0 0
   [junit4]   2> 918412 INFO  (qtp394060823-10199) [    x:collection1] o.a.s.u.p.LogUpdateProcessorFactory [collection1]  webapp= path=/update params={wt=javabin&version=2}{add=[50 (1612064091640168448)]} 0 0
   [junit4]   2> 918412 INFO  (qtp7777891-10239) [    x:collection1] o.a.s.u.p.LogUpdateProcessorFactory [collection1]  webapp= path=/update params={wt=javabin&version=2}{add=[50 (1612064091640168448)]} 0 0
   [junit4]   2> 918412 INFO  (qtp394060823-10200) [    x:collection1] o.a.s.u.p.LogUpdateProcessorFactory [collection1]  webapp= path=/update params={wt=javabin&version=2}{add=[51 (1612064091640168449)]} 0 0
   [junit4]   2> 918412 INFO  (qtp2074599002-10220) [    x:collection1] o.a.s.u.p.LogUpdateProcessorFactory [collection1]  webapp= path=/update params={wt=javabin&version=2}{add=[51 (1612064091640168448)]} 0 0
   [junit4]   2> 918413 INFO  (qtp394060823-10199) [    x:collection1] o.a.s.u.p.LogUpdateProcessorFactory [collection1]  webapp= path=/update params={wt=javabin&version=2}{add=[52 (1612064091641217024)]} 0 0
   [junit4]   2> 918413 INFO  (qtp7777891-10240) [    x:collection1] o.a.s.u.p.LogUpdateProcessorFactory [collection1]  webapp= path=/update params={wt=javabin&version=2}{add=[52 (1612064091641217024)]} 0 0
   [junit4]   2> 918413 INFO  (qtp394060823-10200) [    x:collection1] o.a.s.u.p.LogUpdateProcessorFactory [collection1]  webapp= path=/update params={wt=javabin&version=2}{add=[53 (1612064091641217025)]} 0 0
   [junit4]   2> 918413 INFO  (qtp2074599002-10219) [    x:collection1] o.a.s.u.p.LogUpdateProcessorFactory [collection1]  webapp= path=/update params={wt=javabin&version=2}{add=[53 (1612064091641217024)]} 0 0
   [junit4]   2> 918414 INFO  (qtp394060823-10199) [    x:collection1] o.a.s.u.p.LogUpdateProcessorFactory [collection1]  webapp= path=/update params={wt=javabin&version=2}{add=[54 (1612064091642265600)]} 0 0
   [junit4]   2> 918414 INFO  (qtp7777891-10239) [    x:collection1] o.a.s.u.p.LogUpdateProcessorFactory [collection1]  webapp= path=/update params={wt=javabin&version=2}{add=[54 (1612064091642265600)]} 0 0
   [junit4]   2> 918414 INFO  (qtp394060823-10200) [    x:collection1] o.a.s.u.p.LogUpdateProcessorFactory [collection1]  webapp= path=/update params={wt=javabin&version=2}{add=[55 (1612064091642265601)]} 0 0
   [junit4]   2> 918414 INFO  (qtp2074599002-10220) [    x:collection1] o.a.s.u.p.LogUpdateProcessorFactory [collection1]  webapp= path=/update params={wt=javabin&version=2}{add=[55 (1612064091642265600)]} 0 0
   [junit4]   2> 918415 INFO  (qtp394060823-10199) [    x:collection1] o.a.s.u.p.LogUpdateProcessorFactory [collection1]  webapp= path=/update params={wt=javabin&version=2}{add=[56 (1612064091643314176)]} 0 0
   [junit4]   2> 918415 INFO  (qtp7777891-10240) [    x:collection1] o.a.s.u.p.LogUpdateProcessorFactory [collection1]  webapp= path=/update params={wt=javabin&version=2}{add=[56 (1612064091643314176)]} 0 0
   [junit4]   2> 918415 INFO  (qtp394060823-10200) [    x:collection1] o.a.s.u.p.LogUpdateProcessorFactory [collection1]  webapp= path=/update params={wt=javabin&version=2}{add=[57 (1612064091643314177)]} 0 0
   [junit4]   2> 918415 INFO  (qtp2074599002-10219) [    x:collection1] o.a.s.u.p.LogUpdateProcessorFactory [collection1]  webapp= path=/update params={wt=javabin&version=2}{add=[57 (1612064091643314176)]} 0 0
   [junit4]   2> 918416 INFO  (qtp394060823-10199) [    x:collection1] o.a.s.u.p.LogUpdateProcessorFactory [collection1]  webapp= path=/update params={wt=javabin&version=2}{add=[58 (1612064091644362752)]} 0 0
   [junit4]   2> 918416 INFO  (qtp7777891-10239) [    x:collection1] o.a.s.u.p.LogUpdateProcessorFactory [collection1]  webapp= path=/update params={wt=javabin&version=2}{add=[58 (1612064091644362752)]} 0 0
   [junit4]   2> 918416 INFO  (qtp394060823-10200) [    x:collection1] o.a.s.u.p.LogUpdateProcessorFactory [collection1]  webapp= path=/update params={wt=javabin&version=2}{add=[59 (1612064091644362753)]} 0 0
   [junit4]   2> 918416 INFO  (qtp2074599002-10220) [    x:collection1] o.a.s.u.p.LogUpdateProcessorFactory [collection1]  webapp= path=/update params={wt=javabin&version=2}{add=[59 (1612064091644362752)]} 0 0
   [junit4]   2> 918417 INFO  (qtp394060823-10199) [    x:collection1] o.a.s.u.p.LogUpdateProcessorFactory [collection1]  webapp= path=/update params={wt=javabin&version=2}{add=[60 (1612064091645411328)]} 0 0
   [junit4]   2> 918417 INFO  (qtp2074599002-10219) [    x:collection1] o.a.s.u.p.LogUpdateProcessorFactory [collection1]  webapp= path=/update params={wt=javabin&version=2}{add=[60 (1612064091645411328)]} 0 0
   [junit4]   2> 918417 INFO  (qtp394060823-10200) [    x:collection1] o.a.s.u.p.LogUpdateProcessorFactory [collection1]  webapp= path=/update params={wt=javabin&version=2}{add=[61 (1612064091645411329)]} 0 0
   [junit4]   2> 918417 INFO  (qtp7777891-10240) [    x:collection1] o.a.s.u.p.LogUpdateProcessorFactory [collection1]  webapp= path=/update params={wt=javabin&version=2}{add=[61 (1612064091645411328)]} 0 0
   [junit4]   2> 918418 INFO  (qtp394060823-10199) [    x:collection1] o.a.s.u.p.LogUpdateProcessorFactory [collection1]  webapp= path=/update params={wt=javabin&version=2}{add=[62 (1612064091646459904)]} 0 0
   [junit4]   2> 918418 INFO  (qtp2074599002-10220) [    x:collection1] o.a.s.u.p.LogUpdateProcessorFactory [collection1]  webapp= path=/update params={wt=javabin&version=2}{add=[62 (1612064091646459904)]} 0 0
   [junit4]   2> 918418 INFO  (qtp394060823-10200) [    x:collection1] o.a.s.u.p.LogUpdateProcessorFactory [collection1]  webapp= path=/update params={wt=javabin&version=2}{add=[63 (1612064091646459905)]} 0 0
   [junit4]   2> 918418 INFO  (qtp7777891-10239) [    x:collection1] o.a.s.u.p.LogUpdateProcessorFactory [collection1]  webapp= path=/update params={wt=javabin&version=2}{add=[63 (1612064091646459904)]} 0 0
   [junit4]   2> 918419 INFO  (qtp394060823-10199) [    x:collection1] o.a.s.u.p.LogUpdateProcessorFactory [collection1]  webapp= path=/update params={wt=javabin&version=2}{add=[64 (1612064091647508480)]} 0 0
   [junit4]   2> 918419 INFO  (qtp2074599002-10219) [    x:collection1] o.a.s.u.p.LogUpdateProcessorFactory [collection1]  webapp= path=/update params={wt=javabin&version=2}{add=[64 (1612064091647508480)]} 0 0
   [junit4]   2> 918419 INFO  (qtp394060823-10200) [    x:collection1] o.a.s.u.p.LogUpdateProcessorFactory [collection1]  webapp= path=/update params={wt=javabin&version=2}{add=[65 (1612064091647508481)]} 0 0
   [junit4]   2> 918419 INFO  (qtp7777891-10240) [    x:collection1] o.a.s.u.p.LogUpdateProcessorFactory [collection1]  webapp= path=/update params={wt=javabin&version=2}{add=[65 (1612064091647508480)]} 0 0
   [junit4]   2> 918420 INFO  (qtp394060823-10199) [    x:collection1] o.a.s.u.p.LogUpdateProcessorFactory [collection1]  webapp= path=/update params={wt=javabin&version=2}{add=[66 (1612064091648557056)]} 0 0
   [junit4]   2> 918420 INFO  (qtp2074599002-10220) [    x:collection1] o.a.s.u.p.LogUpdateProcessorFactory [collection1]  webapp= path=/update params={wt=javabin&version=2}{add=[66 (1612064091648557056)]} 0 0
   [junit4]   2> 918420 INFO  (qtp394060823-10200) [    x:collection1] o.a.s.u.p.LogUpdateProcessorFactory [collection1]  webapp= path=/update params={wt=javabin&version=2}{add=[67 (1612064091648557057)]} 0 0
   [junit4]   2> 918420 INFO  (qtp7777891-10239) [    x:collection1] o.a.s.u.p.LogUpdateProcessorFactory [collection1]  webapp= path=/update params={wt=javabin&version=2}{add=[67 (1612064091648557056)]} 0 0
   [junit4]   2> 918420 INFO  (qtp394060823-10199) [    x:collection1] o.a.s.u.p.LogUpdateProcessorFactory [collection1]  webapp= path=/update params={wt=javabin&version=2}{add=[68 (1612064091648557058)]} 0 0
   [junit4]   2> 918421 INFO  (qtp2074599002-10219) [    x:collection1] o.a.s.u.p.LogUpdateProcessorFactory [collection1]  webapp= path=/update params={wt=javabin&version=2}{add=[68 (1612064091649605632)]} 0 0
   [junit4]   2> 918421 INFO  (qtp394060823-10200) [    x:collection1] o.a.s.u.p.LogUpdateProcessorFactory [collection1]  webapp= path=/update params={wt=javabin&version=2}{add=[69 (1612064091649605632)]} 0 0
   [junit4]   2> 918421 INFO  (qtp7777891-10240) [    x:collection1] o.a.s.u.p.LogUpdateProcessorFactory [collection1]  webapp= path=/update params={wt=javabin&version=2}{add=[69 (1612064091649605632)]} 0 0
   [junit4]   2> 918421 INFO  (qtp394060823-10199) [    x:collection1] o.a.s.u.p.LogUpdateProcessorFactory [collection1]  webapp= path=/update params={wt=javabin&version=2}{add=[70 (1612064091649605633)]} 0 0
   [junit4]   2> 918422 INFO  (qtp7777891-10239) [    x:collection1] o.a.s.u.p.LogUpdateProcessorFactory [collection1]  webapp= path=/update params={wt=javabin&version=2}{add=[70 (1612064091650654208)]} 0 0
   [junit4]   2> 918422 INFO  (qtp394060823-10200) [    x:collection1] o.a.s.u.p.LogUpdateProcessorFactory [collection1]  webapp= path=/update params={wt=javabin&version=2}{add=[71 (1612064091650654208)]} 0 0
   [junit4]   2> 918422 INFO  (qtp2074599002-10220) [    x:collection1] o.a.s.u.p.LogUpdateProcessorFactory [collection1]  webapp= path=/update params={wt=javabin&version=2}{add=[71 (1612064091650654208)]} 0 0
   [junit4]   2> 918422 INFO  (qtp394060823-10199) [    x:collection1] o.a.s.u.p.LogUpdateProcessorFactory [collection1]  webapp= path=/update params={wt=javabin&version=2}{add=[72 (1612064091650654209)]} 0 0
   [junit4]   2> 918422 INFO  (qtp7777891-10240) [    x:collection1] o.a.s.u.p.LogUpdateProcessorFactory [collection1]  webapp= path=/update params={wt=javabin&version=2}{add=[72 (1612064091650654209)]} 0 0
   [junit4]   2> 918423 INFO  (qtp394060823-10200) [    x:collection1] o.a.s.u.p.LogUpdateProcessorFactory [collection1]  webapp= path=/update params={wt=javabin&version=2}{add=[73 (1612064091651702784)]} 0 0
   [junit4]   2> 918423 INFO  (qtp2074599002-10219) [    x:collection1] o.a.s.u.p.LogUpdateProcessorFactory [collection1]  webapp= path=/update params={wt=javabin&version=2}{add=[73 (1612064091651702784)]} 0 0
   [junit4]   2> 918423 INFO  (qtp394060823-10199) [    x:collection1] o.a.s.u.p.LogUpdateProcessorFactory [collection1]  webapp= path=/update params={wt=javabin&version=2}{add=[74 (1612064091651702785)]} 0 0
   [junit4]   2> 918423 INFO  (qtp7777891-10239) [    x:collection1] o.a.s.u.p.LogUpdateProcessorFactory [collection1]  webapp= path=/update params={wt=javabin&version=2}{add=[74 (1612064091651702784)]} 0 0
   [junit4]   2> 918423 INFO  (qtp394060823-10200) [    x:collection1] o.a.s.u.p.LogUpdateProcessorFactory [collection1]  webapp= path=/update params={wt=javabin&version=2}{add=[75 (1612064091651702786)]} 0 0
   [junit4]   2> 918423 INFO  (qtp2074599002-10220) [    x:collection1] o.a.s.u.p.LogUpdateProcessorFactory [collection1]  webapp= path=/update params={wt=javabin&version=2}{add=[75 (1612064091651702785)]} 0 0
   [junit4]   2> 918424 INFO  (qtp394060823-10199) [    x:collection1] o.a.s.u.p.LogUpdateProcessorFactory [collection1]  webapp= path=/update params={wt=javabin&version=2}{add=[76 (1612064091652751360)]} 0 0
   [junit4]   2> 918424 INFO  (qtp7777891-10240) [    x:collection1] o.a.s.u.p.LogUpdateProcessorFactory [collection1]  webapp= path=/update params={wt=javabin&version=2}{add=[76 (1612064091652751360)]} 0 0
   [junit4]   2> 918424 INFO  (qtp394060823-10200) [    x:collection1] o.a.s.u.p.LogUpdateProcessorFactory [collection1]  webapp= path=/update params={wt=javabin&version=2}{add=[77 (1612064091652751361)]} 0 0
   [junit4]   2> 918424 INFO  (qtp2074599002-10219) [    x:collection1] o.a.s.u.p.LogUpdateProcessorFactory [collection1]  webapp= path=/update params={wt=javabin&version=2}{add=[77 (1612064091652751360)]} 0 0
   [junit4]   2> 918424 INFO  (qtp394060823-10199) [    x:collection1] o.a.s.u.p.LogUpdateProcessorFactory [collection1]  webapp= path=/update params={wt=javabin&version=2}{add=[78 (1612064091652751362)]} 0 0
   [junit4]   2> 918425 INFO  (qtp7777891-10239) [    x:collection1] o.a.s.u.p.LogUpdateProcessorFactory [collection1]  webapp= path=/update params={wt=javabin&version=2}{add=[78 (1612064091653799936)]} 0 0
   [junit4]   2> 918425 INFO  (qtp394060823-10200) [    x:collection1] o.a.s.u.p.LogUpdateProcessorFactory [collection1]  webapp= path=/update params={wt=javabin&version=2}{add=[79 (1612064091653799936)]} 0 0
   [junit4]   2> 918425 INFO  (qtp2074599002-10220) [    x:collection1] o.a.s.u.p.LogUpdateProcessorFactory [collection1]  webapp= path=/update params={wt=javabin&version=2}{add=[79 (1612064091653799936)]} 0 0
   [junit4]   2> 918425 INFO  (qtp394060823-10199) [    x:collection1] o.a.s.u.p.LogUpdateProcessorFactory [collection1]  webapp= path=/update params={wt=javabin&version=2}{add=[80 (1612064091653799937)]} 0 0
   [junit4]   2> 918425 INFO  (qtp2074599002-10219) [    x:collection1] o.a.s.u.p.LogUpdateProcessorFactory [collection1]  webapp= path=/update params={wt=javabin&version=2}{add=[80 (1612064091653799937)]} 0 0
   [junit4]   2> 918426 INFO  (qtp394060823-10200) [    x:collection1] o.a.s.u.p.LogUpdateProcessorFactory [collection1]  webapp= path=/update params={wt=javabin&version=2}{add=[81 (1612064091654848512)]} 0 0
   [junit4]   2> 918426 INFO  (qtp7777891-10240) [    x:collection1] o.a.s.u.p.LogUpdateProcessorFactory [collection1]  webapp= path=/update params={wt=javabin&version=2}{add=[81 (1612064091654848512)]} 0 0
   [junit4]   2> 918426 INFO  (qtp394060823-10199) [    x:collection1] o.a.s.u.p.LogUpdateProcessorFactory [collection1]  webapp= path=/update params={wt=javabin&version=2}{add=[82 (1612064091654848513)]} 0 0
   [junit4]   2> 918426 INFO  (qtp2074599002-10220) [    x:collection1] o.a.s.u.p.LogUpdateProcessorFactory [collection1]  webapp= path=/update params={wt=javabin&version=2}{add=[82 (1612064091654848512)]} 0 0
   [junit4]   2> 918427 INFO  (qtp394060823-10200) [    x:collection1] o.a.s.u.p.LogUpdateProcessorFactory [collection1]  webapp= path=/update params={wt=javabin&version=2}{add=[83 (1612064091655897088)]} 0 0
   [junit4]   2> 918427 INFO  (qtp7777891-10239) [    x:collection1] o.a.s.u.p.LogUpdateProcessorFactory [collection1]  webapp= path=/update params={wt=javabin&version=2}{add=[83 (1612064091655897088)]} 0 0
   [junit4]   2> 918427 INFO  (qtp394060823-10199) [    x:collection1] o.a.s.u.p.LogUpdateProcessorFactory [collection1]  webapp= path=/update params={wt=javabin&version=2}{add=[84 (1612064091655897089)]} 0 0
   [junit4]   2> 918427 INFO  (qtp2074599002-10219) [    x:collection1] o.a.s.u.p.LogUpdateProcessorFactory [collection1]  webapp= path=/update params={wt=javabin&version=2}{add=[84 (1612064091655897088)]} 0 0
   [junit4]   2> 918427 INFO  (qtp394060823-10200) [    x:collection1] o.a.s.u.p.LogUpdateProcessorFactory [collection1]  webapp= path=/update params={wt=javabin&version=2}{add=[85 (1612064091655897090)]} 0 0
   [junit4]   2> 918428 INFO  (qtp7777891-10240) [    x:collection1] o.a.s.u.p.LogUpdateProcessorFactory [collection1]  webapp= path=/update params={wt=javabin&version=2}{add=[85 (1612064091655897089)]} 0 0
   [junit4]   2> 918428 INFO  (qtp394060823-10199) [    x:collection1] o.a.s.u.p.LogUpdateProcessorFactory [collection1]  webapp= path=/update params={wt=javabin&version=2}{add=[86 (1612064091656945664)]} 0 0
   [junit4]   2> 918428 INFO  (qtp2074599002-10220) [    x:collection1] o.a.s.u.p.LogUpdateProcessorFactory [collection1]  webapp= path=/update params={wt=javabin&version=2}{add=[86 (1612064091656945664)]} 0 0
   [junit4]   2> 918428 INFO  (qtp394060823-10200) [    x:collection1] o.a.s.u.p.LogUpdateProcessorFactory [collection1]  webapp= path=/update params={wt=javabin&version=2}{add=[87 (1612064091656945665)]} 0 0
   [junit4]   2> 918428 INFO  (qtp7777891-10239) [    x:collection1] o.a.s.u.p.LogUpdateProcessorFactory [collection1]  webapp= path=/update params={wt=javabin&version=2}{add=[87 (1612064091656945664)]} 0 0
   [junit4]   2> 918429 INFO  (qtp394060823-10199) [    x:collection1] o.a.s.u.p.LogUpdateProcessorFactory [collection1]  webapp= path=/update params={wt=javabin&version=2}{add=[88 (1612064091657994240)]} 0 0
   [junit4]   2> 918429 INFO  (qtp2074599002-10219) [    x:collection1] o.a.s.u.p.LogUpdateProcessorFactory [collection1]  webapp= path=/update params={wt=javabin&version=2}{add=[88 (1612064091657994240)]} 0 0
   [junit4]   2> 918429 INFO  (qtp394060823-10200) [    x:collection1] o.a.s.u.p.LogUpdateProcessorFactory [collection1]  webapp= path=/update params={wt=javabin&version=2}{add=[89 (1612064091657994241)]} 0 0
   [junit4]   2> 918429 INFO  (qtp7777891-10240) [    x:collection1] o.a.s.u.p.LogUpdateProcessorFactory [collection1]  webapp= path=/update params={wt=javabin&version=2}{add=[89 (1612064091657994240)]} 0 0
   [junit4]   2> 918429 INFO  (qtp394060823-10199) [    x:collection1] o.a.s.u.p.LogUpdateProcessorFactory [collection1]  webapp= path=/update params={wt=javabin&version=2}{add=[90 (1612064091657994242)]} 0 0
   [junit4]   2> 918430 INFO  (qtp7777891-10239) [    x:collection1] o.a.s.u.p.LogUpdateProcessorFactory [collection1]  webapp= path=/update params={wt=javabin&version=2}{add=[90 (1612064091659042816)]} 0 0
   [junit4]   2> 918430 INFO  (qtp394060823-10200) [    x:collection1] o.a.s.u.p.LogUpdateProcessorFactory [collection1]  webapp= path=/update params={wt=javabin&version=2}{add=[91 (1612064091659042816)]} 0 0
   [junit4]   2> 918430 INFO  (qtp2074599002-10220) [    x:collection1] o.a.s.u.p.LogUpdateProcessorFactory [collection1]  webapp= path=/update params={wt=javabin&version=2}{add=[91 (1612064091659042816)]} 0 0
   [junit4]   2> 918430 INFO  (qtp394060823-10199) [    x:collection1] o.a.s.u.p.LogUpdateProcessorFactory [collection1]  webapp= path=/update params={wt=javabin&version=2}{add=[92 (1612064091659042817)]} 0 0
   [junit4]   2> 918431 INFO  (qtp7777891-10240) [    x:collection1] o.a.s.u.p.LogUpdateProcessorFactory [collection1]  webapp= path=/update params={wt=javabin&version=2}{add=[92 (1612064091660091392)]} 0 0
   [junit4]   2> 918431 INFO  (qtp394060823-10200) [    x:collection1] o.a.s.u.p.LogUpdateProcessorFactory [collection1]  webapp= path=/update params={wt=javabin&version=2}{add=[93 (1612064091660091392)]} 0 0
   [junit4]   2> 918431 INFO  (qtp2074599002-10219) [    x:collection1] o.a.s.u.p.LogUpdateProcessorFactory [collection1]  webapp= path=/update params={wt=javabin&version=2}{add=[93 (1612064091660091392)]} 0 0
   [junit4]   2> 918431 INFO  (qtp394060823-10199) [    x:collection1] o.a.s.u.p.LogUpdateProcessorFactory [collection1]  webapp= path=/update params={wt=javabin&version=2}{add=[94 (1612064091660091393)]} 0 0
   [junit4]   2> 918431 INFO  (qtp7777891-10239) [    x:collection1] o.a.s.u.p.LogUpdateProcessorFactory [collection1]  webapp= path=/update params={wt=javabin&version=2}{add=[94 (1612064091660091393)]} 0 0
   [junit4]   2> 918431 INFO  (qtp394060823-10200) [    x:collection1] o.a.s.u.p.LogUpdateProcessorFactory [collection1]  webapp= path=/update params={wt=javabin&version=2}{add=[95 (1612064091660091394)]} 0 0
   [junit4]   2> 918432 INFO  (qtp2074599002-10220) [    x:collection1] o.a.s.u.p.LogUpdateProcessorFactory [collection1]  webapp= path=/update params={wt=javabin&version=2}{add=[95 (1612064091661139968)]} 0 0
   [junit4]   2> 918432 INFO  (qtp394060823-10199) [    x:collection1] o.a.s.u.p.LogUpdateProcessorFactory [collection1]  webapp= path=/update params={wt=javabin&version=2}{add=[96 (1612064091661139968)]} 0 0
   [junit4]   2> 918432 INFO  (qtp7777891-10240) [    x:collection1] o.a.s.u.p.LogUpdateProcessorFactory [collection1]  webapp= path

[...truncated too long message...]

reporter [org.apache.solr.metrics.reporters.SolrJmxReporter@30017e7e: rootName = solr_38329, domain = solr.jvm, service url = null, agent id = null] for registry solr.jvm / com.codahale.metrics.MetricRegistry@6c79d655
   [junit4]   2> 1426040 INFO  (jetty-closer-7424-thread-1) [    ] o.a.s.m.SolrMetricManager Closing metric reporters for registry=solr.jetty, tag=null
   [junit4]   2> 1426040 INFO  (jetty-closer-7424-thread-1) [    ] o.a.s.m.r.SolrJmxReporter Closing reporter [org.apache.solr.metrics.reporters.SolrJmxReporter@65356b88: rootName = solr_38329, domain = solr.jetty, service url = null, agent id = null] for registry solr.jetty / com.codahale.metrics.MetricRegistry@7b49e1d8
   [junit4]   2> 1426041 INFO  (jetty-closer-7424-thread-1) [    ] o.a.s.c.ZkController Remove node as live in ZooKeeper:/live_nodes/127.0.0.1:38329_solr
   [junit4]   2> 1426041 INFO  (jetty-closer-7424-thread-1) [    ] o.a.s.m.SolrMetricManager Closing metric reporters for registry=solr.cluster, tag=null
   [junit4]   2> 1426041 INFO  (jetty-closer-7424-thread-1) [    ] o.a.s.c.TransientSolrCoreCacheDefault Allocating transient cache for 2147483647 transient cores
   [junit4]   2> 1426041 INFO  (zkCallback-7440-thread-1) [    ] o.a.s.c.c.ZkStateReader Updated live nodes from ZooKeeper... (1) -> (0)
   [junit4]   2> 1426041 INFO  (zkCallback-7433-thread-1) [    ] o.a.s.c.c.ZkStateReader Updated live nodes from ZooKeeper... (1) -> (0)
   [junit4]   2> 1426041 INFO  (jetty-closer-7424-thread-1) [    ] o.a.s.c.Overseer Overseer (id=72252910757216259-127.0.0.1:38329_solr-n_0000000000) closing
   [junit4]   2> 1426041 INFO  (OverseerStateUpdate-72252910757216259-127.0.0.1:38329_solr-n_0000000000) [n:127.0.0.1:38329_solr    ] o.a.s.c.Overseer Overseer Loop exiting : 127.0.0.1:38329_solr
   [junit4]   2> 1426041 WARN  (OverseerAutoScalingTriggerThread-72252910757216259-127.0.0.1:38329_solr-n_0000000000) [    ] o.a.s.c.a.OverseerTriggerThread OverseerTriggerThread woken up but we are closed, exiting.
   [junit4]   2> 1426042 DEBUG (jetty-closer-7424-thread-1) [    ] o.a.s.c.a.ScheduledTriggers Shutting down scheduled thread pool executor now
   [junit4]   2> 1426042 DEBUG (jetty-closer-7424-thread-1) [    ] o.a.s.c.a.ScheduledTriggers Shutting down action executor now
   [junit4]   2> 1426042 DEBUG (jetty-closer-7424-thread-1) [    ] o.a.s.c.a.ScheduledTriggers Awaiting termination for action executor
   [junit4]   2> 1426042 DEBUG (jetty-closer-7424-thread-1) [    ] o.a.s.c.a.ScheduledTriggers Awaiting termination for scheduled thread pool executor
   [junit4]   2> 1426042 DEBUG (jetty-closer-7424-thread-1) [    ] o.a.s.c.a.ScheduledTriggers ScheduledTriggers closed completely
   [junit4]   2> 1426042 DEBUG (jetty-closer-7424-thread-1) [    ] o.a.s.c.a.OverseerTriggerThread OverseerTriggerThread has been closed explicitly
   [junit4]   2> 1426042 INFO  (jetty-closer-7424-thread-1) [    ] o.e.j.s.h.ContextHandler Stopped o.e.j.s.ServletContextHandler@39d9bf9d{/solr,null,UNAVAILABLE}
   [junit4]   2> 1426042 INFO  (jetty-closer-7424-thread-1) [    ] o.e.j.s.session node0 Stopped scavenging
   [junit4]   2> 1426043 ERROR (SUITE-ScheduledTriggerTest-seed#[A64108481CFDC09C]-worker) [    ] o.a.z.s.ZooKeeperServer ZKShutdownHandler is not registered, so ZooKeeper server won't take any action on ERROR or SHUTDOWN server state changes
   [junit4]   2> 1426043 INFO  (SUITE-ScheduledTriggerTest-seed#[A64108481CFDC09C]-worker) [    ] o.a.s.c.ZkTestServer connecting to 127.0.0.1:41729 41729
   [junit4]   2> 1426167 INFO  (Thread-3737) [    ] o.a.s.c.ZkTestServer connecting to 127.0.0.1:41729 41729
   [junit4]   2> 1426167 WARN  (Thread-3737) [    ] o.a.s.c.ZkTestServer Watch limit violations: 
   [junit4]   2> Maximum concurrent create/delete watches above limit:
   [junit4]   2> 
   [junit4]   2> 	3	/solr/aliases.json
   [junit4]   2> 	3	/solr/clusterprops.json
   [junit4]   2> 
   [junit4]   2> Maximum concurrent data watches above limit:
   [junit4]   2> 
   [junit4]   2> 	3	/solr/clusterstate.json
   [junit4]   2> 
   [junit4]   2> Maximum concurrent children watches above limit:
   [junit4]   2> 
   [junit4]   2> 	3	/solr/live_nodes
   [junit4]   2> 	3	/solr/collections
   [junit4]   2> 
   [junit4]   2> NOTE: leaving temporary files on disk at: /home/jenkins/workspace/Lucene-Solr-master-Linux/solr/build/solr-core/test/J2/temp/solr.cloud.autoscaling.ScheduledTriggerTest_A64108481CFDC09C-001
   [junit4]   2> Sep 19, 2018 7:17:08 PM com.carrotsearch.randomizedtesting.ThreadLeakControl checkThreadLeaks
   [junit4]   2> WARNING: Will linger awaiting termination of 1 leaked thread(s).
   [junit4]   2> NOTE: test params are: codec=Asserting(Lucene80): {}, docValues:{}, maxPointsInLeafNode=915, maxMBSortInHeap=5.966054780489871, sim=Asserting(org.apache.lucene.search.similarities.AssertingSimilarity@715efce0), locale=ha-NE, timezone=ECT
   [junit4]   2> NOTE: Linux 4.15.0-32-generic amd64/Oracle Corporation 10.0.1 (64-bit)/cpus=8,threads=1,free=187940168,total=530579456
   [junit4]   2> NOTE: All tests run in this JVM: [MetricsHistoryIntegrationTest, CoreAdminRequestStatusTest, DeleteReplicaTest, TestCloudRecovery, DistributedFacetPivotSmallAdvancedTest, DistributedTermsComponentTest, MetricTriggerTest, SolrCloudExampleTest, SpellCheckComponentTest, TestFastOutputStream, TestScoreJoinQPNoScore, TaggingAttributeTest, SoftAutoCommitTest, TestCSVResponseWriter, TestCollectionAPIs, NumericFieldsTest, TestSystemIdResolver, TestNamedUpdateProcessors, TriggerEventQueueTest, TestJoin, TestPostingsSolrHighlighter, TestStressLucene, TestAnalyzedSuggestions, TestSubQueryTransformerDistrib, CloneFieldUpdateProcessorFactoryTest, TestEmbeddedSolrServerAdminHandler, RestoreTriggerStateTest, TestSolrDeletionPolicy2, TestCollectionAPI, ChangedSchemaMergeTest, TestStressLiveNodes, LeaderElectionTest, ConvertedLegacyTest, DistributedMLTComponentTest, ClassificationUpdateProcessorFactoryTest, CacheHeaderTest, TestReplicationHandler, TestManagedStopFilterFactory, SolrCoreMetricManagerTest, TestWriterPerf, BitVectorTest, TestSortByMinMaxFunction, TermsComponentTest, HttpPartitionOnCommitTest, RequiredFieldsTest, TestCodecSupport, TestDocTermOrds, CdcrBidirectionalTest, StatsReloadRaceTest, CdcrReplicationHandlerTest, DateFieldTest, TestImpersonationWithHadoopAuth, HdfsNNFailoverTest, TestAuthenticationFramework, ZkStateWriterTest, TestRestManager, TestUseDocValuesAsStored, TestCloudInspectUtil, XsltUpdateRequestHandlerTest, SharedFSAutoReplicaFailoverTest, V2ApiIntegrationTest, AddSchemaFieldsUpdateProcessorFactoryTest, SpatialHeatmapFacetsTest, PrimUtilsTest, LIRRollingUpdatesTest, ClusterStateUpdateTest, AnalyticsMergeStrategyTest, TestComplexPhraseLeadingWildcard, TestSolrConfigHandlerCloud, TestHttpShardHandlerFactory, AsyncCallRequestStatusResponseTest, DistributedQueueTest, ZkControllerTest, TestCustomStream, CollectionsAPIDistributedZkTest, ComputePlanActionTest, BasicZkTest, SuggesterTest, TestCloudSchemaless, TestHashPartitioner, TestSweetSpotSimilarityFactory, TestDynamicFieldCollectionResource, RegexBoostProcessorTest, MoveReplicaHDFSFailoverTest, OverseerModifyCollectionTest, TestRemoteStreaming, TestLegacyNumericUtils, SuggestComponentTest, TestExportWriter, TestWordDelimiterFilterFactory, SearchHandlerTest, TestFieldResource, TestFunctionQuery, DebugComponentTest, TestOnReconnectListenerSupport, RecoveryAfterSoftCommitTest, TestExtendedDismaxParser, HighlighterConfigTest, SystemLogListenerTest, ConnectionManagerTest, TestRestoreCore, ManagedSchemaRoundRobinCloudTest, TestSkipOverseerOperations, HLLSerializationTest, TestNumericRangeQuery32, TestPushWriter, TestFieldCacheVsDocValues, NoCacheHeaderTest, TestXIncludeConfig, TestDocumentBuilder, HdfsBasicDistributedZkTest, ResponseLogComponentTest, ReturnFieldsTest, TestFilteredDocIdSet, TestConfigSetsAPI, RegexBytesRefFilterTest, UninvertDocValuesMergePolicyTest, ForceLeaderTest, DataDrivenBlockJoinTest, TestLocalFSCloudBackupRestore, TestDistribIDF, ChaosMonkeySafeLeaderTest, TestQueryTypes, UniqFieldsUpdateProcessorFactoryTest, TestQuerySenderNoQuery, JSONWriterTest, ZkShardTermsTest, ExternalFileFieldSortTest, TestSchemaManager, ScheduledTriggerTest]
   [junit4] Completed [362/834 (2!)] on J2 in 9.63s, 2 tests, 1 failure <<< FAILURES!

[...truncated 43847 lines...]
[repro] Jenkins log URL: https://jenkins.thetaphi.de/job/Lucene-Solr-master-Linux/22887/consoleText

[repro] Revision: 5981895cb48416f1133702a35bf9811f963f3ed9

[repro] Ant options: "-Dargs=-XX:+UseCompressedOops -XX:+UseParallelGC"
[repro] Repro line:  ant test  -Dtestcase=TestDistributedStatsComponentCardinality -Dtests.method=test -Dtests.seed=A64108481CFDC09C -Dtests.multiplier=3 -Dtests.slow=true -Dtests.locale=en-IN -Dtests.timezone=America/North_Dakota/Beulah -Dtests.asserts=true -Dtests.file.encoding=UTF-8

[repro] Repro line:  ant test  -Dtestcase=ScheduledTriggerTest -Dtests.method=testTrigger -Dtests.seed=A64108481CFDC09C -Dtests.multiplier=3 -Dtests.slow=true -Dtests.locale=ha-NE -Dtests.timezone=ECT -Dtests.asserts=true -Dtests.file.encoding=UTF-8

[repro] ant clean

[...truncated 6 lines...]
[repro] Test suites by module:
[repro]    solr/core
[repro]       ScheduledTriggerTest
[repro]       TestDistributedStatsComponentCardinality
[repro] ant compile-test

[...truncated 3429 lines...]
[repro] ant test-nocompile -Dtests.dups=5 -Dtests.maxfailures=10 -Dtests.class="*.ScheduledTriggerTest|*.TestDistributedStatsComponentCardinality" -Dtests.showOutput=onerror "-Dargs=-XX:+UseCompressedOops -XX:+UseParallelGC" -Dtests.seed=A64108481CFDC09C -Dtests.multiplier=3 -Dtests.slow=true -Dtests.locale=ha-NE -Dtests.timezone=ECT -Dtests.asserts=true -Dtests.file.encoding=UTF-8

[...truncated 102 lines...]
[repro] Failures:
[repro]   0/5 failed: org.apache.solr.cloud.autoscaling.ScheduledTriggerTest
[repro]   0/5 failed: org.apache.solr.handler.component.TestDistributedStatsComponentCardinality
[repro] Exiting with code 0

[...truncated 40 lines...]

Mime
View raw message