lucene-dev mailing list archives

Site index · List index
Message view « Date » · « Thread »
Top « Date » · « Thread »
From Policeman Jenkins Server <jenk...@thetaphi.de>
Subject [JENKINS] Lucene-Solr-7.x-Linux (64bit/jdk-9.0.4) - Build # 2670 - Failure!
Date Sat, 01 Sep 2018 20:31:09 GMT
Build: https://jenkins.thetaphi.de/job/Lucene-Solr-7.x-Linux/2670/
Java: 64bit/jdk-9.0.4 -XX:-UseCompressedOops -XX:+UseParallelGC

2 tests failed.
FAILED:  org.apache.solr.handler.RequestLoggingTest.testLogBeforeExecuteWithRequestLogger

Error Message:


Stack Trace:
java.lang.AssertionError
	at __randomizedtesting.SeedInfo.seed([71D8ECFC7436C65C:C0B1CCF3D9C07E12]:0)
	at org.junit.Assert.fail(Assert.java:92)
	at org.junit.Assert.assertTrue(Assert.java:43)
	at org.junit.Assert.assertTrue(Assert.java:54)
	at org.apache.solr.handler.RequestLoggingTest.testLogBeforeExecute(RequestLoggingTest.java:88)
	at org.apache.solr.handler.RequestLoggingTest.testLogBeforeExecuteWithRequestLogger(RequestLoggingTest.java:71)
	at java.base/jdk.internal.reflect.NativeMethodAccessorImpl.invoke0(Native Method)
	at java.base/jdk.internal.reflect.NativeMethodAccessorImpl.invoke(NativeMethodAccessorImpl.java:62)
	at java.base/jdk.internal.reflect.DelegatingMethodAccessorImpl.invoke(DelegatingMethodAccessorImpl.java:43)
	at java.base/java.lang.reflect.Method.invoke(Method.java:564)
	at com.carrotsearch.randomizedtesting.RandomizedRunner.invoke(RandomizedRunner.java:1737)
	at com.carrotsearch.randomizedtesting.RandomizedRunner$8.evaluate(RandomizedRunner.java:934)
	at com.carrotsearch.randomizedtesting.RandomizedRunner$9.evaluate(RandomizedRunner.java:970)
	at com.carrotsearch.randomizedtesting.RandomizedRunner$10.evaluate(RandomizedRunner.java:984)
	at com.carrotsearch.randomizedtesting.rules.SystemPropertiesRestoreRule$1.evaluate(SystemPropertiesRestoreRule.java:57)
	at org.apache.lucene.util.TestRuleSetupTeardownChained$1.evaluate(TestRuleSetupTeardownChained.java:49)
	at org.apache.lucene.util.AbstractBeforeAfterRule$1.evaluate(AbstractBeforeAfterRule.java:45)
	at org.apache.lucene.util.TestRuleThreadAndTestName$1.evaluate(TestRuleThreadAndTestName.java:48)
	at org.apache.lucene.util.TestRuleIgnoreAfterMaxFailures$1.evaluate(TestRuleIgnoreAfterMaxFailures.java:64)
	at org.apache.lucene.util.TestRuleMarkFailure$1.evaluate(TestRuleMarkFailure.java:47)
	at com.carrotsearch.randomizedtesting.rules.StatementAdapter.evaluate(StatementAdapter.java:36)
	at com.carrotsearch.randomizedtesting.ThreadLeakControl$StatementRunner.run(ThreadLeakControl.java:368)
	at com.carrotsearch.randomizedtesting.ThreadLeakControl.forkTimeoutingTask(ThreadLeakControl.java:817)
	at com.carrotsearch.randomizedtesting.ThreadLeakControl$3.evaluate(ThreadLeakControl.java:468)
	at com.carrotsearch.randomizedtesting.RandomizedRunner.runSingleTest(RandomizedRunner.java:943)
	at com.carrotsearch.randomizedtesting.RandomizedRunner$5.evaluate(RandomizedRunner.java:829)
	at com.carrotsearch.randomizedtesting.RandomizedRunner$6.evaluate(RandomizedRunner.java:879)
	at com.carrotsearch.randomizedtesting.RandomizedRunner$7.evaluate(RandomizedRunner.java:890)
	at com.carrotsearch.randomizedtesting.rules.StatementAdapter.evaluate(StatementAdapter.java:36)
	at com.carrotsearch.randomizedtesting.rules.SystemPropertiesRestoreRule$1.evaluate(SystemPropertiesRestoreRule.java:57)
	at org.apache.lucene.util.AbstractBeforeAfterRule$1.evaluate(AbstractBeforeAfterRule.java:45)
	at com.carrotsearch.randomizedtesting.rules.StatementAdapter.evaluate(StatementAdapter.java:36)
	at org.apache.lucene.util.TestRuleStoreClassName$1.evaluate(TestRuleStoreClassName.java:41)
	at com.carrotsearch.randomizedtesting.rules.NoShadowingOrOverridesOnMethodsRule$1.evaluate(NoShadowingOrOverridesOnMethodsRule.java:40)
	at com.carrotsearch.randomizedtesting.rules.NoShadowingOrOverridesOnMethodsRule$1.evaluate(NoShadowingOrOverridesOnMethodsRule.java:40)
	at com.carrotsearch.randomizedtesting.rules.StatementAdapter.evaluate(StatementAdapter.java:36)
	at com.carrotsearch.randomizedtesting.rules.StatementAdapter.evaluate(StatementAdapter.java:36)
	at org.apache.lucene.util.TestRuleAssertionsRequired$1.evaluate(TestRuleAssertionsRequired.java:53)
	at org.apache.lucene.util.TestRuleMarkFailure$1.evaluate(TestRuleMarkFailure.java:47)
	at org.apache.lucene.util.TestRuleIgnoreAfterMaxFailures$1.evaluate(TestRuleIgnoreAfterMaxFailures.java:64)
	at org.apache.lucene.util.TestRuleIgnoreTestSuites$1.evaluate(TestRuleIgnoreTestSuites.java:54)
	at com.carrotsearch.randomizedtesting.rules.StatementAdapter.evaluate(StatementAdapter.java:36)
	at com.carrotsearch.randomizedtesting.ThreadLeakControl$StatementRunner.run(ThreadLeakControl.java:368)
	at java.base/java.lang.Thread.run(Thread.java:844)


FAILED:  org.apache.solr.handler.RequestLoggingTest.testLogBeforeExecuteWithCoreLogger

Error Message:


Stack Trace:
java.lang.AssertionError
	at __randomizedtesting.SeedInfo.seed([71D8ECFC7436C65C:BD5EEC728AFFADCA]:0)
	at org.junit.Assert.fail(Assert.java:92)
	at org.junit.Assert.assertTrue(Assert.java:43)
	at org.junit.Assert.assertTrue(Assert.java:54)
	at org.apache.solr.handler.RequestLoggingTest.testLogBeforeExecute(RequestLoggingTest.java:88)
	at org.apache.solr.handler.RequestLoggingTest.testLogBeforeExecuteWithCoreLogger(RequestLoggingTest.java:65)
	at java.base/jdk.internal.reflect.NativeMethodAccessorImpl.invoke0(Native Method)
	at java.base/jdk.internal.reflect.NativeMethodAccessorImpl.invoke(NativeMethodAccessorImpl.java:62)
	at java.base/jdk.internal.reflect.DelegatingMethodAccessorImpl.invoke(DelegatingMethodAccessorImpl.java:43)
	at java.base/java.lang.reflect.Method.invoke(Method.java:564)
	at com.carrotsearch.randomizedtesting.RandomizedRunner.invoke(RandomizedRunner.java:1737)
	at com.carrotsearch.randomizedtesting.RandomizedRunner$8.evaluate(RandomizedRunner.java:934)
	at com.carrotsearch.randomizedtesting.RandomizedRunner$9.evaluate(RandomizedRunner.java:970)
	at com.carrotsearch.randomizedtesting.RandomizedRunner$10.evaluate(RandomizedRunner.java:984)
	at com.carrotsearch.randomizedtesting.rules.SystemPropertiesRestoreRule$1.evaluate(SystemPropertiesRestoreRule.java:57)
	at org.apache.lucene.util.TestRuleSetupTeardownChained$1.evaluate(TestRuleSetupTeardownChained.java:49)
	at org.apache.lucene.util.AbstractBeforeAfterRule$1.evaluate(AbstractBeforeAfterRule.java:45)
	at org.apache.lucene.util.TestRuleThreadAndTestName$1.evaluate(TestRuleThreadAndTestName.java:48)
	at org.apache.lucene.util.TestRuleIgnoreAfterMaxFailures$1.evaluate(TestRuleIgnoreAfterMaxFailures.java:64)
	at org.apache.lucene.util.TestRuleMarkFailure$1.evaluate(TestRuleMarkFailure.java:47)
	at com.carrotsearch.randomizedtesting.rules.StatementAdapter.evaluate(StatementAdapter.java:36)
	at com.carrotsearch.randomizedtesting.ThreadLeakControl$StatementRunner.run(ThreadLeakControl.java:368)
	at com.carrotsearch.randomizedtesting.ThreadLeakControl.forkTimeoutingTask(ThreadLeakControl.java:817)
	at com.carrotsearch.randomizedtesting.ThreadLeakControl$3.evaluate(ThreadLeakControl.java:468)
	at com.carrotsearch.randomizedtesting.RandomizedRunner.runSingleTest(RandomizedRunner.java:943)
	at com.carrotsearch.randomizedtesting.RandomizedRunner$5.evaluate(RandomizedRunner.java:829)
	at com.carrotsearch.randomizedtesting.RandomizedRunner$6.evaluate(RandomizedRunner.java:879)
	at com.carrotsearch.randomizedtesting.RandomizedRunner$7.evaluate(RandomizedRunner.java:890)
	at com.carrotsearch.randomizedtesting.rules.StatementAdapter.evaluate(StatementAdapter.java:36)
	at com.carrotsearch.randomizedtesting.rules.SystemPropertiesRestoreRule$1.evaluate(SystemPropertiesRestoreRule.java:57)
	at org.apache.lucene.util.AbstractBeforeAfterRule$1.evaluate(AbstractBeforeAfterRule.java:45)
	at com.carrotsearch.randomizedtesting.rules.StatementAdapter.evaluate(StatementAdapter.java:36)
	at org.apache.lucene.util.TestRuleStoreClassName$1.evaluate(TestRuleStoreClassName.java:41)
	at com.carrotsearch.randomizedtesting.rules.NoShadowingOrOverridesOnMethodsRule$1.evaluate(NoShadowingOrOverridesOnMethodsRule.java:40)
	at com.carrotsearch.randomizedtesting.rules.NoShadowingOrOverridesOnMethodsRule$1.evaluate(NoShadowingOrOverridesOnMethodsRule.java:40)
	at com.carrotsearch.randomizedtesting.rules.StatementAdapter.evaluate(StatementAdapter.java:36)
	at com.carrotsearch.randomizedtesting.rules.StatementAdapter.evaluate(StatementAdapter.java:36)
	at org.apache.lucene.util.TestRuleAssertionsRequired$1.evaluate(TestRuleAssertionsRequired.java:53)
	at org.apache.lucene.util.TestRuleMarkFailure$1.evaluate(TestRuleMarkFailure.java:47)
	at org.apache.lucene.util.TestRuleIgnoreAfterMaxFailures$1.evaluate(TestRuleIgnoreAfterMaxFailures.java:64)
	at org.apache.lucene.util.TestRuleIgnoreTestSuites$1.evaluate(TestRuleIgnoreTestSuites.java:54)
	at com.carrotsearch.randomizedtesting.rules.StatementAdapter.evaluate(StatementAdapter.java:36)
	at com.carrotsearch.randomizedtesting.ThreadLeakControl$StatementRunner.run(ThreadLeakControl.java:368)
	at java.base/java.lang.Thread.run(Thread.java:844)




Build Log:
[...truncated 14517 lines...]
   [junit4] Suite: org.apache.solr.handler.RequestLoggingTest
   [junit4]   2> 2882341 INFO  (SUITE-RequestLoggingTest-seed#[71D8ECFC7436C65C]-worker) [    ] o.a.s.SolrTestCaseJ4 SecureRandom sanity checks: test.solr.allowed.securerandom=null & java.security.egd=file:/dev/./urandom
   [junit4]   2> Creating dataDir: /home/jenkins/workspace/Lucene-Solr-7.x-Linux/solr/build/solr-core/test/J0/temp/solr.handler.RequestLoggingTest_71D8ECFC7436C65C-001/init-core-data-001
   [junit4]   2> 2882341 WARN  (SUITE-RequestLoggingTest-seed#[71D8ECFC7436C65C]-worker) [    ] o.a.s.SolrTestCaseJ4 startTrackingSearchers: numOpens=5 numCloses=5
   [junit4]   2> 2882341 INFO  (SUITE-RequestLoggingTest-seed#[71D8ECFC7436C65C]-worker) [    ] o.a.s.SolrTestCaseJ4 Using TrieFields (NUMERIC_POINTS_SYSPROP=false) w/NUMERIC_DOCVALUES_SYSPROP=false
   [junit4]   2> 2882342 INFO  (SUITE-RequestLoggingTest-seed#[71D8ECFC7436C65C]-worker) [    ] o.a.s.SolrTestCaseJ4 Randomized ssl (true) and clientAuth (false) via: @org.apache.solr.util.RandomizeSSL(reason="", ssl=0.0/0.0, value=0.0/0.0, clientAuth=0.0/0.0)
   [junit4]   2> 2882342 INFO  (SUITE-RequestLoggingTest-seed#[71D8ECFC7436C65C]-worker) [    ] o.a.s.SolrTestCaseJ4 ####initCore
   [junit4]   2> 2882343 INFO  (SUITE-RequestLoggingTest-seed#[71D8ECFC7436C65C]-worker) [    ] o.a.s.c.SolrResourceLoader [null] Added 2 libs to classloader, from paths: [/home/jenkins/workspace/Lucene-Solr-7.x-Linux/solr/core/src/test-files/solr/collection1/lib, /home/jenkins/workspace/Lucene-Solr-7.x-Linux/solr/core/src/test-files/solr/collection1/lib/classes]
   [junit4]   2> 2882363 INFO  (SUITE-RequestLoggingTest-seed#[71D8ECFC7436C65C]-worker) [    ] o.a.s.c.SolrConfig Using Lucene MatchVersion: 7.5.0
   [junit4]   2> 2882380 INFO  (SUITE-RequestLoggingTest-seed#[71D8ECFC7436C65C]-worker) [    ] o.a.s.s.IndexSchema [null] Schema name=test
   [junit4]   2> 2882437 INFO  (SUITE-RequestLoggingTest-seed#[71D8ECFC7436C65C]-worker) [    ] o.a.s.s.IndexSchema Loaded schema test/1.0 with uniqueid field id
   [junit4]   2> 2882483 INFO  (SUITE-RequestLoggingTest-seed#[71D8ECFC7436C65C]-worker) [    ] o.a.s.c.TransientSolrCoreCacheDefault Allocating transient cache for 2147483647 transient cores
   [junit4]   2> 2882483 INFO  (SUITE-RequestLoggingTest-seed#[71D8ECFC7436C65C]-worker) [    ] o.a.s.h.a.MetricsHistoryHandler No .system collection, keeping metrics history in memory.
   [junit4]   2> 2882490 INFO  (SUITE-RequestLoggingTest-seed#[71D8ECFC7436C65C]-worker) [    ] o.a.s.m.r.SolrJmxReporter JMX monitoring for 'solr.node' (registry 'solr.node') enabled at server: com.sun.jmx.mbeanserver.JmxMBeanServer@6fd19252
   [junit4]   2> 2882495 INFO  (SUITE-RequestLoggingTest-seed#[71D8ECFC7436C65C]-worker) [    ] o.a.s.m.r.SolrJmxReporter JMX monitoring for 'solr.jvm' (registry 'solr.jvm') enabled at server: com.sun.jmx.mbeanserver.JmxMBeanServer@6fd19252
   [junit4]   2> 2882495 INFO  (SUITE-RequestLoggingTest-seed#[71D8ECFC7436C65C]-worker) [    ] o.a.s.m.r.SolrJmxReporter JMX monitoring for 'solr.jetty' (registry 'solr.jetty') enabled at server: com.sun.jmx.mbeanserver.JmxMBeanServer@6fd19252
   [junit4]   2> 2882496 INFO  (coreLoadExecutor-9805-thread-1) [    x:collection1] o.a.s.c.SolrResourceLoader [null] Added 2 libs to classloader, from paths: [/home/jenkins/workspace/Lucene-Solr-7.x-Linux/solr/core/src/test-files/solr/collection1/lib, /home/jenkins/workspace/Lucene-Solr-7.x-Linux/solr/core/src/test-files/solr/collection1/lib/classes]
   [junit4]   2> 2882511 INFO  (coreLoadExecutor-9805-thread-1) [    x:collection1] o.a.s.c.SolrConfig Using Lucene MatchVersion: 7.5.0
   [junit4]   2> 2882523 INFO  (coreLoadExecutor-9805-thread-1) [    x:collection1] o.a.s.s.IndexSchema [collection1] Schema name=test
   [junit4]   2> 2882616 INFO  (coreLoadExecutor-9805-thread-1) [    x:collection1] o.a.s.s.IndexSchema Loaded schema test/1.0 with uniqueid field id
   [junit4]   2> 2882623 INFO  (coreLoadExecutor-9805-thread-1) [    x:collection1] o.a.s.c.CoreContainer Creating SolrCore 'collection1' using configuration from instancedir /home/jenkins/workspace/Lucene-Solr-7.x-Linux/solr/core/src/test-files/solr/collection1, trusted=true
   [junit4]   2> 2882623 INFO  (coreLoadExecutor-9805-thread-1) [    x:collection1] o.a.s.m.r.SolrJmxReporter JMX monitoring for 'solr.core.collection1' (registry 'solr.core.collection1') enabled at server: com.sun.jmx.mbeanserver.JmxMBeanServer@6fd19252
   [junit4]   2> 2882623 INFO  (coreLoadExecutor-9805-thread-1) [    x:collection1] o.a.s.c.SolrCore solr.RecoveryStrategy.Builder
   [junit4]   2> 2882623 INFO  (coreLoadExecutor-9805-thread-1) [    x:collection1] o.a.s.c.SolrCore [[collection1] ] Opening new SolrCore at [/home/jenkins/workspace/Lucene-Solr-7.x-Linux/solr/core/src/test-files/solr/collection1], dataDir=[/home/jenkins/workspace/Lucene-Solr-7.x-Linux/solr/build/solr-core/test/J0/temp/solr.handler.RequestLoggingTest_71D8ECFC7436C65C-001/init-core-data-001/]
   [junit4]   2> 2882624 INFO  (coreLoadExecutor-9805-thread-1) [    x:collection1] o.a.s.u.RandomMergePolicy RandomMergePolicy wrapping class org.apache.lucene.index.TieredMergePolicy: [TieredMergePolicy: maxMergeAtOnce=31, maxMergeAtOnceExplicit=24, maxMergedSegmentMB=29.796875, floorSegmentMB=0.6884765625, forceMergeDeletesPctAllowed=29.952122081937933, segmentsPerTier=32.0, maxCFSSegmentSizeMB=8.796093022207999E12, noCFSRatio=1.0, deletesPctAllowed=31.140203698024276
   [junit4]   2> 2882657 INFO  (coreLoadExecutor-9805-thread-1) [    x:collection1] o.a.s.u.UpdateHandler Using UpdateLog implementation: org.apache.solr.update.UpdateLog
   [junit4]   2> 2882657 INFO  (coreLoadExecutor-9805-thread-1) [    x:collection1] o.a.s.u.UpdateLog Initializing UpdateLog: dataDir= defaultSyncLevel=FLUSH numRecordsToKeep=100 maxNumLogsToKeep=10 numVersionBuckets=65536
   [junit4]   2> 2882658 INFO  (coreLoadExecutor-9805-thread-1) [    x:collection1] o.a.s.u.CommitTracker Hard AutoCommit: disabled
   [junit4]   2> 2882658 INFO  (coreLoadExecutor-9805-thread-1) [    x:collection1] o.a.s.u.CommitTracker Soft AutoCommit: disabled
   [junit4]   2> 2882658 INFO  (coreLoadExecutor-9805-thread-1) [    x:collection1] o.a.s.u.RandomMergePolicy RandomMergePolicy wrapping class org.apache.lucene.index.TieredMergePolicy: [TieredMergePolicy: maxMergeAtOnce=38, maxMergeAtOnceExplicit=50, maxMergedSegmentMB=66.3349609375, floorSegmentMB=1.876953125, forceMergeDeletesPctAllowed=2.6129430328416046, segmentsPerTier=30.0, maxCFSSegmentSizeMB=8.796093022207999E12, noCFSRatio=0.8540219291450675, deletesPctAllowed=23.482071839951033
   [junit4]   2> 2882659 INFO  (coreLoadExecutor-9805-thread-1) [    x:collection1] o.a.s.s.SolrIndexSearcher Opening [Searcher@19131d43[collection1] main]
   [junit4]   2> 2882659 INFO  (coreLoadExecutor-9805-thread-1) [    x:collection1] o.a.s.h.c.SpellCheckComponent Initializing spell checkers
   [junit4]   2> 2882766 INFO  (coreLoadExecutor-9805-thread-1) [    x:collection1] o.a.s.s.DirectSolrSpellChecker init: {name=direct,classname=DirectSolrSpellChecker,field=lowerfilt,minQueryLength=3}
   [junit4]   2> 2882852 INFO  (coreLoadExecutor-9805-thread-1) [    x:collection1] o.a.s.h.ReplicationHandler Commits will be reserved for 10000ms.
   [junit4]   2> 2882852 INFO  (searcherExecutor-9806-thread-1-processing-x:collection1) [    x:collection1] o.a.s.h.c.SpellCheckComponent Loading spell index for spellchecker: default
   [junit4]   2> 2882852 INFO  (coreLoadExecutor-9805-thread-1) [    x:collection1] o.a.s.u.UpdateLog Could not find max version in index or recent updates, using new clock 1610438145039400960
   [junit4]   2> 2882853 INFO  (searcherExecutor-9806-thread-1-processing-x:collection1) [    x:collection1] o.a.s.h.c.SpellCheckComponent Loading spell index for spellchecker: direct
   [junit4]   2> 2882853 INFO  (searcherExecutor-9806-thread-1-processing-x:collection1) [    x:collection1] o.a.s.h.c.SpellCheckComponent Loading spell index for spellchecker: wordbreak
   [junit4]   2> 2882853 INFO  (searcherExecutor-9806-thread-1-processing-x:collection1) [    x:collection1] o.a.s.h.c.SpellCheckComponent Loading spell index for spellchecker: multipleFields
   [junit4]   2> 2882853 INFO  (searcherExecutor-9806-thread-1-processing-x:collection1) [    x:collection1] o.a.s.h.c.SpellCheckComponent Loading spell index for spellchecker: jarowinkler
   [junit4]   2> 2882853 INFO  (searcherExecutor-9806-thread-1-processing-x:collection1) [    x:collection1] o.a.s.h.c.SpellCheckComponent Loading spell index for spellchecker: external
   [junit4]   2> 2882853 INFO  (searcherExecutor-9806-thread-1-processing-x:collection1) [    x:collection1] o.a.s.h.c.SpellCheckComponent Loading spell index for spellchecker: freq
   [junit4]   2> 2882853 INFO  (searcherExecutor-9806-thread-1-processing-x:collection1) [    x:collection1] o.a.s.h.c.SpellCheckComponent Loading spell index for spellchecker: fqcn
   [junit4]   2> 2882853 INFO  (searcherExecutor-9806-thread-1-processing-x:collection1) [    x:collection1] o.a.s.h.c.SpellCheckComponent Loading spell index for spellchecker: perDict
   [junit4]   2> 2882854 INFO  (searcherExecutor-9806-thread-1-processing-x:collection1) [    x:collection1] o.a.s.c.SolrCore [collection1] Registered new searcher Searcher@19131d43[collection1] main{ExitableDirectoryReader(UninvertingDirectoryReader())}
   [junit4]   2> 2882855 INFO  (SUITE-RequestLoggingTest-seed#[71D8ECFC7436C65C]-worker) [    ] o.a.s.SolrTestCaseJ4 ####initCore end
   [junit4]   2> 2882856 INFO  (TEST-RequestLoggingTest.testLogBeforeExecuteWithRequestLogger-seed#[71D8ECFC7436C65C]) [    ] o.a.s.SolrTestCaseJ4 ###Starting testLogBeforeExecuteWithRequestLogger
   [junit4]   2> 2882863 DEBUG (TEST-RequestLoggingTest.testLogBeforeExecuteWithRequestLogger-seed#[71D8ECFC7436C65C]) [    ] o.a.s.c.S.Request [collection1]  webapp=null path=null params={q=*:*&wt=xml}
   [junit4]   2> 2882863 DEBUG (TEST-RequestLoggingTest.testLogBeforeExecuteWithRequestLogger-seed#[71D8ECFC7436C65C]) [    ] o.a.s.h.c.SearchHandler Adding  component:org.apache.solr.handler.component.QueryComponent@77923d6
   [junit4]   2> 2882863 DEBUG (TEST-RequestLoggingTest.testLogBeforeExecuteWithRequestLogger-seed#[71D8ECFC7436C65C]) [    ] o.a.s.h.c.SearchHandler Adding  component:org.apache.solr.handler.component.FacetComponent@2b308244
   [junit4]   2> 2882863 DEBUG (TEST-RequestLoggingTest.testLogBeforeExecuteWithRequestLogger-seed#[71D8ECFC7436C65C]) [    ] o.a.s.h.c.SearchHandler Adding  component:org.apache.solr.search.facet.FacetModule@5e7afa2f
   [junit4]   2> 2882863 DEBUG (TEST-RequestLoggingTest.testLogBeforeExecuteWithRequestLogger-seed#[71D8ECFC7436C65C]) [    ] o.a.s.h.c.SearchHandler Adding  component:org.apache.solr.handler.component.MoreLikeThisComponent@48b8c99e
   [junit4]   2> 2882863 DEBUG (TEST-RequestLoggingTest.testLogBeforeExecuteWithRequestLogger-seed#[71D8ECFC7436C65C]) [    ] o.a.s.h.c.SearchHandler Adding  component:org.apache.solr.handler.component.HighlightComponent@69134cc
   [junit4]   2> 2882863 DEBUG (TEST-RequestLoggingTest.testLogBeforeExecuteWithRequestLogger-seed#[71D8ECFC7436C65C]) [    ] o.a.s.h.c.SearchHandler Adding  component:org.apache.solr.handler.component.StatsComponent@299cb4f8
   [junit4]   2> 2882863 DEBUG (TEST-RequestLoggingTest.testLogBeforeExecuteWithRequestLogger-seed#[71D8ECFC7436C65C]) [    ] o.a.s.h.c.SearchHandler Adding  component:org.apache.solr.handler.component.ExpandComponent@20be9866
   [junit4]   2> 2882863 DEBUG (TEST-RequestLoggingTest.testLogBeforeExecuteWithRequestLogger-seed#[71D8ECFC7436C65C]) [    ] o.a.s.h.c.SearchHandler Adding  component:org.apache.solr.handler.component.TermsComponent@2ec441d6
   [junit4]   2> 2882863 DEBUG (TEST-RequestLoggingTest.testLogBeforeExecuteWithRequestLogger-seed#[71D8ECFC7436C65C]) [    ] o.a.s.h.c.SearchHandler Adding  debug component:org.apache.solr.handler.component.DebugComponent@217c2796
   [junit4]   2> 2882863 DEBUG (TEST-RequestLoggingTest.testLogBeforeExecuteWithRequestLogger-seed#[71D8ECFC7436C65C]) [    ] o.a.s.h.c.QueryComponent process: q=*:*&df=text&wt=xml&indent=off
   [junit4]   2> 2882863 DEBUG (TEST-RequestLoggingTest.testLogBeforeExecuteWithRequestLogger-seed#[71D8ECFC7436C65C]) [    ] o.a.s.s.s.LocalStatsCache ## GET LocalSolrQueryRequest{q=*:*&df=text&wt=xml&indent=off}
   [junit4]   2> 2882863 INFO  (TEST-RequestLoggingTest.testLogBeforeExecuteWithRequestLogger-seed#[71D8ECFC7436C65C]) [    ] o.a.s.c.S.Request [collection1]  webapp=null path=null params={q=*:*&wt=xml} hits=0 status=0 QTime=0
   [junit4]   2> 2882864 INFO  (TEST-RequestLoggingTest.testLogBeforeExecuteWithRequestLogger-seed#[71D8ECFC7436C65C]) [    ] o.a.s.SolrTestCaseJ4 ###Ending testLogBeforeExecuteWithRequestLogger
   [junit4]   2> NOTE: reproduce with: ant test  -Dtestcase=RequestLoggingTest -Dtests.method=testLogBeforeExecuteWithRequestLogger -Dtests.seed=71D8ECFC7436C65C -Dtests.multiplier=3 -Dtests.slow=true -Dtests.locale=ga-IE -Dtests.timezone=Arctic/Longyearbyen -Dtests.asserts=true -Dtests.file.encoding=UTF-8
   [junit4] FAILURE 0.01s J0 | RequestLoggingTest.testLogBeforeExecuteWithRequestLogger <<<
   [junit4]    > Throwable #1: java.lang.AssertionError
   [junit4]    > 	at __randomizedtesting.SeedInfo.seed([71D8ECFC7436C65C:C0B1CCF3D9C07E12]:0)
   [junit4]    > 	at org.apache.solr.handler.RequestLoggingTest.testLogBeforeExecute(RequestLoggingTest.java:88)
   [junit4]    > 	at org.apache.solr.handler.RequestLoggingTest.testLogBeforeExecuteWithRequestLogger(RequestLoggingTest.java:71)
   [junit4]    > 	at java.base/jdk.internal.reflect.NativeMethodAccessorImpl.invoke0(Native Method)
   [junit4]    > 	at java.base/jdk.internal.reflect.NativeMethodAccessorImpl.invoke(NativeMethodAccessorImpl.java:62)
   [junit4]    > 	at java.base/jdk.internal.reflect.DelegatingMethodAccessorImpl.invoke(DelegatingMethodAccessorImpl.java:43)
   [junit4]    > 	at java.base/java.lang.reflect.Method.invoke(Method.java:564)
   [junit4]    > 	at java.base/java.lang.Thread.run(Thread.java:844)
   [junit4]   2> 2882868 INFO  (TEST-RequestLoggingTest.testLogBeforeExecuteWithCoreLogger-seed#[71D8ECFC7436C65C]) [    ] o.a.s.SolrTestCaseJ4 ###Starting testLogBeforeExecuteWithCoreLogger
   [junit4]   2> 2882870 DEBUG (TEST-RequestLoggingTest.testLogBeforeExecuteWithCoreLogger-seed#[71D8ECFC7436C65C]) [    ] o.a.s.c.S.Request [collection1]  webapp=null path=null params={q=*:*&wt=xml}
   [junit4]   2> 2882870 DEBUG (TEST-RequestLoggingTest.testLogBeforeExecuteWithCoreLogger-seed#[71D8ECFC7436C65C]) [    ] o.a.s.h.c.QueryComponent process: q=*:*&df=text&wt=xml&indent=off
   [junit4]   2> 2882870 DEBUG (TEST-RequestLoggingTest.testLogBeforeExecuteWithCoreLogger-seed#[71D8ECFC7436C65C]) [    ] o.a.s.s.s.LocalStatsCache ## GET LocalSolrQueryRequest{q=*:*&df=text&wt=xml&indent=off}
   [junit4]   2> 2882870 INFO  (TEST-RequestLoggingTest.testLogBeforeExecuteWithCoreLogger-seed#[71D8ECFC7436C65C]) [    ] o.a.s.c.S.Request [collection1]  webapp=null path=null params={q=*:*&wt=xml} hits=0 status=0 QTime=0
   [junit4]   2> 2882871 INFO  (TEST-RequestLoggingTest.testLogBeforeExecuteWithCoreLogger-seed#[71D8ECFC7436C65C]) [    ] o.a.s.SolrTestCaseJ4 ###Ending testLogBeforeExecuteWithCoreLogger
   [junit4]   2> NOTE: reproduce with: ant test  -Dtestcase=RequestLoggingTest -Dtests.method=testLogBeforeExecuteWithCoreLogger -Dtests.seed=71D8ECFC7436C65C -Dtests.multiplier=3 -Dtests.slow=true -Dtests.locale=ga-IE -Dtests.timezone=Arctic/Longyearbyen -Dtests.asserts=true -Dtests.file.encoding=UTF-8
   [junit4] FAILURE 0.01s J0 | RequestLoggingTest.testLogBeforeExecuteWithCoreLogger <<<
   [junit4]    > Throwable #1: java.lang.AssertionError
   [junit4]    > 	at __randomizedtesting.SeedInfo.seed([71D8ECFC7436C65C:BD5EEC728AFFADCA]:0)
   [junit4]    > 	at org.apache.solr.handler.RequestLoggingTest.testLogBeforeExecute(RequestLoggingTest.java:88)
   [junit4]    > 	at org.apache.solr.handler.RequestLoggingTest.testLogBeforeExecuteWithCoreLogger(RequestLoggingTest.java:65)
   [junit4]    > 	at java.base/jdk.internal.reflect.NativeMethodAccessorImpl.invoke0(Native Method)
   [junit4]    > 	at java.base/jdk.internal.reflect.NativeMethodAccessorImpl.invoke(NativeMethodAccessorImpl.java:62)
   [junit4]    > 	at java.base/jdk.internal.reflect.DelegatingMethodAccessorImpl.invoke(DelegatingMethodAccessorImpl.java:43)
   [junit4]    > 	at java.base/java.lang.reflect.Method.invoke(Method.java:564)
   [junit4]    > 	at java.base/java.lang.Thread.run(Thread.java:844)
   [junit4]   2> 2882872 INFO  (SUITE-RequestLoggingTest-seed#[71D8ECFC7436C65C]-worker) [    ] o.a.s.SolrTestCaseJ4 ###deleteCore
   [junit4]   2> 2882872 INFO  (SUITE-RequestLoggingTest-seed#[71D8ECFC7436C65C]-worker) [    ] o.a.s.c.CoreContainer Shutting down CoreContainer instance=73048272
   [junit4]   2> 2882872 INFO  (SUITE-RequestLoggingTest-seed#[71D8ECFC7436C65C]-worker) [    ] o.a.s.m.SolrMetricManager Closing metric reporters for registry=solr.node, tag=null
   [junit4]   2> 2882872 INFO  (SUITE-RequestLoggingTest-seed#[71D8ECFC7436C65C]-worker) [    ] o.a.s.m.r.SolrJmxReporter Closing reporter [org.apache.solr.metrics.reporters.SolrJmxReporter@1f6172f1: rootName = null, domain = solr.node, service url = null, agent id = null] for registry solr.node / com.codahale.metrics.MetricRegistry@99e9faf
   [junit4]   2> 2882876 INFO  (SUITE-RequestLoggingTest-seed#[71D8ECFC7436C65C]-worker) [    ] o.a.s.m.SolrMetricManager Closing metric reporters for registry=solr.jvm, tag=null
   [junit4]   2> 2882876 INFO  (SUITE-RequestLoggingTest-seed#[71D8ECFC7436C65C]-worker) [    ] o.a.s.m.r.SolrJmxReporter Closing reporter [org.apache.solr.metrics.reporters.SolrJmxReporter@4c19e7da: rootName = null, domain = solr.jvm, service url = null, agent id = null] for registry solr.jvm / com.codahale.metrics.MetricRegistry@593d0660
   [junit4]   2> 2882879 INFO  (SUITE-RequestLoggingTest-seed#[71D8ECFC7436C65C]-worker) [    ] o.a.s.m.SolrMetricManager Closing metric reporters for registry=solr.jetty, tag=null
   [junit4]   2> 2882879 INFO  (SUITE-RequestLoggingTest-seed#[71D8ECFC7436C65C]-worker) [    ] o.a.s.m.r.SolrJmxReporter Closing reporter [org.apache.solr.metrics.reporters.SolrJmxReporter@1c5a1785: rootName = null, domain = solr.jetty, service url = null, agent id = null] for registry solr.jetty / com.codahale.metrics.MetricRegistry@20950ede
   [junit4]   2> 2882879 INFO  (coreCloseExecutor-9811-thread-1) [    x:collection1] o.a.s.c.SolrCore [collection1]  CLOSING SolrCore org.apache.solr.core.SolrCore@7e9b4a84
   [junit4]   2> 2882879 INFO  (coreCloseExecutor-9811-thread-1) [    x:collection1] o.a.s.m.SolrMetricManager Closing metric reporters for registry=solr.core.collection1, tag=7e9b4a84
   [junit4]   2> 2882880 INFO  (coreCloseExecutor-9811-thread-1) [    x:collection1] o.a.s.m.r.SolrJmxReporter Closing reporter [org.apache.solr.metrics.reporters.SolrJmxReporter@77588832: rootName = null, domain = solr.core.collection1, service url = null, agent id = null] for registry solr.core.collection1 / com.codahale.metrics.MetricRegistry@30f05834
   [junit4]   2> NOTE: leaving temporary files on disk at: /home/jenkins/workspace/Lucene-Solr-7.x-Linux/solr/build/solr-core/test/J0/temp/solr.handler.RequestLoggingTest_71D8ECFC7436C65C-001
   [junit4]   2> NOTE: test params are: codec=Asserting(Lucene70): {}, docValues:{}, maxPointsInLeafNode=1089, maxMBSortInHeap=5.590871201547865, sim=RandomSimilarity(queryNorm=true): {}, locale=ga-IE, timezone=Arctic/Longyearbyen
   [junit4]   2> NOTE: Linux 4.15.0-32-generic amd64/Oracle Corporation 9.0.4 (64-bit)/cpus=8,threads=1,free=98990608,total=525336576
   [junit4]   2> NOTE: All tests run in this JVM: [TestPerFieldSimilarity, DistributedMLTComponentTest, TestDocTermOrdsUninvertLimit, DirectUpdateHandlerTest, TestCrossCoreJoin, AnalyticsQueryTest, HdfsCollectionsAPIDistributedZkTest, PeerSyncReplicationTest, DistributedVersionInfoTest, TestHashQParserPlugin, BlockCacheTest, HighlighterMaxOffsetTest, SimpleFacetsTest, JavabinLoaderTest, NodeLostTriggerIntegrationTest, TestMinMaxOnMultiValuedField, ZookeeperStatusHandlerTest, SolrCmdDistributorTest, LIROnShardRestartTest, TestStressRecovery, CloudExitableDirectoryReaderTest, DeleteShardTest, SolrIndexSplitterTest, TestSolrDeletionPolicy2, TestSolr4Spatial, TestBulkSchemaAPI, BasicDistributedZk2Test, MetricsHandlerTest, TestFieldTypeCollectionResource, TestReload, StatelessScriptUpdateProcessorFactoryTest, OverseerCollectionConfigSetProcessorTest, EchoParamsTest, TestSolrQueryResponse, TestDynamicURP, TestSolrCloudWithSecureImpersonation, HttpTriggerListenerTest, TestSolrCloudWithHadoopAuthPlugin, TestUseDocValuesAsStored2, TestNumericRangeQuery64, TokenizerChainTest, TestLuceneMatchVersion, BinaryUpdateRequestHandlerTest, TestRandomDVFaceting, SSLMigrationTest, TestDistributedMap, DateMathParserTest, TestSimClusterStateProvider, DocValuesTest, TestNoOpRegenerator, TestSha256AuthenticationProvider, DistributedQueryElevationComponentTest, URLClassifyProcessorTest, TestJsonFacetRefinement, BadIndexSchemaTest, TestRawResponseWriter, DefaultValueUpdateProcessorTest, ChaosMonkeySafeLeaderWithPullReplicasTest, SearchHandlerTest, TestFuzzyAnalyzedSuggestions, TestFastLRUCache, SearchHandlerTest, AtomicUpdateProcessorFactoryTest, TestCollationField, SolrShardReporterTest, TestSimpleTextCodec, TestDynamicFieldResource, RulesTest, QueryParsingTest, FieldAnalysisRequestHandlerTest, DistributedTermsComponentTest, TestPayloadScoreQParserPlugin, TestLocalFSCloudBackupRestore, StressHdfsTest, TestCodecSupport, TestLegacyField, FullSolrCloudDistribCmdsTest, TestSolrFieldCacheBean, SpellingQueryConverterTest, TestMergePolicyConfig, PeerSyncWithLeaderAndIndexFingerprintCachingTest, SolrCoreTest, MultiTermTest, ResourceLoaderTest, ZkStateWriterTest, TestDistributedMissingSort, FieldMutatingUpdateProcessorTest, XmlInterpolationTest, AutoAddReplicasIntegrationTest, V2ApiIntegrationTest, TestScoreJoinQPScore, LeaderFailureAfterFreshStartTest, TestRestoreCore, SuggesterWFSTTest, TestConfigSetImmutable, UpdateRequestProcessorFactoryTest, SystemLogListenerTest, TestSearcherReuse, HdfsTlogReplayBufferedWhileIndexingTest, TestJavabinTupleStreamParser, TestRebalanceLeaders, CoreAdminCreateDiscoverTest, AliasIntegrationTest, ShardRoutingTest, TestCustomDocTransformer, TestManagedSynonymFilterFactory, CollectionPropsTest, TestStreamBody, ConnectionReuseTest, ParsingFieldUpdateProcessorsTest, DistributedFacetSimpleRefinementLongTailTest, BlockJoinFacetRandomTest, TestRangeQuery, SpatialRPTFieldTypeTest, MetricTriggerTest, SampleTest, TestMaxScoreQueryParser, DistributedFacetExistsSmallTest, TestSkipOverseerOperations, CdcrReplicationHandlerTest, TestFaceting, TestSimPolicyCloud, TestLeaderInitiatedRecoveryThread, HdfsDirectoryTest, SmileWriterTest, TestInPlaceUpdatesStandalone, TestComplexPhraseQParserPlugin, TestValueSourceCache, SolrJmxReporterTest, TestCloudDeleteByQuery, TestFiltering, TestCollectionAPIs, CoreSorterTest, TestAddFieldRealTimeGet, TestManagedResource, MoveReplicaTest, DistribJoinFromCollectionTest, LeaderElectionTest, MoveReplicaHDFSTest, OverseerTest, SolrXmlInZkTest, SyncSliceTest, TestCloudPivotFacet, TestCloudSearcherWarming, TestConfigSetsAPIExclusivity, TestConfigSetsAPIZkFailure, TestCryptoKeys, TestHashPartitioner, TestLeaderElectionZkExpiry, TestOnReconnectListenerSupport, TestPullReplica, TestRandomFlRTGCloud, TestSegmentSorting, TestStressLiveNodes, TestTolerantUpdateProcessorCloud, TestTolerantUpdateProcessorRandomCloud, TestUtilizeNode, TestWithCollection, VMParamsZkACLAndCredentialsProvidersTest, ZkCLITest, ZkControllerTest, ZkNodePropsTest, ZkShardTermsTest, ZkSolrClientTest, AssignTest, CollectionReloadTest, CollectionTooManyReplicasTest, CollectionsAPIAsyncDistributedZkTest, ConcurrentDeleteAndCreateCollectionTest, CustomCollectionTest, TestCollectionAPI, TestCollectionsAPIViaSolrCloudCluster, TestHdfsCloudBackupRestore, ComputePlanActionTest, HdfsAutoAddReplicasIntegrationTest, RestoreTriggerStateTest, SearchRateTriggerIntegrationTest, TestSimDistributedQueue, TestSimExecutePlanAction, TestSimGenericDistributedQueue, TestSimLargeCluster, TestSimNodeAddedTrigger, TestSimNodeLostTrigger, CdcrBidirectionalTest, CdcrOpsAndBoundariesTest, TestLazyCores, TestSolrCoreSnapshots, PingRequestHandlerTest, RequestLoggingTest]
   [junit4] Completed [586/831 (1!)] on J0 in 0.56s, 2 tests, 2 failures <<< FAILURES!

[...truncated 599 lines...]
   [junit4] JVM J1: stdout was not empty, see: /home/jenkins/workspace/Lucene-Solr-7.x-Linux/solr/build/solr-core/test/temp/junit4-J1-20180901_193654_1646421444426906435731.sysout
   [junit4] >>> JVM J1 emitted unexpected output (verbatim) ----
   [junit4] #
   [junit4] # A fatal error has been detected by the Java Runtime Environment:
   [junit4] #
   [junit4] #  SIGSEGV (0xb) at pc=0x00007f7361b85dc9, pid=14953, tid=15015
   [junit4] #
   [junit4] # JRE version: Java(TM) SE Runtime Environment (9.0+11) (build 9.0.4+11)
   [junit4] # Java VM: Java HotSpot(TM) 64-Bit Server VM (9.0.4+11, mixed mode, tiered, parallel gc, linux-amd64)
   [junit4] # Problematic frame:
   [junit4] # V  [libjvm.so+0xc5adc9]  PhaseIdealLoop::split_up(Node*, Node*, Node*) [clone .part.40]+0x619
   [junit4] #
   [junit4] # No core dump will be written. Core dumps have been disabled. To enable core dumping, try "ulimit -c unlimited" before starting Java again
   [junit4] #
   [junit4] # An error report file with more information is saved as:
   [junit4] # /home/jenkins/workspace/Lucene-Solr-7.x-Linux/solr/build/solr-core/test/J1/hs_err_pid14953.log
   [junit4] #
   [junit4] # Compiler replay data is saved as:
   [junit4] # /home/jenkins/workspace/Lucene-Solr-7.x-Linux/solr/build/solr-core/test/J1/replay_pid14953.log
   [junit4] #
   [junit4] # If you would like to submit a bug report, please visit:
   [junit4] #   http://bugreport.java.com/bugreport/crash.jsp
   [junit4] #
   [junit4] <<< JVM J1: EOF ----

[...truncated 328 lines...]
   [junit4] ERROR: JVM J1 ended with an exception, command line: /home/jenkins/tools/java/64bit/jdk-9.0.4/bin/java -XX:-UseCompressedOops -XX:+UseParallelGC -XX:+HeapDumpOnOutOfMemoryError -XX:HeapDumpPath=/home/jenkins/workspace/Lucene-Solr-7.x-Linux/heapdumps -ea -esa --illegal-access=deny -Dtests.prefix=tests -Dtests.seed=71D8ECFC7436C65C -Xmx512M -Dtests.iters= -Dtests.verbose=false -Dtests.infostream=false -Dtests.codec=random -Dtests.postingsformat=random -Dtests.docvaluesformat=random -Dtests.locale=random -Dtests.timezone=random -Dtests.directory=random -Dtests.linedocsfile=europarl.lines.txt.gz -Dtests.luceneMatchVersion=7.5.0 -Dtests.cleanthreads=perClass -Djava.util.logging.config.file=/home/jenkins/workspace/Lucene-Solr-7.x-Linux/lucene/tools/junit4/logging.properties -Dtests.nightly=false -Dtests.weekly=false -Dtests.monster=false -Dtests.slow=true -Dtests.asserts=true -Dtests.multiplier=3 -DtempDir=./temp -Djava.io.tmpdir=./temp -Djunit4.tempDir=/home/jenkins/workspace/Lucene-Solr-7.x-Linux/solr/build/solr-core/test/temp -Dcommon.dir=/home/jenkins/workspace/Lucene-Solr-7.x-Linux/lucene -Dclover.db.dir=/home/jenkins/workspace/Lucene-Solr-7.x-Linux/lucene/build/clover/db -Djava.security.policy=/home/jenkins/workspace/Lucene-Solr-7.x-Linux/lucene/tools/junit4/solr-tests.policy -Dtests.LUCENE_VERSION=7.5.0 -Djetty.testMode=1 -Djetty.insecurerandom=1 -Dsolr.directoryFactory=org.apache.solr.core.MockDirectoryFactory -Djava.awt.headless=true -Djdk.map.althashing.threshold=0 -Dtests.src.home=/home/jenkins/workspace/Lucene-Solr-7.x-Linux -Djava.security.egd=file:/dev/./urandom -Djunit4.childvm.cwd=/home/jenkins/workspace/Lucene-Solr-7.x-Linux/solr/build/solr-core/test/J1 -Djunit4.childvm.id=1 -Djunit4.childvm.count=3 -Djava.security.manager=org.apache.lucene.util.TestSecurityManager -Dtests.filterstacks=true -Dtests.leaveTemporary=false -Dtests.badapples=false -classpath /home/jenkins/workspace/Lucene-Solr-7.x-Linux/solr/build/solr-core/classes/test:/home/jenkins/workspace/Lucene-Solr-7.x-Linux/solr/build/solr-test-framework/classes/java:/home/jenkins/workspace/Lucene-Solr-7.x-Linux/solr/test-framework/lib/junit4-ant-2.6.0.jar:/home/jenkins/workspace/Lucene-Solr-7.x-Linux/solr/core/src/test-files:/home/jenkins/workspace/Lucene-Solr-7.x-Linux/lucene/build/test-framework/classes/java:/home/jenkins/workspace/Lucene-Solr-7.x-Linux/lucene/build/codecs/classes/java:/home/jenkins/workspace/Lucene-Solr-7.x-Linux/solr/build/solr-solrj/classes/java:/home/jenkins/workspace/Lucene-Solr-7.x-Linux/solr/build/solr-core/classes/java:/home/jenkins/workspace/Lucene-Solr-7.x-Linux/lucene/build/analysis/common/lucene-analyzers-common-7.5.0-SNAPSHOT.jar:/home/jenkins/workspace/Lucene-Solr-7.x-Linux/lucene/build/analysis/kuromoji/lucene-analyzers-kuromoji-7.5.0-SNAPSHOT.jar:/home/jenkins/workspace/Lucene-Solr-7.x-Linux/lucene/build/analysis/nori/lucene-analyzers-nori-7.5.0-SNAPSHOT.jar:/home/jenkins/workspace/Lucene-Solr-7.x-Linux/lucene/build/analysis/phonetic/lucene-analyzers-phonetic-7.5.0-SNAPSHOT.jar:/home/jenkins/workspace/Lucene-Solr-7.x-Linux/lucene/build/codecs/lucene-codecs-7.5.0-SNAPSHOT.jar:/home/jenkins/workspace/Lucene-Solr-7.x-Linux/lucene/build/backward-codecs/lucene-backward-codecs-7.5.0-SNAPSHOT.jar:/home/jenkins/workspace/Lucene-Solr-7.x-Linux/lucene/build/highlighter/lucene-highlighter-7.5.0-SNAPSHOT.jar:/home/jenkins/workspace/Lucene-Solr-7.x-Linux/lucene/build/memory/lucene-memory-7.5.0-SNAPSHOT.jar:/home/jenkins/workspace/Lucene-Solr-7.x-Linux/lucene/build/misc/lucene-misc-7.5.0-SNAPSHOT.jar:/home/jenkins/workspace/Lucene-Solr-7.x-Linux/lucene/build/spatial-extras/lucene-spatial-extras-7.5.0-SNAPSHOT.jar:/home/jenkins/workspace/Lucene-Solr-7.x-Linux/lucene/build/spatial3d/lucene-spatial3d-7.5.0-SNAPSHOT.jar:/home/jenkins/workspace/Lucene-Solr-7.x-Linux/lucene/build/expressions/lucene-expressions-7.5.0-SNAPSHOT.jar:/home/jenkins/workspace/Lucene-Solr-7.x-Linux/lucene/build/suggest/lucene-suggest-7.5.0-SNAPSHOT.jar:/home/jenkins/workspace/Lucene-Solr-7.x-Linux/lucene/build/grouping/lucene-grouping-7.5.0-SNAPSHOT.jar:/home/jenkins/workspace/Lucene-Solr-7.x-Linux/lucene/build/queries/lucene-queries-7.5.0-SNAPSHOT.jar:/home/jenkins/workspace/Lucene-Solr-7.x-Linux/lucene/build/queryparser/lucene-queryparser-7.5.0-SNAPSHOT.jar:/home/jenkins/workspace/Lucene-Solr-7.x-Linux/lucene/build/join/lucene-join-7.5.0-SNAPSHOT.jar:/home/jenkins/workspace/Lucene-Solr-7.x-Linux/lucene/build/sandbox/lucene-sandbox-7.5.0-SNAPSHOT.jar:/home/jenkins/workspace/Lucene-Solr-7.x-Linux/lucene/build/classification/lucene-classification-7.5.0-SNAPSHOT.jar:/home/jenkins/workspace/Lucene-Solr-7.x-Linux/solr/core/lib/antlr4-runtime-4.5.1-1.jar:/home/jenkins/workspace/Lucene-Solr-7.x-Linux/solr/core/lib/asm-5.1.jar:/home/jenkins/workspace/Lucene-Solr-7.x-Linux/solr/core/lib/asm-commons-5.1.jar:/home/jenkins/workspace/Lucene-Solr-7.x-Linux/solr/core/lib/avatica-core-1.10.0.jar:/home/jenkins/workspace/Lucene-Solr-7.x-Linux/solr/core/lib/caffeine-2.4.0.jar:/home/jenkins/workspace/Lucene-Solr-7.x-Linux/solr/core/lib/calcite-core-1.13.0.jar:/home/jenkins/workspace/Lucene-Solr-7.x-Linux/solr/core/lib/calcite-linq4j-1.13.0.jar:/home/jenkins/workspace/Lucene-Solr-7.x-Linux/solr/core/lib/commons-cli-1.2.jar:/home/jenkins/workspace/Lucene-Solr-7.x-Linux/solr/core/lib/commons-codec-1.10.jar:/home/jenkins/workspace/Lucene-Solr-7.x-Linux/solr/core/lib/commons-collections-3.2.2.jar:/home/jenkins/workspace/Lucene-Solr-7.x-Linux/solr/core/lib/commons-compiler-2.7.6.jar:/home/jenkins/workspace/Lucene-Solr-7.x-Linux/solr/core/lib/commons-configuration-1.6.jar:/home/jenkins/workspace/Lucene-Solr-7.x-Linux/solr/core/lib/commons-exec-1.3.jar:/home/jenkins/workspace/Lucene-Solr-7.x-Linux/solr/core/lib/commons-fileupload-1.3.3.jar:/home/jenkins/workspace/Lucene-Solr-7.x-Linux/solr/core/lib/commons-io-2.5.jar:/home/jenkins/workspace/Lucene-Solr-7.x-Linux/solr/core/lib/commons-lang-2.6.jar:/home/jenkins/workspace/Lucene-Solr-7.x-Linux/solr/core/lib/commons-lang3-3.6.jar:/home/jenkins/workspace/Lucene-Solr-7.x-Linux/solr/core/lib/curator-client-2.8.0.jar:/home/jenkins/workspace/Lucene-Solr-7.x-Linux/solr/core/lib/curator-framework-2.8.0.jar:/home/jenkins/workspace/Lucene-Solr-7.x-Linux/solr/core/lib/curator-recipes-2.8.0.jar:/home/jenkins/workspace/Lucene-Solr-7.x-Linux/solr/core/lib/disruptor-3.4.0.jar:/home/jenkins/workspace/Lucene-Solr-7.x-Linux/solr/core/lib/dom4j-1.6.1.jar:/home/jenkins/workspace/Lucene-Solr-7.x-Linux/solr/core/lib/eigenbase-properties-1.1.5.jar:/home/jenkins/workspace/Lucene-Solr-7.x-Linux/solr/core/lib/guava-14.0.1.jar:/home/jenkins/workspace/Lucene-Solr-7.x-Linux/solr/core/lib/hadoop-annotations-2.7.4.jar:/home/jenkins/workspace/Lucene-Solr-7.x-Linux/solr/core/lib/hadoop-auth-2.7.4.jar:/home/jenkins/workspace/Lucene-Solr-7.x-Linux/solr/core/lib/hadoop-common-2.7.4.jar:/home/jenkins/workspace/Lucene-Solr-7.x-Linux/solr/core/lib/hadoop-hdfs-2.7.4.jar:/home/jenkins/workspace/Lucene-Solr-7.x-Linux/solr/core/lib/hppc-0.8.1.jar:/home/jenkins/workspace/Lucene-Solr-7.x-Linux/solr/core/lib/htrace-core-3.2.0-incubating.jar:/home/jenkins/workspace/Lucene-Solr-7.x-Linux/solr/core/lib/jackson-annotations-2.9.5.jar:/home/jenkins/workspace/Lucene-Solr-7.x-Linux/solr/core/lib/jackson-core-2.9.5.jar:/home/jenkins/workspace/Lucene-Solr-7.x-Linux/solr/core/lib/jackson-core-asl-1.9.13.jar:/home/jenkins/workspace/Lucene-Solr-7.x-Linux/solr/core/lib/jackson-databind-2.9.5.jar:/home/jenkins/workspace/Lucene-Solr-7.x-Linux/solr/core/lib/jackson-dataformat-smile-2.9.5.jar:/home/jenkins/workspace/Lucene-Solr-7.x-Linux/solr/core/lib/jackson-mapper-asl-1.9.13.jar:/home/jenkins/workspace/Lucene-Solr-7.x-Linux/solr/core/lib/janino-2.7.6.jar:/home/jenkins/workspace/Lucene-Solr-7.x-Linux/solr/core/lib/jcl-over-slf4j-1.7.24.jar:/home/jenkins/workspace/Lucene-Solr-7.x-Linux/solr/core/lib/joda-time-2.2.jar:/home/jenkins/workspace/Lucene-Solr-7.x-Linux/solr/core/lib/log4j-1.2-api-2.11.0.jar:/home/jenkins/workspace/Lucene-Solr-7.x-Linux/solr/core/lib/log4j-api-2.11.0.jar:/home/jenkins/workspace/Lucene-Solr-7.x-Linux/solr/core/lib/log4j-core-2.11.0.jar:/home/jenkins/workspace/Lucene-Solr-7.x-Linux/solr/core/lib/log4j-slf4j-impl-2.11.0.jar:/home/jenkins/workspace/Lucene-Solr-7.x-Linux/solr/core/lib/org.restlet-2.3.0.jar:/home/jenkins/workspace/Lucene-Solr-7.x-Linux/solr/core/lib/org.restlet.ext.servlet-2.3.0.jar:/home/jenkins/workspace/Lucene-Solr-7.x-Linux/solr/core/lib/protobuf-java-3.1.0.jar:/home/jenkins/workspace/Lucene-Solr-7.x-Linux/solr/core/lib/rrd4j-3.2.jar:/home/jenkins/workspace/Lucene-Solr-7.x-Linux/solr/core/lib/spatial4j-0.7.jar:/home/jenkins/workspace/Lucene-Solr-7.x-Linux/solr/core/lib/t-digest-3.1.jar:/home/jenkins/workspace/Lucene-Solr-7.x-Linux/solr/solrj/lib/commons-io-2.5.jar:/home/jenkins/workspace/Lucene-Solr-7.x-Linux/solr/solrj/lib/commons-math3-3.6.1.jar:/home/jenkins/workspace/Lucene-Solr-7.x-Linux/solr/solrj/lib/httpclient-4.5.3.jar:/home/jenkins/workspace/Lucene-Solr-7.x-Linux/solr/solrj/lib/httpcore-4.4.6.jar:/home/jenkins/workspace/Lucene-Solr-7.x-Linux/solr/solrj/lib/httpmime-4.5.3.jar:/home/jenkins/workspace/Lucene-Solr-7.x-Linux/solr/solrj/lib/jcl-over-slf4j-1.7.24.jar:/home/jenkins/workspace/Lucene-Solr-7.x-Linux/solr/solrj/lib/noggit-0.8.jar:/home/jenkins/workspace/Lucene-Solr-7.x-Linux/solr/solrj/lib/slf4j-api-1.7.24.jar:/home/jenkins/workspace/Lucene-Solr-7.x-Linux/solr/solrj/lib/stax2-api-3.1.4.jar:/home/jenkins/workspace/Lucene-Solr-7.x-Linux/solr/solrj/lib/woodstox-core-asl-4.4.1.jar:/home/jenkins/workspace/Lucene-Solr-7.x-Linux/solr/solrj/lib/zookeeper-3.4.11.jar:/home/jenkins/workspace/Lucene-Solr-7.x-Linux/solr/server/lib/gmetric4j-1.0.7.jar:/home/jenkins/workspace/Lucene-Solr-7.x-Linux/solr/server/lib/javax.servlet-api-3.1.0.jar:/home/jenkins/workspace/Lucene-Solr-7.x-Linux/solr/server/lib/jetty-continuation-9.4.11.v20180605.jar:/home/jenkins/workspace/Lucene-Solr-7.x-Linux/solr/server/lib/jetty-deploy-9.4.11.v20180605.jar:/home/jenkins/workspace/Lucene-Solr-7.x-Linux/solr/server/lib/jetty-http-9.4.11.v20180605.jar:/home/jenkins/workspace/Lucene-Solr-7.x-Linux/solr/server/lib/jetty-io-9.4.11.v20180605.jar:/home/jenkins/workspace/Lucene-Solr-7.x-Linux/solr/server/lib/jetty-jmx-9.4.11.v20180605.jar:/home/jenkins/workspace/Lucene-Solr-7.x-Linux/solr/server/lib/jetty-rewrite-9.4.11.v20180605.jar:/home/jenkins/workspace/Lucene-Solr-7.x-Linux/solr/server/lib/jetty-security-9.4.11.v20180605.jar:/home/jenkins/workspace/Lucene-Solr-7.x-Linux/solr/server/lib/jetty-server-9.4.11.v20180605.jar:/home/jenkins/workspace/Lucene-Solr-7.x-Linux/solr/server/lib/jetty-servlet-9.4.11.v20180605.jar:/home/jenkins/workspace/Lucene-Solr-7.x-Linux/solr/server/lib/jetty-servlets-9.4.11.v20180605.jar:/home/jenkins/workspace/Lucene-Solr-7.x-Linux/solr/server/lib/jetty-util-9.4.11.v20180605.jar:/home/jenkins/workspace/Lucene-Solr-7.x-Linux/solr/server/lib/jetty-webapp-9.4.11.v20180605.jar:/home/jenkins/workspace/Lucene-Solr-7.x-Linux/solr/server/lib/jetty-xml-9.4.11.v20180605.jar:/home/jenkins/workspace/Lucene-Solr-7.x-Linux/solr/server/lib/metrics-core-3.2.6.jar:/home/jenkins/workspace/Lucene-Solr-7.x-Linux/solr/server/lib/metrics-ganglia-3.2.6.jar:/home/jenkins/workspace/Lucene-Solr-7.x-Linux/solr/server/lib/metrics-graphite-3.2.6.jar:/home/jenkins/workspace/Lucene-Solr-7.x-Linux/solr/server/lib/metrics-jetty9-3.2.6.jar:/home/jenkins/workspace/Lucene-Solr-7.x-Linux/solr/server/lib/metrics-jvm-3.2.6.jar:/home/jenkins/workspace/Lucene-Solr-7.x-Linux/solr/example/example-DIH/solr/db/lib/derby-10.9.1.0.jar:/home/jenkins/workspace/Lucene-Solr-7.x-Linux/solr/example/example-DIH/solr/db/lib/hsqldb-2.4.0.jar:/home/jenkins/workspace/Lucene-Solr-7.x-Linux/lucene/build/core/classes/java:/home/jenkins/workspace/Lucene-Solr-7.x-Linux/lucene/test-framework/lib/junit-4.10.jar:/home/jenkins/workspace/Lucene-Solr-7.x-Linux/lucene/test-framework/lib/randomizedtesting-runner-2.6.0.jar:/home/jenkins/workspace/Lucene-Solr-7.x-Linux/solr/core/test-lib/antlr-2.7.7.jar:/home/jenkins/workspace/Lucene-Solr-7.x-Linux/solr/core/test-lib/antlr4-runtime-4.5.1-1.jar:/home/jenkins/workspace/Lucene-Solr-7.x-Linux/solr/core/test-lib/apacheds-core-2.0.0-M15.jar:/home/jenkins/workspace/Lucene-Solr-7.x-Linux/solr/core/test-lib/apacheds-core-api-2.0.0-M15.jar:/home/jenkins/workspace/Lucene-Solr-7.x-Linux/solr/core/test-lib/apacheds-core-avl-2.0.0-M15.jar:/home/jenkins/workspace/Lucene-Solr-7.x-Linux/solr/core/test-lib/apacheds-core-shared-2.0.0-M15.jar:/home/jenkins/workspace/Lucene-Solr-7.x-Linux/solr/core/test-lib/apacheds-i18n-2.0.0-M15.jar:/home/jenkins/workspace/Lucene-Solr-7.x-Linux/solr/core/test-lib/apacheds-interceptor-kerberos-2.0.0-M15.jar:/home/jenkins/workspace/Lucene-Solr-7.x-Linux/solr/core/test-lib/apacheds-interceptors-admin-2.0.0-M15.jar:/home/jenkins/workspace/Lucene-Solr-7.x-Linux/solr/core/test-lib/apacheds-interceptors-authn-2.0.0-M15.jar:/home/jenkins/workspace/Lucene-Solr-7.x-Linux/solr/core/test-lib/apacheds-interceptors-authz-2.0.0-M15.jar:/home/jenkins/workspace/Lucene-Solr-7.x-Linux/solr/core/test-lib/apacheds-interceptors-changelog-2.0.0-M15.jar:/home/jenkins/workspace/Lucene-Solr-7.x-Linux/solr/core/test-lib/apacheds-interceptors-collective-2.0.0-M15.jar:/home/jenkins/workspace/Lucene-Solr-7.x-Linux/solr/core/test-lib/apacheds-interceptors-event-2.0.0-M15.jar:/home/jenkins/workspace/Lucene-Solr-7.x-Linux/solr/core/test-lib/apacheds-interceptors-exception-2.0.0-M15.jar:/home/jenkins/workspace/Lucene-Solr-7.x-Linux/solr/core/test-lib/apacheds-interceptors-journal-2.0.0-M15.jar:/home/jenkins/workspace/Lucene-Solr-7.x-Linux/solr/core/test-lib/apacheds-interceptors-normalization-2.0.0-M15.jar:/home/jenkins/workspace/Lucene-Solr-7.x-Linux/solr/core/test-lib/apacheds-interceptors-operational-2.0.0-M15.jar:/home/jenkins/workspace/Lucene-Solr-7.x-Linux/solr/core/test-lib/apacheds-interceptors-referral-2.0.0-M15.jar:/home/jenkins/workspace/Lucene-Solr-7.x-Linux/solr/core/test-lib/apacheds-interceptors-schema-2.0.0-M15.jar:/home/jenkins/workspace/Lucene-Solr-7.x-Linux/solr/core/test-lib/apacheds-interceptors-subtree-2.0.0-M15.jar:/home/jenkins/workspace/Lucene-Solr-7.x-Linux/solr/core/test-lib/apacheds-interceptors-trigger-2.0.0-M15.jar:/home/jenkins/workspace/Lucene-Solr-7.x-Linux/solr/core/test-lib/apacheds-jdbm-partition-2.0.0-M15.jar:/home/jenkins/workspace/Lucene-Solr-7.x-Linux/solr/core/test-lib/apacheds-jdbm1-2.0.0-M2.jar:/home/jenkins/workspace/Lucene-Solr-7.x-Linux/solr/core/test-lib/apacheds-kerberos-codec-2.0.0-M15.jar:/home/jenkins/workspace/Lucene-Solr-7.x-Linux/solr/core/test-lib/apacheds-ldif-partition-2.0.0-M15.jar:/home/jenkins/workspace/Lucene-Solr-7.x-Linux/solr/core/test-lib/apacheds-mavibot-partition-2.0.0-M15.jar:/home/jenkins/workspace/Lucene-Solr-7.x-Linux/solr/core/test-lib/apacheds-protocol-kerberos-2.0.0-M15.jar:/home/jenkins/workspace/Lucene-Solr-7.x-Linux/solr/core/test-lib/apacheds-protocol-ldap-2.0.0-M15.jar:/home/jenkins/workspace/Lucene-Solr-7.x-Linux/solr/core/test-lib/apacheds-protocol-shared-2.0.0-M15.jar:/home/jenkins/workspace/Lucene-Solr-7.x-Linux/solr/core/test-lib/apacheds-xdbm-partition-2.0.0-M15.jar:/home/jenkins/workspace/Lucene-Solr-7.x-Linux/solr/core/test-lib/api-all-1.0.0-M20.jar:/home/jenkins/workspace/Lucene-Solr-7.x-Linux/solr/core/test-lib/bcprov-jdk15on-1.54.jar:/home/jenkins/workspace/Lucene-Solr-7.x-Linux/solr/core/test-lib/byte-buddy-1.6.2.jar:/home/jenkins/workspace/Lucene-Solr-7.x-Linux/solr/core/test-lib/commons-collections-3.2.2.jar:/home/jenkins/workspace/Lucene-Solr-7.x-Linux/solr/core/test-lib/commons-math3-3.6.1.jar:/home/jenkins/workspace/Lucene-Solr-7.x-Linux/solr/core/test-lib/ehcache-core-2.4.4.jar:/home/jenkins/workspace/Lucene-Solr-7.x-Linux/solr/core/test-lib/hadoop-common-2.7.4-tests.jar:/home/jenkins/workspace/Lucene-Solr-7.x-Linux/solr/core/test-lib/hadoop-hdfs-2.7.4-tests.jar:/home/jenkins/workspace/Lucene-Solr-7.x-Linux/solr/core/test-lib/hadoop-minikdc-2.7.4.jar:/home/jenkins/workspace/Lucene-Solr-7.x-Linux/solr/core/test-lib/htrace-core-3.2.0-incubating.jar:/home/jenkins/workspace/Lucene-Solr-7.x-Linux/solr/core/test-lib/jersey-core-1.9.jar:/home/jenkins/workspace/Lucene-Solr-7.x-Linux/solr/core/test-lib/jersey-server-1.9.jar:/home/jenkins/workspace/Lucene-Solr-7.x-Linux/solr/core/test-lib/jetty-6.1.26.jar:/home/jenkins/workspace/Lucene-Solr-7.x-Linux/solr/core/test-lib/jetty-sslengine-6.1.26.jar:/home/jenkins/workspace/Lucene-Solr-7.x-Linux/solr/core/test-lib/jetty-util-6.1.26.jar:/home/jenkins/workspace/Lucene-Solr-7.x-Linux/solr/core/test-lib/mina-core-2.0.0-M5.jar:/home/jenkins/workspace/Lucene-Solr-7.x-Linux/solr/core/test-lib/mockito-core-2.6.2.jar:/home/jenkins/workspace/Lucene-Solr-7.x-Linux/solr/core/test-lib/netty-all-4.0.36.Final.jar:/home/jenkins/workspace/Lucene-Solr-7.x-Linux/solr/core/test-lib/objenesis-2.5.jar:/home/jenkins/workspace/Lucene-Solr-7.x-Linux/lucene/build/analysis/icu/lucene-analyzers-icu-7.5.0-SNAPSHOT.jar:/home/jenkins/workspace/Lucene-Solr-7.x-Linux/solr/build/contrib/solr-analysis-extras/classes/java:/home/jenkins/workspace/Lucene-Solr-7.x-Linux/lucene/build/queryparser/classes/test:/home/jenkins/workspace/Lucene-Solr-7.x-Linux/lucene/build/backward-codecs/classes/test:/home/jenkins/workspace/Lucene-Solr-7.x-Linux/solr/contrib/analysis-extras/lib/icu4j-62.1.jar:/var/lib/jenkins/tools/hudson.tasks.Ant_AntInstallation/ANT_1.8.2/lib/ant-launcher.jar:/home/jenkins/.ant/lib/ivy-2.4.0.jar:/var/lib/jenkins/tools/hudson.tasks.Ant_AntInstallation/ANT_1.8.2/lib/ant-netrexx.jar:/var/lib/jenkins/tools/hudson.tasks.Ant_AntInstallation/ANT_1.8.2/lib/ant-apache-xalan2.jar:/var/lib/jenkins/tools/hudson.tasks.Ant_AntInstallation/ANT_1.8.2/lib/ant.jar:/var/lib/jenkins/tools/hudson.tasks.Ant_AntInstallation/ANT_1.8.2/lib/ant-javamail.jar:/var/lib/jenkins/tools/hudson.tasks.Ant_AntInstallation/ANT_1.8.2/lib/ant-commons-net.jar:/var/lib/jenkins/tools/hudson.tasks.Ant_AntInstallation/ANT_1.8.2/lib/ant-apache-regexp.jar:/var/lib/jenkins/tools/hudson.tasks.Ant_AntInstallation/ANT_1.8.2/lib/ant-apache-oro.jar:/var/lib/jenkins/tools/hudson.tasks.Ant_AntInstallation/ANT_1.8.2/lib/ant-jmf.jar:/var/lib/jenkins/tools/hudson.tasks.Ant_AntInstallation/ANT_1.8.2/lib/ant-apache-log4j.jar:/var/lib/jenkins/tools/hudson.tasks.Ant_AntInstallation/ANT_1.8.2/lib/ant-jsch.jar:/var/lib/jenkins/tools/hudson.tasks.Ant_AntInstallation/ANT_1.8.2/lib/ant-jai.jar:/var/lib/jenkins/tools/hudson.tasks.Ant_AntInstallation/ANT_1.8.2/lib/ant-apache-bsf.jar:/var/lib/jenkins/tools/hudson.tasks.Ant_AntInstallation/ANT_1.8.2/lib/ant-junit4.jar:/var/lib/jenkins/tools/hudson.tasks.Ant_AntInstallation/ANT_1.8.2/lib/ant-apache-resolver.jar:/var/lib/jenkins/tools/hudson.tasks.Ant_AntInstallation/ANT_1.8.2/lib/ant-apache-bcel.jar:/var/lib/jenkins/tools/hudson.tasks.Ant_AntInstallation/ANT_1.8.2/lib/ant-junit.jar:/var/lib/jenkins/tools/hudson.tasks.Ant_AntInstallation/ANT_1.8.2/lib/ant-jdepend.jar:/var/lib/jenkins/tools/hudson.tasks.Ant_AntInstallation/ANT_1.8.2/lib/ant-testutil.jar:/var/lib/jenkins/tools/hudson.tasks.Ant_AntInstallation/ANT_1.8.2/lib/ant-antlr.jar:/var/lib/jenkins/tools/hudson.tasks.Ant_AntInstallation/ANT_1.8.2/lib/ant-swing.jar:/var/lib/jenkins/tools/hudson.tasks.Ant_AntInstallation/ANT_1.8.2/lib/ant-commons-logging.jar:/home/jenkins/.ivy2/cache/com.carrotsearch.randomizedtesting/junit4-ant/jars/junit4-ant-2.6.0.jar com.carrotsearch.ant.tasks.junit4.slave.SlaveMainSafe -eventsfile /home/jenkins/workspace/Lucene-Solr-7.x-Linux/solr/build/solr-core/test/temp/junit4-J1-20180901_193654_16410246484110328707556.events @/home/jenkins/workspace/Lucene-Solr-7.x-Linux/solr/build/solr-core/test/temp/junit4-J1-20180901_193654_16412803812582781087533.suites -stdin
   [junit4] ERROR: JVM J1 ended with an exception: Forked process returned with error code: 134. Very likely a JVM crash.  See process stdout at: /home/jenkins/workspace/Lucene-Solr-7.x-Linux/solr/build/solr-core/test/temp/junit4-J1-20180901_193654_1646421444426906435731.sysout
   [junit4] 	at com.carrotsearch.ant.tasks.junit4.JUnit4.executeSlave(JUnit4.java:1519)
   [junit4] 	at com.carrotsearch.ant.tasks.junit4.JUnit4.access$000(JUnit4.java:126)
   [junit4] 	at com.carrotsearch.ant.tasks.junit4.JUnit4$2.call(JUnit4.java:982)
   [junit4] 	at com.carrotsearch.ant.tasks.junit4.JUnit4$2.call(JUnit4.java:979)
   [junit4] 	at java.base/java.util.concurrent.FutureTask.run(FutureTask.java:264)
   [junit4] 	at java.base/java.util.concurrent.ThreadPoolExecutor.runWorker(ThreadPoolExecutor.java:1167)
   [junit4] 	at java.base/java.util.concurrent.ThreadPoolExecutor$Worker.run(ThreadPoolExecutor.java:641)
   [junit4] 	at java.base/java.lang.Thread.run(Thread.java:844)

BUILD FAILED
/home/jenkins/workspace/Lucene-Solr-7.x-Linux/build.xml:633: The following error occurred while executing this line:
/home/jenkins/workspace/Lucene-Solr-7.x-Linux/build.xml:577: The following error occurred while executing this line:
/home/jenkins/workspace/Lucene-Solr-7.x-Linux/build.xml:59: The following error occurred while executing this line:
/home/jenkins/workspace/Lucene-Solr-7.x-Linux/solr/build.xml:267: The following error occurred while executing this line:
/home/jenkins/workspace/Lucene-Solr-7.x-Linux/solr/common-build.xml:558: The following error occurred while executing this line:
/home/jenkins/workspace/Lucene-Solr-7.x-Linux/lucene/common-build.xml:1568: The following error occurred while executing this line:
/home/jenkins/workspace/Lucene-Solr-7.x-Linux/lucene/common-build.xml:1092: At least one slave process threw an exception, first: Forked process returned with error code: 134. Very likely a JVM crash.  See process stdout at: /home/jenkins/workspace/Lucene-Solr-7.x-Linux/solr/build/solr-core/test/temp/junit4-J1-20180901_193654_1646421444426906435731.sysout

Total time: 78 minutes 58 seconds
Build step 'Invoke Ant' marked build as failure
Archiving artifacts
Setting ANT_1_8_2_HOME=/var/lib/jenkins/tools/hudson.tasks.Ant_AntInstallation/ANT_1.8.2
[WARNINGS] Skipping publisher since build result is FAILURE
Recording test results
Setting ANT_1_8_2_HOME=/var/lib/jenkins/tools/hudson.tasks.Ant_AntInstallation/ANT_1.8.2
Email was triggered for: Failure - Any
Sending email for trigger: Failure - Any
Setting ANT_1_8_2_HOME=/var/lib/jenkins/tools/hudson.tasks.Ant_AntInstallation/ANT_1.8.2
Setting ANT_1_8_2_HOME=/var/lib/jenkins/tools/hudson.tasks.Ant_AntInstallation/ANT_1.8.2
Setting ANT_1_8_2_HOME=/var/lib/jenkins/tools/hudson.tasks.Ant_AntInstallation/ANT_1.8.2
Setting ANT_1_8_2_HOME=/var/lib/jenkins/tools/hudson.tasks.Ant_AntInstallation/ANT_1.8.2

Mime
View raw message