lucene-dev mailing list archives

Site index · List index
Message view « Date » · « Thread »
Top « Date » · « Thread »
From Policeman Jenkins Server <jenk...@thetaphi.de>
Subject [JENKINS] Lucene-Solr-master-Windows (64bit/jdk-9.0.4) - Build # 7500 - Still unstable!
Date Sun, 02 Sep 2018 10:05:38 GMT
Build: https://jenkins.thetaphi.de/job/Lucene-Solr-master-Windows/7500/
Java: 64bit/jdk-9.0.4 -XX:-UseCompressedOops -XX:+UseParallelGC

4 tests failed.
FAILED:  junit.framework.TestSuite.org.apache.solr.cloud.TestCloudRecovery

Error Message:
Error from server at http://127.0.0.1:50690/solr: create the collection time out:180s

Stack Trace:
org.apache.solr.client.solrj.impl.HttpSolrClient$RemoteSolrException: Error from server at http://127.0.0.1:50690/solr: create the collection time out:180s
	at __randomizedtesting.SeedInfo.seed([CBE3CBC1A5DADDB4]:0)
	at org.apache.solr.client.solrj.impl.HttpSolrClient.executeMethod(HttpSolrClient.java:643)
	at org.apache.solr.client.solrj.impl.HttpSolrClient.request(HttpSolrClient.java:255)
	at org.apache.solr.client.solrj.impl.HttpSolrClient.request(HttpSolrClient.java:244)
	at org.apache.solr.client.solrj.impl.LBHttpSolrClient.doRequest(LBHttpSolrClient.java:483)
	at org.apache.solr.client.solrj.impl.LBHttpSolrClient.request(LBHttpSolrClient.java:413)
	at org.apache.solr.client.solrj.impl.CloudSolrClient.sendRequest(CloudSolrClient.java:1109)
	at org.apache.solr.client.solrj.impl.CloudSolrClient.requestWithRetryOnStaleState(CloudSolrClient.java:886)
	at org.apache.solr.client.solrj.impl.CloudSolrClient.request(CloudSolrClient.java:819)
	at org.apache.solr.client.solrj.SolrRequest.process(SolrRequest.java:194)
	at org.apache.solr.client.solrj.SolrRequest.process(SolrRequest.java:211)
	at org.apache.solr.cloud.TestCloudRecovery.setupCluster(TestCloudRecovery.java:69)
	at java.base/jdk.internal.reflect.NativeMethodAccessorImpl.invoke0(Native Method)
	at java.base/jdk.internal.reflect.NativeMethodAccessorImpl.invoke(NativeMethodAccessorImpl.java:62)
	at java.base/jdk.internal.reflect.DelegatingMethodAccessorImpl.invoke(DelegatingMethodAccessorImpl.java:43)
	at java.base/java.lang.reflect.Method.invoke(Method.java:564)
	at com.carrotsearch.randomizedtesting.RandomizedRunner.invoke(RandomizedRunner.java:1737)
	at com.carrotsearch.randomizedtesting.RandomizedRunner$6.evaluate(RandomizedRunner.java:874)
	at com.carrotsearch.randomizedtesting.RandomizedRunner$7.evaluate(RandomizedRunner.java:890)
	at com.carrotsearch.randomizedtesting.rules.StatementAdapter.evaluate(StatementAdapter.java:36)
	at com.carrotsearch.randomizedtesting.rules.SystemPropertiesRestoreRule$1.evaluate(SystemPropertiesRestoreRule.java:57)
	at org.apache.lucene.util.AbstractBeforeAfterRule$1.evaluate(AbstractBeforeAfterRule.java:45)
	at com.carrotsearch.randomizedtesting.rules.StatementAdapter.evaluate(StatementAdapter.java:36)
	at org.apache.lucene.util.TestRuleStoreClassName$1.evaluate(TestRuleStoreClassName.java:41)
	at com.carrotsearch.randomizedtesting.rules.NoShadowingOrOverridesOnMethodsRule$1.evaluate(NoShadowingOrOverridesOnMethodsRule.java:40)
	at com.carrotsearch.randomizedtesting.rules.NoShadowingOrOverridesOnMethodsRule$1.evaluate(NoShadowingOrOverridesOnMethodsRule.java:40)
	at com.carrotsearch.randomizedtesting.rules.StatementAdapter.evaluate(StatementAdapter.java:36)
	at com.carrotsearch.randomizedtesting.rules.StatementAdapter.evaluate(StatementAdapter.java:36)
	at org.apache.lucene.util.TestRuleAssertionsRequired$1.evaluate(TestRuleAssertionsRequired.java:53)
	at org.apache.lucene.util.TestRuleMarkFailure$1.evaluate(TestRuleMarkFailure.java:47)
	at org.apache.lucene.util.TestRuleIgnoreAfterMaxFailures$1.evaluate(TestRuleIgnoreAfterMaxFailures.java:64)
	at org.apache.lucene.util.TestRuleIgnoreTestSuites$1.evaluate(TestRuleIgnoreTestSuites.java:54)
	at com.carrotsearch.randomizedtesting.rules.StatementAdapter.evaluate(StatementAdapter.java:36)
	at com.carrotsearch.randomizedtesting.ThreadLeakControl$StatementRunner.run(ThreadLeakControl.java:368)
	at java.base/java.lang.Thread.run(Thread.java:844)


FAILED:  org.apache.solr.handler.RequestLoggingTest.testLogBeforeExecuteWithCoreLogger

Error Message:


Stack Trace:
java.lang.AssertionError
	at __randomizedtesting.SeedInfo.seed([CBE3CBC1A5DADDB4:765CB4F5B13B622]:0)
	at org.junit.Assert.fail(Assert.java:92)
	at org.junit.Assert.assertTrue(Assert.java:43)
	at org.junit.Assert.assertTrue(Assert.java:54)
	at org.apache.solr.handler.RequestLoggingTest.testLogBeforeExecute(RequestLoggingTest.java:88)
	at org.apache.solr.handler.RequestLoggingTest.testLogBeforeExecuteWithCoreLogger(RequestLoggingTest.java:65)
	at java.base/jdk.internal.reflect.NativeMethodAccessorImpl.invoke0(Native Method)
	at java.base/jdk.internal.reflect.NativeMethodAccessorImpl.invoke(NativeMethodAccessorImpl.java:62)
	at java.base/jdk.internal.reflect.DelegatingMethodAccessorImpl.invoke(DelegatingMethodAccessorImpl.java:43)
	at java.base/java.lang.reflect.Method.invoke(Method.java:564)
	at com.carrotsearch.randomizedtesting.RandomizedRunner.invoke(RandomizedRunner.java:1737)
	at com.carrotsearch.randomizedtesting.RandomizedRunner$8.evaluate(RandomizedRunner.java:934)
	at com.carrotsearch.randomizedtesting.RandomizedRunner$9.evaluate(RandomizedRunner.java:970)
	at com.carrotsearch.randomizedtesting.RandomizedRunner$10.evaluate(RandomizedRunner.java:984)
	at com.carrotsearch.randomizedtesting.rules.SystemPropertiesRestoreRule$1.evaluate(SystemPropertiesRestoreRule.java:57)
	at org.apache.lucene.util.TestRuleSetupTeardownChained$1.evaluate(TestRuleSetupTeardownChained.java:49)
	at org.apache.lucene.util.AbstractBeforeAfterRule$1.evaluate(AbstractBeforeAfterRule.java:45)
	at org.apache.lucene.util.TestRuleThreadAndTestName$1.evaluate(TestRuleThreadAndTestName.java:48)
	at org.apache.lucene.util.TestRuleIgnoreAfterMaxFailures$1.evaluate(TestRuleIgnoreAfterMaxFailures.java:64)
	at org.apache.lucene.util.TestRuleMarkFailure$1.evaluate(TestRuleMarkFailure.java:47)
	at com.carrotsearch.randomizedtesting.rules.StatementAdapter.evaluate(StatementAdapter.java:36)
	at com.carrotsearch.randomizedtesting.ThreadLeakControl$StatementRunner.run(ThreadLeakControl.java:368)
	at com.carrotsearch.randomizedtesting.ThreadLeakControl.forkTimeoutingTask(ThreadLeakControl.java:817)
	at com.carrotsearch.randomizedtesting.ThreadLeakControl$3.evaluate(ThreadLeakControl.java:468)
	at com.carrotsearch.randomizedtesting.RandomizedRunner.runSingleTest(RandomizedRunner.java:943)
	at com.carrotsearch.randomizedtesting.RandomizedRunner$5.evaluate(RandomizedRunner.java:829)
	at com.carrotsearch.randomizedtesting.RandomizedRunner$6.evaluate(RandomizedRunner.java:879)
	at com.carrotsearch.randomizedtesting.RandomizedRunner$7.evaluate(RandomizedRunner.java:890)
	at com.carrotsearch.randomizedtesting.rules.StatementAdapter.evaluate(StatementAdapter.java:36)
	at com.carrotsearch.randomizedtesting.rules.SystemPropertiesRestoreRule$1.evaluate(SystemPropertiesRestoreRule.java:57)
	at org.apache.lucene.util.AbstractBeforeAfterRule$1.evaluate(AbstractBeforeAfterRule.java:45)
	at com.carrotsearch.randomizedtesting.rules.StatementAdapter.evaluate(StatementAdapter.java:36)
	at org.apache.lucene.util.TestRuleStoreClassName$1.evaluate(TestRuleStoreClassName.java:41)
	at com.carrotsearch.randomizedtesting.rules.NoShadowingOrOverridesOnMethodsRule$1.evaluate(NoShadowingOrOverridesOnMethodsRule.java:40)
	at com.carrotsearch.randomizedtesting.rules.NoShadowingOrOverridesOnMethodsRule$1.evaluate(NoShadowingOrOverridesOnMethodsRule.java:40)
	at com.carrotsearch.randomizedtesting.rules.StatementAdapter.evaluate(StatementAdapter.java:36)
	at com.carrotsearch.randomizedtesting.rules.StatementAdapter.evaluate(StatementAdapter.java:36)
	at org.apache.lucene.util.TestRuleAssertionsRequired$1.evaluate(TestRuleAssertionsRequired.java:53)
	at org.apache.lucene.util.TestRuleMarkFailure$1.evaluate(TestRuleMarkFailure.java:47)
	at org.apache.lucene.util.TestRuleIgnoreAfterMaxFailures$1.evaluate(TestRuleIgnoreAfterMaxFailures.java:64)
	at org.apache.lucene.util.TestRuleIgnoreTestSuites$1.evaluate(TestRuleIgnoreTestSuites.java:54)
	at com.carrotsearch.randomizedtesting.rules.StatementAdapter.evaluate(StatementAdapter.java:36)
	at com.carrotsearch.randomizedtesting.ThreadLeakControl$StatementRunner.run(ThreadLeakControl.java:368)
	at java.base/java.lang.Thread.run(Thread.java:844)


FAILED:  org.apache.solr.handler.RequestLoggingTest.testLogBeforeExecuteWithCoreLogger

Error Message:


Stack Trace:
java.lang.AssertionError
	at __randomizedtesting.SeedInfo.seed([CBE3CBC1A5DADDB4:765CB4F5B13B622]:0)
	at org.junit.Assert.fail(Assert.java:92)
	at org.junit.Assert.assertTrue(Assert.java:43)
	at org.junit.Assert.assertTrue(Assert.java:54)
	at org.apache.solr.handler.RequestLoggingTest.testLogBeforeExecute(RequestLoggingTest.java:88)
	at org.apache.solr.handler.RequestLoggingTest.testLogBeforeExecuteWithCoreLogger(RequestLoggingTest.java:65)
	at java.base/jdk.internal.reflect.NativeMethodAccessorImpl.invoke0(Native Method)
	at java.base/jdk.internal.reflect.NativeMethodAccessorImpl.invoke(NativeMethodAccessorImpl.java:62)
	at java.base/jdk.internal.reflect.DelegatingMethodAccessorImpl.invoke(DelegatingMethodAccessorImpl.java:43)
	at java.base/java.lang.reflect.Method.invoke(Method.java:564)
	at com.carrotsearch.randomizedtesting.RandomizedRunner.invoke(RandomizedRunner.java:1737)
	at com.carrotsearch.randomizedtesting.RandomizedRunner$8.evaluate(RandomizedRunner.java:934)
	at com.carrotsearch.randomizedtesting.RandomizedRunner$9.evaluate(RandomizedRunner.java:970)
	at com.carrotsearch.randomizedtesting.RandomizedRunner$10.evaluate(RandomizedRunner.java:984)
	at com.carrotsearch.randomizedtesting.rules.SystemPropertiesRestoreRule$1.evaluate(SystemPropertiesRestoreRule.java:57)
	at org.apache.lucene.util.TestRuleSetupTeardownChained$1.evaluate(TestRuleSetupTeardownChained.java:49)
	at org.apache.lucene.util.AbstractBeforeAfterRule$1.evaluate(AbstractBeforeAfterRule.java:45)
	at org.apache.lucene.util.TestRuleThreadAndTestName$1.evaluate(TestRuleThreadAndTestName.java:48)
	at org.apache.lucene.util.TestRuleIgnoreAfterMaxFailures$1.evaluate(TestRuleIgnoreAfterMaxFailures.java:64)
	at org.apache.lucene.util.TestRuleMarkFailure$1.evaluate(TestRuleMarkFailure.java:47)
	at com.carrotsearch.randomizedtesting.rules.StatementAdapter.evaluate(StatementAdapter.java:36)
	at com.carrotsearch.randomizedtesting.ThreadLeakControl$StatementRunner.run(ThreadLeakControl.java:368)
	at com.carrotsearch.randomizedtesting.ThreadLeakControl.forkTimeoutingTask(ThreadLeakControl.java:817)
	at com.carrotsearch.randomizedtesting.ThreadLeakControl$3.evaluate(ThreadLeakControl.java:468)
	at com.carrotsearch.randomizedtesting.RandomizedRunner.runSingleTest(RandomizedRunner.java:943)
	at com.carrotsearch.randomizedtesting.RandomizedRunner$5.evaluate(RandomizedRunner.java:829)
	at com.carrotsearch.randomizedtesting.RandomizedRunner$6.evaluate(RandomizedRunner.java:879)
	at com.carrotsearch.randomizedtesting.RandomizedRunner$7.evaluate(RandomizedRunner.java:890)
	at com.carrotsearch.randomizedtesting.rules.StatementAdapter.evaluate(StatementAdapter.java:36)
	at com.carrotsearch.randomizedtesting.rules.SystemPropertiesRestoreRule$1.evaluate(SystemPropertiesRestoreRule.java:57)
	at org.apache.lucene.util.AbstractBeforeAfterRule$1.evaluate(AbstractBeforeAfterRule.java:45)
	at com.carrotsearch.randomizedtesting.rules.StatementAdapter.evaluate(StatementAdapter.java:36)
	at org.apache.lucene.util.TestRuleStoreClassName$1.evaluate(TestRuleStoreClassName.java:41)
	at com.carrotsearch.randomizedtesting.rules.NoShadowingOrOverridesOnMethodsRule$1.evaluate(NoShadowingOrOverridesOnMethodsRule.java:40)
	at com.carrotsearch.randomizedtesting.rules.NoShadowingOrOverridesOnMethodsRule$1.evaluate(NoShadowingOrOverridesOnMethodsRule.java:40)
	at com.carrotsearch.randomizedtesting.rules.StatementAdapter.evaluate(StatementAdapter.java:36)
	at com.carrotsearch.randomizedtesting.rules.StatementAdapter.evaluate(StatementAdapter.java:36)
	at org.apache.lucene.util.TestRuleAssertionsRequired$1.evaluate(TestRuleAssertionsRequired.java:53)
	at org.apache.lucene.util.TestRuleMarkFailure$1.evaluate(TestRuleMarkFailure.java:47)
	at org.apache.lucene.util.TestRuleIgnoreAfterMaxFailures$1.evaluate(TestRuleIgnoreAfterMaxFailures.java:64)
	at org.apache.lucene.util.TestRuleIgnoreTestSuites$1.evaluate(TestRuleIgnoreTestSuites.java:54)
	at com.carrotsearch.randomizedtesting.rules.StatementAdapter.evaluate(StatementAdapter.java:36)
	at com.carrotsearch.randomizedtesting.ThreadLeakControl$StatementRunner.run(ThreadLeakControl.java:368)
	at java.base/java.lang.Thread.run(Thread.java:844)


FAILED:  org.apache.solr.handler.RequestLoggingTest.testLogBeforeExecuteWithRequestLogger

Error Message:


Stack Trace:
java.lang.AssertionError
	at __randomizedtesting.SeedInfo.seed([CBE3CBC1A5DADDB4:7A8AEBCE082C65FA]:0)
	at org.junit.Assert.fail(Assert.java:92)
	at org.junit.Assert.assertTrue(Assert.java:43)
	at org.junit.Assert.assertTrue(Assert.java:54)
	at org.apache.solr.handler.RequestLoggingTest.testLogBeforeExecute(RequestLoggingTest.java:88)
	at org.apache.solr.handler.RequestLoggingTest.testLogBeforeExecuteWithRequestLogger(RequestLoggingTest.java:71)
	at java.base/jdk.internal.reflect.NativeMethodAccessorImpl.invoke0(Native Method)
	at java.base/jdk.internal.reflect.NativeMethodAccessorImpl.invoke(NativeMethodAccessorImpl.java:62)
	at java.base/jdk.internal.reflect.DelegatingMethodAccessorImpl.invoke(DelegatingMethodAccessorImpl.java:43)
	at java.base/java.lang.reflect.Method.invoke(Method.java:564)
	at com.carrotsearch.randomizedtesting.RandomizedRunner.invoke(RandomizedRunner.java:1737)
	at com.carrotsearch.randomizedtesting.RandomizedRunner$8.evaluate(RandomizedRunner.java:934)
	at com.carrotsearch.randomizedtesting.RandomizedRunner$9.evaluate(RandomizedRunner.java:970)
	at com.carrotsearch.randomizedtesting.RandomizedRunner$10.evaluate(RandomizedRunner.java:984)
	at com.carrotsearch.randomizedtesting.rules.SystemPropertiesRestoreRule$1.evaluate(SystemPropertiesRestoreRule.java:57)
	at org.apache.lucene.util.TestRuleSetupTeardownChained$1.evaluate(TestRuleSetupTeardownChained.java:49)
	at org.apache.lucene.util.AbstractBeforeAfterRule$1.evaluate(AbstractBeforeAfterRule.java:45)
	at org.apache.lucene.util.TestRuleThreadAndTestName$1.evaluate(TestRuleThreadAndTestName.java:48)
	at org.apache.lucene.util.TestRuleIgnoreAfterMaxFailures$1.evaluate(TestRuleIgnoreAfterMaxFailures.java:64)
	at org.apache.lucene.util.TestRuleMarkFailure$1.evaluate(TestRuleMarkFailure.java:47)
	at com.carrotsearch.randomizedtesting.rules.StatementAdapter.evaluate(StatementAdapter.java:36)
	at com.carrotsearch.randomizedtesting.ThreadLeakControl$StatementRunner.run(ThreadLeakControl.java:368)
	at com.carrotsearch.randomizedtesting.ThreadLeakControl.forkTimeoutingTask(ThreadLeakControl.java:817)
	at com.carrotsearch.randomizedtesting.ThreadLeakControl$3.evaluate(ThreadLeakControl.java:468)
	at com.carrotsearch.randomizedtesting.RandomizedRunner.runSingleTest(RandomizedRunner.java:943)
	at com.carrotsearch.randomizedtesting.RandomizedRunner$5.evaluate(RandomizedRunner.java:829)
	at com.carrotsearch.randomizedtesting.RandomizedRunner$6.evaluate(RandomizedRunner.java:879)
	at com.carrotsearch.randomizedtesting.RandomizedRunner$7.evaluate(RandomizedRunner.java:890)
	at com.carrotsearch.randomizedtesting.rules.StatementAdapter.evaluate(StatementAdapter.java:36)
	at com.carrotsearch.randomizedtesting.rules.SystemPropertiesRestoreRule$1.evaluate(SystemPropertiesRestoreRule.java:57)
	at org.apache.lucene.util.AbstractBeforeAfterRule$1.evaluate(AbstractBeforeAfterRule.java:45)
	at com.carrotsearch.randomizedtesting.rules.StatementAdapter.evaluate(StatementAdapter.java:36)
	at org.apache.lucene.util.TestRuleStoreClassName$1.evaluate(TestRuleStoreClassName.java:41)
	at com.carrotsearch.randomizedtesting.rules.NoShadowingOrOverridesOnMethodsRule$1.evaluate(NoShadowingOrOverridesOnMethodsRule.java:40)
	at com.carrotsearch.randomizedtesting.rules.NoShadowingOrOverridesOnMethodsRule$1.evaluate(NoShadowingOrOverridesOnMethodsRule.java:40)
	at com.carrotsearch.randomizedtesting.rules.StatementAdapter.evaluate(StatementAdapter.java:36)
	at com.carrotsearch.randomizedtesting.rules.StatementAdapter.evaluate(StatementAdapter.java:36)
	at org.apache.lucene.util.TestRuleAssertionsRequired$1.evaluate(TestRuleAssertionsRequired.java:53)
	at org.apache.lucene.util.TestRuleMarkFailure$1.evaluate(TestRuleMarkFailure.java:47)
	at org.apache.lucene.util.TestRuleIgnoreAfterMaxFailures$1.evaluate(TestRuleIgnoreAfterMaxFailures.java:64)
	at org.apache.lucene.util.TestRuleIgnoreTestSuites$1.evaluate(TestRuleIgnoreTestSuites.java:54)
	at com.carrotsearch.randomizedtesting.rules.StatementAdapter.evaluate(StatementAdapter.java:36)
	at com.carrotsearch.randomizedtesting.ThreadLeakControl$StatementRunner.run(ThreadLeakControl.java:368)
	at java.base/java.lang.Thread.run(Thread.java:844)




Build Log:
[...truncated 12897 lines...]
   [junit4] Suite: org.apache.solr.handler.RequestLoggingTest
   [junit4]   2> 756513 INFO  (SUITE-RequestLoggingTest-seed#[CBE3CBC1A5DADDB4]-worker) [    ] o.a.s.SolrTestCaseJ4 SecureRandom sanity checks: test.solr.allowed.securerandom=null & java.security.egd=file:/dev/./urandom
   [junit4]   2> Creating dataDir: C:\Users\jenkins\workspace\Lucene-Solr-master-Windows\solr\build\solr-core\test\J0\temp\solr.handler.RequestLoggingTest_CBE3CBC1A5DADDB4-001\init-core-data-001
   [junit4]   2> 756514 WARN  (SUITE-RequestLoggingTest-seed#[CBE3CBC1A5DADDB4]-worker) [    ] o.a.s.SolrTestCaseJ4 startTrackingSearchers: numOpens=16 numCloses=16
   [junit4]   2> 756514 INFO  (SUITE-RequestLoggingTest-seed#[CBE3CBC1A5DADDB4]-worker) [    ] o.a.s.SolrTestCaseJ4 Using PointFields (NUMERIC_POINTS_SYSPROP=true) w/NUMERIC_DOCVALUES_SYSPROP=false
   [junit4]   2> 756516 INFO  (SUITE-RequestLoggingTest-seed#[CBE3CBC1A5DADDB4]-worker) [    ] o.a.s.SolrTestCaseJ4 Randomized ssl (false) and clientAuth (false) via: @org.apache.solr.util.RandomizeSSL(reason="", value=0.0/0.0, ssl=0.0/0.0, clientAuth=0.0/0.0)
   [junit4]   2> 756516 INFO  (SUITE-RequestLoggingTest-seed#[CBE3CBC1A5DADDB4]-worker) [    ] o.a.s.SolrTestCaseJ4 ####initCore
   [junit4]   2> 756517 INFO  (SUITE-RequestLoggingTest-seed#[CBE3CBC1A5DADDB4]-worker) [    ] o.a.s.c.SolrResourceLoader [null] Added 2 libs to classloader, from paths: [/C:/Users/jenkins/workspace/Lucene-Solr-master-Windows/solr/core/src/test-files/solr/collection1/lib, /C:/Users/jenkins/workspace/Lucene-Solr-master-Windows/solr/core/src/test-files/solr/collection1/lib/classes]
   [junit4]   2> 756540 INFO  (SUITE-RequestLoggingTest-seed#[CBE3CBC1A5DADDB4]-worker) [    ] o.a.s.c.SolrConfig Using Lucene MatchVersion: 8.0.0
   [junit4]   2> 756555 INFO  (SUITE-RequestLoggingTest-seed#[CBE3CBC1A5DADDB4]-worker) [    ] o.a.s.s.IndexSchema [null] Schema name=test
   [junit4]   2> 756634 INFO  (SUITE-RequestLoggingTest-seed#[CBE3CBC1A5DADDB4]-worker) [    ] o.a.s.s.IndexSchema Loaded schema test/1.0 with uniqueid field id
   [junit4]   2> 756989 INFO  (SUITE-RequestLoggingTest-seed#[CBE3CBC1A5DADDB4]-worker) [    ] o.a.s.c.TransientSolrCoreCacheDefault Allocating transient cache for 2147483647 transient cores
   [junit4]   2> 756989 INFO  (SUITE-RequestLoggingTest-seed#[CBE3CBC1A5DADDB4]-worker) [    ] o.a.s.h.a.MetricsHistoryHandler No .system collection, keeping metrics history in memory.
   [junit4]   2> 757010 INFO  (SUITE-RequestLoggingTest-seed#[CBE3CBC1A5DADDB4]-worker) [    ] o.a.s.m.r.SolrJmxReporter JMX monitoring for 'solr.node' (registry 'solr.node') enabled at server: com.sun.jmx.mbeanserver.JmxMBeanServer@bb843fb
   [junit4]   2> 757018 INFO  (SUITE-RequestLoggingTest-seed#[CBE3CBC1A5DADDB4]-worker) [    ] o.a.s.m.r.SolrJmxReporter JMX monitoring for 'solr.jvm' (registry 'solr.jvm') enabled at server: com.sun.jmx.mbeanserver.JmxMBeanServer@bb843fb
   [junit4]   2> 757018 INFO  (SUITE-RequestLoggingTest-seed#[CBE3CBC1A5DADDB4]-worker) [    ] o.a.s.m.r.SolrJmxReporter JMX monitoring for 'solr.jetty' (registry 'solr.jetty') enabled at server: com.sun.jmx.mbeanserver.JmxMBeanServer@bb843fb
   [junit4]   2> 757028 INFO  (coreLoadExecutor-3984-thread-1) [    x:collection1] o.a.s.c.SolrResourceLoader [null] Added 2 libs to classloader, from paths: [/C:/Users/jenkins/workspace/Lucene-Solr-master-Windows/solr/core/src/test-files/solr/collection1/lib, /C:/Users/jenkins/workspace/Lucene-Solr-master-Windows/solr/core/src/test-files/solr/collection1/lib/classes]
   [junit4]   2> 757064 INFO  (coreLoadExecutor-3984-thread-1) [    x:collection1] o.a.s.c.SolrConfig Using Lucene MatchVersion: 8.0.0
   [junit4]   2> 757087 INFO  (coreLoadExecutor-3984-thread-1) [    x:collection1] o.a.s.s.IndexSchema [collection1] Schema name=test
   [junit4]   2> 757211 INFO  (coreLoadExecutor-3984-thread-1) [    x:collection1] o.a.s.s.IndexSchema Loaded schema test/1.0 with uniqueid field id
   [junit4]   2> 757228 INFO  (coreLoadExecutor-3984-thread-1) [    x:collection1] o.a.s.c.CoreContainer Creating SolrCore 'collection1' using configuration from instancedir C:\Users\jenkins\workspace\Lucene-Solr-master-Windows\solr\core\src\test-files\solr\collection1, trusted=true
   [junit4]   2> 757229 INFO  (coreLoadExecutor-3984-thread-1) [    x:collection1] o.a.s.m.r.SolrJmxReporter JMX monitoring for 'solr.core.collection1' (registry 'solr.core.collection1') enabled at server: com.sun.jmx.mbeanserver.JmxMBeanServer@bb843fb
   [junit4]   2> 757229 INFO  (coreLoadExecutor-3984-thread-1) [    x:collection1] o.a.s.c.SolrCore solr.RecoveryStrategy.Builder
   [junit4]   2> 757229 INFO  (coreLoadExecutor-3984-thread-1) [    x:collection1] o.a.s.c.SolrCore [[collection1] ] Opening new SolrCore at [C:\Users\jenkins\workspace\Lucene-Solr-master-Windows\solr\core\src\test-files\solr\collection1], dataDir=[C:\Users\jenkins\workspace\Lucene-Solr-master-Windows\solr\build\solr-core\test\J0\temp\solr.handler.RequestLoggingTest_CBE3CBC1A5DADDB4-001\init-core-data-001\]
   [junit4]   2> 757231 INFO  (coreLoadExecutor-3984-thread-1) [    x:collection1] o.a.s.u.RandomMergePolicy RandomMergePolicy wrapping class org.apache.lucene.index.LogByteSizeMergePolicy: [LogByteSizeMergePolicy: minMergeSize=1677721, mergeFactor=10, maxMergeSize=2147483648, maxMergeSizeForForcedMerge=9223372036854775807, calibrateSizeByDeletes=false, maxMergeDocs=2147483647, maxCFSSegmentSizeMB=8.796093022207999E12, noCFSRatio=0.0]
   [junit4]   2> 757334 INFO  (coreLoadExecutor-3984-thread-1) [    x:collection1] o.a.s.u.UpdateHandler Using UpdateLog implementation: org.apache.solr.update.UpdateLog
   [junit4]   2> 757334 INFO  (coreLoadExecutor-3984-thread-1) [    x:collection1] o.a.s.u.UpdateLog Initializing UpdateLog: dataDir= defaultSyncLevel=FLUSH numRecordsToKeep=100 maxNumLogsToKeep=10 numVersionBuckets=65536
   [junit4]   2> 757336 INFO  (coreLoadExecutor-3984-thread-1) [    x:collection1] o.a.s.u.CommitTracker Hard AutoCommit: disabled
   [junit4]   2> 757336 INFO  (coreLoadExecutor-3984-thread-1) [    x:collection1] o.a.s.u.CommitTracker Soft AutoCommit: disabled
   [junit4]   2> 757337 INFO  (coreLoadExecutor-3984-thread-1) [    x:collection1] o.a.s.u.RandomMergePolicy RandomMergePolicy wrapping class org.apache.lucene.index.TieredMergePolicy: [TieredMergePolicy: maxMergeAtOnce=17, maxMergeAtOnceExplicit=17, maxMergedSegmentMB=71.2587890625, floorSegmentMB=1.203125, forceMergeDeletesPctAllowed=6.438715922746653, segmentsPerTier=32.0, maxCFSSegmentSizeMB=8.796093022207999E12, noCFSRatio=0.0, deletesPctAllowed=40.76561851260462
   [junit4]   2> 757337 INFO  (coreLoadExecutor-3984-thread-1) [    x:collection1] o.a.s.s.SolrIndexSearcher Opening [Searcher@5f92b275[collection1] main]
   [junit4]   2> 757338 INFO  (coreLoadExecutor-3984-thread-1) [    x:collection1] o.a.s.h.c.SpellCheckComponent Initializing spell checkers
   [junit4]   2> 757366 INFO  (coreLoadExecutor-3984-thread-1) [    x:collection1] o.a.s.s.DirectSolrSpellChecker init: {name=direct,classname=DirectSolrSpellChecker,field=lowerfilt,minQueryLength=3}
   [junit4]   2> 757515 INFO  (coreLoadExecutor-3984-thread-1) [    x:collection1] o.a.s.h.ReplicationHandler Commits will be reserved for 10000ms.
   [junit4]   2> 757515 INFO  (coreLoadExecutor-3984-thread-1) [    x:collection1] o.a.s.u.UpdateLog Could not find max version in index or recent updates, using new clock 1610484414435819520
   [junit4]   2> 757515 INFO  (searcherExecutor-3985-thread-1-processing-x:collection1) [    x:collection1] o.a.s.h.c.SpellCheckComponent Loading spell index for spellchecker: default
   [junit4]   2> 757518 INFO  (SUITE-RequestLoggingTest-seed#[CBE3CBC1A5DADDB4]-worker) [    ] o.a.s.SolrTestCaseJ4 ####initCore end
   [junit4]   2> 757525 INFO  (searcherExecutor-3985-thread-1-processing-x:collection1) [    x:collection1] o.a.s.h.c.SpellCheckComponent Loading spell index for spellchecker: direct
   [junit4]   2> 757525 INFO  (searcherExecutor-3985-thread-1-processing-x:collection1) [    x:collection1] o.a.s.h.c.SpellCheckComponent Loading spell index for spellchecker: wordbreak
   [junit4]   2> 757525 INFO  (searcherExecutor-3985-thread-1-processing-x:collection1) [    x:collection1] o.a.s.h.c.SpellCheckComponent Loading spell index for spellchecker: multipleFields
   [junit4]   2> 757531 INFO  (TEST-RequestLoggingTest.testLogBeforeExecuteWithRequestLogger-seed#[CBE3CBC1A5DADDB4]) [    ] o.a.s.SolrTestCaseJ4 ###Starting testLogBeforeExecuteWithRequestLogger
   [junit4]   2> 757531 INFO  (searcherExecutor-3985-thread-1-processing-x:collection1) [    x:collection1] o.a.s.h.c.SpellCheckComponent Loading spell index for spellchecker: jarowinkler
   [junit4]   2> 757532 INFO  (searcherExecutor-3985-thread-1-processing-x:collection1) [    x:collection1] o.a.s.h.c.SpellCheckComponent Loading spell index for spellchecker: external
   [junit4]   2> 757532 INFO  (searcherExecutor-3985-thread-1-processing-x:collection1) [    x:collection1] o.a.s.h.c.SpellCheckComponent Loading spell index for spellchecker: freq
   [junit4]   2> 757532 INFO  (searcherExecutor-3985-thread-1-processing-x:collection1) [    x:collection1] o.a.s.h.c.SpellCheckComponent Loading spell index for spellchecker: fqcn
   [junit4]   2> 757532 INFO  (searcherExecutor-3985-thread-1-processing-x:collection1) [    x:collection1] o.a.s.h.c.SpellCheckComponent Loading spell index for spellchecker: perDict
   [junit4]   2> 757532 INFO  (searcherExecutor-3985-thread-1-processing-x:collection1) [    x:collection1] o.a.s.c.SolrCore [collection1] Registered new searcher Searcher@5f92b275[collection1] main{ExitableDirectoryReader(UninvertingDirectoryReader())}
   [junit4]   2> 757540 DEBUG (TEST-RequestLoggingTest.testLogBeforeExecuteWithRequestLogger-seed#[CBE3CBC1A5DADDB4]) [    ] o.a.s.c.S.Request [collection1]  webapp=null path=null params={q=*:*&wt=xml}
   [junit4]   2> 757540 DEBUG (TEST-RequestLoggingTest.testLogBeforeExecuteWithRequestLogger-seed#[CBE3CBC1A5DADDB4]) [    ] o.a.s.h.c.SearchHandler Adding  component:org.apache.solr.handler.component.QueryComponent@4af0e055
   [junit4]   2> 757540 DEBUG (TEST-RequestLoggingTest.testLogBeforeExecuteWithRequestLogger-seed#[CBE3CBC1A5DADDB4]) [    ] o.a.s.h.c.SearchHandler Adding  component:org.apache.solr.handler.component.FacetComponent@140f543
   [junit4]   2> 757540 DEBUG (TEST-RequestLoggingTest.testLogBeforeExecuteWithRequestLogger-seed#[CBE3CBC1A5DADDB4]) [    ] o.a.s.h.c.SearchHandler Adding  component:org.apache.solr.search.facet.FacetModule@3d41788c
   [junit4]   2> 757540 DEBUG (TEST-RequestLoggingTest.testLogBeforeExecuteWithRequestLogger-seed#[CBE3CBC1A5DADDB4]) [    ] o.a.s.h.c.SearchHandler Adding  component:org.apache.solr.handler.component.MoreLikeThisComponent@9e0df14
   [junit4]   2> 757540 DEBUG (TEST-RequestLoggingTest.testLogBeforeExecuteWithRequestLogger-seed#[CBE3CBC1A5DADDB4]) [    ] o.a.s.h.c.SearchHandler Adding  component:org.apache.solr.handler.component.HighlightComponent@44df7435
   [junit4]   2> 757540 DEBUG (TEST-RequestLoggingTest.testLogBeforeExecuteWithRequestLogger-seed#[CBE3CBC1A5DADDB4]) [    ] o.a.s.h.c.SearchHandler Adding  component:org.apache.solr.handler.component.StatsComponent@42b37b00
   [junit4]   2> 757540 DEBUG (TEST-RequestLoggingTest.testLogBeforeExecuteWithRequestLogger-seed#[CBE3CBC1A5DADDB4]) [    ] o.a.s.h.c.SearchHandler Adding  component:org.apache.solr.handler.component.ExpandComponent@7400fec2
   [junit4]   2> 757540 DEBUG (TEST-RequestLoggingTest.testLogBeforeExecuteWithRequestLogger-seed#[CBE3CBC1A5DADDB4]) [    ] o.a.s.h.c.SearchHandler Adding  component:org.apache.solr.handler.component.TermsComponent@7b978729
   [junit4]   2> 757540 DEBUG (TEST-RequestLoggingTest.testLogBeforeExecuteWithRequestLogger-seed#[CBE3CBC1A5DADDB4]) [    ] o.a.s.h.c.SearchHandler Adding  debug component:org.apache.solr.handler.component.DebugComponent@44562ab2
   [junit4]   2> 757540 DEBUG (TEST-RequestLoggingTest.testLogBeforeExecuteWithRequestLogger-seed#[CBE3CBC1A5DADDB4]) [    ] o.a.s.h.c.QueryComponent process: q=*:*&df=text&wt=xml&indent=off
   [junit4]   2> 757540 DEBUG (TEST-RequestLoggingTest.testLogBeforeExecuteWithRequestLogger-seed#[CBE3CBC1A5DADDB4]) [    ] o.a.s.s.s.LocalStatsCache ## GET LocalSolrQueryRequest{q=*:*&df=text&wt=xml&indent=off}
   [junit4]   2> 757540 INFO  (TEST-RequestLoggingTest.testLogBeforeExecuteWithRequestLogger-seed#[CBE3CBC1A5DADDB4]) [    ] o.a.s.c.S.Request [collection1]  webapp=null path=null params={q=*:*&wt=xml} hits=0 status=0 QTime=0
   [junit4]   2> 757541 INFO  (TEST-RequestLoggingTest.testLogBeforeExecuteWithRequestLogger-seed#[CBE3CBC1A5DADDB4]) [    ] o.a.s.SolrTestCaseJ4 ###Ending testLogBeforeExecuteWithRequestLogger
   [junit4]   2> NOTE: reproduce with: ant test  -Dtestcase=RequestLoggingTest -Dtests.method=testLogBeforeExecuteWithRequestLogger -Dtests.seed=CBE3CBC1A5DADDB4 -Dtests.slow=true -Dtests.locale=mk -Dtests.timezone=America/St_Lucia -Dtests.asserts=true -Dtests.file.encoding=UTF-8
   [junit4] FAILURE 0.02s J0 | RequestLoggingTest.testLogBeforeExecuteWithRequestLogger <<<
   [junit4]    > Throwable #1: java.lang.AssertionError
   [junit4]    > 	at __randomizedtesting.SeedInfo.seed([CBE3CBC1A5DADDB4:7A8AEBCE082C65FA]:0)
   [junit4]    > 	at org.apache.solr.handler.RequestLoggingTest.testLogBeforeExecute(RequestLoggingTest.java:88)
   [junit4]    > 	at org.apache.solr.handler.RequestLoggingTest.testLogBeforeExecuteWithRequestLogger(RequestLoggingTest.java:71)
   [junit4]    > 	at java.base/jdk.internal.reflect.NativeMethodAccessorImpl.invoke0(Native Method)
   [junit4]    > 	at java.base/jdk.internal.reflect.NativeMethodAccessorImpl.invoke(NativeMethodAccessorImpl.java:62)
   [junit4]    > 	at java.base/jdk.internal.reflect.DelegatingMethodAccessorImpl.invoke(DelegatingMethodAccessorImpl.java:43)
   [junit4]    > 	at java.base/java.lang.reflect.Method.invoke(Method.java:564)
   [junit4]    > 	at java.base/java.lang.Thread.run(Thread.java:844)
   [junit4]   2> 757545 INFO  (TEST-RequestLoggingTest.testLogBeforeExecuteWithCoreLogger-seed#[CBE3CBC1A5DADDB4]) [    ] o.a.s.SolrTestCaseJ4 ###Starting testLogBeforeExecuteWithCoreLogger
   [junit4]   2> 757547 DEBUG (TEST-RequestLoggingTest.testLogBeforeExecuteWithCoreLogger-seed#[CBE3CBC1A5DADDB4]) [    ] o.a.s.c.S.Request [collection1]  webapp=null path=null params={q=*:*&wt=xml}
   [junit4]   2> 757547 DEBUG (TEST-RequestLoggingTest.testLogBeforeExecuteWithCoreLogger-seed#[CBE3CBC1A5DADDB4]) [    ] o.a.s.h.c.QueryComponent process: q=*:*&df=text&wt=xml&indent=off
   [junit4]   2> 757547 DEBUG (TEST-RequestLoggingTest.testLogBeforeExecuteWithCoreLogger-seed#[CBE3CBC1A5DADDB4]) [    ] o.a.s.s.s.LocalStatsCache ## GET LocalSolrQueryRequest{q=*:*&df=text&wt=xml&indent=off}
   [junit4]   2> 757547 INFO  (TEST-RequestLoggingTest.testLogBeforeExecuteWithCoreLogger-seed#[CBE3CBC1A5DADDB4]) [    ] o.a.s.c.S.Request [collection1]  webapp=null path=null params={q=*:*&wt=xml} hits=0 status=0 QTime=0
   [junit4]   2> 757548 INFO  (TEST-RequestLoggingTest.testLogBeforeExecuteWithCoreLogger-seed#[CBE3CBC1A5DADDB4]) [    ] o.a.s.SolrTestCaseJ4 ###Ending testLogBeforeExecuteWithCoreLogger
   [junit4]   2> 757548 INFO  (SUITE-RequestLoggingTest-seed#[CBE3CBC1A5DADDB4]-worker) [    ] o.a.s.SolrTestCaseJ4 ###deleteCore
   [junit4]   2> 757548 INFO  (SUITE-RequestLoggingTest-seed#[CBE3CBC1A5DADDB4]-worker) [    ] o.a.s.c.CoreContainer Shutting down CoreContainer instance=483452456
   [junit4]   2> 757548 INFO  (SUITE-RequestLoggingTest-seed#[CBE3CBC1A5DADDB4]-worker) [    ] o.a.s.m.SolrMetricManager Closing metric reporters for registry=solr.node, tag=null
   [junit4]   2> 757548 INFO  (SUITE-RequestLoggingTest-seed#[CBE3CBC1A5DADDB4]-worker) [    ] o.a.s.m.r.SolrJmxReporter Closing reporter [org.apache.solr.metrics.reporters.SolrJmxReporter@501d4892: rootName = null, domain = solr.node, service url = null, agent id = null] for registry solr.node / com.codahale.metrics.MetricRegistry@4f64d5cf
   [junit4]   2> 757552 INFO  (SUITE-RequestLoggingTest-seed#[CBE3CBC1A5DADDB4]-worker) [    ] o.a.s.m.SolrMetricManager Closing metric reporters for registry=solr.jvm, tag=null
   [junit4]   2> 757552 INFO  (SUITE-RequestLoggingTest-seed#[CBE3CBC1A5DADDB4]-worker) [    ] o.a.s.m.r.SolrJmxReporter Closing reporter [org.apache.solr.metrics.reporters.SolrJmxReporter@4fd8a0e0: rootName = null, domain = solr.jvm, service url = null, agent id = null] for registry solr.jvm / com.codahale.metrics.MetricRegistry@7a80944
   [junit4]   2> 757554 INFO  (SUITE-RequestLoggingTest-seed#[CBE3CBC1A5DADDB4]-worker) [    ] o.a.s.m.SolrMetricManager Closing metric reporters for registry=solr.jetty, tag=null
   [junit4]   2> 757554 INFO  (SUITE-RequestLoggingTest-seed#[CBE3CBC1A5DADDB4]-worker) [    ] o.a.s.m.r.SolrJmxReporter Closing reporter [org.apache.solr.metrics.reporters.SolrJmxReporter@3fc74bb1: rootName = null, domain = solr.jetty, service url = null, agent id = null] for registry solr.jetty / com.codahale.metrics.MetricRegistry@1671f59d
   [junit4]   2> 757554 INFO  (coreCloseExecutor-3990-thread-1) [    x:collection1] o.a.s.c.SolrCore [collection1]  CLOSING SolrCore org.apache.solr.core.SolrCore@28b68427
   [junit4]   2> 757554 INFO  (coreCloseExecutor-3990-thread-1) [    x:collection1] o.a.s.m.SolrMetricManager Closing metric reporters for registry=solr.core.collection1, tag=28b68427
   [junit4]   2> 757554 INFO  (coreCloseExecutor-3990-thread-1) [    x:collection1] o.a.s.m.r.SolrJmxReporter Closing reporter [org.apache.solr.metrics.reporters.SolrJmxReporter@640d2aba: rootName = null, domain = solr.core.collection1, service url = null, agent id = null] for registry solr.core.collection1 / com.codahale.metrics.MetricRegistry@6c5e55b5
   [junit4]   2> NOTE: leaving temporary files on disk at: C:\Users\jenkins\workspace\Lucene-Solr-master-Windows\solr\build\solr-core\test\J0\temp\solr.handler.RequestLoggingTest_CBE3CBC1A5DADDB4-001
   [junit4]   2> NOTE: test params are: codec=Asserting(Lucene80): {}, docValues:{}, maxPointsInLeafNode=191, maxMBSortInHeap=6.6068975215395485, sim=Asserting(org.apache.lucene.search.similarities.AssertingSimilarity@26de0f00), locale=mk, timezone=America/St_Lucia
   [junit4]   2> NOTE: Windows 10 10.0 amd64/Oracle Corporation 9.0.4 (64-bit)/cpus=3,threads=1,free=71940720,total=446693376
   [junit4]   2> NOTE: All tests run in this JVM: [UpdateParamsTest, TestExactStatsCache, DirectoryFactoryTest, DistributedSpellCheckComponentTest, TestPKIAuthenticationPlugin, TestSchemaResource, TestMaxScoreQueryParser, TestSimpleQParserPlugin, TestFieldCache, TestUseDocValuesAsStored2, TestHdfsUpdateLog, SegmentsInfoRequestHandlerTest, TestJsonFacets, TestCoreContainer, ConcurrentCreateRoutedAliasTest, OverriddenZkACLAndCredentialsProvidersTest, HighlighterMaxOffsetTest, HdfsNNFailoverTest, TestReload, TestOverriddenPrefixQueryForCustomFieldType, SpatialRPTFieldTypeTest, CollectionStateFormat2Test, TestCopyFieldCollectionResource, TestCorePropertiesReload, HdfsChaosMonkeyNothingIsSafeTest, SolrPluginUtilsTest, TestRandomFlRTGCloud, BasicAuthIntegrationTest, TestSort, ConvertedLegacyTest, TestSolrJ, MetricsHandlerTest, TestSimpleTextCodec, TestHashPartitioner, ResourceLoaderTest, ChaosMonkeyNothingIsSafeTest, TestStreamBody, NodeMutatorTest, TestSimDistribStateManager, ClusterStateUpdateTest, DirectUpdateHandlerTest, SpellCheckComponentTest, TestLeaderElectionZkExpiry, TestNumericTerms64, TestXmlQParser, TestClusterStateMutator, PluginInfoTest, SimpleCollectionCreateDeleteTest, TestJsonRequest, TestLRUCache, SignificantTermsQParserPluginTest, TestDistributedSearch, AtomicUpdatesTest, DeleteLastCustomShardedReplicaTest, SystemLogListenerTest, TestXIncludeConfig, SolrInfoBeanTest, TestShortCircuitedRequests, SuggesterTSTTest, TestCloudDeleteByQuery, TestLockTree, MetricTriggerTest, PrimUtilsTest, FastVectorHighlighterTest, BigEndianAscendingWordSerializerTest, SimpleMLTQParserTest, SchemaVersionSpecificBehaviorTest, NoCacheHeaderTest, HdfsCollectionsAPIDistributedZkTest, TestCryptoKeys, TestUtilizeNode, AsyncCallRequestStatusResponseTest, SolrJmxReporterTest, ReplaceNodeTest, TestDistributedGrouping, ZkStateWriterTest, MoreLikeThisHandlerTest, TestCloudManagedSchema, CdcrBidirectionalTest, MetricsHistoryIntegrationTest, DistributedQueryComponentOptimizationTest, ReplicaListTransformerTest, TestSolrConfigHandlerCloud, RemoteQueryErrorTest, SharedFSAutoReplicaFailoverTest, TestDynamicURP, TestLegacyNumericUtils, RequestLoggingTest]
   [junit4] Completed [156/832 (1!)] on J0 in 1.07s, 2 tests, 1 failure <<< FAILURES!

[...truncated 1230 lines...]
   [junit4] Suite: org.apache.solr.cloud.TestCloudRecovery
   [junit4]   2> 3444266 INFO  (SUITE-TestCloudRecovery-seed#[CBE3CBC1A5DADDB4]-worker) [    ] o.a.s.SolrTestCaseJ4 SecureRandom sanity checks: test.solr.allowed.securerandom=null & java.security.egd=file:/dev/./urandom
   [junit4]   2> Creating dataDir: C:\Users\jenkins\workspace\Lucene-Solr-master-Windows\solr\build\solr-core\test\J1\temp\solr.cloud.TestCloudRecovery_CBE3CBC1A5DADDB4-001\init-core-data-001
   [junit4]   2> 3444267 WARN  (SUITE-TestCloudRecovery-seed#[CBE3CBC1A5DADDB4]-worker) [    ] o.a.s.SolrTestCaseJ4 startTrackingSearchers: numOpens=13 numCloses=13
   [junit4]   2> 3444267 INFO  (SUITE-TestCloudRecovery-seed#[CBE3CBC1A5DADDB4]-worker) [    ] o.a.s.SolrTestCaseJ4 Using PointFields (NUMERIC_POINTS_SYSPROP=true) w/NUMERIC_DOCVALUES_SYSPROP=true
   [junit4]   2> 3444269 INFO  (SUITE-TestCloudRecovery-seed#[CBE3CBC1A5DADDB4]-worker) [    ] o.a.s.SolrTestCaseJ4 Randomized ssl (false) and clientAuth (false) via: @org.apache.solr.util.RandomizeSSL(reason="", value=0.0/0.0, ssl=0.0/0.0, clientAuth=0.0/0.0)
   [junit4]   2> 3444269 INFO  (SUITE-TestCloudRecovery-seed#[CBE3CBC1A5DADDB4]-worker) [    ] o.a.s.c.MiniSolrCloudCluster Starting cluster of 2 servers in C:\Users\jenkins\workspace\Lucene-Solr-master-Windows\solr\build\solr-core\test\J1\temp\solr.cloud.TestCloudRecovery_CBE3CBC1A5DADDB4-001\tempDir-001
   [junit4]   2> 3444269 INFO  (SUITE-TestCloudRecovery-seed#[CBE3CBC1A5DADDB4]-worker) [    ] o.a.s.c.ZkTestServer STARTING ZK TEST SERVER
   [junit4]   2> 3444269 INFO  (Thread-5711) [    ] o.a.s.c.ZkTestServer client port:0.0.0.0/0.0.0.0:0
   [junit4]   2> 3444270 INFO  (Thread-5711) [    ] o.a.s.c.ZkTestServer Starting server
   [junit4]   2> 3444274 ERROR (Thread-5711) [    ] o.a.z.s.ZooKeeperServer ZKShutdownHandler is not registered, so ZooKeeper server won't take any action on ERROR or SHUTDOWN server state changes
   [junit4]   2> 3444369 INFO  (SUITE-TestCloudRecovery-seed#[CBE3CBC1A5DADDB4]-worker) [    ] o.a.s.c.ZkTestServer start zk server on port:50686
   [junit4]   2> 3444372 INFO  (zkConnectionManagerCallback-9691-thread-1) [    ] o.a.s.c.c.ConnectionManager zkClient has connected
   [junit4]   2> 3444374 WARN  (NIOServerCxn.Factory:0.0.0.0/0.0.0.0:0) [    ] o.a.z.s.NIOServerCnxn Unable to read additional data from client sessionid 0x10057fb65a90000, likely client has closed socket
   [junit4]   2> 3444375 INFO  (jetty-launcher-9688-thread-2) [    ] o.e.j.s.Server jetty-9.4.11.v20180605; built: 2018-06-05T18:24:03.829Z; git: d5fc0523cfa96bfebfbda19606cad384d772f04c; jvm 9.0.4+11
   [junit4]   2> 3444375 INFO  (jetty-launcher-9688-thread-1) [    ] o.e.j.s.Server jetty-9.4.11.v20180605; built: 2018-06-05T18:24:03.829Z; git: d5fc0523cfa96bfebfbda19606cad384d772f04c; jvm 9.0.4+11
   [junit4]   2> 3444387 INFO  (jetty-launcher-9688-thread-2) [    ] o.e.j.s.session DefaultSessionIdManager workerName=node0
   [junit4]   2> 3444387 INFO  (jetty-launcher-9688-thread-2) [    ] o.e.j.s.session No SessionScavenger set, using defaults
   [junit4]   2> 3444387 INFO  (jetty-launcher-9688-thread-2) [    ] o.e.j.s.session node0 Scavenging every 600000ms
   [junit4]   2> 3444388 INFO  (jetty-launcher-9688-thread-1) [    ] o.e.j.s.session DefaultSessionIdManager workerName=node0
   [junit4]   2> 3444388 INFO  (jetty-launcher-9688-thread-1) [    ] o.e.j.s.session No SessionScavenger set, using defaults
   [junit4]   2> 3444388 INFO  (jetty-launcher-9688-thread-1) [    ] o.e.j.s.session node0 Scavenging every 660000ms
   [junit4]   2> 3444388 INFO  (jetty-launcher-9688-thread-2) [    ] o.e.j.s.h.ContextHandler Started o.e.j.s.ServletContextHandler@4f0ce6cd{/solr,null,AVAILABLE}
   [junit4]   2> 3444388 INFO  (jetty-launcher-9688-thread-1) [    ] o.e.j.s.h.ContextHandler Started o.e.j.s.ServletContextHandler@1da2ee79{/solr,null,AVAILABLE}
   [junit4]   2> 3444390 INFO  (jetty-launcher-9688-thread-2) [    ] o.e.j.s.AbstractConnector Started ServerConnector@706b1177{HTTP/1.1,[http/1.1]}{127.0.0.1:50690}
   [junit4]   2> 3444390 INFO  (jetty-launcher-9688-thread-1) [    ] o.e.j.s.AbstractConnector Started ServerConnector@65913900{HTTP/1.1,[http/1.1]}{127.0.0.1:50691}
   [junit4]   2> 3444390 INFO  (jetty-launcher-9688-thread-1) [    ] o.e.j.s.Server Started @3444426ms
   [junit4]   2> 3444390 INFO  (jetty-launcher-9688-thread-2) [    ] o.e.j.s.Server Started @3444426ms
   [junit4]   2> 3444390 INFO  (jetty-launcher-9688-thread-1) [    ] o.a.s.c.s.e.JettySolrRunner Jetty properties: {hostContext=/solr, hostPort=50691}
   [junit4]   2> 3444390 INFO  (jetty-launcher-9688-thread-2) [    ] o.a.s.c.s.e.JettySolrRunner Jetty properties: {hostContext=/solr, hostPort=50690}
   [junit4]   2> 3444390 ERROR (jetty-launcher-9688-thread-1) [    ] o.a.s.u.StartupLoggingUtils Missing Java Option solr.log.dir. Logging may be missing or incomplete.
   [junit4]   2> 3444390 ERROR (jetty-launcher-9688-thread-2) [    ] o.a.s.u.StartupLoggingUtils Missing Java Option solr.log.dir. Logging may be missing or incomplete.
   [junit4]   2> 3444390 INFO  (jetty-launcher-9688-thread-2) [    ] o.a.s.s.SolrDispatchFilter Using logger factory org.apache.logging.slf4j.Log4jLoggerFactory
   [junit4]   2> 3444390 INFO  (jetty-launcher-9688-thread-1) [    ] o.a.s.s.SolrDispatchFilter Using logger factory org.apache.logging.slf4j.Log4jLoggerFactory
   [junit4]   2> 3444390 INFO  (jetty-launcher-9688-thread-1) [    ] o.a.s.s.SolrDispatchFilter  ___      _       Welcome to Apache Solr™ version 8.0.0
   [junit4]   2> 3444390 INFO  (jetty-launcher-9688-thread-2) [    ] o.a.s.s.SolrDispatchFilter  ___      _       Welcome to Apache Solr™ version 8.0.0
   [junit4]   2> 3444390 INFO  (jetty-launcher-9688-thread-1) [    ] o.a.s.s.SolrDispatchFilter / __| ___| |_ _   Starting in cloud mode on port null
   [junit4]   2> 3444390 INFO  (jetty-launcher-9688-thread-1) [    ] o.a.s.s.SolrDispatchFilter \__ \/ _ \ | '_|  Install dir: null
   [junit4]   2> 3444390 INFO  (jetty-launcher-9688-thread-2) [    ] o.a.s.s.SolrDispatchFilter / __| ___| |_ _   Starting in cloud mode on port null
   [junit4]   2> 3444390 INFO  (jetty-launcher-9688-thread-2) [    ] o.a.s.s.SolrDispatchFilter \__ \/ _ \ | '_|  Install dir: null
   [junit4]   2> 3444390 INFO  (jetty-launcher-9688-thread-1) [    ] o.a.s.s.SolrDispatchFilter |___/\___/_|_|    Start time: 2018-09-02T09:25:09.892109800Z
   [junit4]   2> 3444390 INFO  (jetty-launcher-9688-thread-2) [    ] o.a.s.s.SolrDispatchFilter |___/\___/_|_|    Start time: 2018-09-02T09:25:09.892109800Z
   [junit4]   2> 3444392 INFO  (zkConnectionManagerCallback-9695-thread-1) [    ] o.a.s.c.c.ConnectionManager zkClient has connected
   [junit4]   2> 3444392 INFO  (zkConnectionManagerCallback-9693-thread-1) [    ] o.a.s.c.c.ConnectionManager zkClient has connected
   [junit4]   2> 3444392 INFO  (jetty-launcher-9688-thread-1) [    ] o.a.s.s.SolrDispatchFilter solr.xml found in ZooKeeper. Loading...
   [junit4]   2> 3444392 INFO  (jetty-launcher-9688-thread-2) [    ] o.a.s.s.SolrDispatchFilter solr.xml found in ZooKeeper. Loading...
   [junit4]   2> 3444397 WARN  (NIOServerCxn.Factory:0.0.0.0/0.0.0.0:0) [    ] o.a.z.s.NIOServerCnxn Unable to read additional data from client sessionid 0x10057fb65a90001, likely client has closed socket
   [junit4]   2> 3444534 INFO  (jetty-launcher-9688-thread-1) [    ] o.a.s.c.ZkContainer Zookeeper client=127.0.0.1:50686/solr
   [junit4]   2> 3444536 INFO  (zkConnectionManagerCallback-9699-thread-1) [    ] o.a.s.c.c.ConnectionManager zkClient has connected
   [junit4]   2> 3444536 WARN  (NIOServerCxn.Factory:0.0.0.0/0.0.0.0:0) [    ] o.a.z.s.NIOServerCnxn Unable to read additional data from client sessionid 0x10057fb65a90003, likely client has closed socket
   [junit4]   2> 3444540 INFO  (zkConnectionManagerCallback-9701-thread-1) [    ] o.a.s.c.c.ConnectionManager zkClient has connected
   [junit4]   2> 3444607 INFO  (jetty-launcher-9688-thread-1) [n:127.0.0.1:50691_solr    ] o.a.s.c.OverseerElectionContext I am going to be the leader 127.0.0.1:50691_solr
   [junit4]   2> 3444607 INFO  (jetty-launcher-9688-thread-1) [n:127.0.0.1:50691_solr    ] o.a.s.c.Overseer Overseer (id=72154331291910148-127.0.0.1:50691_solr-n_0000000000) starting
   [junit4]   2> 3444617 INFO  (zkConnectionManagerCallback-9708-thread-1) [    ] o.a.s.c.c.ConnectionManager zkClient has connected
   [junit4]   2> 3444619 INFO  (jetty-launcher-9688-thread-1) [n:127.0.0.1:50691_solr    ] o.a.s.c.s.i.ZkClientClusterStateProvider Cluster at 127.0.0.1:50686/solr ready
   [junit4]   2> 3444619 INFO  (jetty-launcher-9688-thread-1) [n:127.0.0.1:50691_solr    ] o.a.s.c.ZkController Register node as live in ZooKeeper:/live_nodes/127.0.0.1:50691_solr
   [junit4]   2> 3444623 INFO  (OverseerStateUpdate-72154331291910148-127.0.0.1:50691_solr-n_0000000000) [n:127.0.0.1:50691_solr    ] o.a.s.c.Overseer Starting to work on the main queue : 127.0.0.1:50691_solr
   [junit4]   2> 3444624 INFO  (OverseerStateUpdate-72154331291910148-127.0.0.1:50691_solr-n_0000000000) [n:127.0.0.1:50691_solr    ] o.a.s.c.c.ZkStateReader Updated live nodes from ZooKeeper... (0) -> (1)
   [junit4]   2> 3444631 INFO  (jetty-launcher-9688-thread-2) [    ] o.a.s.c.ZkContainer Zookeeper client=127.0.0.1:50686/solr
   [junit4]   2> 3444632 INFO  (zkCallback-9707-thread-1) [    ] o.a.s.c.c.ZkStateReader Updated live nodes from ZooKeeper... (0) -> (1)
   [junit4]   2> 3444642 INFO  (zkConnectionManagerCallback-9712-thread-1) [    ] o.a.s.c.c.ConnectionManager zkClient has connected
   [junit4]   2> 3444644 INFO  (jetty-launcher-9688-thread-1) [n:127.0.0.1:50691_solr    ] o.a.s.h.a.MetricsHistoryHandler No .system collection, keeping metrics history in memory.
   [junit4]   2> 3444648 INFO  (zkConnectionManagerCallback-9715-thread-1) [    ] o.a.s.c.c.ConnectionManager zkClient has connected
   [junit4]   2> 3444653 INFO  (jetty-launcher-9688-thread-2) [n:127.0.0.1:50690_solr    ] o.a.s.c.c.ZkStateReader Updated live nodes from ZooKeeper... (0) -> (1)
   [junit4]   2> 3444656 INFO  (jetty-launcher-9688-thread-2) [n:127.0.0.1:50690_solr    ] o.a.s.c.TransientSolrCoreCacheDefault Allocating transient cache for 2147483647 transient cores
   [junit4]   2> 3444656 INFO  (jetty-launcher-9688-thread-2) [n:127.0.0.1:50690_solr    ] o.a.s.c.ZkController Register node as live in ZooKeeper:/live_nodes/127.0.0.1:50690_solr
   [junit4]   2> 3444658 INFO  (zkCallback-9700-thread-1) [    ] o.a.s.c.c.ZkStateReader Updated live nodes from ZooKeeper... (1) -> (2)
   [junit4]   2> 3444658 INFO  (zkCallback-9707-thread-1) [    ] o.a.s.c.c.ZkStateReader Updated live nodes from ZooKeeper... (1) -> (2)
   [junit4]   2> 3444659 INFO  (zkCallback-9714-thread-1) [    ] o.a.s.c.c.ZkStateReader Updated live nodes from ZooKeeper... (1) -> (2)
   [junit4]   2> 3444667 INFO  (jetty-launcher-9688-thread-1) [n:127.0.0.1:50691_solr    ] o.a.s.m.r.SolrJmxReporter JMX monitoring for 'solr_50691.solr.node' (registry 'solr.node') enabled at server: com.sun.jmx.mbeanserver.JmxMBeanServer@179bd920
   [junit4]   2> 3444672 INFO  (jetty-launcher-9688-thread-1) [n:127.0.0.1:50691_solr    ] o.a.s.m.r.SolrJmxReporter JMX monitoring for 'solr_50691.solr.jvm' (registry 'solr.jvm') enabled at server: com.sun.jmx.mbeanserver.JmxMBeanServer@179bd920
   [junit4]   2> 3444672 INFO  (jetty-launcher-9688-thread-1) [n:127.0.0.1:50691_solr    ] o.a.s.m.r.SolrJmxReporter JMX monitoring for 'solr_50691.solr.jetty' (registry 'solr.jetty') enabled at server: com.sun.jmx.mbeanserver.JmxMBeanServer@179bd920
   [junit4]   2> 3444673 INFO  (jetty-launcher-9688-thread-1) [n:127.0.0.1:50691_solr    ] o.a.s.c.CorePropertiesLocator Found 0 core definitions underneath C:\Users\jenkins\workspace\Lucene-Solr-master-Windows\solr\build\solr-core\test\J1\temp\solr.cloud.TestCloudRecovery_CBE3CBC1A5DADDB4-001\tempDir-001\node2\.
   [junit4]   2> 3444679 INFO  (zkConnectionManagerCallback-9722-thread-1) [    ] o.a.s.c.c.ConnectionManager zkClient has connected
   [junit4]   2> 3444680 INFO  (jetty-launcher-9688-thread-2) [n:127.0.0.1:50690_solr    ] o.a.s.c.c.ZkStateReader Updated live nodes from ZooKeeper... (0) -> (2)
   [junit4]   2> 3444681 INFO  (jetty-launcher-9688-thread-2) [n:127.0.0.1:50690_solr    ] o.a.s.c.s.i.ZkClientClusterStateProvider Cluster at 127.0.0.1:50686/solr ready
   [junit4]   2> 3444681 INFO  (jetty-launcher-9688-thread-2) [n:127.0.0.1:50690_solr    ] o.a.s.h.a.MetricsHistoryHandler No .system collection, keeping metrics history in memory.
   [junit4]   2> 3444697 INFO  (jetty-launcher-9688-thread-2) [n:127.0.0.1:50690_solr    ] o.a.s.m.r.SolrJmxReporter JMX monitoring for 'solr_50690.solr.node' (registry 'solr.node') enabled at server: com.sun.jmx.mbeanserver.JmxMBeanServer@179bd920
   [junit4]   2> 3444702 INFO  (jetty-launcher-9688-thread-2) [n:127.0.0.1:50690_solr    ] o.a.s.m.r.SolrJmxReporter JMX monitoring for 'solr_50690.solr.jvm' (registry 'solr.jvm') enabled at server: com.sun.jmx.mbeanserver.JmxMBeanServer@179bd920
   [junit4]   2> 3444702 INFO  (jetty-launcher-9688-thread-2) [n:127.0.0.1:50690_solr    ] o.a.s.m.r.SolrJmxReporter JMX monitoring for 'solr_50690.solr.jetty' (registry 'solr.jetty') enabled at server: com.sun.jmx.mbeanserver.JmxMBeanServer@179bd920
   [junit4]   2> 3444703 INFO  (jetty-launcher-9688-thread-2) [n:127.0.0.1:50690_solr    ] o.a.s.c.CorePropertiesLocator Found 0 core definitions underneath C:\Users\jenkins\workspace\Lucene-Solr-master-Windows\solr\build\solr-core\test\J1\temp\solr.cloud.TestCloudRecovery_CBE3CBC1A5DADDB4-001\tempDir-001\node1\.
   [junit4]   2> 3444730 INFO  (zkConnectionManagerCallback-9725-thread-1) [    ] o.a.s.c.c.ConnectionManager zkClient has connected
   [junit4]   2> 3444734 INFO  (zkConnectionManagerCallback-9730-thread-1) [    ] o.a.s.c.c.ConnectionManager zkClient has connected
   [junit4]   2> 3444735 INFO  (SUITE-TestCloudRecovery-seed#[CBE3CBC1A5DADDB4]-worker) [    ] o.a.s.c.c.ZkStateReader Updated live nodes from ZooKeeper... (0) -> (2)
   [junit4]   2> 3444736 INFO  (SUITE-TestCloudRecovery-seed#[CBE3CBC1A5DADDB4]-worker) [    ] o.a.s.c.s.i.ZkClientClusterStateProvider Cluster at 127.0.0.1:50686/solr ready
   [junit4]   2> 3444741 INFO  (qtp247400476-33875) [n:127.0.0.1:50690_solr    ] o.a.s.h.a.CollectionsHandler Invoked Collection Action :create with params pullReplicas=0&collection.configName=config&maxShardsPerNode=2&name=collection1&nrtReplicas=2&action=CREATE&numShards=2&tlogReplicas=0&wt=javabin&version=2 and sendToOCPQueue=true
   [junit4]   2> 3444744 INFO  (OverseerThreadFactory-13774-thread-1-processing-n:127.0.0.1:50691_solr) [n:127.0.0.1:50691_solr    ] o.a.s.c.a.c.CreateCollectionCmd Create collection collection1
   [junit4]   2> 3444852 INFO  (OverseerStateUpdate-72154331291910148-127.0.0.1:50691_solr-n_0000000000) [n:127.0.0.1:50691_solr    ] o.a.s.c.o.SliceMutator createReplica() {
   [junit4]   2>   "operation":"ADDREPLICA",
   [junit4]   2>   "collection":"collection1",
   [junit4]   2>   "shard":"shard1",
   [junit4]   2>   "core":"collection1_shard1_replica_n1",
   [junit4]   2>   "state":"down",
   [junit4]   2>   "base_url":"http://127.0.0.1:50691/solr",
   [junit4]   2>   "type":"NRT",
   [junit4]   2>   "waitForFinalState":"false"} 
   [junit4]   2> 3444854 INFO  (OverseerStateUpdate-72154331291910148-127.0.0.1:50691_solr-n_0000000000) [n:127.0.0.1:50691_solr    ] o.a.s.c.o.SliceMutator createReplica() {
   [junit4]   2>   "operation":"ADDREPLICA",
   [junit4]   2>   "collection":"collection1",
   [junit4]   2>   "shard":"shard1",
   [junit4]   2>   "core":"collection1_shard1_replica_n2",
   [junit4]   2>   "state":"down",
   [junit4]   2>   "base_url":"http://127.0.0.1:50690/solr",
   [junit4]   2>   "type":"NRT",
   [junit4]   2>   "waitForFinalState":"false"} 
   [junit4]   2> 3444856 INFO  (OverseerStateUpdate-72154331291910148-127.0.0.1:50691_solr-n_0000000000) [n:127.0.0.1:50691_solr    ] o.a.s.c.o.SliceMutator createReplica() {
   [junit4]   2>   "operation":"ADDREPLICA",
   [junit4]   2>   "collection":"collection1",
   [junit4]   2>   "shard":"shard2",
   [junit4]   2>   "core":"collection1_shard2_replica_n4",
   [junit4]   2>   "state":"down",
   [junit4]   2>   "base_url":"http://127.0.0.1:50691/solr",
   [junit4]   2>   "type":"NRT",
   [junit4]   2>   "waitForFinalState":"false"} 
   [junit4]   2> 3444858 INFO  (OverseerStateUpdate-72154331291910148-127.0.0.1:50691_solr-n_0000000000) [n:127.0.0.1:50691_solr    ] o.a.s.c.o.SliceMutator createReplica() {
   [junit4]   2>   "operation":"ADDREPLICA",
   [junit4]   2>   "collection":"collection1",
   [junit4]   2>   "shard":"shard2",
   [junit4]   2>   "core":"collection1_shard2_replica_n6",
   [junit4]   2>   "state":"down",
   [junit4]   2>   "base_url":"http://127.0.0.1:50690/solr",
   [junit4]   2>   "type":"NRT",
   [junit4]   2>   "waitForFinalState":"false"} 
   [junit4]   2> 3445062 INFO  (qtp247400476-33863) [n:127.0.0.1:50690_solr    x:collection1_shard2_replica_n6] o.a.s.h.a.CoreAdminOperation core create command qt=/admin/cores&coreNodeName=core_node8&collection.configName=config&newCollection=true&name=collection1_shard2_replica_n6&action=CREATE&numShards=2&collection=collection1&shard=shard2&wt=javabin&version=2&replicaType=NRT
   [junit4]   2> 3445062 INFO  (qtp514170760-33874) [n:127.0.0.1:50691_solr    x:collection1_shard2_replica_n4] o.a.s.h.a.CoreAdminOperation core create command qt=/admin/cores&coreNodeName=core_node7&collection.configName=config&newCollection=true&name=collection1_shard2_replica_n4&action=CREATE&numShards=2&collection=collection1&shard=shard2&wt=javabin&version=2&replicaType=NRT
   [junit4]   2> 3445062 INFO  (qtp247400476-33876) [n:127.0.0.1:50690_solr    x:collection1_shard1_replica_n2] o.a.s.h.a.CoreAdminOperation core create command qt=/admin/cores&coreNodeName=core_node5&collection.configName=config&newCollection=true&name=collection1_shard1_replica_n2&action=CREATE&numShards=2&collection=collection1&shard=shard1&wt=javabin&version=2&replicaType=NRT
   [junit4]   2> 3445062 INFO  (qtp514170760-33874) [n:127.0.0.1:50691_solr    x:collection1_shard2_replica_n4] o.a.s.c.TransientSolrCoreCacheDefault Allocating transient cache for 2147483647 transient cores
   [junit4]   2> 3445063 INFO  (qtp514170760-33869) [n:127.0.0.1:50691_solr    x:collection1_shard1_replica_n1] o.a.s.h.a.CoreAdminOperation core create command qt=/admin/cores&coreNodeName=core_node3&collection.configName=config&newCollection=true&name=collection1_shard1_replica_n1&action=CREATE&numShards=2&collection=collection1&shard=shard1&wt=javabin&version=2&replicaType=NRT
   [junit4]   2> 3446075 INFO  (qtp514170760-33874) [n:127.0.0.1:50691_solr c:collection1 s:shard2 r:core_node7 x:collection1_shard2_replica_n4] o.a.s.c.SolrConfig Using Lucene MatchVersion: 8.0.0
   [junit4]   2> 3446075 INFO  (qtp514170760-33869) [n:127.0.0.1:50691_solr c:collection1 s:shard1 r:core_node3 x:collection1_shard1_replica_n1] o.a.s.c.SolrConfig Using Lucene MatchVersion: 8.0.0
   [junit4]   2> 3446081 INFO  (qtp514170760-33874) [n:127.0.0.1:50691_solr c:collection1 s:shard2 r:core_node7 x:collection1_shard2_replica_n4] o.a.s.s.IndexSchema [collection1_shard2_replica_n4] Schema name=minimal
   [junit4]   2> 3446081 INFO  (qtp514170760-33869) [n:127.0.0.1:50691_solr c:collection1 s:shard1 r:core_node3 x:collection1_shard1_replica_n1] o.a.s.s.IndexSchema [collection1_shard1_replica_n1] Schema name=minimal
   [junit4]   2> 3446082 INFO  (qtp514170760-33874) [n:127.0.0.1:50691_solr c:collection1 s:shard2 r:core_node7 x:collection1_shard2_replica_n4] o.a.s.s.IndexSchema Loaded schema minimal/1.1 with uniqueid field id
   [junit4]   2> 3446082 INFO  (qtp514170760-33869) [n:127.0.0.1:50691_solr c:collection1 s:shard1 r:core_node3 x:collection1_shard1_replica_n1] o.a.s.s.IndexSchema Loaded schema minimal/1.1 with uniqueid field id
   [junit4]   2> 3446082 INFO  (qtp514170760-33869) [n:127.0.0.1:50691_solr c:collection1 s:shard1 r:core_node3 x:collection1_shard1_replica_n1] o.a.s.c.CoreContainer Creating SolrCore 'collection1_shard1_replica_n1' using configuration from collection collection1, trusted=true
   [junit4]   2> 3446082 INFO  (qtp514170760-33874) [n:127.0.0.1:50691_solr c:collection1 s:shard2 r:core_node7 x:collection1_shard2_replica_n4] o.a.s.c.CoreContainer Creating SolrCore 'collection1_shard2_replica_n4' using configuration from collection collection1, trusted=true
   [junit4]   2> 3446082 INFO  (qtp514170760-33874) [n:127.0.0.1:50691_solr c:collection1 s:shard2 r:core_node7 x:collection1_shard2_replica_n4] o.a.s.m.r.SolrJmxReporter JMX monitoring for 'solr_50691.solr.core.collection1.shard2.replica_n4' (registry 'solr.core.collection1.shard2.replica_n4') enabled at server: com.sun.jmx.mbeanserver.JmxMBeanServer@179bd920
   [junit4]   2> 3446082 INFO  (qtp514170760-33869) [n:127.0.0.1:50691_solr c:collection1 s:shard1 r:core_node3 x:collection1_shard1_replica_n1] o.a.s.m.r.SolrJmxReporter JMX monitoring for 'solr_50691.solr.core.collection1.shard1.replica_n1' (registry 'solr.core.collection1.shard1.replica_n1') enabled at server: com.sun.jmx.mbeanserver.JmxMBeanServer@179bd920
   [junit4]   2> 3446082 INFO  (qtp514170760-33874) [n:127.0.0.1:50691_solr c:collection1 s:shard2 r:core_node7 x:collection1_shard2_replica_n4] o.a.s.c.SolrCore solr.RecoveryStrategy.Builder
   [junit4]   2> 3446082 INFO  (qtp514170760-33869) [n:127.0.0.1:50691_solr c:collection1 s:shard1 r:core_node3 x:collection1_shard1_replica_n1] o.a.s.c.SolrCore solr.RecoveryStrategy.Builder
   [junit4]   2> 3446082 INFO  (qtp514170760-33869) [n:127.0.0.1:50691_solr c:collection1 s:shard1 r:core_node3 x:collection1_shard1_replica_n1] o.a.s.c.SolrCore [[collection1_shard1_replica_n1] ] Opening new SolrCore at [C:\Users\jenkins\workspace\Lucene-Solr-master-Windows\solr\build\solr-core\test\J1\temp\solr.cloud.TestCloudRecovery_CBE3CBC1A5DADDB4-001\tempDir-001\node2\collection1_shard1_replica_n1], dataDir=[C:\Users\jenkins\workspace\Lucene-Solr-master-Windows\solr\build\solr-core\test\J1\temp\solr.cloud.TestCloudRecovery_CBE3CBC1A5DADDB4-001\tempDir-001\node2\.\collection1_shard1_replica_n1\data\]
   [junit4]   2> 3446082 INFO  (qtp514170760-33874) [n:127.0.0.1:50691_solr c:collection1 s:shard2 r:core_node7 x:collection1_shard2_replica_n4] o.a.s.c.SolrCore [[collection1_shard2_replica_n4] ] Opening new SolrCore at [C:\Users\jenkins\workspace\Lucene-Solr-master-Windows\solr\build\solr-core\test\J1\temp\solr.cloud.TestCloudRecovery_CBE3CBC1A5DADDB4-001\tempDir-001\node2\collection1_shard2_replica_n4], dataDir=[C:\Users\jenkins\workspace\Lucene-Solr-master-Windows\solr\build\solr-core\test\J1\temp\solr.cloud.TestCloudRecovery_CBE3CBC1A5DADDB4-001\tempDir-001\node2\.\collection1_shard2_replica_n4\data\]
   [junit4]   2> 3446187 INFO  (qtp514170760-33874) [n:127.0.0.1:50691_solr c:collection1 s:shard2 r:core_node7 x:collection1_shard2_replica_n4] o.a.s.u.UpdateHandler Using UpdateLog implementation: org.apache.solr.update.UpdateLog
   [junit4]   2> 3446187 INFO  (qtp514170760-33874) [n:127.0.0.1:50691_solr c:collection1 s:shard2 r:core_node7 x:collection1_shard2_replica_n4] o.a.s.u.UpdateLog Initializing UpdateLog: dataDir=null defaultSyncLevel=FLUSH numRecordsToKeep=100 maxNumLogsToKeep=10 numVersionBuckets=65536
   [junit4]   2> 3446189 INFO  (qtp514170760-33869) [n:127.0.0.1:50691_solr c:collection1 s:shard1 r:core_node3 x:collection1_shard1_replica_n1] o.a.s.u.UpdateHandler Using UpdateLog implementation: org.apache.solr.update.UpdateLog
   [junit4]   2> 3446189 INFO  (qtp514170760-33869) [n:127.0.0.1:50691_solr c:collection1 s:shard1 r:core_node3 x:collection1_shard1_replica_n1] o.a.s.u.UpdateLog Initializing UpdateLog: dataDir=null defaultSyncLevel=FLUSH numRecordsToKeep=100 maxNumLogsToKeep=10 numVersionBuckets=65536
   [junit4]   2> 3446189 INFO  (qtp514170760-33874) [n:127.0.0.1:50691_solr c:collection1 s:shard2 r:core_node7 x:collection1_shard2_replica_n4] o.a.s.u.CommitTracker Hard AutoCommit: disabled
   [junit4]   2> 3446189 INFO  (qtp514170760-33874) [n:127.0.0.1:50691_solr c:collection1 s:shard2 r:core_node7 x:collection1_shard2_replica_n4] o.a.s.u.CommitTracker Soft AutoCommit: disabled
   [junit4]   2> 3446190 INFO  (qtp514170760-33869) [n:127.0.0.1:50691_solr c:collection1 s:shard1 r:core_node3 x:collection1_shard1_replica_n1] o.a.s.u.CommitTracker Hard AutoCommit: disabled
   [junit4]   2> 3446190 INFO  (qtp514170760-33869) [n:127.0.0.1:50691_solr c:collection1 s:shard1 r:core_node3 x:collection1_shard1_replica_n1] o.a.s.u.CommitTracker Soft AutoCommit: disabled
   [junit4]   2> 3446193 INFO  (qtp514170760-33869) [n:127.0.0.1:50691_solr c:collection1 s:shard1 r:core_node3 x:collection1_shard1_replica_n1] o.a.s.s.SolrIndexSearcher Opening [Searcher@51987b0[collection1_shard1_replica_n1] main]
   [junit4]   2> 3446193 INFO  (qtp514170760-33874) [n:127.0.0.1:50691_solr c:collection1 s:shard2 r:core_node7 x:collection1_shard2_replica_n4] o.a.s.s.SolrIndexSearcher Opening [Searcher@eb88a0[collection1_shard2_replica_n4] main]
   [junit4]   2> 3446195 INFO  (qtp514170760-33869) [n:127.0.0.1:50691_solr c:collection1 s:shard1 r:core_node3 x:collection1_shard1_replica_n1] o.a.s.r.ManagedResourceStorage Configured ZooKeeperStorageIO with znodeBase: /configs/config
   [junit4]   2> 3446195 INFO  (qtp514170760-33874) [n:127.0.0.1:50691_solr c:collection1 s:shard2 r:core_node7 x:collection1_shard2_replica_n4] o.a.s.r.ManagedResourceStorage Configured ZooKeeperStorageIO with znodeBase: /configs/config
   [junit4]   2> 3446195 INFO  (qtp514170760-33869) [n:127.0.0.1:50691_solr c:collection1 s:shard1 r:core_node3 x:collection1_shard1_replica_n1] o.a.s.r.ManagedResourceStorage Loaded null at path _rest_managed.json using ZooKeeperStorageIO:path=/configs/config
   [junit4]   2> 3446195 INFO  (qtp514170760-33874) [n:127.0.0.1:50691_solr c:collection1 s:shard2 r:core_node7 x:collection1_shard2_replica_n4] o.a.s.r.ManagedResourceStorage Loaded null at path _rest_managed.json using ZooKeeperStorageIO:path=/configs/config
   [junit4]   2> 3446196 INFO  (qtp514170760-33869) [n:127.0.0.1:50691_solr c:collection1 s:shard1 r:core_node3 x:collection1_shard1_replica_n1] o.a.s.h.ReplicationHandler Commits will be reserved for 10000ms.
   [junit4]   2> 3446196 INFO  (qtp514170760-33874) [n:127.0.0.1:50691_solr c:collection1 s:shard2 r:core_node7 x:collection1_shard2_replica_n4] o.a.s.h.ReplicationHandler Commits will be reserved for 10000ms.
   [junit4]   2> 3446196 INFO  (qtp514170760-33869) [n:127.0.0.1:50691_solr c:collection1 s:shard1 r:core_node3 x:collection1_shard1_replica_n1] o.a.s.u.UpdateLog Could not find max version in index or recent updates, using new clock 1610487233719042048
   [junit4]   2> 3446196 INFO  (qtp514170760-33874) [n:127.0.0.1:50691_solr c:collection1 s:shard2 r:core_node7 x:collection1_shard2_replica_n4] o.a.s.u.UpdateLog Could not find max version in index or recent updates, using new clock 1610487233719042048
   [junit4]   2> 3446197 INFO  (searcherExecutor-13783-thread-1-processing-n:127.0.0.1:50691_solr x:collection1_shard1_replica_n1 c:collection1 s:shard1 r:core_node3) [n:127.0.0.1:50691_solr c:collection1 s:shard1 r:core_node3 x:collection1_shard1_replica_n1] o.a.s.c.SolrCore [collection1_shard1_replica_n1] Registered new searcher Searcher@51987b0[collection1_shard1_replica_n1] main{ExitableDirectoryReader(UninvertingDirectoryReader())}
   [junit4]   2> 3446197 INFO  (searcherExecutor-13784-thread-1-processing-n:127.0.0.1:50691_solr x:collection1_shard2_replica_n4 c:collection1 s:shard2 r:core_node7) [n:127.0.0.1:50691_solr c:collection1 s:shard2 r:core_node7 x:collection1_shard2_replica_n4] o.a.s.c.SolrCore [collection1_shard2_replica_n4] Registered new searcher Searcher@eb88a0[collection1_shard2_replica_n4] main{ExitableDirectoryReader(UninvertingDirectoryReader())}
   [junit4]   2> 3446201 INFO  (qtp514170760-33869) [n:127.0.0.1:50691_solr c:collection1 s:shard1 r:core_node3 x:collection1_shard1_replica_n1] o.a.s.c.ZkShardTerms Successful update of terms at /collections/collection1/terms/shard1 to Terms{values={core_node3=0}, version=0}
   [junit4]   2> 3446202 INFO  (qtp514170760-33874) [n:127.0.0.1:50691_solr c:collection1 s:shard2 r:core_node7 x:collection1_shard2_replica_n4] o.a.s.c.ZkShardTerms Successful update of terms at /collections/collection1/terms/shard2 to Terms{values={core_node7=0}, version=0}
   [junit4]   2> 3446204 INFO  (qtp514170760-33869) [n:127.0.0.1:50691_solr c:collection1 s:shard1 r:core_node3 x:collection1_shard1_replica_n1] o.a.s.c.ShardLeaderElectionContext Waiting until we see more replicas up for shard shard1: total=2 found=1 timeoutin=9999ms
   [junit4]   2> 3446206 INFO  (qtp514170760-33874) [n:127.0.0.1:50691_solr c:collection1 s:shard2 r:core_node7 x:collection1_shard2_replica_n4] o.a.s.c.ShardLeaderElectionContext Waiting until we see more replicas up for shard shard2: total=2 found=1 timeoutin=9999ms
   [junit4]   2> 3456224 INFO  (qtp514170760-33869) [n:127.0.0.1:50691_solr c:collection1 s:shard1 r:core_node3 x:collection1_shard1_replica_n1] o.a.s.c.ShardLeaderElectionContext Was waiting for replicas to come up, but they are taking too long - assuming they won't come back till later
   [junit4]   2> 3456224 INFO  (qtp514170760-33869) [n:127.0.0.1:50691_solr c:collection1 s:shard1 r:core_node3 x:collection1_shard1_replica_n1] o.a.s.c.ShardLeaderElectionContext I may be the new leader - try and sync
   [junit4]   2> 3456224 INFO  (qtp514170760-33869) [n:127.0.0.1:50691_solr c:collection1 s:shard1 r:core_node3 x:collection1_shard1_replica_n1] o.a.s.c.SyncStrategy Sync replicas to http://127.0.0.1:50691/solr/collection1_shard1_replica_n1/
   [junit4]   2> 3456224 INFO  (qtp514170760-33874) [n:127.0.0.1:50691_solr c:collection1 s:shard2 r:core_node7 x:collection1_shard2_replica_n4] o.a.s.c.ShardLeaderElectionContext Was waiting for replicas to come up, but they are taking too long - assuming they won't come back till later
   [junit4]   2> 3456224 INFO  (qtp514170760-33874) [n:127.0.0.1:50691_solr c:collection1 s:shard2 r:core_node7 x:collection1_shard2_replica_n4] o.a.s.c.ShardLeaderElectionContext I may be the new leader - try and sync
   [junit4]   2> 3456224 INFO  (qtp514170760-33874) [n:127.0.0.1:50691_solr c:collection1 s:shard2 r:core_node7 x:collection1_shard2_replica_n4] o.a.s.c.SyncStrategy Sync replicas to http://127.0.0.1:50691/solr/collection1_shard2_replica_n4/
   [junit4]   2> 3456224 INFO  (qtp514170760-33869) [n:127.0.0.1:50691_solr c:collection1 s:shard1 r:core_node3 x:collection1_shard1_replica_n1] o.a.s.u.PeerSync PeerSync: core=collection1_shard1_replica_n1 url=http://127.0.0.1:50691/solr START replicas=[http://127.0.0.1:50690/solr/collection1_shard1_replica_n2/] nUpdates=100
   [junit4]   2> 3456224 INFO  (qtp514170760-33874) [n:127.0.0.1:50691_solr c:collection1 s:shard2 r:core_node7 x:collection1_shard2_replica_n4] o.a.s.u.PeerSync PeerSync: core=collection1_shard2_replica_n4 url=http://127.0.0.1:50691/solr START replicas=[http://127.0.0.1:50690/solr/collection1_shard2_replica_n6/] nUpdates=100
   [junit4]   2> 3456224 INFO  (qtp514170760-33869) [n:127.0.0.1:50691_solr c:collection1 s:shard1 r:core_node3 x:collection1_shard1_replica_n1] o.a.s.u.PeerSync PeerSync: core=collection1_shard1_replica_n1 url=http://127.0.0.1:50691/solr DONE.  We have no versions.  sync failed.
   [junit4]   2> 3456224 INFO  (qtp514170760-33874) [n:127.0.0.1:50691_solr c:collection1 s:shard2 r:core_node7 x:collection1_shard2_replica_n4] o.a.s.u.PeerSync PeerSync: core=collection1_shard2_replica_n4 url=http://127.0.0.1:50691/solr DONE.  We have no versions.  sync failed.
   [junit4]   2> 3456228 INFO  (qtp514170760-33869) [n:127.0.0.1:50691_solr c:collection1 s:shard1 r:core_node3 x:collection1_shard1_replica_n1] o.a.s.c.SyncStrategy Leader's attempt to sync with shard failed, moving to the next candidate
   [junit4]   2> 3456228 INFO  (qtp514170760-33869) [n:127.0.0.1:50691_solr c:collection1 s:shard1 r:core_node3 x:collection1_shard1_replica_n1] o.a.s.c.ShardLeaderElectionContext We failed sync, but we have no versions - we can't sync in that case - we were active before, so become leader anyway
   [junit4]   2> 3456228 INFO  (qtp514170760-33874) [n:127.0.0.1:50691_solr c:collection1 s:shard2 r:core_node7 x:collection1_shard2_replica_n4] o.a.s.c.SyncStrategy Leader's attempt to sync with shard failed, moving to the next candidate
   [junit4]   2> 3456228 INFO  (qtp514170760-33874) [n:127.0.0.1:50691_solr c:collection1 s:shard2 r:core_node7 x:collection1_shard2_replica_n4] o.a.s.c.ShardLeaderElectionContext We failed sync, but we have no versions - we can't sync in that case - we were active before, so become leader anyway
   [junit4]   2> 3456231 INFO  (qtp514170760-33869) [n:127.0.0.1:50691_solr c:collection1 s:shard1 r:core_node3 x:collection1_shard1_replica_n1] o.a.s.c.ShardLeaderElectionContext I am the new leader: http://127.0.0.1:50691/solr/collection1_shard1_replica_n1/ shard1
   [junit4]   2> 3456232 INFO  (qtp514170760-33874) [n:127.0.0.1:50691_solr c:collection1 s:shard2 r:core_node7 x:collection1_shard2_replica_n4] o.a.s.c.ShardLeaderElectionContext I am the new leader: http://127.0.0.1:50691/solr/collection1_shard2_replica_n4/ shard2
   [junit4]   2> 3456283 INFO  (qtp514170760-33869) [n:127.0.0.1:50691_solr c:collection1 s:shard1 r:core_node3 x:collection1_shard1_replica_n1] o.a.s.c.ZkController I am the leader, no recovery necessary
   [junit4]   2> 3456285 INFO  (qtp514170760-33869) [n:127.0.0.1:50691_solr c:collection1 s:shard1 r:core_node3 x:collection1_shard1_replica_n1] o.a.s.s.HttpSolrCall [admin] webapp=null path=/admin/cores params={qt=/admin/cores&coreNodeName=core_node3&collection.configName=config&newCollection=true&name=collection1_shard1_replica_n1&action=CREATE&numShards=2&collection=collection1&shard=shard1&wt=javabin&version=2&replicaType=NRT} status=0 QTime=11222
   [junit4]   2> 3456386 INFO  (zkCallback-9700-thread-1) [    ] o.a.s.c.c.ZkStateReader A cluster state change: [WatchedEvent state:SyncConnected type:NodeDataChanged path:/collections/collection1/state.json] for collection [collection1] has occurred - updating... (live nodes size: [2])
   [junit4]   2> 3456435 INFO  (qtp514170760-33874) [n:127.0.0.1:50691_solr c:collection1 s:shard2 r:core_node7 x:collection1_shard2_replica_n4] o.a.s.c.ZkController I am the leader, no recovery necessary
   [junit4]   2> 3456437 INFO  (qtp514170760-33874) [n:127.0.0.1:50691_solr c:collection1 s:shard2 r:core_node7 x:collection1_shard2_replica_n4] o.a.s.s.HttpSolrCall [admin] webapp=null path=/admin/cores params={qt=/admin/cores&coreNodeName=core_node7&collection.configName=config&newCollection=true&name=collection1_shard2_replica_n4&action=CREATE&numShards=2&collection=collection1&shard=shard2&wt=javabin&version=2&replicaType=NRT} status=0 QTime=11374
   [junit4]   2> 3456537 INFO  (zkCallback-9700-thread-2) [    ] o.a.s.c.c.ZkStateReader A cluster state change: [WatchedEvent state:SyncConnected type:NodeDataChanged path:/collections/collection1/state.json] for collection [collection1] has occurred - updating... (live nodes size: [2])
   [junit4]   2> 3504647 INFO  (qtp247400476-33878) [n:127.0.0.1:50690_solr    ] o.a.s.s.HttpSolrCall [admin] webapp=null path=/admin/metrics params={wt=javabin&version=2&key=solr.core.collection1.shard1.replica_n2:INDEX.sizeInBytes&key=solr.core.collection1.shard1.replica_n2:UPDATE./update.requests&key=solr.core.collection1.shard2.replica_n6:UPDATE./update.requests&key=solr.core.collection1.shard2.replica_n6:QUERY./select.requests&key=solr.core.collection1.shard2.replica_n6:INDEX.sizeInBytes&key=solr.core.collection1.shard1.replica_n2:QUERY./select.requests} status=0 QTime=0
   [junit4]   2> 3504654 INFO  (qtp247400476-33867) [n:127.0.0.1:50690_solr    ] o.a.s.s.HttpSolrCall [admin] webapp=null path=/admin/metrics params={wt=javabin&version=2&key=solr.jvm:os.processCpuLoad&key=solr.node:CONTAINER.fs.coreRoot.usableSpace&key=solr.jvm:os.systemLoadAverage&key=solr.jvm:memory.heap.used} status=0 QTime=6
   [junit4]   2> 3504660 INFO  (qtp514170760-33864) [n:127.0.0.1:50691_solr    ] o.a.s.s.HttpSolrCall [admin] webapp=null path=/admin/metrics params={wt=javabin&version=2&key=solr.core.collection1.shard1.replica_n1:INDEX.sizeInBytes&key=solr.core.collection1.shard1.replica_n1:QUERY./select.requests&key=solr.core.collection1.shard2.replica_n4:QUERY./select.requests&key=solr.core.collection1.shard1.replica_n1:UPDATE./update.requests&key=solr.core.collection1.shard2.replica_n4:UPDATE./update.requests&key=solr.core.collection1.shard2.replica_n4:INDEX.sizeInBytes} status=0 QTime=4
   [junit4]   2> 3504665 INFO  (qtp514170760-33866) [n:127.0.0.1:50691_solr    ] o.a.s.s.HttpSolrCall [admin] webapp=null path=/admin/metrics params={wt=javabin&version=2&key=solr.jvm:os.processCpuLoad&key=solr.node:CONTAINER.fs.coreRoot.usableSpace&key=solr.jvm:os.systemLoadAverage&key=solr.jvm:memory.heap.used} status=0 QTime=4
   [junit4]   2> 3564669 INFO  (qtp247400476-33878) [n:127.0.0.1:50690_solr    ] o.a.s.s.HttpSolrCall [admin] webapp=null path=/admin/metrics params={wt=javabin&version=2&key=solr.core.collection1.shard1.replica_n2:INDEX.sizeInBytes&key=solr.core.collection1.shard1.replica_n2:UPDATE./update.requests&key=solr.core.collection1.shard2.replica_n6:UPDATE./update.requests&key=solr.core.collection1.shard2.replica_n6:QUERY./select.requests&key=solr.core.collection1.shard2.replica_n6:INDEX.sizeInBytes&key=solr.core.collection1.shard1.replica_n2:QUERY./select.requests} status=0 QTime=0
   [junit4]   2> 3564674 INFO  (qtp247400476-33958) [n:127.0.0.1:50690_solr    ] o.a.s.s.HttpSolrCall [admin] webapp=null path=/admin/metrics params={wt=javabin&version=2&key=solr.jvm:os.processCpuLoad&key=solr.node:CONTAINER.fs.coreRoot.usableSpace&key=solr.jvm:os.systemLoadAverage&key=solr.jvm:memory.heap.used} status=0 QTime=5
   [junit4]   2> 3564681 INFO  (qtp514170760-33870) [n:127.0.0.1:50691_solr    ] o.a.s.s.HttpSolrCall [admin] webapp=null path=/admin/metrics params={wt=javabin&version=2&key=solr.core.collection1.shard1.replica_n1:INDEX.sizeInBytes&key=solr.core.collection1.shard1.replica_n1:QUERY./select.requests&key=solr.core.collection1.shard2.replica_n4:QUERY./select.requests&key=solr.core.collection1.shard1.replica_n1:UPDATE./update.requests&key=solr.core.collection1.shard2.replica_n4:UPDATE./update.requests&key=solr.core.collection1.shard2.replica_n4:INDEX.sizeInBytes} status=0 QTime=3
   [junit4]   2> 3564688 INFO  (qtp514170760-33871) [n:127.0.0.1:50691_solr    ] o.a.s.s.HttpSolrCall [admin] webapp=null path=/admin/metrics params={wt=javabin&version=2&key=solr.jvm:os.processCpuLoad&key=solr.node:CONTAINER.fs.coreRoot.usableSpace&key=solr.jvm:os.systemLoadAverage&key=solr.jvm:memory.heap.used} status=0 QTime=6
   [junit4]   2> 3624693 INFO  (qtp247400476-33878) [n:127.0.0.1:50690_solr    ] o.a.s.s.HttpSolrCall [admin] webapp=null path=/admin/metrics params={wt=javabin&version=2&key=solr.core.collection1.shard1.replica_n2:INDEX.sizeInBytes&key=solr.core.collection1.shard1.replica_n2:UPDATE./update.requests&key=solr.core.collection1.shard2.replica_n6:UPDATE./update.requests&key=solr.core.collection1.shard2.replica_n6:QUERY./select.requests&key=solr.core.collection1.shard2.replica_n6:INDEX.sizeInBytes&key=solr.core.collection1.shard1.replica_n2:QUERY./select.requests} status=0 QTime=0
   [junit4]   2> 3624705 INFO  (qtp247400476-33877) [n:127.0.0.1:50690_solr    ] o.a.s.s.HttpSolrCall [admin] webapp=null path=/admin/metrics params={wt=javabin&version=2&key=solr.jvm:os.processCpuLoad&key=solr.node:CONTAINER.fs.coreRoot.usableSpace&key=solr.jvm:os.systemLoadAverage&key=solr.jvm:memory.heap.used} status=0 QTime=11
   [junit4]   2> 3624710 INFO  (qtp514170760-33870) [n:127.0.0.1:50691_solr    ] o.a.s.s.HttpSolrCall [admin] webapp=null path=/admin/metrics params={wt=javabin&version=2&key=solr.core.collection1.shard1.replica_n1:INDEX.sizeInBytes&key=solr.core.collection1.shard1.replica_n1:QUERY./select.requests&key=solr.core.collection1.shard2.replica_n4:QUERY./select.requests&key=solr.core.collection1.shard1.replica_n1:UPDATE./update.requests&key=solr.core.collection1.shard2.replica_n4:UPDATE./update.requests&key=solr.core.collection1.shard2.replica_n4:INDEX.sizeInBytes} status=0 QTime=4
   [junit4]   2> 3624718 INFO  (qtp514170760-33872) [n:127.0.0.1:50691_solr    ] o.a.s.s.HttpSolrCall [admin] webapp=null path=/admin/metrics params={wt=javabin&version=2&key=solr.jvm:os.processCpuLoad&key=solr.node:CONTAINER.fs.coreRoot.usableSpace&key=solr.jvm:os.systemLoadAverage&key=solr.jvm:memory.heap.used} status=0 QTime=7
   [junit4]   2> 3624744 ERROR (qtp247400476-33875) [n:127.0.0.1:50690_solr    ] o.a.s.h.RequestHandlerBase org.apache.solr.common.SolrException: create the collection time out:180s
   [junit4]   2> 	at org.apache.solr.handler.admin.CollectionsHandler.sendToOCPQueue(CollectionsHandler.java:367)
   [junit4]   2> 	at org.apache.solr.handler.admin.CollectionsHandler.invokeAction(CollectionsHandler.java:272)
   [junit4]   2> 	at org.apache.solr.handler.admin.CollectionsHandler.handleRequestBody(CollectionsHandler.java:246)
   [junit4]   2> 	at org.apache.solr.handler.RequestHandlerBase.handleRequest(RequestHandlerBase.java:199)
   [junit4]   2> 	at org.apache.solr.servlet.HttpSolrCall.handleAdmin(HttpSolrCall.java:734)
   [junit4]   2> 	at org.apache.solr.servlet.HttpSolrCall.handleAdminRequest(HttpSolrCall.java:715)
   [junit4]   2> 	at org.apache.solr.servlet.HttpSolrCall.call(HttpSolrCall.java:496)
   [junit4]   2> 	at org.apache.solr.servlet.SolrDispatchFilter.doFilter(SolrDispatchFilter.java:377)
   [junit4]   2> 	at org.apache.solr.servlet.SolrDispatchFilter.doFilter(SolrDispatchFilter.java:323)
   [junit4]   2> 	at org.eclipse.jetty.servlet.ServletHandler$CachedChain.doFilter(ServletHandler.java:1642)
   [junit4]   2> 	at org.apache.solr.client.solrj.embedded.JettySolrRunner$DebugFilter.doFilter(JettySolrRunner.java:139)
   [junit4]   2> 	at org.eclipse.jetty.servlet.ServletHandler$CachedChain.doFilter(ServletHandler.java:1642)
   [junit4]   2> 	at org.eclipse.jetty.servlet.ServletHandler.doHandle(ServletHandler.java:533)
   [junit4]   2> 	at org.eclipse.jetty.server.handler.ScopedHandler.nextHandle(ScopedHandler.java:255)
   [junit4]   2> 	at org.eclipse.jetty.server.session.SessionHandler.doHandle(SessionHandler.java:1595)
   [junit4]   2> 	at org.eclipse.jetty.server.handler.ScopedHandler.nextHandle(ScopedHandler.java:255)
   [junit4]   2> 	at org.eclipse.jetty.server.handler.ContextHandler.doHandle(ContextHandler.java:1317)
   [junit4]   2> 	at org.eclipse.jetty.server.handler.ScopedHandler.nextScope(ScopedHandler.java:203)
   [junit4]   2> 	at org.eclipse.jetty.servlet.ServletHandler.doScope(ServletHandler.java:473)
   [junit4]   2> 	at org.eclipse.jetty.server.session.SessionHandler.doScope(SessionHandler.java:1564)
   [junit4]   2> 	at org.eclipse.jetty.server.handler.ScopedHandler.nextScope(ScopedHandler.java:201)
   [junit4]   2> 	at org.eclipse.jetty.server.handler.ContextHandler.doScope(ContextHandler.java:1219)
   [junit4]   2> 	at org.eclipse.jetty.server.handler.ScopedHandler.handle(ScopedHandler.java:144)
   [junit4]   2> 	at org.eclipse.jetty.server.handler.gzip.GzipHandler.handle(GzipHandler.java:724)
   [junit4]   2> 	at org.eclipse.jetty.server.handler.HandlerWrapper.handle(HandlerWrapper.java:132)
   [junit4]   2> 	at org.eclipse.jetty.server.Server.handle(Server.java:531)
   [junit4]   2> 	at org.eclipse.jetty.server.HttpChannel.handle(HttpChannel.java:352)
   [junit4]   2> 	at org.eclipse.jetty.server.HttpConnection.onFillable(HttpConnection.java:260)
   [junit4]   2> 	at org.eclipse.jetty.io.AbstractConnection$ReadCallback.succeeded(AbstractConnection.java:281)
   [junit4]   2> 	at org.eclipse.jetty.io.FillInterest.fillable(FillInterest.java:102)
   [junit4]   2> 	at org.eclipse.jetty.io.ChannelEndPoint$2.run(ChannelEndPoint.java:118)
   [junit4]   2> 	at org.eclipse.jetty.util.thread.QueuedThreadPool.runJob(QueuedThreadPool.java:762)
   [junit4]   2> 	at org.eclipse.jetty.util.thread.QueuedThreadPool$2.run(QueuedThreadPool.java:680)
   [junit4]   2> 	at java.base/java.lang.Thread.run(Thread.java:844)
   [junit4]   2> 
   [junit4]   2> 3624744 INFO  (qtp247400476-33875) [n:127.0.0.1:50690_solr    ] o.a.s.s.HttpSolrCall [admin] webapp=null path=/admin/collections params={pullReplicas=0&collection.configName=config&maxShardsPerNode=2&name=collection1&nrtReplicas=2&action=CREATE&numShards=2&tlogReplicas=0&wt=javabin&version=2} status=500 QTime=180002
   [junit4]   2> 3624744 ERROR (qtp247400476-33875) [n:127.0.0.1:50690_solr    ] o.a.s.s.HttpSolrCall null:org.apache.solr.common.SolrException: create the collection time out:180s
   [junit4]   2> 	at org.apache.solr.handler.admin.CollectionsHandler.sendToOCPQueue(CollectionsHandler.java:367)
   [junit4]   2> 	at org.apache.solr.handler.admin.CollectionsHandler.invokeAction(CollectionsHandler.java:272)
   [junit4]   2> 	at org.apache.solr.handler.admin.CollectionsHandler.handleRequestBody(CollectionsHandler.java:246)
   [junit4]   2> 	at org.apache.solr.handler.RequestHandlerBase.handleRequest(RequestHandlerBase.java:199)
   [junit4]   2> 	at org.apache.solr.servlet.HttpSolrCall.handleAdmin(HttpSolrCall.java:734)
   [junit4]   2> 	at org.apache.solr.servlet.HttpSolrCall.handleAdminRequest(HttpSolrCall.java:715)
   [junit4]   2> 	at org.apache.solr.servlet.HttpSolrCall.call(HttpSolrCall.java:496)
   [junit4]   2> 	at org.apache.solr.servlet.SolrDispatchFilter.doFilter(SolrDispatchFilter.java:377)
   [junit4]   2> 	at org.apache.solr.servlet.SolrDispatchFilter.doFilter(SolrDispatchFilter.java:323)
   [junit4]   2> 	at org.eclipse.jetty.servlet.ServletHandler$CachedChain.doFilter(ServletHandler.java:1642)
   [junit4]   2> 	at org.apache.solr.client.solrj.embedded.JettySolrRunner$DebugFilter.doFilter(JettySolrRunner.java:139)
   [junit4]   2> 	at org.eclipse.jetty.servlet.ServletHandler$CachedChain.doFilter(ServletHandler.java:1642)
   [junit4]   2> 	at org.eclipse.jetty.servlet.ServletHandler.doHandle(ServletHandler.java:533)
   [junit4]   2> 	at org.eclipse.jetty.server.handler.ScopedHandler.nextHandle(ScopedHandler.java:255)
   [junit4]   2> 	at org.eclipse.jetty.server.session.SessionHandler.doHandle(SessionHandler.java:1595)
   [junit4]   2> 	at org.eclipse.jetty.server.handler.ScopedHandler.nextHandle(ScopedHandler.java:255)
   [junit4]   2> 	at org.eclipse.jetty.server.handler.ContextHandler.doHandle(ContextHandler.java:1317)
   [junit4]   2> 	at org.eclipse.jetty.server.handler.ScopedHandler.nextScope(ScopedHandler.java:203)
   [junit4]   2> 	at org.eclipse.jetty.servlet.ServletHandler.doScope(ServletHandler.java:473)
   [junit4]   2> 	at org.eclipse.jetty.server.session.SessionHandler.doScope(SessionHandler.java:1564)
   [junit4]   2> 	at org.eclipse.jetty.server.handler.ScopedHandler.nextScope(ScopedHandler.java:201)
   [junit4]   2> 	at org.eclipse.jetty.server.handler.ContextHandler.doScope(ContextHandler.java:1219)
   [junit4]   2> 	at org.eclipse.jetty.server.handler.ScopedHandler.handle(ScopedHandler.java:144)
   [junit4]   2> 	at org.eclipse.jetty.server.handler.gzip.GzipHandler.handle(GzipHandler.java:724)
   [junit4]   2> 	at org.eclipse.jetty.server.handler.HandlerWrapper.handle(HandlerWrapper.java:132)
   [junit4]   2> 	at org.eclipse.jetty.server.Server.handle(Server.java:531)
   [junit4]   2> 	at org.eclipse.jetty.server.HttpChannel.handle(HttpChannel.java:352)
   [junit4]   2> 	at org.eclipse.jetty.server.HttpConnection.onFillable(HttpConnection.java:260)
   [junit4]   2> 	at org.eclipse.jetty.io.AbstractConnection$ReadCallback.succeeded(AbstractConnection.java:281)
   [junit4]   2> 	at org.eclipse.jetty.io.FillInterest.fillable(FillInterest.java:102)
   [junit4]   2> 	at org.eclipse.jetty.io.ChannelEndPoint$2.run(ChannelEndPoint.java:118)
   [junit4]   2> 	at org.eclipse.jetty.util.thread.QueuedThreadPool.runJob(QueuedThreadPool.java:762)
   [junit4]   2> 	at org.eclipse.jetty.util.thread.QueuedThreadPool$2.run(QueuedThreadPool.java:680)
   [junit4]   2> 	at java.base/java.lang.Thread.run(Thread.java:844)
   [junit4]   2> 
   [junit4]   2> 3624745 WARN  (NIOServerCxn.Factory:0.0.0.0/0.0.0.0:0) [    ] o.a.z.s.NIOServerCnxn Unable to read additional data from client sessionid 0x10057fb65a9000a, likely client has closed socket
   [junit4]   2> 3624747 ERROR (OverseerThreadFactory-13774-thread-1-processing-n:127.0.0.1:50691_solr) [n:127.0.0.1:50691_solr    ] o.a.s.c.a.c.OverseerCollectionMessageHandler Error from shard: http://127.0.0.1:50690/solr
   [junit4]   2> org.apache.solr.client.solrj.SolrServerException: IOException occured when talking to server at: http://127.0.0.1:50690/solr
   [junit4]   2> 	at org.apache.solr.client.solrj.impl.HttpSolrClient.executeMethod(HttpSolrClient.java:657) ~[java/:?]
   [junit4]   2> 	at org.apache.solr.client.solrj.impl.HttpSolrClient.request(HttpSolrClient.java:255) ~[java/:?]
   [junit4]   2> 	at org.apache.solr.client.solrj.impl.HttpSolrClient.request(HttpSolrClient.java:244) ~[java/:?]
   [junit4]   2> 	at org.apache.solr.client.solrj.SolrClient.request(SolrClient.java:1219) ~[java/:?]
   [junit4]   2> 	at org.apache.solr.handler.component.HttpShardHandler.lambda$submit$0(HttpShardHandler.java:172) ~[java/:?]
   [junit4]   2> 	at java.util.concurrent.FutureTask.run(FutureTask.java:264) ~[?:?]
   [junit4]   2> 	at java.util.concurrent.Executors$RunnableAdapter.call(Executors.java:514) ~[?:?]
   [junit4]   2> 	at java.util.concurrent.FutureTask.run(FutureTask.java:264) ~[?:?]
   [junit4]   2> 	at com.codahale.metrics.InstrumentedExecutorService$InstrumentedRunnable.run(InstrumentedExecutorService.java:176) ~[metrics-core-3.2.6.jar:3.2.6]
   [junit4]   2> 	at org.apache.solr.common.util.ExecutorUtil$MDCAwareThreadPoolExecutor.lambda$execute$0(ExecutorUtil.java:209) ~[java/:?]
   [junit4]   2> 	at java.util.concurrent.ThreadPoolExecutor.runWorker(ThreadPoolExecutor.java:1167) ~[?:?]
   [junit4]   2> 	at java.util.concurrent.ThreadPoolExecutor$Worker.run(ThreadPoolExecutor.java:641) ~[?:?]
   [junit4]   2> 	at java.lang.Thread.run(Thread.java:844) [?:?]
   [junit4]   2> Caused by: org.apache.http.NoHttpResponseException: 127.0.0.1:50690 failed to respond
   [junit4]   2> 	at org.apache.http.impl.conn.DefaultHttpResponseParser.parseHead(DefaultHttpResponseParser.java:141) ~[httpclient-4.5.3.jar:4.5.3]
   [junit4]   2> 	at org.apache.http.impl.conn.DefaultHttpResponseParser.parseHead(DefaultHttpResponseParser.java:56) ~[httpclient-4.5.3.jar:4.5.3]
   [junit4]   2> 	at org.apache.http.impl.io.AbstractMessageParser.parse(AbstractMessageParser.java:259) ~[httpcore-4.4.6.jar:4.4.6]
   [junit4]   2> 	at org.apache.http.impl.DefaultBHttpClientConnection.receiveResponseHeader(DefaultBHttpClientConnection.java:163) ~[httpcore-4.4.6.jar:4.4.6]
   [junit4]   2> 	at org.apache.http.impl.conn.CPoolProxy.receiveResponseHeader(CPoolProxy.java:165) ~[httpclient-4.5.3.jar:4.5.3]
   [junit4]   2> 	at org.apache.http.protocol.HttpRequestExecutor.doReceiveResponse(HttpRequestExecutor.java:273) ~[httpcore-4.4.6.jar:4.4.6]
   [junit4]   2> 	at org.apache.http.protocol.HttpRequestExecutor.execute(HttpRequestExecutor.java:125) ~[httpcore-4.4.6.jar:4.4.6]
   [junit4]   2> 	at org.apache.solr.util.stats.InstrumentedHttpRequestExecutor.execute(InstrumentedHttpRequestExecutor.java:120) ~[java/:?]
   [junit4]   2> 	at org.apache.http.impl.execchain.MainClientExec.execute(MainClientExec.java:272) ~[httpclient-4.5.3.jar:4.5.3]
   [junit4]   2> 	at org.apache.http.impl.execchain.ProtocolExec.execute(ProtocolExec.java:185) ~[httpclient-4.5.3.jar:4.5.3]
   [junit4]   2> 	at org.apache.http.impl.execchain.RetryExec.execute(RetryExec.java:89) ~[httpclient-4.5.3.jar:4.5.3]
   [junit4]   2> 	at org.apache.http.impl.execchain.RedirectExec.execute(RedirectExec.java:111) ~[httpclient-4.5.3.jar:4.5.3]
   [junit4]   2> 	at org.apache.http.impl.client.InternalHttpClient.doExecute(InternalHttpClient.java:185) ~[httpclient-4.5.3.jar:4.5.3]
   [junit4]   2> 	at org.apache.http.impl.client.CloseableHttpClient.execute(CloseableHtt

[...truncated too long message...]

edDocs,scope=searcher, tag=2b82dbbe
   [junit4]   2> 66181 DEBUG (searcherExecutor-362-thread-1-processing-x:collection1) [    x:collection1] o.a.s.m.r.j.JmxMetricsReporter ## registered solr:category=SEARCHER,dom1=core,dom2=collection1,name=reader,scope=searcher, tag=2b82dbbe
   [junit4]   2> 66181 DEBUG (searcherExecutor-362-thread-1-processing-x:collection1) [    x:collection1] o.a.s.m.r.j.JmxMetricsReporter ## registered solr:category=SEARCHER,dom1=core,dom2=collection1,name=readerDir,scope=searcher, tag=2b82dbbe
   [junit4]   2> 66181 DEBUG (searcherExecutor-362-thread-1-processing-x:collection1) [    x:collection1] o.a.s.m.r.j.JmxMetricsReporter ## registered solr:category=SEARCHER,dom1=core,dom2=collection1,name=indexVersion,scope=searcher, tag=2b82dbbe
   [junit4]   2> 66181 INFO  (searcherExecutor-362-thread-1-processing-x:collection1) [    x:collection1] o.a.s.c.SolrCore [collection1] Registered new searcher Searcher@477fbb25[collection1] main{ExitableDirectoryReader(UninvertingDirectoryReader())}
   [junit4]   2> 66181 INFO  (TEST-RequestLoggingTest.testLogBeforeExecuteWithRequestLogger-seed#[CBE3CBC1A5DADDB4]) [    ] o.a.s.c.S.Request [collection1]  webapp=null path=null params={q=*:*&wt=xml} hits=0 status=0 QTime=2
   [junit4]   2> 66182 INFO  (TEST-RequestLoggingTest.testLogBeforeExecuteWithRequestLogger-seed#[CBE3CBC1A5DADDB4]) [    ] o.a.s.SolrTestCaseJ4 ###Ending testLogBeforeExecuteWithRequestLogger
   [junit4] OK      0.01s J1 | RequestLoggingTest.testLogBeforeExecuteWithRequestLogger
   [junit4]   2> 66184 INFO  (TEST-RequestLoggingTest.testLogBeforeExecuteWithCoreLogger-seed#[CBE3CBC1A5DADDB4]) [    ] o.a.s.SolrTestCaseJ4 ###Starting testLogBeforeExecuteWithCoreLogger
   [junit4]   2> 66186 DEBUG (TEST-RequestLoggingTest.testLogBeforeExecuteWithCoreLogger-seed#[CBE3CBC1A5DADDB4]) [    ] o.a.s.c.S.Request [collection1]  webapp=null path=null params={q=*:*&wt=xml}
   [junit4]   2> 66187 DEBUG (TEST-RequestLoggingTest.testLogBeforeExecuteWithCoreLogger-seed#[CBE3CBC1A5DADDB4]) [    ] o.a.s.h.c.QueryComponent process: q=*:*&df=text&wt=xml&indent=off
   [junit4]   2> 66187 DEBUG (TEST-RequestLoggingTest.testLogBeforeExecuteWithCoreLogger-seed#[CBE3CBC1A5DADDB4]) [    ] o.a.s.s.s.LocalStatsCache ## GET LocalSolrQueryRequest{q=*:*&df=text&wt=xml&indent=off}
   [junit4]   2> 66187 INFO  (TEST-RequestLoggingTest.testLogBeforeExecuteWithCoreLogger-seed#[CBE3CBC1A5DADDB4]) [    ] o.a.s.c.S.Request [collection1]  webapp=null path=null params={q=*:*&wt=xml} hits=0 status=0 QTime=0
   [junit4]   2> 66187 INFO  (TEST-RequestLoggingTest.testLogBeforeExecuteWithCoreLogger-seed#[CBE3CBC1A5DADDB4]) [    ] o.a.s.SolrTestCaseJ4 ###Ending testLogBeforeExecuteWithCoreLogger
   [junit4]   2> NOTE: reproduce with: ant test  -Dtestcase=RequestLoggingTest -Dtests.method=testLogBeforeExecuteWithCoreLogger -Dtests.seed=CBE3CBC1A5DADDB4 -Dtests.slow=true -Dtests.badapples=true -Dtests.locale=mk -Dtests.timezone=America/St_Lucia -Dtests.asserts=true -Dtests.file.encoding=UTF-8
   [junit4] FAILURE 0.01s J1 | RequestLoggingTest.testLogBeforeExecuteWithCoreLogger <<<
   [junit4]    > Throwable #1: java.lang.AssertionError
   [junit4]    > 	at __randomizedtesting.SeedInfo.seed([CBE3CBC1A5DADDB4:765CB4F5B13B622]:0)
   [junit4]    > 	at org.apache.solr.handler.RequestLoggingTest.testLogBeforeExecute(RequestLoggingTest.java:88)
   [junit4]    > 	at org.apache.solr.handler.RequestLoggingTest.testLogBeforeExecuteWithCoreLogger(RequestLoggingTest.java:65)
   [junit4]    > 	at java.base/jdk.internal.reflect.NativeMethodAccessorImpl.invoke0(Native Method)
   [junit4]    > 	at java.base/jdk.internal.reflect.NativeMethodAccessorImpl.invoke(NativeMethodAccessorImpl.java:62)
   [junit4]    > 	at java.base/jdk.internal.reflect.DelegatingMethodAccessorImpl.invoke(DelegatingMethodAccessorImpl.java:43)
   [junit4]    > 	at java.base/java.lang.reflect.Method.invoke(Method.java:564)
   [junit4]    > 	at java.base/java.lang.Thread.run(Thread.java:844)
   [junit4]   2> 66188 INFO  (SUITE-RequestLoggingTest-seed#[CBE3CBC1A5DADDB4]-worker) [    ] o.a.s.SolrTestCaseJ4 ###deleteCore
   [junit4]   2> 66188 INFO  (SUITE-RequestLoggingTest-seed#[CBE3CBC1A5DADDB4]-worker) [    ] o.a.s.c.CoreContainer Shutting down CoreContainer instance=1308100682
   [junit4]   2> 66188 INFO  (SUITE-RequestLoggingTest-seed#[CBE3CBC1A5DADDB4]-worker) [    ] o.a.s.m.SolrMetricManager Closing metric reporters for registry=solr.node, tag=null
   [junit4]   2> 66188 INFO  (SUITE-RequestLoggingTest-seed#[CBE3CBC1A5DADDB4]-worker) [    ] o.a.s.m.r.SolrJmxReporter Closing reporter [org.apache.solr.metrics.reporters.SolrJmxReporter@7a05fac9: rootName = null, domain = solr.node, service url = null, agent id = null] for registry solr.node / com.codahale.metrics.MetricRegistry@388cb031
   [junit4]   2> 66192 INFO  (SUITE-RequestLoggingTest-seed#[CBE3CBC1A5DADDB4]-worker) [    ] o.a.s.m.SolrMetricManager Closing metric reporters for registry=solr.jvm, tag=null
   [junit4]   2> 66192 INFO  (SUITE-RequestLoggingTest-seed#[CBE3CBC1A5DADDB4]-worker) [    ] o.a.s.m.r.SolrJmxReporter Closing reporter [org.apache.solr.metrics.reporters.SolrJmxReporter@7840877: rootName = null, domain = solr.jvm, service url = null, agent id = null] for registry solr.jvm / com.codahale.metrics.MetricRegistry@561b0ed6
   [junit4]   2> 66194 INFO  (SUITE-RequestLoggingTest-seed#[CBE3CBC1A5DADDB4]-worker) [    ] o.a.s.m.SolrMetricManager Closing metric reporters for registry=solr.jetty, tag=null
   [junit4]   2> 66194 INFO  (SUITE-RequestLoggingTest-seed#[CBE3CBC1A5DADDB4]-worker) [    ] o.a.s.m.r.SolrJmxReporter Closing reporter [org.apache.solr.metrics.reporters.SolrJmxReporter@7898261e: rootName = null, domain = solr.jetty, service url = null, agent id = null] for registry solr.jetty / com.codahale.metrics.MetricRegistry@48fbda19
   [junit4]   2> 66195 INFO  (coreCloseExecutor-367-thread-1) [    x:collection1] o.a.s.c.SolrCore [collection1]  CLOSING SolrCore org.apache.solr.core.SolrCore@5bcf89d4
   [junit4]   2> 66195 INFO  (coreCloseExecutor-367-thread-1) [    x:collection1] o.a.s.m.SolrMetricManager Closing metric reporters for registry=solr.core.collection1, tag=5bcf89d4
   [junit4]   2> 66195 INFO  (coreCloseExecutor-367-thread-1) [    x:collection1] o.a.s.m.r.SolrJmxReporter Closing reporter [org.apache.solr.metrics.reporters.SolrJmxReporter@2b82dbbe: rootName = null, domain = solr.core.collection1, service url = null, agent id = null] for registry solr.core.collection1 / com.codahale.metrics.MetricRegistry@29db6f32
   [junit4]   2> NOTE: leaving temporary files on disk at: C:\Users\jenkins\workspace\Lucene-Solr-master-Windows\solr\build\solr-core\test\J1\temp\solr.handler.RequestLoggingTest_CBE3CBC1A5DADDB4-002
   [junit4]   2> NOTE: test params are: codec=Asserting(Lucene80): {}, docValues:{}, maxPointsInLeafNode=191, maxMBSortInHeap=6.6068975215395485, sim=Asserting(org.apache.lucene.search.similarities.AssertingSimilarity@f0c9738), locale=mk, timezone=America/St_Lucia
   [junit4]   2> NOTE: Windows 10 10.0 amd64/Oracle Corporation 9.0.4 (64-bit)/cpus=3,threads=1,free=138873792,total=308281344
   [junit4]   2> NOTE: All tests run in this JVM: [TestCloudRecovery, RequestLoggingTest, RequestLoggingTest, TestCloudRecovery, RequestLoggingTest, RequestLoggingTest, RequestLoggingTest]
   [junit4] Completed [9/10 (2!)] on J1 in 0.72s, 2 tests, 1 failure <<< FAILURES!

[...truncated 16 lines...]
BUILD FAILED
C:\Users\jenkins\workspace\Lucene-Solr-master-Windows\lucene\common-build.xml:1568: The following error occurred while executing this line:
C:\Users\jenkins\workspace\Lucene-Solr-master-Windows\lucene\common-build.xml:1092: There were test failures: 10 suites, 20 tests, 2 failures [seed: CBE3CBC1A5DADDB4]

Total time: 1 minute 22 seconds

[repro] Setting last failure code to 1

[repro] Failures:
[repro]   0/5 failed: org.apache.solr.cloud.TestCloudRecovery
[repro]   2/5 failed: org.apache.solr.handler.RequestLoggingTest
[repro] Exiting with code 1

C:\Users\jenkins\workspace\Lucene-Solr-master-Windows>IF EXIST lucene\build move /y lucene\build lucene\build.repro 
        1 dir(s) moved.

C:\Users\jenkins\workspace\Lucene-Solr-master-Windows>IF EXIST solr\build move /y solr\build solr\build.repro 
        1 dir(s) moved.

C:\Users\jenkins\workspace\Lucene-Solr-master-Windows>IF EXIST lucene\build.orig move /y lucene\build.orig lucene\build 
        1 dir(s) moved.

C:\Users\jenkins\workspace\Lucene-Solr-master-Windows>IF EXIST solr\build.orig move /y solr\build.orig solr\build 
        1 dir(s) moved.

C:\Users\jenkins\workspace\Lucene-Solr-master-Windows>exit 0 
Archiving artifacts
Setting ANT_1_8_2_HOME=C:\Users\jenkins\tools\hudson.tasks.Ant_AntInstallation\ANT_1.8.2
[WARNINGS] Parsing warnings in console log with parser Java Compiler (javac)
Setting ANT_1_8_2_HOME=C:\Users\jenkins\tools\hudson.tasks.Ant_AntInstallation\ANT_1.8.2
Setting ANT_1_8_2_HOME=C:\Users\jenkins\tools\hudson.tasks.Ant_AntInstallation\ANT_1.8.2
<Git Blamer> Using GitBlamer to create author and commit information for all warnings.
<Git Blamer> GIT_COMMIT=d93c46ea94dec612aa53e37d119fe34b5e8a828e, workspace=C:\Users\jenkins\workspace\Lucene-Solr-master-Windows
[WARNINGS] Computing warning deltas based on reference build #7498
Recording test results
Setting ANT_1_8_2_HOME=C:\Users\jenkins\tools\hudson.tasks.Ant_AntInstallation\ANT_1.8.2
Build step 'Publish JUnit test result report' changed build result to UNSTABLE
Email was triggered for: Unstable (Test Failures)
Sending email for trigger: Unstable (Test Failures)
Setting ANT_1_8_2_HOME=C:\Users\jenkins\tools\hudson.tasks.Ant_AntInstallation\ANT_1.8.2
Setting ANT_1_8_2_HOME=C:\Users\jenkins\tools\hudson.tasks.Ant_AntInstallation\ANT_1.8.2
Setting ANT_1_8_2_HOME=C:\Users\jenkins\tools\hudson.tasks.Ant_AntInstallation\ANT_1.8.2
Setting ANT_1_8_2_HOME=C:\Users\jenkins\tools\hudson.tasks.Ant_AntInstallation\ANT_1.8.2

Mime
View raw message