lucene-dev mailing list archives

Site index · List index
Message view « Date » · « Thread »
Top « Date » · « Thread »
From Policeman Jenkins Server <jenk...@thetaphi.de>
Subject [JENKINS] Lucene-Solr-master-Solaris (64bit/jdk1.8.0) - Build # 2069 - Unstable!
Date Fri, 21 Sep 2018 10:58:09 GMT
Build: https://jenkins.thetaphi.de/job/Lucene-Solr-master-Solaris/2069/
Java: 64bit/jdk1.8.0 -XX:+UseCompressedOops -XX:+UseParallelGC

1 tests failed.
FAILED:  org.apache.solr.handler.component.TestDistributedStatsComponentCardinality.test

Error Message:
sanity check num matches, p=q=id_i1:[10678+TO+14093]&rows=0&stats=true&stats.field={!cardinality%3Dtrue+hllLog2m%3D23+hllRegwidth%3D8}int_i&stats.field={!cardinality%3Dtrue+hllLog2m%3D23+hllRegwidth%3D8+hllPreHashed%3Dtrue}int_i_prehashed_l&stats.field={!cardinality%3Dtrue+hllLog2m%3D23+hllRegwidth%3D8}long_l&stats.field={!cardinality%3Dtrue+hllLog2m%3D23+hllRegwidth%3D8+hllPreHashed%3Dtrue}long_l_prehashed_l&stats.field={!cardinality%3Dtrue+hllLog2m%3D23+hllRegwidth%3D8}string_s&stats.field={!cardinality%3Dtrue+hllLog2m%3D23+hllRegwidth%3D8+hllPreHashed%3Dtrue}string_s_prehashed_l expected:<3416> but was:<0>

Stack Trace:
java.lang.AssertionError: sanity check num matches, p=q=id_i1:[10678+TO+14093]&rows=0&stats=true&stats.field={!cardinality%3Dtrue+hllLog2m%3D23+hllRegwidth%3D8}int_i&stats.field={!cardinality%3Dtrue+hllLog2m%3D23+hllRegwidth%3D8+hllPreHashed%3Dtrue}int_i_prehashed_l&stats.field={!cardinality%3Dtrue+hllLog2m%3D23+hllRegwidth%3D8}long_l&stats.field={!cardinality%3Dtrue+hllLog2m%3D23+hllRegwidth%3D8+hllPreHashed%3Dtrue}long_l_prehashed_l&stats.field={!cardinality%3Dtrue+hllLog2m%3D23+hllRegwidth%3D8}string_s&stats.field={!cardinality%3Dtrue+hllLog2m%3D23+hllRegwidth%3D8+hllPreHashed%3Dtrue}string_s_prehashed_l expected:<3416> but was:<0>
	at __randomizedtesting.SeedInfo.seed([6881289A3320A121:E0D517409DDCCCD9]:0)
	at org.junit.Assert.fail(Assert.java:93)
	at org.junit.Assert.failNotEquals(Assert.java:647)
	at org.junit.Assert.assertEquals(Assert.java:128)
	at org.junit.Assert.assertEquals(Assert.java:472)
	at org.apache.solr.handler.component.TestDistributedStatsComponentCardinality.test(TestDistributedStatsComponentCardinality.java:143)
	at sun.reflect.NativeMethodAccessorImpl.invoke0(Native Method)
	at sun.reflect.NativeMethodAccessorImpl.invoke(NativeMethodAccessorImpl.java:62)
	at sun.reflect.DelegatingMethodAccessorImpl.invoke(DelegatingMethodAccessorImpl.java:43)
	at java.lang.reflect.Method.invoke(Method.java:498)
	at com.carrotsearch.randomizedtesting.RandomizedRunner.invoke(RandomizedRunner.java:1742)
	at com.carrotsearch.randomizedtesting.RandomizedRunner$8.evaluate(RandomizedRunner.java:935)
	at com.carrotsearch.randomizedtesting.RandomizedRunner$9.evaluate(RandomizedRunner.java:971)
	at com.carrotsearch.randomizedtesting.RandomizedRunner$10.evaluate(RandomizedRunner.java:985)
	at org.apache.solr.BaseDistributedSearchTestCase$ShardsRepeatRule$ShardsFixedStatement.callStatement(BaseDistributedSearchTestCase.java:1008)
	at org.apache.solr.BaseDistributedSearchTestCase$ShardsRepeatRule$ShardsStatement.evaluate(BaseDistributedSearchTestCase.java:983)
	at com.carrotsearch.randomizedtesting.rules.SystemPropertiesRestoreRule$1.evaluate(SystemPropertiesRestoreRule.java:57)
	at org.apache.lucene.util.TestRuleSetupTeardownChained$1.evaluate(TestRuleSetupTeardownChained.java:49)
	at org.apache.lucene.util.AbstractBeforeAfterRule$1.evaluate(AbstractBeforeAfterRule.java:45)
	at org.apache.lucene.util.TestRuleThreadAndTestName$1.evaluate(TestRuleThreadAndTestName.java:48)
	at org.apache.lucene.util.TestRuleIgnoreAfterMaxFailures$1.evaluate(TestRuleIgnoreAfterMaxFailures.java:64)
	at org.apache.lucene.util.TestRuleMarkFailure$1.evaluate(TestRuleMarkFailure.java:47)
	at com.carrotsearch.randomizedtesting.rules.StatementAdapter.evaluate(StatementAdapter.java:36)
	at com.carrotsearch.randomizedtesting.ThreadLeakControl$StatementRunner.run(ThreadLeakControl.java:368)
	at com.carrotsearch.randomizedtesting.ThreadLeakControl.forkTimeoutingTask(ThreadLeakControl.java:817)
	at com.carrotsearch.randomizedtesting.ThreadLeakControl$3.evaluate(ThreadLeakControl.java:468)
	at com.carrotsearch.randomizedtesting.RandomizedRunner.runSingleTest(RandomizedRunner.java:944)
	at com.carrotsearch.randomizedtesting.RandomizedRunner$5.evaluate(RandomizedRunner.java:830)
	at com.carrotsearch.randomizedtesting.RandomizedRunner$6.evaluate(RandomizedRunner.java:880)
	at com.carrotsearch.randomizedtesting.RandomizedRunner$7.evaluate(RandomizedRunner.java:891)
	at com.carrotsearch.randomizedtesting.rules.StatementAdapter.evaluate(StatementAdapter.java:36)
	at com.carrotsearch.randomizedtesting.rules.SystemPropertiesRestoreRule$1.evaluate(SystemPropertiesRestoreRule.java:57)
	at org.apache.lucene.util.AbstractBeforeAfterRule$1.evaluate(AbstractBeforeAfterRule.java:45)
	at com.carrotsearch.randomizedtesting.rules.StatementAdapter.evaluate(StatementAdapter.java:36)
	at org.apache.lucene.util.TestRuleStoreClassName$1.evaluate(TestRuleStoreClassName.java:41)
	at com.carrotsearch.randomizedtesting.rules.NoShadowingOrOverridesOnMethodsRule$1.evaluate(NoShadowingOrOverridesOnMethodsRule.java:40)
	at com.carrotsearch.randomizedtesting.rules.NoShadowingOrOverridesOnMethodsRule$1.evaluate(NoShadowingOrOverridesOnMethodsRule.java:40)
	at com.carrotsearch.randomizedtesting.rules.StatementAdapter.evaluate(StatementAdapter.java:36)
	at com.carrotsearch.randomizedtesting.rules.StatementAdapter.evaluate(StatementAdapter.java:36)
	at com.carrotsearch.randomizedtesting.rules.StatementAdapter.evaluate(StatementAdapter.java:36)
	at org.apache.lucene.util.TestRuleAssertionsRequired$1.evaluate(TestRuleAssertionsRequired.java:53)
	at org.apache.lucene.util.TestRuleMarkFailure$1.evaluate(TestRuleMarkFailure.java:47)
	at org.apache.lucene.util.TestRuleIgnoreAfterMaxFailures$1.evaluate(TestRuleIgnoreAfterMaxFailures.java:64)
	at org.apache.lucene.util.TestRuleIgnoreTestSuites$1.evaluate(TestRuleIgnoreTestSuites.java:54)
	at com.carrotsearch.randomizedtesting.rules.StatementAdapter.evaluate(StatementAdapter.java:36)
	at com.carrotsearch.randomizedtesting.ThreadLeakControl$StatementRunner.run(ThreadLeakControl.java:368)
	at java.lang.Thread.run(Thread.java:748)




Build Log:
[...truncated 12460 lines...]
   [junit4] Suite: org.apache.solr.handler.component.TestDistributedStatsComponentCardinality
   [junit4]   2> 214004 INFO  (SUITE-TestDistributedStatsComponentCardinality-seed#[6881289A3320A121]-worker) [    ] o.a.s.SolrTestCaseJ4 SecureRandom sanity checks: test.solr.allowed.securerandom=null & java.security.egd=file:/dev/./urandom
   [junit4]   2> Creating dataDir: /export/home/jenkins/workspace/Lucene-Solr-master-Solaris/solr/build/solr-core/test/J1/temp/solr.handler.component.TestDistributedStatsComponentCardinality_6881289A3320A121-001/init-core-data-001
   [junit4]   2> 214005 WARN  (SUITE-TestDistributedStatsComponentCardinality-seed#[6881289A3320A121]-worker) [    ] o.a.s.SolrTestCaseJ4 startTrackingSearchers: numOpens=8 numCloses=8
   [junit4]   2> 214006 INFO  (SUITE-TestDistributedStatsComponentCardinality-seed#[6881289A3320A121]-worker) [    ] o.a.s.SolrTestCaseJ4 Using PointFields (NUMERIC_POINTS_SYSPROP=true) w/NUMERIC_DOCVALUES_SYSPROP=false
   [junit4]   2> 214007 INFO  (SUITE-TestDistributedStatsComponentCardinality-seed#[6881289A3320A121]-worker) [    ] o.a.s.SolrTestCaseJ4 Randomized ssl (false) and clientAuth (false) via: @org.apache.solr.SolrTestCaseJ4$SuppressSSL(bugUrl=https://issues.apache.org/jira/browse/SOLR-9062)
   [junit4]   2> 214007 INFO  (SUITE-TestDistributedStatsComponentCardinality-seed#[6881289A3320A121]-worker) [    ] o.a.s.BaseDistributedSearchTestCase Setting hostContext system property: /
   [junit4]   2> 214193 INFO  (TEST-TestDistributedStatsComponentCardinality.test-seed#[6881289A3320A121]) [    ] o.a.s.SolrTestCaseJ4 Writing core.properties file to /export/home/jenkins/workspace/Lucene-Solr-master-Solaris/solr/build/solr-core/test/J1/temp/solr.handler.component.TestDistributedStatsComponentCardinality_6881289A3320A121-001/tempDir-001/control/cores/collection1
   [junit4]   2> 214194 INFO  (TEST-TestDistributedStatsComponentCardinality.test-seed#[6881289A3320A121]) [    ] o.e.j.s.Server jetty-9.4.11.v20180605; built: 2018-06-05T18:24:03.829Z; git: d5fc0523cfa96bfebfbda19606cad384d772f04c; jvm 1.8.0_172-b11
   [junit4]   2> 214194 INFO  (TEST-TestDistributedStatsComponentCardinality.test-seed#[6881289A3320A121]) [    ] o.e.j.s.session DefaultSessionIdManager workerName=node0
   [junit4]   2> 214194 INFO  (TEST-TestDistributedStatsComponentCardinality.test-seed#[6881289A3320A121]) [    ] o.e.j.s.session No SessionScavenger set, using defaults
   [junit4]   2> 214194 INFO  (TEST-TestDistributedStatsComponentCardinality.test-seed#[6881289A3320A121]) [    ] o.e.j.s.session node0 Scavenging every 600000ms
   [junit4]   2> 214194 INFO  (TEST-TestDistributedStatsComponentCardinality.test-seed#[6881289A3320A121]) [    ] o.e.j.s.h.ContextHandler Started o.e.j.s.ServletContextHandler@54b74de1{/,null,AVAILABLE}
   [junit4]   2> 214201 INFO  (TEST-TestDistributedStatsComponentCardinality.test-seed#[6881289A3320A121]) [    ] o.e.j.s.AbstractConnector Started ServerConnector@272c2fb2{HTTP/1.1,[http/1.1]}{127.0.0.1:57939}
   [junit4]   2> 214201 INFO  (TEST-TestDistributedStatsComponentCardinality.test-seed#[6881289A3320A121]) [    ] o.e.j.s.Server Started @214331ms
   [junit4]   2> 214201 INFO  (TEST-TestDistributedStatsComponentCardinality.test-seed#[6881289A3320A121]) [    ] o.a.s.c.s.e.JettySolrRunner Jetty properties: {schema=schema-sql.xml, hostContext=/, hostPort=57939, coreRootDirectory=/export/home/jenkins/workspace/Lucene-Solr-master-Solaris/solr/build/solr-core/test/J1/temp/solr.handler.component.TestDistributedStatsComponentCardinality_6881289A3320A121-001/tempDir-001/control/cores}
   [junit4]   2> 214201 ERROR (TEST-TestDistributedStatsComponentCardinality.test-seed#[6881289A3320A121]) [    ] o.a.s.u.StartupLoggingUtils Missing Java Option solr.log.dir. Logging may be missing or incomplete.
   [junit4]   2> 214201 INFO  (TEST-TestDistributedStatsComponentCardinality.test-seed#[6881289A3320A121]) [    ] o.a.s.s.SolrDispatchFilter Using logger factory org.apache.logging.slf4j.Log4jLoggerFactory
   [junit4]   2> 214202 INFO  (TEST-TestDistributedStatsComponentCardinality.test-seed#[6881289A3320A121]) [    ] o.a.s.s.SolrDispatchFilter  ___      _       Welcome to Apache Solr™ version 8.0.0
   [junit4]   2> 214202 INFO  (TEST-TestDistributedStatsComponentCardinality.test-seed#[6881289A3320A121]) [    ] o.a.s.s.SolrDispatchFilter / __| ___| |_ _   Starting in standalone mode on port null
   [junit4]   2> 214202 INFO  (TEST-TestDistributedStatsComponentCardinality.test-seed#[6881289A3320A121]) [    ] o.a.s.s.SolrDispatchFilter \__ \/ _ \ | '_|  Install dir: null
   [junit4]   2> 214202 INFO  (TEST-TestDistributedStatsComponentCardinality.test-seed#[6881289A3320A121]) [    ] o.a.s.s.SolrDispatchFilter |___/\___/_|_|    Start time: 2018-09-21T09:15:56.601Z
   [junit4]   2> 214202 INFO  (TEST-TestDistributedStatsComponentCardinality.test-seed#[6881289A3320A121]) [    ] o.a.s.c.SolrXmlConfig Loading container configuration from /export/home/jenkins/workspace/Lucene-Solr-master-Solaris/solr/build/solr-core/test/J1/temp/solr.handler.component.TestDistributedStatsComponentCardinality_6881289A3320A121-001/tempDir-001/control/solr.xml
   [junit4]   2> 214205 INFO  (TEST-TestDistributedStatsComponentCardinality.test-seed#[6881289A3320A121]) [    ] o.a.s.c.SolrXmlConfig Configuration parameter autoReplicaFailoverWorkLoopDelay is ignored
   [junit4]   2> 214205 INFO  (TEST-TestDistributedStatsComponentCardinality.test-seed#[6881289A3320A121]) [    ] o.a.s.c.SolrXmlConfig Configuration parameter autoReplicaFailoverBadNodeExpiration is ignored
   [junit4]   2> 214205 INFO  (TEST-TestDistributedStatsComponentCardinality.test-seed#[6881289A3320A121]) [    ] o.a.s.c.SolrXmlConfig MBean server found: com.sun.jmx.mbeanserver.JmxMBeanServer@4c536634, but no JMX reporters were configured - adding default JMX reporter.
   [junit4]   2> 214604 INFO  (TEST-TestDistributedStatsComponentCardinality.test-seed#[6881289A3320A121]) [    ] o.a.s.c.TransientSolrCoreCacheDefault Allocating transient cache for 4 transient cores
   [junit4]   2> 214604 INFO  (TEST-TestDistributedStatsComponentCardinality.test-seed#[6881289A3320A121]) [    ] o.a.s.h.a.MetricsHistoryHandler No .system collection, keeping metrics history in memory.
   [junit4]   2> 214626 INFO  (TEST-TestDistributedStatsComponentCardinality.test-seed#[6881289A3320A121]) [    ] o.a.s.m.r.SolrJmxReporter JMX monitoring for 'solr.node' (registry 'solr.node') enabled at server: com.sun.jmx.mbeanserver.JmxMBeanServer@4c536634
   [junit4]   2> 214635 INFO  (TEST-TestDistributedStatsComponentCardinality.test-seed#[6881289A3320A121]) [    ] o.a.s.m.r.SolrJmxReporter JMX monitoring for 'solr.jvm' (registry 'solr.jvm') enabled at server: com.sun.jmx.mbeanserver.JmxMBeanServer@4c536634
   [junit4]   2> 214635 INFO  (TEST-TestDistributedStatsComponentCardinality.test-seed#[6881289A3320A121]) [    ] o.a.s.m.r.SolrJmxReporter JMX monitoring for 'solr.jetty' (registry 'solr.jetty') enabled at server: com.sun.jmx.mbeanserver.JmxMBeanServer@4c536634
   [junit4]   2> 214637 INFO  (TEST-TestDistributedStatsComponentCardinality.test-seed#[6881289A3320A121]) [    ] o.a.s.c.CorePropertiesLocator Found 1 core definitions underneath /export/home/jenkins/workspace/Lucene-Solr-master-Solaris/solr/build/solr-core/test/J1/temp/solr.handler.component.TestDistributedStatsComponentCardinality_6881289A3320A121-001/tempDir-001/control/cores
   [junit4]   2> 214637 INFO  (TEST-TestDistributedStatsComponentCardinality.test-seed#[6881289A3320A121]) [    ] o.a.s.c.CorePropertiesLocator Cores are: [collection1]
   [junit4]   2> 214638 INFO  (coreLoadExecutor-1244-thread-1) [    x:collection1] o.a.s.c.SolrResourceLoader [null] Added 2 libs to classloader, from paths: [/export/home/jenkins/workspace/Lucene-Solr-master-Solaris/solr/core/src/test-files/solr/collection1/lib, /export/home/jenkins/workspace/Lucene-Solr-master-Solaris/solr/core/src/test-files/solr/collection1/lib/classes]
   [junit4]   2> 214667 INFO  (coreLoadExecutor-1244-thread-1) [    x:collection1] o.a.s.c.SolrConfig Using Lucene MatchVersion: 8.0.0
   [junit4]   2> 214679 INFO  (coreLoadExecutor-1244-thread-1) [    x:collection1] o.a.s.s.IndexSchema [collection1] Schema name=test
   [junit4]   2> 214713 WARN  (coreLoadExecutor-1244-thread-1) [    x:collection1] o.a.s.s.IndexSchema Field lowerfilt1and2 is not multivalued and destination for multiple copyFields (2)
   [junit4]   2> 214713 WARN  (coreLoadExecutor-1244-thread-1) [    x:collection1] o.a.s.s.IndexSchema Field text is not multivalued and destination for multiple copyFields (3)
   [junit4]   2> 214713 INFO  (coreLoadExecutor-1244-thread-1) [    x:collection1] o.a.s.s.IndexSchema Loaded schema test/1.6 with uniqueid field id
   [junit4]   2> 214713 INFO  (coreLoadExecutor-1244-thread-1) [    x:collection1] o.a.s.c.CoreContainer Creating SolrCore 'collection1' using configuration from configset /export/home/jenkins/workspace/Lucene-Solr-master-Solaris/solr/core/src/test-files/solr/collection1, trusted=true
   [junit4]   2> 214713 INFO  (coreLoadExecutor-1244-thread-1) [    x:collection1] o.a.s.m.r.SolrJmxReporter JMX monitoring for 'solr.core.collection1' (registry 'solr.core.collection1') enabled at server: com.sun.jmx.mbeanserver.JmxMBeanServer@4c536634
   [junit4]   2> 214713 INFO  (coreLoadExecutor-1244-thread-1) [    x:collection1] o.a.s.c.SolrCore [[collection1] ] Opening new SolrCore at [/export/home/jenkins/workspace/Lucene-Solr-master-Solaris/solr/core/src/test-files/solr/collection1], dataDir=[/export/home/jenkins/workspace/Lucene-Solr-master-Solaris/solr/build/solr-core/test/J1/temp/solr.handler.component.TestDistributedStatsComponentCardinality_6881289A3320A121-001/tempDir-001/control/cores/collection1/data/]
   [junit4]   2> 214715 INFO  (coreLoadExecutor-1244-thread-1) [    x:collection1] o.a.s.u.RandomMergePolicy RandomMergePolicy wrapping class org.apache.lucene.index.TieredMergePolicy: [TieredMergePolicy: maxMergeAtOnce=45, maxMergeAtOnceExplicit=43, maxMergedSegmentMB=65.9267578125, floorSegmentMB=1.439453125, forceMergeDeletesPctAllowed=11.291230024736258, segmentsPerTier=39.0, maxCFSSegmentSizeMB=8.796093022207999E12, noCFSRatio=0.7388929780726712, deletesPctAllowed=28.150783994654383
   [junit4]   2> 214767 INFO  (coreLoadExecutor-1244-thread-1) [    x:collection1] o.a.s.u.UpdateHandler Using UpdateLog implementation: org.apache.solr.update.UpdateLog
   [junit4]   2> 214767 INFO  (coreLoadExecutor-1244-thread-1) [    x:collection1] o.a.s.u.UpdateLog Initializing UpdateLog: dataDir= defaultSyncLevel=FLUSH numRecordsToKeep=100 maxNumLogsToKeep=10 numVersionBuckets=65536
   [junit4]   2> 214768 INFO  (coreLoadExecutor-1244-thread-1) [    x:collection1] o.a.s.u.CommitTracker Hard AutoCommit: disabled
   [junit4]   2> 214768 INFO  (coreLoadExecutor-1244-thread-1) [    x:collection1] o.a.s.u.CommitTracker Soft AutoCommit: disabled
   [junit4]   2> 214768 INFO  (coreLoadExecutor-1244-thread-1) [    x:collection1] o.a.s.u.RandomMergePolicy RandomMergePolicy wrapping class org.apache.lucene.index.LogByteSizeMergePolicy: [LogByteSizeMergePolicy: minMergeSize=1677721, mergeFactor=16, maxMergeSize=2147483648, maxMergeSizeForForcedMerge=9223372036854775807, calibrateSizeByDeletes=true, maxMergeDocs=2147483647, maxCFSSegmentSizeMB=8.796093022207999E12, noCFSRatio=0.26524799568187574]
   [junit4]   2> 214768 INFO  (coreLoadExecutor-1244-thread-1) [    x:collection1] o.a.s.s.SolrIndexSearcher Opening [Searcher@1b4913ce[collection1] main]
   [junit4]   2> 214769 INFO  (coreLoadExecutor-1244-thread-1) [    x:collection1] o.a.s.h.c.SpellCheckComponent Initializing spell checkers
   [junit4]   2> 214884 INFO  (coreLoadExecutor-1244-thread-1) [    x:collection1] o.a.s.s.DirectSolrSpellChecker init: {name=direct,classname=DirectSolrSpellChecker,field=lowerfilt,minQueryLength=3}
   [junit4]   2> 215202 INFO  (coreLoadExecutor-1244-thread-1) [    x:collection1] o.a.s.h.ReplicationHandler Commits will be reserved for 10000ms.
   [junit4]   2> 215202 INFO  (searcherExecutor-1245-thread-1-processing-x:collection1) [    x:collection1] o.a.s.h.c.SpellCheckComponent Loading spell index for spellchecker: default
   [junit4]   2> 215202 INFO  (coreLoadExecutor-1244-thread-1) [    x:collection1] o.a.s.u.UpdateLog Could not find max version in index or recent updates, using new clock 1612207995067826176
   [junit4]   2> 215202 INFO  (searcherExecutor-1245-thread-1-processing-x:collection1) [    x:collection1] o.a.s.h.c.SpellCheckComponent Loading spell index for spellchecker: direct
   [junit4]   2> 215202 INFO  (searcherExecutor-1245-thread-1-processing-x:collection1) [    x:collection1] o.a.s.h.c.SpellCheckComponent Loading spell index for spellchecker: wordbreak
   [junit4]   2> 215202 INFO  (searcherExecutor-1245-thread-1-processing-x:collection1) [    x:collection1] o.a.s.h.c.SpellCheckComponent Loading spell index for spellchecker: multipleFields
   [junit4]   2> 215203 INFO  (searcherExecutor-1245-thread-1-processing-x:collection1) [    x:collection1] o.a.s.h.c.SpellCheckComponent Loading spell index for spellchecker: jarowinkler
   [junit4]   2> 215203 INFO  (searcherExecutor-1245-thread-1-processing-x:collection1) [    x:collection1] o.a.s.h.c.SpellCheckComponent Loading spell index for spellchecker: external
   [junit4]   2> 215203 INFO  (searcherExecutor-1245-thread-1-processing-x:collection1) [    x:collection1] o.a.s.h.c.SpellCheckComponent Loading spell index for spellchecker: freq
   [junit4]   2> 215204 INFO  (searcherExecutor-1245-thread-1-processing-x:collection1) [    x:collection1] o.a.s.h.c.SpellCheckComponent Loading spell index for spellchecker: fqcn
   [junit4]   2> 215204 INFO  (searcherExecutor-1245-thread-1-processing-x:collection1) [    x:collection1] o.a.s.h.c.SpellCheckComponent Loading spell index for spellchecker: perDict
   [junit4]   2> 215205 INFO  (searcherExecutor-1245-thread-1-processing-x:collection1) [    x:collection1] o.a.s.c.SolrCore [collection1] Registered new searcher Searcher@1b4913ce[collection1] main{ExitableDirectoryReader(UninvertingDirectoryReader())}
   [junit4]   2> 215338 INFO  (TEST-TestDistributedStatsComponentCardinality.test-seed#[6881289A3320A121]) [    ] o.a.s.SolrTestCaseJ4 Writing core.properties file to /export/home/jenkins/workspace/Lucene-Solr-master-Solaris/solr/build/solr-core/test/J1/temp/solr.handler.component.TestDistributedStatsComponentCardinality_6881289A3320A121-001/tempDir-001/shard0/cores/collection1
   [junit4]   2> 215339 INFO  (TEST-TestDistributedStatsComponentCardinality.test-seed#[6881289A3320A121]) [    ] o.e.j.s.Server jetty-9.4.11.v20180605; built: 2018-06-05T18:24:03.829Z; git: d5fc0523cfa96bfebfbda19606cad384d772f04c; jvm 1.8.0_172-b11
   [junit4]   2> 215340 INFO  (TEST-TestDistributedStatsComponentCardinality.test-seed#[6881289A3320A121]) [    ] o.e.j.s.session DefaultSessionIdManager workerName=node0
   [junit4]   2> 215340 INFO  (TEST-TestDistributedStatsComponentCardinality.test-seed#[6881289A3320A121]) [    ] o.e.j.s.session No SessionScavenger set, using defaults
   [junit4]   2> 215341 INFO  (TEST-TestDistributedStatsComponentCardinality.test-seed#[6881289A3320A121]) [    ] o.e.j.s.session node0 Scavenging every 600000ms
   [junit4]   2> 215341 INFO  (TEST-TestDistributedStatsComponentCardinality.test-seed#[6881289A3320A121]) [    ] o.e.j.s.h.ContextHandler Started o.e.j.s.ServletContextHandler@608ed269{/,null,AVAILABLE}
   [junit4]   2> 215341 INFO  (TEST-TestDistributedStatsComponentCardinality.test-seed#[6881289A3320A121]) [    ] o.e.j.s.AbstractConnector Started ServerConnector@418ac25b{HTTP/1.1,[http/1.1]}{127.0.0.1:37870}
   [junit4]   2> 215341 INFO  (TEST-TestDistributedStatsComponentCardinality.test-seed#[6881289A3320A121]) [    ] o.e.j.s.Server Started @215471ms
   [junit4]   2> 215341 INFO  (TEST-TestDistributedStatsComponentCardinality.test-seed#[6881289A3320A121]) [    ] o.a.s.c.s.e.JettySolrRunner Jetty properties: {schema=schema-sql.xml, hostContext=/, hostPort=37870, coreRootDirectory=/export/home/jenkins/workspace/Lucene-Solr-master-Solaris/solr/build/solr-core/test/J1/temp/solr.handler.component.TestDistributedStatsComponentCardinality_6881289A3320A121-001/tempDir-001/shard0/cores}
   [junit4]   2> 215341 ERROR (TEST-TestDistributedStatsComponentCardinality.test-seed#[6881289A3320A121]) [    ] o.a.s.u.StartupLoggingUtils Missing Java Option solr.log.dir. Logging may be missing or incomplete.
   [junit4]   2> 215342 INFO  (TEST-TestDistributedStatsComponentCardinality.test-seed#[6881289A3320A121]) [    ] o.a.s.s.SolrDispatchFilter Using logger factory org.apache.logging.slf4j.Log4jLoggerFactory
   [junit4]   2> 215342 INFO  (TEST-TestDistributedStatsComponentCardinality.test-seed#[6881289A3320A121]) [    ] o.a.s.s.SolrDispatchFilter  ___      _       Welcome to Apache Solr™ version 8.0.0
   [junit4]   2> 215342 INFO  (TEST-TestDistributedStatsComponentCardinality.test-seed#[6881289A3320A121]) [    ] o.a.s.s.SolrDispatchFilter / __| ___| |_ _   Starting in standalone mode on port null
   [junit4]   2> 215342 INFO  (TEST-TestDistributedStatsComponentCardinality.test-seed#[6881289A3320A121]) [    ] o.a.s.s.SolrDispatchFilter \__ \/ _ \ | '_|  Install dir: null
   [junit4]   2> 215342 INFO  (TEST-TestDistributedStatsComponentCardinality.test-seed#[6881289A3320A121]) [    ] o.a.s.s.SolrDispatchFilter |___/\___/_|_|    Start time: 2018-09-21T09:15:57.741Z
   [junit4]   2> 215342 INFO  (TEST-TestDistributedStatsComponentCardinality.test-seed#[6881289A3320A121]) [    ] o.a.s.c.SolrXmlConfig Loading container configuration from /export/home/jenkins/workspace/Lucene-Solr-master-Solaris/solr/build/solr-core/test/J1/temp/solr.handler.component.TestDistributedStatsComponentCardinality_6881289A3320A121-001/tempDir-001/shard0/solr.xml
   [junit4]   2> 215345 INFO  (TEST-TestDistributedStatsComponentCardinality.test-seed#[6881289A3320A121]) [    ] o.a.s.c.SolrXmlConfig Configuration parameter autoReplicaFailoverWorkLoopDelay is ignored
   [junit4]   2> 215345 INFO  (TEST-TestDistributedStatsComponentCardinality.test-seed#[6881289A3320A121]) [    ] o.a.s.c.SolrXmlConfig Configuration parameter autoReplicaFailoverBadNodeExpiration is ignored
   [junit4]   2> 215345 INFO  (TEST-TestDistributedStatsComponentCardinality.test-seed#[6881289A3320A121]) [    ] o.a.s.c.SolrXmlConfig MBean server found: com.sun.jmx.mbeanserver.JmxMBeanServer@4c536634, but no JMX reporters were configured - adding default JMX reporter.
   [junit4]   2> 215965 INFO  (TEST-TestDistributedStatsComponentCardinality.test-seed#[6881289A3320A121]) [    ] o.a.s.c.TransientSolrCoreCacheDefault Allocating transient cache for 4 transient cores
   [junit4]   2> 215966 INFO  (TEST-TestDistributedStatsComponentCardinality.test-seed#[6881289A3320A121]) [    ] o.a.s.h.a.MetricsHistoryHandler No .system collection, keeping metrics history in memory.
   [junit4]   2> 215980 INFO  (TEST-TestDistributedStatsComponentCardinality.test-seed#[6881289A3320A121]) [    ] o.a.s.m.r.SolrJmxReporter JMX monitoring for 'solr.node' (registry 'solr.node') enabled at server: com.sun.jmx.mbeanserver.JmxMBeanServer@4c536634
   [junit4]   2> 215990 INFO  (TEST-TestDistributedStatsComponentCardinality.test-seed#[6881289A3320A121]) [    ] o.a.s.m.r.SolrJmxReporter JMX monitoring for 'solr.jvm' (registry 'solr.jvm') enabled at server: com.sun.jmx.mbeanserver.JmxMBeanServer@4c536634
   [junit4]   2> 215990 INFO  (TEST-TestDistributedStatsComponentCardinality.test-seed#[6881289A3320A121]) [    ] o.a.s.m.r.SolrJmxReporter JMX monitoring for 'solr.jetty' (registry 'solr.jetty') enabled at server: com.sun.jmx.mbeanserver.JmxMBeanServer@4c536634
   [junit4]   2> 215992 INFO  (TEST-TestDistributedStatsComponentCardinality.test-seed#[6881289A3320A121]) [    ] o.a.s.c.CorePropertiesLocator Found 1 core definitions underneath /export/home/jenkins/workspace/Lucene-Solr-master-Solaris/solr/build/solr-core/test/J1/temp/solr.handler.component.TestDistributedStatsComponentCardinality_6881289A3320A121-001/tempDir-001/shard0/cores
   [junit4]   2> 215992 INFO  (TEST-TestDistributedStatsComponentCardinality.test-seed#[6881289A3320A121]) [    ] o.a.s.c.CorePropertiesLocator Cores are: [collection1]
   [junit4]   2> 215993 INFO  (coreLoadExecutor-1258-thread-1) [    x:collection1] o.a.s.c.SolrResourceLoader [null] Added 2 libs to classloader, from paths: [/export/home/jenkins/workspace/Lucene-Solr-master-Solaris/solr/core/src/test-files/solr/collection1/lib, /export/home/jenkins/workspace/Lucene-Solr-master-Solaris/solr/core/src/test-files/solr/collection1/lib/classes]
   [junit4]   2> 216018 INFO  (coreLoadExecutor-1258-thread-1) [    x:collection1] o.a.s.c.SolrConfig Using Lucene MatchVersion: 8.0.0
   [junit4]   2> 216049 INFO  (coreLoadExecutor-1258-thread-1) [    x:collection1] o.a.s.s.IndexSchema [collection1] Schema name=test
   [junit4]   2> 216076 WARN  (coreLoadExecutor-1258-thread-1) [    x:collection1] o.a.s.s.IndexSchema Field lowerfilt1and2 is not multivalued and destination for multiple copyFields (2)
   [junit4]   2> 216076 WARN  (coreLoadExecutor-1258-thread-1) [    x:collection1] o.a.s.s.IndexSchema Field text is not multivalued and destination for multiple copyFields (3)
   [junit4]   2> 216076 INFO  (coreLoadExecutor-1258-thread-1) [    x:collection1] o.a.s.s.IndexSchema Loaded schema test/1.6 with uniqueid field id
   [junit4]   2> 216076 INFO  (coreLoadExecutor-1258-thread-1) [    x:collection1] o.a.s.c.CoreContainer Creating SolrCore 'collection1' using configuration from configset /export/home/jenkins/workspace/Lucene-Solr-master-Solaris/solr/core/src/test-files/solr/collection1, trusted=true
   [junit4]   2> 216076 INFO  (coreLoadExecutor-1258-thread-1) [    x:collection1] o.a.s.m.r.SolrJmxReporter JMX monitoring for 'solr.core.collection1' (registry 'solr.core.collection1') enabled at server: com.sun.jmx.mbeanserver.JmxMBeanServer@4c536634
   [junit4]   2> 216077 INFO  (coreLoadExecutor-1258-thread-1) [    x:collection1] o.a.s.c.SolrCore [[collection1] ] Opening new SolrCore at [/export/home/jenkins/workspace/Lucene-Solr-master-Solaris/solr/core/src/test-files/solr/collection1], dataDir=[/export/home/jenkins/workspace/Lucene-Solr-master-Solaris/solr/build/solr-core/test/J1/temp/solr.handler.component.TestDistributedStatsComponentCardinality_6881289A3320A121-001/tempDir-001/shard0/cores/collection1/data/]
   [junit4]   2> 216078 INFO  (coreLoadExecutor-1258-thread-1) [    x:collection1] o.a.s.u.RandomMergePolicy RandomMergePolicy wrapping class org.apache.lucene.index.TieredMergePolicy: [TieredMergePolicy: maxMergeAtOnce=45, maxMergeAtOnceExplicit=43, maxMergedSegmentMB=65.9267578125, floorSegmentMB=1.439453125, forceMergeDeletesPctAllowed=11.291230024736258, segmentsPerTier=39.0, maxCFSSegmentSizeMB=8.796093022207999E12, noCFSRatio=0.7388929780726712, deletesPctAllowed=28.150783994654383
   [junit4]   2> 216126 INFO  (coreLoadExecutor-1258-thread-1) [    x:collection1] o.a.s.u.UpdateHandler Using UpdateLog implementation: org.apache.solr.update.UpdateLog
   [junit4]   2> 216126 INFO  (coreLoadExecutor-1258-thread-1) [    x:collection1] o.a.s.u.UpdateLog Initializing UpdateLog: dataDir= defaultSyncLevel=FLUSH numRecordsToKeep=100 maxNumLogsToKeep=10 numVersionBuckets=65536
   [junit4]   2> 216127 INFO  (coreLoadExecutor-1258-thread-1) [    x:collection1] o.a.s.u.CommitTracker Hard AutoCommit: disabled
   [junit4]   2> 216127 INFO  (coreLoadExecutor-1258-thread-1) [    x:collection1] o.a.s.u.CommitTracker Soft AutoCommit: disabled
   [junit4]   2> 216127 INFO  (coreLoadExecutor-1258-thread-1) [    x:collection1] o.a.s.u.RandomMergePolicy RandomMergePolicy wrapping class org.apache.lucene.index.LogByteSizeMergePolicy: [LogByteSizeMergePolicy: minMergeSize=1677721, mergeFactor=16, maxMergeSize=2147483648, maxMergeSizeForForcedMerge=9223372036854775807, calibrateSizeByDeletes=true, maxMergeDocs=2147483647, maxCFSSegmentSizeMB=8.796093022207999E12, noCFSRatio=0.26524799568187574]
   [junit4]   2> 216127 INFO  (coreLoadExecutor-1258-thread-1) [    x:collection1] o.a.s.s.SolrIndexSearcher Opening [Searcher@c933183[collection1] main]
   [junit4]   2> 216127 INFO  (coreLoadExecutor-1258-thread-1) [    x:collection1] o.a.s.h.c.SpellCheckComponent Initializing spell checkers
   [junit4]   2> 216208 INFO  (coreLoadExecutor-1258-thread-1) [    x:collection1] o.a.s.s.DirectSolrSpellChecker init: {name=direct,classname=DirectSolrSpellChecker,field=lowerfilt,minQueryLength=3}
   [junit4]   2> 216385 INFO  (coreLoadExecutor-1258-thread-1) [    x:collection1] o.a.s.h.ReplicationHandler Commits will be reserved for 10000ms.
   [junit4]   2> 216385 INFO  (coreLoadExecutor-1258-thread-1) [    x:collection1] o.a.s.u.UpdateLog Could not find max version in index or recent updates, using new clock 1612207996308291584
   [junit4]   2> 216385 INFO  (searcherExecutor-1259-thread-1-processing-x:collection1) [    x:collection1] o.a.s.h.c.SpellCheckComponent Loading spell index for spellchecker: default
   [junit4]   2> 216385 INFO  (searcherExecutor-1259-thread-1-processing-x:collection1) [    x:collection1] o.a.s.h.c.SpellCheckComponent Loading spell index for spellchecker: direct
   [junit4]   2> 216385 INFO  (searcherExecutor-1259-thread-1-processing-x:collection1) [    x:collection1] o.a.s.h.c.SpellCheckComponent Loading spell index for spellchecker: wordbreak
   [junit4]   2> 216385 INFO  (searcherExecutor-1259-thread-1-processing-x:collection1) [    x:collection1] o.a.s.h.c.SpellCheckComponent Loading spell index for spellchecker: multipleFields
   [junit4]   2> 216385 INFO  (searcherExecutor-1259-thread-1-processing-x:collection1) [    x:collection1] o.a.s.h.c.SpellCheckComponent Loading spell index for spellchecker: jarowinkler
   [junit4]   2> 216386 INFO  (searcherExecutor-1259-thread-1-processing-x:collection1) [    x:collection1] o.a.s.h.c.SpellCheckComponent Loading spell index for spellchecker: external
   [junit4]   2> 216386 INFO  (searcherExecutor-1259-thread-1-processing-x:collection1) [    x:collection1] o.a.s.h.c.SpellCheckComponent Loading spell index for spellchecker: freq
   [junit4]   2> 216386 INFO  (searcherExecutor-1259-thread-1-processing-x:collection1) [    x:collection1] o.a.s.h.c.SpellCheckComponent Loading spell index for spellchecker: fqcn
   [junit4]   2> 216387 INFO  (searcherExecutor-1259-thread-1-processing-x:collection1) [    x:collection1] o.a.s.h.c.SpellCheckComponent Loading spell index for spellchecker: perDict
   [junit4]   2> 216388 INFO  (TEST-TestDistributedStatsComponentCardinality.test-seed#[6881289A3320A121]) [    ] o.a.s.SolrTestCaseJ4 ###Starting test
   [junit4]   2> 216388 INFO  (TEST-TestDistributedStatsComponentCardinality.test-seed#[6881289A3320A121]) [    ] o.a.s.h.c.TestDistributedStatsComponentCardinality Building an index of 14518 docs
   [junit4]   2> 216388 INFO  (searcherExecutor-1259-thread-1-processing-x:collection1) [    x:collection1] o.a.s.c.SolrCore [collection1] Registered new searcher Searcher@c933183[collection1] main{ExitableDirectoryReader(UninvertingDirectoryReader())}
   [junit4]   2> 216398 INFO  (qtp1701731266-4072) [    x:collection1] o.a.s.u.p.LogUpdateProcessorFactory [collection1]  webapp= path=/update params={wt=javabin&version=2}{add=[1 (1612207996319825920)]} 0 1
   [junit4]   2> 216402 INFO  (qtp866759778-4091) [    x:collection1] o.a.s.u.p.LogUpdateProcessorFactory [collection1]  webapp= path=/update params={wt=javabin&version=2}{add=[1 (1612207996325068800)]} 0 1
   [junit4]   2> 216409 INFO  (qtp1701731266-4067) [    x:collection1] o.a.s.u.p.LogUpdateProcessorFactory [collection1]  webapp= path=/update params={wt=javabin&version=2}{add=[2 (1612207996331360256)]} 0 2
   [junit4]   2> 216412 INFO  (qtp866759778-4087) [    x:collection1] o.a.s.u.p.LogUpdateProcessorFactory [collection1]  webapp= path=/update params={wt=javabin&version=2}{add=[2 (1612207996334505984)]} 0 2
   [junit4]   2> 216413 INFO  (qtp1701731266-4071) [    x:collection1] o.a.s.u.p.LogUpdateProcessorFactory [collection1]  webapp= path=/update params={wt=javabin&version=2}{add=[3 (1612207996337651712)]} 0 0
   [junit4]   2> 216414 INFO  (qtp866759778-4090) [    x:collection1] o.a.s.u.p.LogUpdateProcessorFactory [collection1]  webapp= path=/update params={wt=javabin&version=2}{add=[3 (1612207996338700288)]} 0 0
   [junit4]   2> 216415 INFO  (qtp1701731266-4071) [    x:collection1] o.a.s.u.p.LogUpdateProcessorFactory [collection1]  webapp= path=/update params={wt=javabin&version=2}{add=[4 (1612207996339748864)]} 0 0
   [junit4]   2> 216416 INFO  (qtp866759778-4090) [    x:collection1] o.a.s.u.p.LogUpdateProcessorFactory [collection1]  webapp= path=/update params={wt=javabin&version=2}{add=[4 (1612207996340797440)]} 0 0
   [junit4]   2> 216417 INFO  (qtp1701731266-4074) [    x:collection1] o.a.s.u.p.LogUpdateProcessorFactory [collection1]  webapp= path=/update params={wt=javabin&version=2}{add=[5 (1612207996341846016)]} 0 0
   [junit4]   2> 216417 INFO  (qtp866759778-4093) [    x:collection1] o.a.s.u.p.LogUpdateProcessorFactory [collection1]  webapp= path=/update params={wt=javabin&version=2}{add=[5 (1612207996341846016)]} 0 0
   [junit4]   2> 216418 INFO  (qtp1701731266-4074) [    x:collection1] o.a.s.u.p.LogUpdateProcessorFactory [collection1]  webapp= path=/update params={wt=javabin&version=2}{add=[6 (1612207996342894592)]} 0 0
   [junit4]   2> 216419 INFO  (qtp866759778-4093) [    x:collection1] o.a.s.u.p.LogUpdateProcessorFactory [collection1]  webapp= path=/update params={wt=javabin&version=2}{add=[6 (1612207996342894592)]} 0 0
   [junit4]   2> 216419 INFO  (qtp1701731266-4071) [    x:collection1] o.a.s.u.p.LogUpdateProcessorFactory [collection1]  webapp= path=/update params={wt=javabin&version=2}{add=[7 (1612207996343943168)]} 0 0
   [junit4]   2> 216420 INFO  (qtp866759778-4093) [    x:collection1] o.a.s.u.p.LogUpdateProcessorFactory [collection1]  webapp= path=/update params={wt=javabin&version=2}{add=[7 (1612207996344991744)]} 0 0
   [junit4]   2> 216421 INFO  (qtp1701731266-4074) [    x:collection1] o.a.s.u.p.LogUpdateProcessorFactory [collection1]  webapp= path=/update params={wt=javabin&version=2}{add=[8 (1612207996346040320)]} 0 0
   [junit4]   2> 216422 INFO  (qtp866759778-4090) [    x:collection1] o.a.s.u.p.LogUpdateProcessorFactory [collection1]  webapp= path=/update params={wt=javabin&version=2}{add=[8 (1612207996347088896)]} 0 0
   [junit4]   2> 216422 INFO  (qtp1701731266-4071) [    x:collection1] o.a.s.u.p.LogUpdateProcessorFactory [collection1]  webapp= path=/update params={wt=javabin&version=2}{add=[9 (1612207996347088896)]} 0 0
   [junit4]   2> 216423 INFO  (qtp866759778-4090) [    x:collection1] o.a.s.u.p.LogUpdateProcessorFactory [collection1]  webapp= path=/update params={wt=javabin&version=2}{add=[9 (1612207996348137472)]} 0 0
   [junit4]   2> 216423 INFO  (qtp1701731266-4071) [    x:collection1] o.a.s.u.p.LogUpdateProcessorFactory [collection1]  webapp= path=/update params={wt=javabin&version=2}{add=[10 (1612207996348137472)]} 0 0
   [junit4]   2> 216424 INFO  (qtp866759778-4090) [    x:collection1] o.a.s.u.p.LogUpdateProcessorFactory [collection1]  webapp= path=/update params={wt=javabin&version=2}{add=[10 (1612207996349186048)]} 0 0
   [junit4]   2> 216425 INFO  (qtp1701731266-4074) [    x:collection1] o.a.s.u.p.LogUpdateProcessorFactory [collection1]  webapp= path=/update params={wt=javabin&version=2}{add=[11 (1612207996349186048)]} 0 0
   [junit4]   2> 216425 INFO  (qtp866759778-4090) [    x:collection1] o.a.s.u.p.LogUpdateProcessorFactory [collection1]  webapp= path=/update params={wt=javabin&version=2}{add=[11 (1612207996350234624)]} 0 0
   [junit4]   2> 216426 INFO  (qtp1701731266-4074) [    x:collection1] o.a.s.u.p.LogUpdateProcessorFactory [collection1]  webapp= path=/update params={wt=javabin&version=2}{add=[12 (1612207996351283200)]} 0 0
   [junit4]   2> 216426 INFO  (qtp866759778-4090) [    x:collection1] o.a.s.u.p.LogUpdateProcessorFactory [collection1]  webapp= path=/update params={wt=javabin&version=2}{add=[12 (1612207996351283200)]} 0 0
   [junit4]   2> 216427 INFO  (qtp1701731266-4071) [    x:collection1] o.a.s.u.p.LogUpdateProcessorFactory [collection1]  webapp= path=/update params={wt=javabin&version=2}{add=[13 (1612207996352331776)]} 0 0
   [junit4]   2> 216428 INFO  (qtp866759778-4090) [    x:collection1] o.a.s.u.p.LogUpdateProcessorFactory [collection1]  webapp= path=/update params={wt=javabin&version=2}{add=[13 (1612207996353380352)]} 0 0
   [junit4]   2> 216428 INFO  (qtp1701731266-4071) [    x:collection1] o.a.s.u.p.LogUpdateProcessorFactory [collection1]  webapp= path=/update params={wt=javabin&version=2}{add=[14 (1612207996353380352)]} 0 0
   [junit4]   2> 216429 INFO  (qtp866759778-4090) [    x:collection1] o.a.s.u.p.LogUpdateProcessorFactory [collection1]  webapp= path=/update params={wt=javabin&version=2}{add=[14 (1612207996353380353)]} 0 0
   [junit4]   2> 216429 INFO  (qtp1701731266-4071) [    x:collection1] o.a.s.u.p.LogUpdateProcessorFactory [collection1]  webapp= path=/update params={wt=javabin&version=2}{add=[15 (1612207996354428928)]} 0 0
   [junit4]   2> 216430 INFO  (qtp866759778-4090) [    x:collection1] o.a.s.u.p.LogUpdateProcessorFactory [collection1]  webapp= path=/update params={wt=javabin&version=2}{add=[15 (1612207996355477504)]} 0 0
   [junit4]   2> 216430 INFO  (qtp1701731266-4071) [    x:collection1] o.a.s.u.p.LogUpdateProcessorFactory [collection1]  webapp= path=/update params={wt=javabin&version=2}{add=[16 (1612207996355477504)]} 0 0
   [junit4]   2> 216431 INFO  (qtp866759778-4090) [    x:collection1] o.a.s.u.p.LogUpdateProcessorFactory [collection1]  webapp= path=/update params={wt=javabin&version=2}{add=[16 (1612207996356526080)]} 0 0
   [junit4]   2> 216431 INFO  (qtp1701731266-4071) [    x:collection1] o.a.s.u.p.LogUpdateProcessorFactory [collection1]  webapp= path=/update params={wt=javabin&version=2}{add=[17 (1612207996356526080)]} 0 0
   [junit4]   2> 216432 INFO  (qtp866759778-4090) [    x:collection1] o.a.s.u.p.LogUpdateProcessorFactory [collection1]  webapp= path=/update params={wt=javabin&version=2}{add=[17 (1612207996357574656)]} 0 0
   [junit4]   2> 216433 INFO  (qtp1701731266-4074) [    x:collection1] o.a.s.u.p.LogUpdateProcessorFactory [collection1]  webapp= path=/update params={wt=javabin&version=2}{add=[18 (1612207996358623232)]} 0 0
   [junit4]   2> 216433 INFO  (qtp866759778-4093) [    x:collection1] o.a.s.u.p.LogUpdateProcessorFactory [collection1]  webapp= path=/update params={wt=javabin&version=2}{add=[18 (1612207996358623232)]} 0 0
   [junit4]   2> 216434 INFO  (qtp1701731266-4071) [    x:collection1] o.a.s.u.p.LogUpdateProcessorFactory [collection1]  webapp= path=/update params={wt=javabin&version=2}{add=[19 (1612207996359671808)]} 0 0
   [junit4]   2> 216435 INFO  (qtp866759778-4090) [    x:collection1] o.a.s.u.p.LogUpdateProcessorFactory [collection1]  webapp= path=/update params={wt=javabin&version=2}{add=[19 (1612207996360720384)]} 0 0
   [junit4]   2> 216435 INFO  (qtp1701731266-4071) [    x:collection1] o.a.s.u.p.LogUpdateProcessorFactory [collection1]  webapp= path=/update params={wt=javabin&version=2}{add=[20 (1612207996360720384)]} 0 0
   [junit4]   2> 216436 INFO  (qtp866759778-4090) [    x:collection1] o.a.s.u.p.LogUpdateProcessorFactory [collection1]  webapp= path=/update params={wt=javabin&version=2}{add=[20 (1612207996361768960)]} 0 0
   [junit4]   2> 216436 INFO  (qtp1701731266-4071) [    x:collection1] o.a.s.u.p.LogUpdateProcessorFactory [collection1]  webapp= path=/update params={wt=javabin&version=2}{add=[21 (1612207996361768960)]} 0 0
   [junit4]   2> 216437 INFO  (qtp866759778-4090) [    x:collection1] o.a.s.u.p.LogUpdateProcessorFactory [collection1]  webapp= path=/update params={wt=javabin&version=2}{add=[21 (1612207996361768961)]} 0 0
   [junit4]   2> 216437 INFO  (qtp1701731266-4071) [    x:collection1] o.a.s.u.p.LogUpdateProcessorFactory [collection1]  webapp= path=/update params={wt=javabin&version=2}{add=[22 (1612207996362817536)]} 0 0
   [junit4]   2> 216437 INFO  (qtp866759778-4090) [    x:collection1] o.a.s.u.p.LogUpdateProcessorFactory [collection1]  webapp= path=/update params={wt=javabin&version=2}{add=[22 (1612207996362817536)]} 0 0
   [junit4]   2> 216438 INFO  (qtp1701731266-4071) [    x:collection1] o.a.s.u.p.LogUpdateProcessorFactory [collection1]  webapp= path=/update params={wt=javabin&version=2}{add=[23 (1612207996363866112)]} 0 0
   [junit4]   2> 216438 INFO  (qtp866759778-4090) [    x:collection1] o.a.s.u.p.LogUpdateProcessorFactory [collection1]  webapp= path=/update params={wt=javabin&version=2}{add=[23 (1612207996363866112)]} 0 0
   [junit4]   2> 216439 INFO  (qtp1701731266-4071) [    x:collection1] o.a.s.u.p.LogUpdateProcessorFactory [collection1]  webapp= path=/update params={wt=javabin&version=2}{add=[24 (1612207996364914688)]} 0 0
   [junit4]   2> 216439 INFO  (qtp866759778-4090) [    x:collection1] o.a.s.u.p.LogUpdateProcessorFactory [collection1]  webapp= path=/update params={wt=javabin&version=2}{add=[24 (1612207996364914688)]} 0 0
   [junit4]   2> 216440 INFO  (qtp1701731266-4071) [    x:collection1] o.a.s.u.p.LogUpdateProcessorFactory [collection1]  webapp= path=/update params={wt=javabin&version=2}{add=[25 (1612207996365963264)]} 0 0
   [junit4]   2> 216440 INFO  (qtp866759778-4090) [    x:collection1] o.a.s.u.p.LogUpdateProcessorFactory [collection1]  webapp= path=/update params={wt=javabin&version=2}{add=[25 (1612207996365963264)]} 0 0
   [junit4]   2> 216441 INFO  (qtp1701731266-4071) [    x:collection1] o.a.s.u.p.LogUpdateProcessorFactory [collection1]  webapp= path=/update params={wt=javabin&version=2}{add=[26 (1612207996365963265)]} 0 0
   [junit4]   2> 216441 INFO  (qtp866759778-4090) [    x:collection1] o.a.s.u.p.LogUpdateProcessorFactory [collection1]  webapp= path=/update params={wt=javabin&version=2}{add=[26 (1612207996367011840)]} 0 0
   [junit4]   2> 216441 INFO  (qtp1701731266-4071) [    x:collection1] o.a.s.u.p.LogUpdateProcessorFactory [collection1]  webapp= path=/update params={wt=javabin&version=2}{add=[27 (1612207996367011840)]} 0 0
   [junit4]   2> 216442 INFO  (qtp866759778-4090) [    x:collection1] o.a.s.u.p.LogUpdateProcessorFactory [collection1]  webapp= path=/update params={wt=javabin&version=2}{add=[27 (1612207996368060416)]} 0 0
   [junit4]   2> 216442 INFO  (qtp1701731266-4071) [    x:collection1] o.a.s.u.p.LogUpdateProcessorFactory [collection1]  webapp= path=/update params={wt=javabin&version=2}{add=[28 (1612207996368060416)]} 0 0
   [junit4]   2> 216443 INFO  (qtp866759778-4090) [    x:collection1] o.a.s.u.p.LogUpdateProcessorFactory [collection1]  webapp= path=/update params={wt=javabin&version=2}{add=[28 (1612207996369108992)]} 0 0
   [junit4]   2> 216443 INFO  (qtp1701731266-4071) [    x:collection1] o.a.s.u.p.LogUpdateProcessorFactory [collection1]  webapp= path=/update params={wt=javabin&version=2}{add=[29 (1612207996369108992)]} 0 0
   [junit4]   2> 216444 INFO  (qtp866759778-4090) [    x:collection1] o.a.s.u.p.LogUpdateProcessorFactory [collection1]  webapp= path=/update params={wt=javabin&version=2}{add=[29 (1612207996369108993)]} 0 0
   [junit4]   2> 216444 INFO  (qtp1701731266-4071) [    x:collection1] o.a.s.u.p.LogUpdateProcessorFactory [collection1]  webapp= path=/update params={wt=javabin&version=2}{add=[30 (1612207996370157568)]} 0 0
   [junit4]   2> 216445 INFO  (qtp866759778-4093) [    x:collection1] o.a.s.u.p.LogUpdateProcessorFactory [collection1]  webapp= path=/update params={wt=javabin&version=2}{add=[30 (1612207996371206144)]} 0 0
   [junit4]   2> 216446 INFO  (qtp1701731266-4074) [    x:collection1] o.a.s.u.p.LogUpdateProcessorFactory [collection1]  webapp= path=/update params={wt=javabin&version=2}{add=[31 (1612207996372254720)]} 0 0
   [junit4]   2> 216446 INFO  (qtp866759778-4090) [    x:collection1] o.a.s.u.p.LogUpdateProcessorFactory [collection1]  webapp= path=/update params={wt=javabin&version=2}{add=[31 (1612207996372254720)]} 0 0
   [junit4]   2> 216447 INFO  (qtp1701731266-4074) [    x:collection1] o.a.s.u.p.LogUpdateProcessorFactory [collection1]  webapp= path=/update params={wt=javabin&version=2}{add=[32 (1612207996373303296)]} 0 0
   [junit4]   2> 216448 INFO  (qtp866759778-4093) [    x:collection1] o.a.s.u.p.LogUpdateProcessorFactory [collection1]  webapp= path=/update params={wt=javabin&version=2}{add=[32 (1612207996373303296)]} 0 0
   [junit4]   2> 216448 INFO  (qtp1701731266-4071) [    x:collection1] o.a.s.u.p.LogUpdateProcessorFactory [collection1]  webapp= path=/update params={wt=javabin&version=2}{add=[33 (1612207996374351872)]} 0 0
   [junit4]   2> 216449 INFO  (qtp866759778-4090) [    x:collection1] o.a.s.u.p.LogUpdateProcessorFactory [collection1]  webapp= path=/update params={wt=javabin&version=2}{add=[33 (1612207996375400448)]} 0 0
   [junit4]   2> 216450 INFO  (qtp1701731266-4074) [    x:collection1] o.a.s.u.p.LogUpdateProcessorFactory [collection1]  webapp= path=/update params={wt=javabin&version=2}{add=[34 (1612207996375400448)]} 0 0
   [junit4]   2> 216450 INFO  (qtp866759778-4093) [    x:collection1] o.a.s.u.p.LogUpdateProcessorFactory [collection1]  webapp= path=/update params={wt=javabin&version=2}{add=[34 (1612207996376449024)]} 0 0
   [junit4]   2> 216451 INFO  (qtp1701731266-4071) [    x:collection1] o.a.s.u.p.LogUpdateProcessorFactory [collection1]  webapp= path=/update params={wt=javabin&version=2}{add=[35 (1612207996377497600)]} 0 0
   [junit4]   2> 216452 INFO  (qtp866759778-4090) [    x:collection1] o.a.s.u.p.LogUpdateProcessorFactory [collection1]  webapp= path=/update params={wt=javabin&version=2}{add=[35 (1612207996378546176)]} 0 0
   [junit4]   2> 216452 INFO  (qtp1701731266-4074) [    x:collection1] o.a.s.u.p.LogUpdateProcessorFactory [collection1]  webapp= path=/update params={wt=javabin&version=2}{add=[36 (1612207996378546176)]} 0 0
   [junit4]   2> 216453 INFO  (qtp866759778-4093) [    x:collection1] o.a.s.u.p.LogUpdateProcessorFactory [collection1]  webapp= path=/update params={wt=javabin&version=2}{add=[36 (1612207996379594752)]} 0 0
   [junit4]   2> 216454 INFO  (qtp1701731266-4071) [    x:collection1] o.a.s.u.p.LogUpdateProcessorFactory [collection1]  webapp= path=/update params={wt=javabin&version=2}{add=[37 (1612207996380643328)]} 0 0
   [junit4]   2> 216454 INFO  (qtp866759778-4090) [    x:collection1] o.a.s.u.p.LogUpdateProcessorFactory [collection1]  webapp= path=/update params={wt=javabin&version=2}{add=[37 (1612207996380643328)]} 0 0
   [junit4]   2> 216455 INFO  (qtp1701731266-4071) [    x:collection1] o.a.s.u.p.LogUpdateProcessorFactory [collection1]  webapp= path=/update params={wt=javabin&version=2}{add=[38 (1612207996381691904)]} 0 0
   [junit4]   2> 216456 INFO  (qtp866759778-4093) [    x:collection1] o.a.s.u.p.LogUpdateProcessorFactory [collection1]  webapp= path=/update params={wt=javabin&version=2}{add=[38 (1612207996382740480)]} 0 0
   [junit4]   2> 216456 INFO  (qtp1701731266-4074) [    x:collection1] o.a.s.u.p.LogUpdateProcessorFactory [collection1]  webapp= path=/update params={wt=javabin&version=2}{add=[39 (1612207996382740480)]} 0 0
   [junit4]   2> 216457 INFO  (qtp866759778-4090) [    x:collection1] o.a.s.u.p.LogUpdateProcessorFactory [collection1]  webapp= path=/update params={wt=javabin&version=2}{add=[39 (1612207996383789056)]} 0 0
   [junit4]   2> 216458 INFO  (qtp1701731266-4071) [    x:collection1] o.a.s.u.p.LogUpdateProcessorFactory [collection1]  webapp= path=/update params={wt=javabin&version=2}{add=[40 (1612207996383789056)]} 0 0
   [junit4]   2> 216458 INFO  (qtp866759778-4093) [    x:collection1] o.a.s.u.p.LogUpdateProcessorFactory [collection1]  webapp= path=/update params={wt=javabin&version=2}{add=[40 (1612207996384837632)]} 0 0
   [junit4]   2> 216459 INFO  (qtp1701731266-4074) [    x:collection1] o.a.s.u.p.LogUpdateProcessorFactory [collection1]  webapp= path=/update params={wt=javabin&version=2}{add=[41 (1612207996385886208)]} 0 0
   [junit4]   2> 216460 INFO  (qtp866759778-4090) [    x:collection1] o.a.s.u.p.LogUpdateProcessorFactory [collection1]  webapp= path=/update params={wt=javabin&version=2}{add=[41 (1612207996385886208)]} 0 0
   [junit4]   2> 216460 INFO  (qtp1701731266-4071) [    x:collection1] o.a.s.u.p.LogUpdateProcessorFactory [collection1]  webapp= path=/update params={wt=javabin&version=2}{add=[42 (1612207996386934784)]} 0 0
   [junit4]   2> 216461 INFO  (qtp866759778-4093) [    x:collection1] o.a.s.u.p.LogUpdateProcessorFactory [collection1]  webapp= path=/update params={wt=javabin&version=2}{add=[42 (1612207996387983360)]} 0 0
   [junit4]   2> 216461 INFO  (qtp1701731266-4071) [    x:collection1] o.a.s.u.p.LogUpdateProcessorFactory [collection1]  webapp= path=/update params={wt=javabin&version=2}{add=[43 (1612207996387983360)]} 0 0
   [junit4]   2> 216462 INFO  (qtp866759778-4093) [    x:collection1] o.a.s.u.p.LogUpdateProcessorFactory [collection1]  webapp= path=/update params={wt=javabin&version=2}{add=[43 (1612207996389031936)]} 0 0
   [junit4]   2> 216462 INFO  (qtp1701731266-4071) [    x:collection1] o.a.s.u.p.LogUpdateProcessorFactory [collection1]  webapp= path=/update params={wt=javabin&version=2}{add=[44 (1612207996389031936)]} 0 0
   [junit4]   2> 216463 INFO  (qtp866759778-4093) [    x:collection1] o.a.s.u.p.LogUpdateProcessorFactory [collection1]  webapp= path=/update params={wt=javabin&version=2}{add=[44 (1612207996390080512)]} 0 0
   [junit4]   2> 216464 INFO  (qtp1701731266-4074) [    x:collection1] o.a.s.u.p.LogUpdateProcessorFactory [collection1]  webapp= path=/update params={wt=javabin&version=2}{add=[45 (1612207996391129088)]} 0 0
   [junit4]   2> 216464 INFO  (qtp866759778-4090) [    x:collection1] o.a.s.u.p.LogUpdateProcessorFactory [collection1]  webapp= path=/update params={wt=javabin&version=2}{add=[45 (1612207996391129088)]} 0 0
   [junit4]   2> 216465 INFO  (qtp1701731266-4071) [    x:collection1] o.a.s.u.p.LogUpdateProcessorFactory [collection1]  webapp= path=/update params={wt=javabin&version=2}{add=[46 (1612207996392177664)]} 0 0
   [junit4]   2> 216465 INFO  (qtp866759778-4093) [    x:collection1] o.a.s.u.p.LogUpdateProcessorFactory [collection1]  webapp= path=/update params={wt=javabin&version=2}{add=[46 (1612207996392177664)]} 0 0
   [junit4]   2> 216466 INFO  (qtp1701731266-4074) [    x:collection1] o.a.s.u.p.LogUpdateProcessorFactory [collection1]  webapp= path=/update params={wt=javabin&version=2}{add=[47 (1612207996393226240)]} 0 0
   [junit4]   2> 216466 INFO  (qtp866759778-4090) [    x:collection1] o.a.s.u.p.LogUpdateProcessorFactory [collection1]  webapp= path=/update params={wt=javabin&version=2}{add=[47 (1612207996393226240)]} 0 0
   [junit4]   2> 216467 INFO  (qtp1701731266-4074) [    x:collection1] o.a.s.u.p.LogUpdateProcessorFactory [collection1]  webapp= path=/update params={wt=javabin&version=2}{add=[48 (1612207996394274816)]} 0 0
   [junit4]   2> 216467 INFO  (qtp866759778-4093) [    x:collection1] o.a.s.u.p.LogUpdateProcessorFactory [collection1]  webapp= path=/update params={wt=javabin&version=2}{add=[48 (1612207996394274816)]} 0 0
   [junit4]   2> 216468 INFO  (qtp1701731266-4071) [    x:collection1] o.a.s.u.p.LogUpdateProcessorFactory [collection1]  webapp= path=/update params={wt=javabin&version=2}{add=[49 (1612207996395323392)]} 0 0
   [junit4]   2> 216469 INFO  (qtp866759778-4090) [    x:collection1] o.a.s.u.p.LogUpdateProcessorFactory [collection1]  webapp= path=/update params={wt=javabin&version=2}{add=[49 (1612207996395323392)]} 0 0
   [junit4]   2> 216469 INFO  (qtp1701731266-4074) [    x:collection1] o.a.s.u.p.LogUpdateProcessorFactory [collection1]  webapp= path=/update params={wt=javabin&version=2}{add=[50 (1612207996396371968)]} 0 0
   [junit4]   2> 216470 INFO  (qtp866759778-4090) [    x:collection1] o.a.s.u.p.LogUpdateProcessorFactory [collection1]  webapp= path=/update params={wt=javabin&version=2}{add=[50 (1612207996396371968)]} 0 0
   [junit4]   2> 216470 INFO  (qtp1701731266-4074) [    x:collection1] o.a.s.u.p.LogUpdateProcessorFactory [collection1]  webapp= path=/update params={wt=javabin&version=2}{add=[51 (1612207996397420544)]} 0 0
   [junit4]   2> 216471 INFO  (qtp866759778-4093) [    x:collection1] o.a.s.u.p.LogUpdateProcessorFactory [collection1]  webapp= path=/update params={wt=javabin&version=2}{add=[51 (1612207996398469120)]} 0 0
   [junit4]   2> 216472 INFO  (qtp1701731266-4071) [    x:collection1] o.a.s.u.p.LogUpdateProcessorFactory [collection1]  webapp= path=/update params={wt=javabin&version=2}{add=[52 (1612207996398469120)]} 0 0
   [junit4]   2> 216472 INFO  (qtp866759778-4090) [    x:collection1] o.a.s.u.p.LogUpdateProcessorFactory [collection1]  webapp= path=/update params={wt=javabin&version=2}{add=[52 (1612207996399517696)]} 0 0
   [junit4]   2> 216473 INFO  (qtp1701731266-4071) [    x:collection1] o.a.s.u.p.LogUpdateProcessorFactory [collection1]  webapp= path=/update params={wt=javabin&version=2}{add=[53 (1612207996400566272)]} 0 0
   [junit4]   2> 216473 INFO  (qtp866759778-4093) [    x:collection1] o.a.s.u.p.LogUpdateProcessorFactory [collection1]  webapp= path=/update params={wt=javabin&version=2}{add=[53 (1612207996400566272)]} 0 0
   [junit4]   2> 216474 INFO  (qtp1701731266-4074) [    x:collection1] o.a.s.u.p.LogUpdateProcessorFactory [collection1]  webapp= path=/update params={wt=javabin&version=2}{add=[54 (1612207996401614848)]} 0 0
   [junit4]   2> 216474 INFO  (qtp866759778-4090) [    x:collection1] o.a.s.u.p.LogUpdateProcessorFactory [collection1]  webapp= path=/update params={wt=javabin&version=2}{add=[54 (1612207996401614848)]} 0 0
   [junit4]   2> 216475 INFO  (qtp1701731266-4071) [    x:collection1] o.a.s.u.p.LogUpdateProcessorFactory [collection1]  webapp= path=/update params={wt=javabin&version=2}{add=[55 (1612207996402663424)]} 0 0
   [junit4]   2> 216475 INFO  (qtp866759778-4090) [    x:collection1] o.a.s.u.p.LogUpdateProcessorFactory [collection1]  webapp= path=/update params={wt=javabin&version=2}{add=[55 (1612207996402663424)]} 0 0
   [junit4]   2> 216476 INFO  (qtp1701731266-4071) [    x:collection1] o.a.s.u.p.LogUpdateProcessorFactory [collection1]  webapp= path=/update params={wt=javabin&version=2}{add=[56 (1612207996403712000)]} 0 0
   [junit4]   2> 216476 INFO  (qtp866759778-4090) [    x:collection1] o.a.s.u.p.LogUpdateProcessorFactory [collection1]  webapp= path=/update params={wt=javabin&version=2}{add=[56 (1612207996403712000)]} 0 0
   [junit4]   2> 216477 INFO  (qtp1701731266-4074) [    x:collection1] o.a.s.u.p.LogUpdateProcessorFactory [collection1]  webapp= path=/update params={wt=javabin&version=2}{add=[57 (1612207996404760576)]} 0 0
   [junit4]   2> 216478 INFO  (qtp866759778-4093) [    x:collection1] o.a.s.u.p.LogUpdateProcessorFactory [collection1]  webapp= path=/update params={wt=javabin&version=2}{add=[57 (1612207996405809152)]} 0 0
   [junit4]   2> 216478 INFO  (qtp1701731266-4071) [    x:collection1] o.a.s.u.p.LogUpdateProcessorFactory [collection1]  webapp= path=/update params={wt=javabin&version=2}{add=[58 (1612207996405809152)]} 0 0
   [junit4]   2> 216479 INFO  (qtp866759778-4090) [    x:collection1] o.a.s.u.p.LogUpdateProcessorFactory [collection1]  webapp= path=/update params={wt=javabin&version=2}{add=[58 (1612207996405809153)]} 0 0
   [junit4]   2> 216479 INFO  (qtp1701731266-4071) [    x:collection1] o.a.s.u.p.LogUpdateProcessorFactory [collection1]  webapp= path=/update params={wt=javabin&version=2}{add=[59 (1612207996406857728)]} 0 0
   [junit4]   2> 216480 INFO  (qtp866759778-4090) [    x:collection1] o.a.s.u.p.LogUpdateProcessorFactory [collection1]  webapp= path=/update params={wt=javabin&version=2}{add=[59 (1612207996406857728)]} 0 0
   [junit4]   2> 216480 INFO  (qtp1701731266-4071) [    x:collection1] o.a.s.u.p.LogUpdateProcessorFactory [collection1]  webapp= path=/update params={wt=javabin&version=2}{add=[60 (1612207996407906304)]} 0 0
   [junit4]   2> 216480 INFO  (qtp866759778-4090) [    x:collection1] o.a.s.u.p.LogUpdateProcessorFactory [collection1]  webapp= path=/update params={wt=javabin&version=2}{add=[60 (1612207996407906304)]} 0 0
   [junit4]   2> 216481 INFO  (qtp1701731266-4071) [    x:collection1] o.a.s.u.p.LogUpdateProcessorFactory [collection1]  webapp= path=/update params={wt=javabin&version=2}{add=[61 (1612207996408954880)]} 0 0
   [junit4]   2> 216481 INFO  (qtp866759778-4090) [    x:collection1] o.a.s.u.p.LogUpdateProcessorFactory [collection1]  webapp= path=/update params={wt=javabin&version=2}{add=[61 (1612207996408954880)]} 0 0
   [junit4]   2> 216482 INFO  (qtp1701731266-4071) [    x:collection1] o.a.s.u.p.LogUpdateProcessorFactory [collection1]  webapp= path=/update params={wt=javabin&version=2}{add=[62 (1612207996410003456)]} 0 0
   [junit4]   2> 216482 INFO  (qtp866759778-4090) [    x:collection1] o.a.s.u.p.LogUpdateProcessorFactory [collection1]  webapp= path=/update params={wt=javabin&version=2}{add=[62 (1612207996410003456)]} 0 0
   [junit4]   2> 216483 INFO  (qtp1701731266-4071) [    x:collection1] o.a.s.u.p.LogUpdateProcessorFactory [collection1]  webapp= path=/update params={wt=javabin&version=2}{add=[63 (1612207996410003457)]} 0 0
   [junit4]   2> 216483 INFO  (qtp866759778-4090) [    x:collection1] o.a.s.u.p.LogUpdateProcessorFactory [collection1]  webapp= path=/update params={wt=javabin&version=2}{add=[63 (1612207996411052032)]} 0 0
   [junit4]   2> 216484 INFO  (qtp1701731266-4071) [    x:collection1] o.a.s.u.p.LogUpdateProcessorFactory [collection1]  webapp= path=/update params={wt=javabin&version=2}{add=[64 (1612207996412100608)]} 0 0
   [junit4]   2> 216485 INFO  (qtp866759778-4093) [    x:collection1] o.a.s.u.p.LogUpdateProcessorFactory [collection1]  webapp= path=/update params={wt=javabin&version=2}{add=[64 (1612207996413149184)]} 0 0
   [junit4]   2> 216485 INFO  (qtp1701731266-4071) [    x:collection1] o.a.s.u.p.LogUpdateProcessorFactory [collection1]  webapp= path=/update params={wt=javabin&version=2}{add=[65 (1612207996413149184)]} 0 0
   [junit4]   2> 216486 INFO  (qtp866759778-4093) [    x:collection1] o.a.s.u.p.LogUpdateProcessorFactory [collection1]  webapp= path=/update params={wt=javabin&version=2}{add=[65 (1612207996414197760)]} 0 0
   [junit4]   2> 216487 INFO  (qtp1701731266-4074) [    x:collection1] o.a.s.u.p.LogUpdateProcessorFactory [collection1]  webapp= path=/update params={wt=javabin&version=2}{add=[66 (1612207996415246336)]} 0 0
   [junit4]   2> 216487 INFO  (qtp866759778-4090) [    x:collection1] o.a.s.u.p.LogUpdateProcessorFactory [collection1]  webapp= path=/update params={wt=javabin&version=2}{add=[66 (1612207996415246336)]} 0 0
   [junit4]   2> 216488 INFO  (qtp1701731266-4071) [    x:collection1] o.a.s.u.p.LogUpdateProcessorFactory [collection1]  webapp= path=/update params={wt=javabin&version=2}{add=[67 (1612207996416294912)]} 0 0
   [junit4]   2> 216488 INFO  (qtp866759778-4093) [    x:collection1] o.a.s.u.p.LogUpdateProcessorFactory [collection1]  webapp= path=/update params={wt=javabin&version=2}{add=[67 (1612207996416294912)]} 0 0
   [junit4]   2> 216489 INFO  (qtp1701731266-4074) [    x:collection1] o.a.s.u.p.LogUpdateProcessorFactory [collection1]  webapp= path=/update params={wt=javabin&version=2}{add=[68 (1612207996417343488)]} 0 0
   [junit4]   2> 216490 INFO  (qtp866759778-4090) [    x:collection1] o.a.s.u.p.LogUpdateProcessorFactory [collection1]  webapp= path=/update params={wt=javabin&version=2}{add=[68 (1612207996418392064)]} 0 0
   [junit4]   2> 216491 INFO  (qtp1701731266-4071) [    x:collection1] o.a.s.u.p.LogUpdateProcessorFactory [collection1]  webapp= path=/update params={wt=javabin&version=2}{add=[69 (1612207996419440640)]} 0 0
   [junit4]   2> 216491 INFO  (qtp866759778-4093) [    x:collection1] o.a.s.u.p.LogUpdateProcessorFactory [collection1]  webapp= path=/update params={wt=javabin&version=2}{add=[69 (1612207996419440640)]} 0 0
   [junit4]   2> 216492 INFO  (qtp1701731266-4074) [    x:collection1] o.a.s.u.p.LogUpdateProcessorFactory [collection1]  webapp= path=/update params={wt=javabin&version=2}{add=[70 (1612207996420489216)]} 0 0
   [junit4]   2> 216493 INFO  (qtp866759778-4093) [    x:collection1] o.a.s.u.p.LogUpdateProcessorFactory [collection1]  webapp= path=/update params={wt=javabin&version=2}{add=[70 (1612207996420489216)]} 0 0
   [junit4]   2> 216493 INFO  (qtp1701731266-4071) [    x:collection1] o.a.s.u.p.LogUpdateProcessorFactory [collection1]  webapp= path=/update params={wt=javabin&version=2}{add=[71 (1612207996421537792)]} 0 0
   [junit4]   2> 216494 INFO  (qtp866759778-4090) [    x:collection1] o.a.s.u.p.LogUpdateProcessorFactory [collection1]  webapp= path=/update params={wt=javabin&version=2}{add=[71 (1612207996422586368)]} 0 0
   [junit4]   2> 216494 INFO  (qtp1701731266-4074) [    x:collection1] o.a.s.u.p.LogUpdateProcessorFactory [collection1]  webapp= path=/update params={wt=javabin&version=2}{add=[72 (1612207996422586368)]} 0 0
   [junit4]   2> 216495 INFO  (qtp866759778-4093) [    x:collection1] o.a.s.u.p.LogUpdateProcessorFactory [collection1]  webapp= path=/update params={wt=javabin&version=2}{add=[72 (1612207996423634944)]} 0 0
   [junit4]   2> 216495 INFO  (qtp1701731266-4071) [    x:collection1] o.a.s.u.p.LogUpdateProcessorFactory [collection1]  webapp= path=/update params={wt=javabin&version=2}{add=[73 (1612207996423634944)]} 0 0
   [junit4]   2> 216496 INFO  (qtp866759778-4090) [    x:collection1] o.a.s.u.p.LogUpdateProcessorFactory [collection1]  webapp= path=/update params={wt=javabin&version=2}{add=[73 (1612207996424683520)]} 0 0
   [junit4]   2> 216497 INFO  (qtp1701731266-4074) [    x:collection1] o.a.s.u.p.LogUpdateProcessorFactory [collection1]  webapp= path=/update params={wt=javabin&version=2}{add=[74 (1612207996424683520)]} 0 0
   [junit4]   2> 216497 INFO  (qtp866759778-4093) [    x:collection1] o.a.s.u.p.LogUpdateProcessorFactory [collection1]  webapp= path=/update params={wt=javabin&version=2}{add=[74 (1612207996425732096)]} 0 0
   [junit4]   2> 216498 INFO  (qtp1701731266-4071) [    x:collection1] o.a.s.u.p.LogUpdateProcessorFactory [collection1]  webapp= path=/update params={wt=javabin&version=2}{add=[75 (1612207996426780672)]} 0 0
   [junit4]   2> 216499 INFO  (qtp866759778-4090) [    x:collection1] o.a.s.u.p.LogUpdateProcessorFactory [collection1]  webapp= path=/update params={wt=javabin&version=2}{add=[75 (1612207996427829248)]} 0 0
   [junit4]   2> 216499 INFO  (qtp1701731266-4074) [    x:collection1] o.a.s.u.p.LogUpdateProcessorFactory [collection1]  webapp= path=/update params={wt=javabin&version=2}{add=[76 (1612207996427829248)]} 0 0
   [junit4]   2> 216500 INFO  (qtp866759778-4093) [    x:collection1] o.a.s.u.p.LogUpdateProcessorFactory [collection1]  webapp= path=/update params={wt=javabin&version=2}{add=[76 (1612207996428877824)]} 0 0
   [junit4]   2> 216501 INFO  (qtp1701731266-4071) [    x:collection1] o.a.s.u.p.LogUpdateProcessorFactory [collection1]  webapp= path=/update params={wt=javabin&version=2}{add=[77 (1612207996429926400)]} 0 0
   [junit4]   2> 216501 INFO  (qtp866759778-4090) [    x:collection1] o.a.s.u.p.LogUpdateProcessorFactory [collection1]  webapp= path=/update params={wt=javabin&version=2}{add=[77 (1612207996429926400)]} 0 0
   [junit4]   2> 216502 INFO  (qtp1701731266-4074) [    x:collection1] o.a.s.u.p.LogUpdateProcessorFactory [collection1]  webapp= path=/update params={wt=javabin&version=2}{add=[78 (1612207996430974976)]} 0 0
   [junit4]   2> 216503 INFO  (qtp866759778-4093) [    x:collection1] o.a.s.u.p.LogUpdateProcessorFactory [collection1]  webapp= path=/update params={wt=javabin&version=2}{add=[78 (1612207996430974976)]} 0 0
   [junit4]   2> 216503 INFO  (qtp1701731266-4071) [    x:collection1] o.a.s.u.p.LogUpdateProcessorFactory [collection1]  webapp= path=/update params={wt=javabin&version=2}{add=[79 (1612207996432023552)]} 0 0
   [junit4]   2> 216504 INFO  (qtp866759778-4090) [    x:collection1] o.a.s.u.p.LogUpdateProcessorFactory [collection1]  webapp= path=/update params={wt=javabin&version=2}{add=[79 (1612207996433072128)]} 0 0
   [junit4]   2> 216505 INFO  (qtp1701731266-4074) [    x:collection1] o.a.s.u.p.LogUpdateProcessorFactory [collection1]  webapp= path=/update params={wt=javabin&version=2}{add=[80 (1612207996434120704)]} 0 0
   [junit4]   2> 216506 INFO  (qtp866759778-4093) [    x:collection1] o.a.s.u.p.LogUpdateProcessorFactory [collection1]  webapp= path=/update params={wt=javabin&version=2}{add=[80 (1612207996434120704)]} 0 0
   [junit4]   2> 216506 INFO  (qtp1701731266-4071) [    x:collection1] o.a.s.u.p.LogUpdateProcessorFactory [collection1]  webapp= path=/update params={wt=javabin&version=2}{add=[81 (1612207996435169280)]} 0 0
   [junit4]   2> 216507 INFO  (qtp866759778-4090) [    x:collection1] o.a.s.u.p.LogUpdateProcessorFactory [collection1]  webapp= path=/update params={wt=javabin&version=2}{add=[81 (1612207996436217856)]} 0 0
   [junit4]   2> 216508 INFO  (qtp1701731266-4074) [    x:collection1] o.a.s.u.p.LogUpdateProcessorFactory [collection1]  webapp= path=/update params={wt=javabin&version=2}{add=[82 (1612207996437266432)]} 0 0
   [junit4]   2> 216508 INFO  (qtp866759778-4093) [    x:collection1] o.a.s.u.p.LogUpdateProcessorFactory [collection1]  webapp= path=/update params={wt=javabin&version=2}{add=[82 (1612207996437266432)]} 0 0
   [junit4]   2> 216509 INFO  (qtp1701731266-4071) [    x:collection1] o.a.s.u.p.LogUpdateProcessorFactory [collection1]  webapp= path=/update params={wt=javabin&version=2}{add=[83 (1612207996438315008)]} 0 0
   [junit4]   2> 216510 INFO  (qtp866759778-4090) [    x:collection1] o.a.s.u.p.LogUpdateProcessorFactory [collection1]  webapp= path=/update params={wt=javabin&version=2}{add=[83 (1612207996439363584)]} 0 0
   [junit4]   2> 216510 INFO  (qtp1701731266-4074) [    x:collection1] o.a.s.u.p.LogUpdateProcessorFactory [collection1]  webapp= path=/update params={wt=javabin&version=2}{add=[84 (1612207996439363584)]} 0 0
   [junit4]   2> 216511 INFO  (qtp866759778-4093) [    x:collection1] o.a.s.u.p.LogUpdateProcessorFactory [collection1]  webapp= path=/update params={wt=javabin&version=2}{add=[84 (1612207996440412160)]} 0 0
   [junit4]   2> 216512 INFO  (qtp1701731266-4071) [    x:collection1] o.a.s.u.p.LogUpdateProcessorFactory [collection1]  webapp= path=/update params={wt=javabin&version=2}{add=[85 (1612207996441460736)]} 0 0
   [junit4]   2> 216513 INFO  (qtp866759778-4090) [    x:collection1] o.a.s.u.p.LogUpdateProcessorFactory [collection1]  webapp= path=/update params={wt=javabin&version=2}{add=[85 (1612207996442509312)]} 0 0
   [junit4]   2> 216513 INFO  (qtp1701731266-4074) [    x:collection1] o.a.s.u.p.LogUpdateProcessorFactory [collection1]  webapp= path=/update params={wt=javabin&version=2}{add=[86 (1612207996442509312)]} 0 0
   [junit4]   2> 216514 INFO  (qtp866759778-4093) [    x:collection1] o.a.s.u.p.LogUpdateProcessorFactory [collection1]  webapp= path=/update params={wt=javabin&version=2}{add=[86 (1612207996443557888)]} 0 0
   [junit4]   2> 216514 INFO  (qtp1701731266-4074) [    x:collection1] o.a.s.u.p.LogUpdateProcessorFactory [collection1]  webapp= path=/update params={wt=javabin&version=2}{add=[87 (1612207996443557888)]} 0 0
   [junit4]   2> 216515 INFO  (qtp866759778-4090) [    x:collection1] o.a.s.u.p.LogUpdateProcessorFactory [collection1]  webapp= path=/update params={wt=javabin&version=2}{add=[87 (1612207996444606464)]} 0 0
   [junit4]   2> 216516 INFO  (qtp1701731266-4071) [    x:collection1] o.a.s.u.p.LogUpdateProcessorFactory [collection1]  webapp= path=/update params={wt=javabin&version=2}{add=[88 (1612207996445655040)]} 0 0
   [junit4]   2> 216516 INFO  (qtp866759778-4093) [    x:collection1] o.a.s.u.p.LogUpdateProcessorFactory [collection1]  webapp= path=/update params={wt=javabin&version=2}{add=[88 (1612207996445655040)]} 0 0
   [junit4]   2> 216517 INFO  (qtp1701731266-4074) [    x:collection1] o.a.s.u.p.LogUpdateProcessorFactory [collection1]  webapp= path=/update params={wt=javabin&version=2}{add=[89 (1612207996446703616)]} 0 0
   [junit4]   2> 216518 INFO  (qtp866759778-4090) [    x:collection1] o.a.s.u.p.LogUpdateProcessorFactory [collection1]  webapp= path=/update params={wt=javabin&version=2}{add=[89 (1612207996447752192)]} 0 0
   [junit4]   2> 216518 INFO  (qtp1701731266-4071) [    x:collection1] o.a.s.u.p.LogUpdateProcessorFactory [collection1]  webapp= path=/update params={wt=javabin&version=2}{add=[90 (1612207996447752192)]} 0 0
   [junit4]   2> 216519 INFO  (qtp866759778-4093) [    x:collection1] o.a.s.u.p.LogUpdateProcessorFactory [collection1]  webapp= path=/update params={wt=javabin&version=2}{add=[90 (1612207996448800768)]} 0 0
   [junit4]   2> 216520 INFO  (qtp1701731266-4074) [    x:collection1] o.a.s.u.p.LogUpdateProcessorFactory [collection1]  webapp= path=/update params={wt=javabin&version=2}{add=[91 (1612207996449849344)]} 0 0
   [junit4]   2> 216521 INFO  (qtp866759778-4090) [    x:collection1] o.a.s.u.p.LogUpdateProcessorFactory [collection1]  webapp= path=/update params={wt=javabin&version=2}{add=[91 (1612207996449849344)]} 0 0
   [junit4]   2> 216521 INFO  (qtp1701731266-4071) [    x:collection1] o.a.s.u.p.LogUpdateProcessorFactory [collection1]  webapp= path=/update params={wt=javabin&version=2}{add=[92 (1612207996450897920)]} 0 0
   [junit4]   2> 216522 INFO  (qtp866759778-4093) [    x:collection1] o.a.s.u.p.LogUpdateProcessorFactory [collection1]  webapp= path=/update params={wt=javabin&version=2}{add=[92 (1612207996451946496)]} 0 0
   [junit4]   2> 216523 INFO  (qtp1701731266-4074) [    x:collection1] o.a.s.u.p.LogUpdateProcessorFactory [collection1]  webapp= path=/update params={wt=javabin&version=2}{add=[93 (1612207996452995072)]} 0 0
   [junit4]   2> 216524 INFO  (qtp866759778-4090) [    x:collection1] o.a.s.u.p.LogUpdateProcessorFactory [collection1]  webapp= path=/update params={wt=javabin&version=2}{add=[93 (1612207996452995072)]} 0 0
   [junit4]   2> 216524 INFO  (qtp1701731266-4071) [    x:collection1] o.a.s.u.p.LogUpdateProcessorFactory [collection1]  webapp= path=/update params={wt=javabin&version=2}{add=[94 (1612207996454043648)]} 0 0
   [junit4]   2> 216525 INFO  (qtp866759778-4093) [    x:collection1] o.a.s.u.p.LogUpdateProcessorFactory [collection1]  webapp= path=/update params={wt=javabin&version=2}{add=[94 (1612207996455092224)]} 0 0
   [junit4]   2> 216526 INFO  (qtp1701731266-4074) [    x:collection1] o.a.s.u.p.LogUpdateProcessorFactory [collection1]  webapp= path=/update params={wt=javabin&version=2}{add=[95 (1612207996456140800)]} 0 0
   [junit4]   2> 216527 INFO  (qtp866759778-4090) [    x:collection1] o.a.s.u.p.LogUpdateProcessorFactory [collection1]  webapp= path=/update params={wt=javabin&version=2}{add=[95 (1612207996457189376)]} 0 0
   [junit4]   2> 216528 INFO  (qtp1701731266-4071) [    x:collection1] o.a.s.u.p.LogUpdateProcessorFactory [collection1]  webapp= path=/update params={wt=javabin&version=2}{add=[96 (1612207996458237952)]} 0 0
   [junit4]   2> 216529 INFO  (qtp866759778-4093) [    x:collection1] o.a.s.u.p.LogUpdateProcessorFactory [collection1]  webapp= path=/update params={wt=javabin&version=2}{add=[96 (1612207996458237952)]} 0 0
   [junit4]   2> 216529 INFO  (qtp1701731266-4071) [    x:collection1] o.a.s.u.p.LogUpdateProcessorFactory [collection1]  webapp= path=/update params={wt=javabin&version=2}{add=[97 (1612207996459286528)]} 0 0
   [junit4]   2> 216530 INFO  (qtp866759778-4090) [    x:collection1] o.a.s.u.p.LogUpdateProcessorFactory [collection1]  webapp= path=/update params={wt=javabin&version=2}{add=[97 (1612207996460335104)]} 0 0
   [junit4]   2> 216531 INFO  (qtp1701731266-4074) [    x:collection1] o.a.s.u.p.LogUpdateProcessorFactory [collection1]  webapp= path=/update params={wt=javabin&version=2}{add=[98 (1612207996461383680)]} 0 0
   [junit4]   2> 216531 INFO  (qtp866759778-4093) [    x:collection1] o.a.s.u.p.LogUpdateProcessorFactory [collection1]  webapp= path=/update params={wt=javabin&version=2}{add=[98 (1612207996461383680)]} 0 0
   [junit4]   2> 216532 INFO  (qtp1701731266-4071) [    x:collection1] o.a.s.u.p.LogUpdateProcessorFactory [collection1]  webapp= path=/update params={wt=javabin&version=2}{add=[99 (1612207996462432256)]} 0 0
   [junit4]   2> 216533 INFO  (qtp866759778-4090) [    x:collection1] o.a.s.u.p.LogUpdateProcessorFactory [collection1]  webapp= path=/update params={wt=javabin&version=2}{add=[99 (1612207996463480832)]} 0 0
   [junit4]   2> 216533 INFO  (qtp1701731266-4074) [    x:collection1] o.a.s.u.p.LogUpdateProcessorFactory [collection1]  webapp= path=/update params={wt=javabin&version=2}{add=[100 (1612207996463480832)]} 0 0
   [junit4]   2> 216534 INFO  (qtp866759778-4093) [    x:collection1] o.a.s.u.p.LogUpdateProcessorFactory [collection1]  webapp= path=/update params={wt=javabin&version=2}{add=[100 (1612207996464529408)]} 0 0
   [junit4]   2> 216534 INFO  (qtp1701731266-4071) [    x:collection1] o.a.s.u.p.LogUpdateProcessorFactory [collection1]  webapp= path=/update params={wt=javabin&version=2}{add=[101 (1612207996464529408)]} 0 0
   [junit4]   2> 216534 INFO  (qtp866759778-4090) [    x:collection1] o.a.s.u.p.LogUpdateProcessorFactory [collection1]  webapp= path=/update params={wt=javabin&version=2}{add=[101 (1612207996464529409)]} 0 0
   [junit4]   2> 216539 INFO  (qtp1701731266-4074) [    x:collection1] o.a.s.u.p.LogUpdateProcessorFactory [collection1]  webapp= path=/update params={wt=javabin&version=2}{add=[102 (1612207996469772288)]} 0 0
   [junit4]   2> 216540 INFO  (qtp866759778-4093) [    x:collection1] o.a.s.u.p.LogUpdateProcessorFactory [collection1]  webapp= path=/update params={wt=javabin&version=2}{add=[102 (1612207996470820864)]} 0 0
   [junit4]   2> 216540 INFO  (qtp1701731266-4071) [    x:collection1] o.a.s.u.p.LogUpdateProcessorFactory [collection1]  webapp= path=/update params={wt=javabin&version=2}{add=[103 (1612207996470820864)]} 0 0
   [junit4]   2> 216541 INFO  (qtp866759778-4090) [    x:collection1] o.a.s.u.p.LogUpdateProcessorFactory [collection1]  webapp= path=/update params={wt=javabin&version=2}{add=[103 (1612207996471869440)]} 0 0
   [junit4]   2> 216542 INFO  (qtp1701731266-4074) [    x:collection1] o.a.s.u.p.LogUpdateProcessorFactory [collection1]  webapp= path=/update params={wt=javabin&version=2}{add=[104 (1612207996472918016)]} 0 0
   [junit4]   2> 216543 INFO  (qtp866759778-4093) [    x:collection1] o.a.s.u.p.LogUpdateProcessorFactory [collection1]  webapp= path=/update params={wt=javabin&version=2}{add=[104 (1612207996472918016)]} 0 0
   [junit4]   2> 216543 INFO  (qtp1701731266-4071) [    x:collection1] o.a.s.u.p.LogUpdateProcessorFactory [collection1]  webapp= path=/update params={wt=javabin&version=2}{add=[105 (1612207996473966592)]} 0 0
   [junit4]   2> 216544 INFO  (qtp866759778-4090) [    x:collection1] o.a.s.u.p.LogUpdateProcessorFactory [collection1]  webapp= path=/update params={wt=javabin&version=2}{add=[105 (1612207996475015168)]} 0 0
   [junit4]   2> 216545 INFO  (qtp1701731266-4074) [    x:collection1] o.a.s.u.p.LogUpdateProcessorFactory [collection1]  webapp= path=/update params={wt=javabin&version=2}{add=[106 (1612207996475015168)]} 0 0
   [junit4]   2> 216545 INFO  (qtp866759778-4093) [    x:collection1] o.a.s.u.p.LogUpdateProcessorFactory [collection1]  webapp= path=/update params={wt=javabin&version=2}{add=[106 (1612207996476063744)]} 0 0
   [junit4]   2> 216546 INFO  (qtp1701731266-4071) [    x:collection1] o.a.s.u.p.LogUpdateProcessorFactory [collection1]  webapp= path=/update params={wt=javabin&version=2}{add=[107 (1612207996477112320)]} 0 0
   [junit4]   2> 216547 INFO  (qtp866759778-4090) [    x:collection1] o.a.s.u.p.LogUpdateProcessorFactory [collection1]  webapp= path=/update params={wt=javabin&version=2}{add=[107 (1612207996478160896)]} 0 0
   [junit4]   2> 216547 INFO  (qtp1701731266-4074) [    x:collection1] o.a.s.u.p.LogUpdateProcessorFactory [collection1]  webapp= path=/update params={wt=javabin&version=2}{add=[108 (1612207996478160896)]} 0 0
   [junit4]   2> 216548 INFO  (qtp866759778-4093) [    x:collection1] o.a.s.u.p.LogUpdateProcessorFactory [collection1]  webapp= path=/update params={wt=javabin&version=2}{add=[108 (1612207996479209472)]} 0 0
   [junit4]   2> 216549 INFO  (qtp1701731266-4071) [    x:collection1] o.a.s.u.p.LogUpdateProcessorFactory [collection1]  webapp= path=/update params={wt=javabin&version=2}{add=[109 (1612207996480258048)]} 0 0
   [junit4]   2> 216549 INFO  (qtp866759778-4090) [    x:collection1] o.a.s.u.p.LogUpdateProcessorFactory [collection1]  webapp= path=/update params={wt=javabin&version=2}{add=[109 (1612207996480258048)]} 0 0
   [junit4]   2> 216550 INFO  (qtp1701731266-4074) [    x:collection1] o.a.s.u.p.LogUpdateProcessorFactory [collection1]  webapp= path=/update params={wt=javabin&version=2}{add=[110 (1612207996481306624)]} 0 0
   [junit4]   2> 216551 INFO  (qtp866759778-4093) [    x:collection1] o.a.s.u.p.LogUpdateProcessorFactory [collection1]  webapp= path=/update params={wt=javabin&version=2}{add=[110 (1612207996482355200)]} 0 0
   [junit4]   2> 216552 INFO  (qtp1701731266-4071) [    x:collection1] o.a.s.u.p.LogUpdateProcessorFactory [collection1]  webapp= path=/update params={wt=javabin&version=2}{add=[111 (1612207996482355200)]} 0 0
   [junit4]   2> 216552 INFO  (qtp866759778-4090) [    x:collection1] o.a.s.u.p.LogUpdateProcessorFactory [collection1]  webapp= path=/update params={wt=javabin&version=2}{add=[111 (1612207996483403776)]} 0 0
   [junit4]   2> 216553 INFO  (qtp1701731266-4074) [    x:collection1] o.a.s.u.p.LogUpdateProcessorFactory [collection1]  webapp= path=/update params={wt=javabin&version=2}{add=[112 (1612207996484452352)]} 0 0
   [junit4]   2> 216554 INFO  (qtp866759778-4093) [    x:collection1] o.a.s.u.p.LogUpdateProcessorFactory [collection1]  webapp= path=/update params={wt=javabin&version=2}{add=[112 (1612207996484452352)]} 0 0
   [junit4]   2> 216554 INFO  (qtp1701731266-4071) [    x:collection1] o.a.s.u.p.LogUpdateProcessorFactory [collection1]  webapp= path=/update params={wt=javabin&version=2}{add=[113 (1612207996485500928)]} 0 0
   [junit4]   2> 216555 INFO  (qtp866759778-4090) [    x:collection1] o.a.s.u.p.LogUpdateProcessorFactory [collection1]  webapp= path=/update params={wt=javabin&version=2}{add=[113 (1612207996486549504)]} 0 0
   [junit4]   2> 216556 INFO  (qtp1701731266-4074) [    x:collection1] o.a.s.u.p.LogUpdateProcessorFactory [collection1]  webapp= path=/update params={wt=javabin&version=2}{add=[114 (1612207996487598080)]} 0 0
   [junit4]   2> 216557 INFO  (qtp866759778-4093) [    x:collection1] o.a.s.u.p.LogUpdateProcessorFactory [collection1]  webapp= path=/update params={wt=javabin&version=2}{add=[114 (1612207996487598080)]} 0 0
   [junit4]   2> 216557 INFO  (qtp1701731266-4071) [    x:collection1] o.a.s.u.p.LogUpdateProcessorFactory [collection1]  webapp= path=/update params={wt=javabin&version=2}{add=[115 (1612207996488646656)]} 0 0
   [junit4]   2> 216558 INFO  (qtp866759778-4090) [    x:collection1] o.a.s.u.p.LogUpdateProcessorFactory [collection1]  webapp= path=/update params={wt=javabin&version=2}{add=[115 (1612207996489695232)]} 0 0
   [junit4]   2> 216558 INFO  (qtp1701731266-4074) [    x:collection1] o.a.s.u.p.LogUpdateProcessorFactory [collection1]  webapp= path=/update params={wt=javabin&version=2}{add=[116 (1612207996489695232)]} 0 0
   [junit4]   2> 216559 INFO  (qtp866759778-4090) [    x:collection1] o.a.s.u.p.LogUpdateProcessorFactory [collection1]  webapp= path=/update params={wt=javabin&version=2}{add=[116 (1612207996490743808)]} 0 0
   [junit4]   2> 216560 INFO  (qtp1701731266-4074) [    x:collection1] o.a.s.u.p.LogUpdateProcessorFactory [collection1]  webapp= path=/update params={wt=javabin&version=2}{add=[117 (1612207996491792384)]} 0 0
   [junit4]   2> 216560 INFO  (qtp866759778-4093) [    x:collection1] o.a.s.u.p.LogUpdateProcessorFactory [collection1]  webapp= path=/update params={wt=javabin&version=2}{add=[117 (1612207996491792384)]} 0 0
   [junit4]   2> 216561 INFO  (qtp1701731266-4071) [    x:collection1] o.a.s.u.p.LogUpdateProcessorFactory [collection1]  webapp= path=/update params={wt=javabin&version=2}{add=[118 (1612207996492840960)]} 0 0
   [junit4]   2> 216562 INFO  (qtp866759778-4090) [    x:collection1] o.a.s.u.p.LogUpdateProcessorFactory [collection1]  webapp= path=/update params={wt=javabin&version=2}{add=[118 (1612207996492840960)]} 0 0
   [junit4]   2> 216562 INFO  (qtp1701731266-4074) [    x:collection1] o.a.s.u.p.LogUpdateProcessorFactory [collection1]  webapp= path=/update params={wt=javabin&version=2}{add=[119 (1612207996493889536)]} 0 0
   [junit4]   2> 216563 INFO  (qtp866759778-4093) [    x:collection1] o.a.s.u.p.LogUpdateProcessorFactory [collection1]  webapp= path=/update params={wt=javabin&version=2}{add=[119 (1612207996494938112)]} 0 0
   [junit4]   2> 216563 INFO  (qtp1701731266-4071) [    x:collection1] o.a.s.u.p.LogUpdateProcessorFactory [collection1]  webapp= path=/update params={wt=javabin&version=2}{add=[120 (1612207996494938112)]} 0 0
   [junit4]   2> 216564 INFO  (qtp866759778-4090) [    x:collection1] o.a.s.u.p.LogUpdateProcessorFactory [collection1]  webapp= path=/update params={wt=javabin&version=2}{add=[120 (1612207996495986688)]} 0 0
   [junit4]   2> 216564 INFO  (qtp1701731266-4074) [    x:collection1] o.a.s.u.p.LogUpdateProcessorFactory [collection1]  webapp= path=/update params={wt=javabin&version=2}{add=[121 (1612207996495986688)]} 0 0
   [junit4]   2> 216565 INFO  (qtp866759778-4093) [    x:collection1] o.a.s.u.p.LogUpdateProcessorFactory [collection1]  webapp= path=/update params={wt=javabin&version=2}{add=[121 (1612207996497035264)]} 0 0
   [junit4]   2> 216566 INFO  (qtp1701731266-4071) [    x:collection1] o.a.s.u.p.LogUpdateProcessorFactory [collection1]  webapp= path=/update params={wt=javabin&version=2}{add=[122 (1612207996497035264)]} 0 0
   [junit4]   2> 216566 INFO  (qtp866759778-4090) [    x:collection1] o.a.s.u.p.LogUpdateProcessorFactory [collection1]  webapp= path=/update params={wt=javabin&version=2}{add=[122 (1612207996498083840)]} 0 0
   [junit4]   2> 216567 INFO  (qtp1701731266-4074) [    x:collection1] o.a.s.u.p.LogUpdateProcessorFactory [collection1]  webapp= path=/update params={wt=javabin&version=2}{add=[123 (1612207996499132416)]} 0 0
   [junit4]   2> 216568 INFO  (qtp866759778-4093) [    x:collection1] o.a.s.u.p.LogUpdateProcessorFactory [collection1]  webapp= path=/update params={wt=javabin&version=2}{add=[123 (1612207996499132416)]} 0 0
   [junit4]   2> 216568 INFO  (qtp1701731266-4074) [    x:collection1] o.a.s.u.p.LogUpdateProcessorFactory [collection1]  webapp= path=/update params={wt=javabin&version=2}{add=[124 (1612207996500180992)]} 0 0
   [junit4]   2> 216569 INFO  (qtp866759778-4090) [    x:collection1] o.a.s.u.p.LogUpdateProcessorFactory [collection1]  webapp= path=/update params={wt=javabin&version=2}{add=[124 (1612207996501229568)]} 0 0
   [junit4]   2> 216569 INFO  (qtp1701731266-4071) [    x:collection1] o.a.s.u.p.LogUpdateProcessorFactory [collection1]  webapp= path=/update params={wt=javabin&version=2}{add=[125 (1612207996501229568)]} 0 0
   [junit4]   2> 216570 INFO  (qtp866759778-4093) [    x:collection1] o.a.s.u.p.LogUpdateProcessorFactory [collection1]  webapp= path=/update params={wt=javabin&version=2}{add=[125 (1612207996502278144)]} 0 0
   [junit4]   2> 216571 INFO  (qtp1701731266-4074) [    x:collection1] o.a.s.u.p.LogUpdateProcessorFactory [collection1]  webapp= path=/update params={wt=javabin&version=2}{add=[126 (1612207996502278144)]} 0 0
   [junit4]   2> 216571 INFO  (qtp866759778-4090) [    x:collection1] o.a.s.u.p.LogUpdateProcessorFactory [collection1]  webapp= path=/update params={wt=javabin&version=2}{add=[126 (1612207996503326720)]} 0 0
   [junit4]   2> 216572 INFO  (qtp1701731266-4071) [    x:collection1] o.a.s.u.p.LogUpdateProcessorFactory [collection1]  webapp= path=/update params={wt=javabin&version=2}{add=[127 (1612207996504375296)]} 0 0
   [junit4]   2> 216573 INFO  (qtp866759778-4093) [    x:collection1] o.a.s.u.p.LogUpdateProcessorFactory [collection1]  webapp= path=/update params={wt=javabin&version=2}{add=[127 (1612207996505423872)]} 0 0
   [junit4]   2> 216574 INFO  (qtp1701731266-4074) [    x:collection1] o.a.s.u.p.LogUpdateProcessorFactory [collection1]  webapp= path=/update params={wt=javabin&version=2}{add=[128 (1612207996505423872)]} 0 1
   [junit4]   2> 216576 INFO  (qtp866759778-4090) [    x:collection1] o.a.s.u.p.LogUpdateProcessorFactory [collection1]  webapp= path=/update params={wt=javabin&version=2}{add=[128 (1612207996507521024)]} 0 0
   [junit4]   2> 216577 INFO  (qtp1701731266-4071) [    x:collection1] o.a.s.u.p.LogUpdateProcessorFactory [collection1]  webapp= path=/update params={wt=javabin&version=2}{add=[129 (1612207996509618176)]} 0 0
   [junit4]   2> 216577 INFO  (qtp866759778-4093) [    x:collection1] o.a.s.u.p.LogUpdateProcessorFactory [collection1]  webapp= path=/update params={wt=javabin&version=2}{add=[129 (1612207996509618176)]} 0 0
   [junit4]   2> 216578 INFO  (qtp1701731266-4074) [    x:collection1] o.a.s.u.p.LogUpdateProcessorFactory [collection1]  webapp= path=/update params={wt=javabin&version=2}{add=[130 (1612207996510666752)]} 0 0
   [junit4]   2> 216579 INFO  (qtp866759778-4090) [    x:collection1] o.a.s.u.p.LogUpdateProcessorFactory [collection1]  webapp= path=/update params={wt=javabin&version=2}{add=[130 (1612207996510666752)]} 0 0
   [junit4]   2> 216579 INFO  (qtp1701731266-4071) [    x:collection1] o.a.s.u.p.LogUpdateProcessorFactory [collection1]  webapp= path=/update params={wt=javabin&version=2}{add=[131 (1612207996511715328)]} 0 0
   [junit4]   2> 216580 INFO  (qtp866759778-4093) [    x:collection1] o.a.s.u.p.LogUpdateProcessorFactory [collection1]  webapp= path=/update params={wt=javabin&version=2}{add=[131 (1612207996512763904)]} 0 0
   [junit4]   2> 216580 INFO  (qtp1701731266-4074) [    x:collection1] o.a.s.u.p.LogUpdateProcessorFactory [collection1]  webapp= path=/update params={wt=javabin&version=2}{add=[132 (1612207996512763904)]} 0 0
   [junit4]   2> 216581 INFO  (qtp866759778-4090) [    x:collection1] o.a.s.u.p.LogUpdateProcessorFactory [collection1]  webapp= path=/update params={wt=javabin&version=2}{add=[132 (1612207996513812480)]} 0 0
   [junit4]   2> 216582 INFO  (qtp1701731266-4071) [    x:collection1] o.a.s.u.p.LogUpdateProcessorFactory [collection1]  webapp= path=/update params={wt=javabin&version=2}{add=[133 (1612207996514861056)]} 0 0
   [junit4]   2> 216582 INFO  (qtp866759778-4093) [    x:collection1] o.a.s.u.p.LogUpdateProcessorFactory [collection1]  webapp= path=/update params={wt=javabin&version=2}{add=[133 (1612207996514861056)]} 0 0
   [junit4]   2> 216583 INFO  (qtp1701731266-4074) [    x:collection1] o.a.s.u.p.LogUpdateProcessorFactory [collection1]  webapp= path=/update params={wt=javabin&version=2}{add=[134 (1612207996515909632)]} 0 0
   [junit4]   2> 216583 INFO  (qtp866759778-4090) [    x:collection1] o.a.s.u.p.LogUpdateProcessorFactory [collection1]  webapp= path=/update params={wt=javabin&version=2}{add=[134 (1612207996515909632)]} 0 0
   [junit4]   2> 216584 INFO  (qtp1701731266-4071) [    x:collection1] o.a.s.u.p.LogUpdateProcessorFactory [collection1]  webapp= path=/update params={wt=javabin&version=2}{add=[135 (1612207996516958208)]} 0 0
   [junit4]   2> 216584 INFO  (qtp866759778-4093) [    x:collection1] o.a.s.u.p.LogUpdateProcessorFactory [collection1]  webapp= path=/update params={wt=javabin&version=2}{add=[135 (1612207996516958208)]} 0 0
   [junit4]   2> 216585 INFO  (qtp1701731266-4074) [    x:collection1] o.a.s.u.p.LogUpdateProcessorFactory [collection1]  webapp= path=/update params={wt=javabin&version=2}{add=[136 (1612207996518006784)]} 0 0
   [junit4]   2> 216586 INFO  (qtp866759778-4090) [    x:collection1] o.a.s.u.p.LogUpdateProcessorFactory [collection1]  webapp= path=/update params={wt=javabin&version=2}{add=[136 (1612207996518006784)]} 0 0
   [junit4]   2> 216586 INFO  (qtp1701731266-4071) [    x:collection1] o.a.s.u.p.LogUpdatePr

[...truncated too long message...]

[copy] Copying 1 file to /export/home/jenkins/workspace/Lucene-Solr-master-Solaris/solr/build/solr-core/classes/test

common-solr.compile-test:

compile-test:

BUILD SUCCESSFUL
Total time: 1 minute 19 seconds
[repro] ant test-nocompile -Dtests.dups=5 -Dtests.maxfailures=5 -Dtests.class="*.TestDistributedStatsComponentCardinality" -Dtests.showOutput=onerror "-Dargs=-XX:+UseCompressedOops -XX:+UseParallelGC" -Dtests.seed=6881289A3320A121 -Dtests.slow=true -Dtests.locale=pl-PL -Dtests.timezone=Etc/GMT-13 -Dtests.asserts=true -Dtests.file.encoding=UTF-8
Buildfile: /export/home/jenkins/workspace/Lucene-Solr-master-Solaris/solr/core/build.xml

-clover.disable:

ivy-configure:
[ivy:configure] :: Apache Ivy 2.4.0 - 20141213170938 :: http://ant.apache.org/ivy/ ::
[ivy:configure] :: loading settings :: file = /export/home/jenkins/workspace/Lucene-Solr-master-Solaris/lucene/top-level-ivy-settings.xml

install-junit4-taskdef:

ivy-availability-check:
[loadresource] Do not set property disallowed.ivy.jars.list as its length is 0.

-ivy-fail-disallowed-ivy-version:

ivy-fail:

resolve-groovy:
[ivy:cachepath] :: resolving dependencies :: org.codehaus.groovy#groovy-all-caller;working
[ivy:cachepath] 	confs: [default]
[ivy:cachepath] 	found org.codehaus.groovy#groovy-all;2.4.15 in public
[ivy:cachepath] :: resolution report :: resolve 26ms :: artifacts dl 1ms
	---------------------------------------------------------------------
	|                  |            modules            ||   artifacts   |
	|       conf       | number| search|dwnlded|evicted|| number|dwnlded|
	---------------------------------------------------------------------
	|      default     |   1   |   0   |   0   |   0   ||   1   |   0   |
	---------------------------------------------------------------------

-init-totals:

-test:
    [mkdir] Created dir: /export/home/jenkins/workspace/Lucene-Solr-master-Solaris/solr/build/solr-core/test
[junit4:pickseed] Seed property 'tests.seed' already defined: 6881289A3320A121
    [mkdir] Created dir: /export/home/jenkins/workspace/Lucene-Solr-master-Solaris/solr/build/solr-core/test/temp
   [junit4] <JUnit4> says hello! Master seed: 6881289A3320A121
   [junit4] Executing 5 suites with 2 JVMs.
   [junit4] 
   [junit4] Started J0 PID(23735@serv1-vm3).
   [junit4] Started J1 PID(23736@serv1-vm3).
   [junit4] Suite: org.apache.solr.handler.component.TestDistributedStatsComponentCardinality
   [junit4] OK      41.8s J0 | TestDistributedStatsComponentCardinality.test
   [junit4] Completed [1/5] on J0 in 44.74s, 1 test
   [junit4] 
   [junit4] Suite: org.apache.solr.handler.component.TestDistributedStatsComponentCardinality
   [junit4] OK      43.1s J1 | TestDistributedStatsComponentCardinality.test
   [junit4] Completed [2/5] on J1 in 45.56s, 1 test
   [junit4] 
   [junit4] Duplicate suite name used with XML reports: org.apache.solr.handler.component.TestDistributedStatsComponentCardinality. This may confuse tools that process XML reports. Set 'ignoreDuplicateSuites' to true to skip this message.
   [junit4] Suite: org.apache.solr.handler.component.TestDistributedStatsComponentCardinality
   [junit4] OK      21.7s J0 | TestDistributedStatsComponentCardinality.test
   [junit4] Completed [3/5] on J0 in 21.74s, 1 test
   [junit4] 
   [junit4] Suite: org.apache.solr.handler.component.TestDistributedStatsComponentCardinality
   [junit4] OK      21.0s J1 | TestDistributedStatsComponentCardinality.test
   [junit4] Completed [4/5] on J1 in 21.07s, 1 test
   [junit4] 
   [junit4] Suite: org.apache.solr.handler.component.TestDistributedStatsComponentCardinality
   [junit4] OK      27.6s J0 | TestDistributedStatsComponentCardinality.test
   [junit4] Completed [5/5] on J0 in 27.71s, 1 test
   [junit4] 
   [junit4] JVM J0:     0.75 ..    96.71 =    95.97s
   [junit4] JVM J1:     0.75 ..    69.26 =    68.51s
   [junit4] Execution time total: 1 minute 36 seconds
   [junit4] Tests summary: 5 suites, 5 tests
   [junit4] Could not remove temporary path: /export/home/jenkins/workspace/Lucene-Solr-master-Solaris/solr/build/solr-core/test/J0 (java.nio.file.DirectoryNotEmptyException: Remaining files: [/export/home/jenkins/workspace/Lucene-Solr-master-Solaris/solr/build/solr-core/test/J0/temp])
   [junit4] Could not remove temporary path: /export/home/jenkins/workspace/Lucene-Solr-master-Solaris/solr/build/solr-core/test/J1 (java.nio.file.DirectoryNotEmptyException: Remaining files: [/export/home/jenkins/workspace/Lucene-Solr-master-Solaris/solr/build/solr-core/test/J1/temp])
     [echo] 5 slowest tests:
[junit4:tophints] 632.92s | org.apache.solr.cloud.BasicDistributedZkTest
[junit4:tophints] 345.10s | org.apache.solr.cloud.cdcr.CdcrWithNodesRestartsTest
[junit4:tophints] 343.93s | org.apache.solr.cloud.api.collections.ShardSplitTest
[junit4:tophints] 241.93s | org.apache.solr.cloud.cdcr.CdcrOpsAndBoundariesTest
[junit4:tophints] 214.16s | org.apache.solr.update.TestInPlaceUpdatesDistrib

-check-totals:

test-nocompile:

BUILD SUCCESSFUL
Total time: 1 minute 39 seconds
[repro] Failures:
[repro]   0/5 failed: org.apache.solr.handler.component.TestDistributedStatsComponentCardinality
[repro] Exiting with code 0
+ mv lucene/build lucene/build.repro
+ mv solr/build solr/build.repro
+ mv lucene/build.orig lucene/build
+ mv solr/build.orig solr/build
Archiving artifacts
Setting ANT_1_8_2_HOME=/export/home/jenkins/tools/hudson.tasks.Ant_AntInstallation/ANT_1.8.2
java.lang.InterruptedException: no matches found within 10000
	at hudson.FilePath$ValidateAntFileMask.hasMatch(FilePath.java:2845)
	at hudson.FilePath$ValidateAntFileMask.invoke(FilePath.java:2724)
	at hudson.FilePath$ValidateAntFileMask.invoke(FilePath.java:2705)
	at hudson.FilePath$FileCallableWrapper.call(FilePath.java:3084)
Also:   hudson.remoting.Channel$CallSiteStackTrace: Remote call to Solaris VBOX
		at hudson.remoting.Channel.attachCallSiteStackTrace(Channel.java:1741)
		at hudson.remoting.UserRequest$ExceptionResponse.retrieve(UserRequest.java:357)
		at hudson.remoting.Channel.call(Channel.java:955)
		at hudson.FilePath.act(FilePath.java:1070)
		at hudson.FilePath.act(FilePath.java:1059)
		at hudson.FilePath.validateAntFileMask(FilePath.java:2703)
		at hudson.tasks.ArtifactArchiver.perform(ArtifactArchiver.java:243)
		at hudson.tasks.BuildStepCompatibilityLayer.perform(BuildStepCompatibilityLayer.java:81)
		at hudson.tasks.BuildStepMonitor$1.perform(BuildStepMonitor.java:20)
		at hudson.model.AbstractBuild$AbstractBuildExecution.perform(AbstractBuild.java:744)
		at hudson.model.AbstractBuild$AbstractBuildExecution.performAllBuildSteps(AbstractBuild.java:690)
		at hudson.model.Build$BuildExecution.post2(Build.java:186)
		at hudson.model.AbstractBuild$AbstractBuildExecution.post(AbstractBuild.java:635)
		at hudson.model.Run.execute(Run.java:1840)
		at hudson.model.FreeStyleBuild.run(FreeStyleBuild.java:43)
		at hudson.model.ResourceController.execute(ResourceController.java:97)
		at hudson.model.Executor.run(Executor.java:429)
Caused: hudson.FilePath$TunneledInterruptedException
	at hudson.FilePath$FileCallableWrapper.call(FilePath.java:3086)
	at hudson.remoting.UserRequest.perform(UserRequest.java:212)
	at hudson.remoting.UserRequest.perform(UserRequest.java:54)
	at hudson.remoting.Request$2.run(Request.java:369)
	at hudson.remoting.InterceptingExecutorService$1.call(InterceptingExecutorService.java:72)
	at java.util.concurrent.FutureTask.run(FutureTask.java:266)
	at java.util.concurrent.ThreadPoolExecutor.runWorker(ThreadPoolExecutor.java:1149)
	at java.util.concurrent.ThreadPoolExecutor$Worker.run(ThreadPoolExecutor.java:624)
	at java.lang.Thread.run(Thread.java:748)
Caused: java.lang.InterruptedException: java.lang.InterruptedException: no matches found within 10000
	at hudson.FilePath.act(FilePath.java:1072)
	at hudson.FilePath.act(FilePath.java:1059)
	at hudson.FilePath.validateAntFileMask(FilePath.java:2703)
	at hudson.tasks.ArtifactArchiver.perform(ArtifactArchiver.java:243)
	at hudson.tasks.BuildStepCompatibilityLayer.perform(BuildStepCompatibilityLayer.java:81)
	at hudson.tasks.BuildStepMonitor$1.perform(BuildStepMonitor.java:20)
	at hudson.model.AbstractBuild$AbstractBuildExecution.perform(AbstractBuild.java:744)
	at hudson.model.AbstractBuild$AbstractBuildExecution.performAllBuildSteps(AbstractBuild.java:690)
	at hudson.model.Build$BuildExecution.post2(Build.java:186)
	at hudson.model.AbstractBuild$AbstractBuildExecution.post(AbstractBuild.java:635)
	at hudson.model.Run.execute(Run.java:1840)
	at hudson.model.FreeStyleBuild.run(FreeStyleBuild.java:43)
	at hudson.model.ResourceController.execute(ResourceController.java:97)
	at hudson.model.Executor.run(Executor.java:429)
No artifacts found that match the file pattern "**/*.events,heapdumps/**,**/*_pid*.log". Configuration error?
[WARNINGS] Parsing warnings in console log with parser Java Compiler (javac)
Setting ANT_1_8_2_HOME=/export/home/jenkins/tools/hudson.tasks.Ant_AntInstallation/ANT_1.8.2
Setting ANT_1_8_2_HOME=/export/home/jenkins/tools/hudson.tasks.Ant_AntInstallation/ANT_1.8.2
<Git Blamer> Using GitBlamer to create author and commit information for all warnings.
<Git Blamer> GIT_COMMIT=af2de93451bbf0cfffb00dc785feef1a94633644, workspace=/export/home/jenkins/workspace/Lucene-Solr-master-Solaris
[WARNINGS] Computing warning deltas based on reference build #2067
Recording test results
Setting ANT_1_8_2_HOME=/export/home/jenkins/tools/hudson.tasks.Ant_AntInstallation/ANT_1.8.2
Build step 'Publish JUnit test result report' changed build result to UNSTABLE
Email was triggered for: Unstable (Test Failures)
Sending email for trigger: Unstable (Test Failures)
Setting ANT_1_8_2_HOME=/export/home/jenkins/tools/hudson.tasks.Ant_AntInstallation/ANT_1.8.2
Setting ANT_1_8_2_HOME=/export/home/jenkins/tools/hudson.tasks.Ant_AntInstallation/ANT_1.8.2
Setting ANT_1_8_2_HOME=/export/home/jenkins/tools/hudson.tasks.Ant_AntInstallation/ANT_1.8.2
Setting ANT_1_8_2_HOME=/export/home/jenkins/tools/hudson.tasks.Ant_AntInstallation/ANT_1.8.2

Mime
View raw message