lucene-dev mailing list archives

Site index · List index
Message view « Date » · « Thread »
Top « Date » · « Thread »
From Policeman Jenkins Server <jenk...@thetaphi.de>
Subject [JENKINS] Lucene-Solr-master-Windows (64bit/jdk-10) - Build # 7529 - Still Unstable!
Date Fri, 21 Sep 2018 18:14:03 GMT
Build: https://jenkins.thetaphi.de/job/Lucene-Solr-master-Windows/7529/
Java: 64bit/jdk-10 -XX:+UseCompressedOops -XX:+UseG1GC

5 tests failed.
FAILED:  org.apache.solr.cloud.AddReplicaTest.testAddMultipleReplicas

Error Message:
expected:<COMPLETED> but was:<FAILED>

Stack Trace:
java.lang.AssertionError: expected:<COMPLETED> but was:<FAILED>
	at __randomizedtesting.SeedInfo.seed([5FA49BAF0BD869F3:B8F44475BB2B519D]:0)
	at org.junit.Assert.fail(Assert.java:93)
	at org.junit.Assert.failNotEquals(Assert.java:647)
	at org.junit.Assert.assertEquals(Assert.java:128)
	at org.junit.Assert.assertEquals(Assert.java:147)
	at org.apache.solr.cloud.AddReplicaTest.testAddMultipleReplicas(AddReplicaTest.java:110)
	at java.base/jdk.internal.reflect.NativeMethodAccessorImpl.invoke0(Native Method)
	at java.base/jdk.internal.reflect.NativeMethodAccessorImpl.invoke(NativeMethodAccessorImpl.java:62)
	at java.base/jdk.internal.reflect.DelegatingMethodAccessorImpl.invoke(DelegatingMethodAccessorImpl.java:43)
	at java.base/java.lang.reflect.Method.invoke(Method.java:564)
	at com.carrotsearch.randomizedtesting.RandomizedRunner.invoke(RandomizedRunner.java:1742)
	at com.carrotsearch.randomizedtesting.RandomizedRunner$8.evaluate(RandomizedRunner.java:935)
	at com.carrotsearch.randomizedtesting.RandomizedRunner$9.evaluate(RandomizedRunner.java:971)
	at com.carrotsearch.randomizedtesting.RandomizedRunner$10.evaluate(RandomizedRunner.java:985)
	at com.carrotsearch.randomizedtesting.rules.SystemPropertiesRestoreRule$1.evaluate(SystemPropertiesRestoreRule.java:57)
	at org.apache.lucene.util.TestRuleSetupTeardownChained$1.evaluate(TestRuleSetupTeardownChained.java:49)
	at org.apache.lucene.util.AbstractBeforeAfterRule$1.evaluate(AbstractBeforeAfterRule.java:45)
	at org.apache.lucene.util.TestRuleThreadAndTestName$1.evaluate(TestRuleThreadAndTestName.java:48)
	at org.apache.lucene.util.TestRuleIgnoreAfterMaxFailures$1.evaluate(TestRuleIgnoreAfterMaxFailures.java:64)
	at org.apache.lucene.util.TestRuleMarkFailure$1.evaluate(TestRuleMarkFailure.java:47)
	at com.carrotsearch.randomizedtesting.rules.StatementAdapter.evaluate(StatementAdapter.java:36)
	at com.carrotsearch.randomizedtesting.ThreadLeakControl$StatementRunner.run(ThreadLeakControl.java:368)
	at com.carrotsearch.randomizedtesting.ThreadLeakControl.forkTimeoutingTask(ThreadLeakControl.java:817)
	at com.carrotsearch.randomizedtesting.ThreadLeakControl$3.evaluate(ThreadLeakControl.java:468)
	at com.carrotsearch.randomizedtesting.RandomizedRunner.runSingleTest(RandomizedRunner.java:944)
	at com.carrotsearch.randomizedtesting.RandomizedRunner$5.evaluate(RandomizedRunner.java:830)
	at com.carrotsearch.randomizedtesting.RandomizedRunner$6.evaluate(RandomizedRunner.java:880)
	at com.carrotsearch.randomizedtesting.RandomizedRunner$7.evaluate(RandomizedRunner.java:891)
	at com.carrotsearch.randomizedtesting.rules.StatementAdapter.evaluate(StatementAdapter.java:36)
	at com.carrotsearch.randomizedtesting.rules.SystemPropertiesRestoreRule$1.evaluate(SystemPropertiesRestoreRule.java:57)
	at org.apache.lucene.util.AbstractBeforeAfterRule$1.evaluate(AbstractBeforeAfterRule.java:45)
	at com.carrotsearch.randomizedtesting.rules.StatementAdapter.evaluate(StatementAdapter.java:36)
	at org.apache.lucene.util.TestRuleStoreClassName$1.evaluate(TestRuleStoreClassName.java:41)
	at com.carrotsearch.randomizedtesting.rules.NoShadowingOrOverridesOnMethodsRule$1.evaluate(NoShadowingOrOverridesOnMethodsRule.java:40)
	at com.carrotsearch.randomizedtesting.rules.NoShadowingOrOverridesOnMethodsRule$1.evaluate(NoShadowingOrOverridesOnMethodsRule.java:40)
	at com.carrotsearch.randomizedtesting.rules.StatementAdapter.evaluate(StatementAdapter.java:36)
	at com.carrotsearch.randomizedtesting.rules.StatementAdapter.evaluate(StatementAdapter.java:36)
	at org.apache.lucene.util.TestRuleAssertionsRequired$1.evaluate(TestRuleAssertionsRequired.java:53)
	at org.apache.lucene.util.TestRuleMarkFailure$1.evaluate(TestRuleMarkFailure.java:47)
	at org.apache.lucene.util.TestRuleIgnoreAfterMaxFailures$1.evaluate(TestRuleIgnoreAfterMaxFailures.java:64)
	at org.apache.lucene.util.TestRuleIgnoreTestSuites$1.evaluate(TestRuleIgnoreTestSuites.java:54)
	at com.carrotsearch.randomizedtesting.rules.StatementAdapter.evaluate(StatementAdapter.java:36)
	at com.carrotsearch.randomizedtesting.ThreadLeakControl$StatementRunner.run(ThreadLeakControl.java:368)
	at java.base/java.lang.Thread.run(Thread.java:844)


FAILED:  org.apache.solr.cloud.AddReplicaTest.testAddMultipleReplicas

Error Message:
expected:<COMPLETED> but was:<FAILED>

Stack Trace:
java.lang.AssertionError: expected:<COMPLETED> but was:<FAILED>
	at __randomizedtesting.SeedInfo.seed([5FA49BAF0BD869F3:B8F44475BB2B519D]:0)
	at org.junit.Assert.fail(Assert.java:93)
	at org.junit.Assert.failNotEquals(Assert.java:647)
	at org.junit.Assert.assertEquals(Assert.java:128)
	at org.junit.Assert.assertEquals(Assert.java:147)
	at org.apache.solr.cloud.AddReplicaTest.testAddMultipleReplicas(AddReplicaTest.java:110)
	at java.base/jdk.internal.reflect.NativeMethodAccessorImpl.invoke0(Native Method)
	at java.base/jdk.internal.reflect.NativeMethodAccessorImpl.invoke(NativeMethodAccessorImpl.java:62)
	at java.base/jdk.internal.reflect.DelegatingMethodAccessorImpl.invoke(DelegatingMethodAccessorImpl.java:43)
	at java.base/java.lang.reflect.Method.invoke(Method.java:564)
	at com.carrotsearch.randomizedtesting.RandomizedRunner.invoke(RandomizedRunner.java:1742)
	at com.carrotsearch.randomizedtesting.RandomizedRunner$8.evaluate(RandomizedRunner.java:935)
	at com.carrotsearch.randomizedtesting.RandomizedRunner$9.evaluate(RandomizedRunner.java:971)
	at com.carrotsearch.randomizedtesting.RandomizedRunner$10.evaluate(RandomizedRunner.java:985)
	at com.carrotsearch.randomizedtesting.rules.SystemPropertiesRestoreRule$1.evaluate(SystemPropertiesRestoreRule.java:57)
	at org.apache.lucene.util.TestRuleSetupTeardownChained$1.evaluate(TestRuleSetupTeardownChained.java:49)
	at org.apache.lucene.util.AbstractBeforeAfterRule$1.evaluate(AbstractBeforeAfterRule.java:45)
	at org.apache.lucene.util.TestRuleThreadAndTestName$1.evaluate(TestRuleThreadAndTestName.java:48)
	at org.apache.lucene.util.TestRuleIgnoreAfterMaxFailures$1.evaluate(TestRuleIgnoreAfterMaxFailures.java:64)
	at org.apache.lucene.util.TestRuleMarkFailure$1.evaluate(TestRuleMarkFailure.java:47)
	at com.carrotsearch.randomizedtesting.rules.StatementAdapter.evaluate(StatementAdapter.java:36)
	at com.carrotsearch.randomizedtesting.ThreadLeakControl$StatementRunner.run(ThreadLeakControl.java:368)
	at com.carrotsearch.randomizedtesting.ThreadLeakControl.forkTimeoutingTask(ThreadLeakControl.java:817)
	at com.carrotsearch.randomizedtesting.ThreadLeakControl$3.evaluate(ThreadLeakControl.java:468)
	at com.carrotsearch.randomizedtesting.RandomizedRunner.runSingleTest(RandomizedRunner.java:944)
	at com.carrotsearch.randomizedtesting.RandomizedRunner$5.evaluate(RandomizedRunner.java:830)
	at com.carrotsearch.randomizedtesting.RandomizedRunner$6.evaluate(RandomizedRunner.java:880)
	at com.carrotsearch.randomizedtesting.RandomizedRunner$7.evaluate(RandomizedRunner.java:891)
	at com.carrotsearch.randomizedtesting.rules.StatementAdapter.evaluate(StatementAdapter.java:36)
	at com.carrotsearch.randomizedtesting.rules.SystemPropertiesRestoreRule$1.evaluate(SystemPropertiesRestoreRule.java:57)
	at org.apache.lucene.util.AbstractBeforeAfterRule$1.evaluate(AbstractBeforeAfterRule.java:45)
	at com.carrotsearch.randomizedtesting.rules.StatementAdapter.evaluate(StatementAdapter.java:36)
	at org.apache.lucene.util.TestRuleStoreClassName$1.evaluate(TestRuleStoreClassName.java:41)
	at com.carrotsearch.randomizedtesting.rules.NoShadowingOrOverridesOnMethodsRule$1.evaluate(NoShadowingOrOverridesOnMethodsRule.java:40)
	at com.carrotsearch.randomizedtesting.rules.NoShadowingOrOverridesOnMethodsRule$1.evaluate(NoShadowingOrOverridesOnMethodsRule.java:40)
	at com.carrotsearch.randomizedtesting.rules.StatementAdapter.evaluate(StatementAdapter.java:36)
	at com.carrotsearch.randomizedtesting.rules.StatementAdapter.evaluate(StatementAdapter.java:36)
	at org.apache.lucene.util.TestRuleAssertionsRequired$1.evaluate(TestRuleAssertionsRequired.java:53)
	at org.apache.lucene.util.TestRuleMarkFailure$1.evaluate(TestRuleMarkFailure.java:47)
	at org.apache.lucene.util.TestRuleIgnoreAfterMaxFailures$1.evaluate(TestRuleIgnoreAfterMaxFailures.java:64)
	at org.apache.lucene.util.TestRuleIgnoreTestSuites$1.evaluate(TestRuleIgnoreTestSuites.java:54)
	at com.carrotsearch.randomizedtesting.rules.StatementAdapter.evaluate(StatementAdapter.java:36)
	at com.carrotsearch.randomizedtesting.ThreadLeakControl$StatementRunner.run(ThreadLeakControl.java:368)
	at java.base/java.lang.Thread.run(Thread.java:844)


FAILED:  org.apache.solr.cloud.AddReplicaTest.testAddMultipleReplicas

Error Message:
expected:<COMPLETED> but was:<FAILED>

Stack Trace:
java.lang.AssertionError: expected:<COMPLETED> but was:<FAILED>
	at __randomizedtesting.SeedInfo.seed([5FA49BAF0BD869F3:B8F44475BB2B519D]:0)
	at org.junit.Assert.fail(Assert.java:93)
	at org.junit.Assert.failNotEquals(Assert.java:647)
	at org.junit.Assert.assertEquals(Assert.java:128)
	at org.junit.Assert.assertEquals(Assert.java:147)
	at org.apache.solr.cloud.AddReplicaTest.testAddMultipleReplicas(AddReplicaTest.java:110)
	at java.base/jdk.internal.reflect.NativeMethodAccessorImpl.invoke0(Native Method)
	at java.base/jdk.internal.reflect.NativeMethodAccessorImpl.invoke(NativeMethodAccessorImpl.java:62)
	at java.base/jdk.internal.reflect.DelegatingMethodAccessorImpl.invoke(DelegatingMethodAccessorImpl.java:43)
	at java.base/java.lang.reflect.Method.invoke(Method.java:564)
	at com.carrotsearch.randomizedtesting.RandomizedRunner.invoke(RandomizedRunner.java:1742)
	at com.carrotsearch.randomizedtesting.RandomizedRunner$8.evaluate(RandomizedRunner.java:935)
	at com.carrotsearch.randomizedtesting.RandomizedRunner$9.evaluate(RandomizedRunner.java:971)
	at com.carrotsearch.randomizedtesting.RandomizedRunner$10.evaluate(RandomizedRunner.java:985)
	at com.carrotsearch.randomizedtesting.rules.SystemPropertiesRestoreRule$1.evaluate(SystemPropertiesRestoreRule.java:57)
	at org.apache.lucene.util.TestRuleSetupTeardownChained$1.evaluate(TestRuleSetupTeardownChained.java:49)
	at org.apache.lucene.util.AbstractBeforeAfterRule$1.evaluate(AbstractBeforeAfterRule.java:45)
	at org.apache.lucene.util.TestRuleThreadAndTestName$1.evaluate(TestRuleThreadAndTestName.java:48)
	at org.apache.lucene.util.TestRuleIgnoreAfterMaxFailures$1.evaluate(TestRuleIgnoreAfterMaxFailures.java:64)
	at org.apache.lucene.util.TestRuleMarkFailure$1.evaluate(TestRuleMarkFailure.java:47)
	at com.carrotsearch.randomizedtesting.rules.StatementAdapter.evaluate(StatementAdapter.java:36)
	at com.carrotsearch.randomizedtesting.ThreadLeakControl$StatementRunner.run(ThreadLeakControl.java:368)
	at com.carrotsearch.randomizedtesting.ThreadLeakControl.forkTimeoutingTask(ThreadLeakControl.java:817)
	at com.carrotsearch.randomizedtesting.ThreadLeakControl$3.evaluate(ThreadLeakControl.java:468)
	at com.carrotsearch.randomizedtesting.RandomizedRunner.runSingleTest(RandomizedRunner.java:944)
	at com.carrotsearch.randomizedtesting.RandomizedRunner$5.evaluate(RandomizedRunner.java:830)
	at com.carrotsearch.randomizedtesting.RandomizedRunner$6.evaluate(RandomizedRunner.java:880)
	at com.carrotsearch.randomizedtesting.RandomizedRunner$7.evaluate(RandomizedRunner.java:891)
	at com.carrotsearch.randomizedtesting.rules.StatementAdapter.evaluate(StatementAdapter.java:36)
	at com.carrotsearch.randomizedtesting.rules.SystemPropertiesRestoreRule$1.evaluate(SystemPropertiesRestoreRule.java:57)
	at org.apache.lucene.util.AbstractBeforeAfterRule$1.evaluate(AbstractBeforeAfterRule.java:45)
	at com.carrotsearch.randomizedtesting.rules.StatementAdapter.evaluate(StatementAdapter.java:36)
	at org.apache.lucene.util.TestRuleStoreClassName$1.evaluate(TestRuleStoreClassName.java:41)
	at com.carrotsearch.randomizedtesting.rules.NoShadowingOrOverridesOnMethodsRule$1.evaluate(NoShadowingOrOverridesOnMethodsRule.java:40)
	at com.carrotsearch.randomizedtesting.rules.NoShadowingOrOverridesOnMethodsRule$1.evaluate(NoShadowingOrOverridesOnMethodsRule.java:40)
	at com.carrotsearch.randomizedtesting.rules.StatementAdapter.evaluate(StatementAdapter.java:36)
	at com.carrotsearch.randomizedtesting.rules.StatementAdapter.evaluate(StatementAdapter.java:36)
	at org.apache.lucene.util.TestRuleAssertionsRequired$1.evaluate(TestRuleAssertionsRequired.java:53)
	at org.apache.lucene.util.TestRuleMarkFailure$1.evaluate(TestRuleMarkFailure.java:47)
	at org.apache.lucene.util.TestRuleIgnoreAfterMaxFailures$1.evaluate(TestRuleIgnoreAfterMaxFailures.java:64)
	at org.apache.lucene.util.TestRuleIgnoreTestSuites$1.evaluate(TestRuleIgnoreTestSuites.java:54)
	at com.carrotsearch.randomizedtesting.rules.StatementAdapter.evaluate(StatementAdapter.java:36)
	at com.carrotsearch.randomizedtesting.ThreadLeakControl$StatementRunner.run(ThreadLeakControl.java:368)
	at java.base/java.lang.Thread.run(Thread.java:844)


FAILED:  org.apache.solr.cloud.AddReplicaTest.testAddMultipleReplicas

Error Message:
expected:<COMPLETED> but was:<FAILED>

Stack Trace:
java.lang.AssertionError: expected:<COMPLETED> but was:<FAILED>
	at __randomizedtesting.SeedInfo.seed([5FA49BAF0BD869F3:B8F44475BB2B519D]:0)
	at org.junit.Assert.fail(Assert.java:93)
	at org.junit.Assert.failNotEquals(Assert.java:647)
	at org.junit.Assert.assertEquals(Assert.java:128)
	at org.junit.Assert.assertEquals(Assert.java:147)
	at org.apache.solr.cloud.AddReplicaTest.testAddMultipleReplicas(AddReplicaTest.java:110)
	at java.base/jdk.internal.reflect.NativeMethodAccessorImpl.invoke0(Native Method)
	at java.base/jdk.internal.reflect.NativeMethodAccessorImpl.invoke(NativeMethodAccessorImpl.java:62)
	at java.base/jdk.internal.reflect.DelegatingMethodAccessorImpl.invoke(DelegatingMethodAccessorImpl.java:43)
	at java.base/java.lang.reflect.Method.invoke(Method.java:564)
	at com.carrotsearch.randomizedtesting.RandomizedRunner.invoke(RandomizedRunner.java:1742)
	at com.carrotsearch.randomizedtesting.RandomizedRunner$8.evaluate(RandomizedRunner.java:935)
	at com.carrotsearch.randomizedtesting.RandomizedRunner$9.evaluate(RandomizedRunner.java:971)
	at com.carrotsearch.randomizedtesting.RandomizedRunner$10.evaluate(RandomizedRunner.java:985)
	at com.carrotsearch.randomizedtesting.rules.SystemPropertiesRestoreRule$1.evaluate(SystemPropertiesRestoreRule.java:57)
	at org.apache.lucene.util.TestRuleSetupTeardownChained$1.evaluate(TestRuleSetupTeardownChained.java:49)
	at org.apache.lucene.util.AbstractBeforeAfterRule$1.evaluate(AbstractBeforeAfterRule.java:45)
	at org.apache.lucene.util.TestRuleThreadAndTestName$1.evaluate(TestRuleThreadAndTestName.java:48)
	at org.apache.lucene.util.TestRuleIgnoreAfterMaxFailures$1.evaluate(TestRuleIgnoreAfterMaxFailures.java:64)
	at org.apache.lucene.util.TestRuleMarkFailure$1.evaluate(TestRuleMarkFailure.java:47)
	at com.carrotsearch.randomizedtesting.rules.StatementAdapter.evaluate(StatementAdapter.java:36)
	at com.carrotsearch.randomizedtesting.ThreadLeakControl$StatementRunner.run(ThreadLeakControl.java:368)
	at com.carrotsearch.randomizedtesting.ThreadLeakControl.forkTimeoutingTask(ThreadLeakControl.java:817)
	at com.carrotsearch.randomizedtesting.ThreadLeakControl$3.evaluate(ThreadLeakControl.java:468)
	at com.carrotsearch.randomizedtesting.RandomizedRunner.runSingleTest(RandomizedRunner.java:944)
	at com.carrotsearch.randomizedtesting.RandomizedRunner$5.evaluate(RandomizedRunner.java:830)
	at com.carrotsearch.randomizedtesting.RandomizedRunner$6.evaluate(RandomizedRunner.java:880)
	at com.carrotsearch.randomizedtesting.RandomizedRunner$7.evaluate(RandomizedRunner.java:891)
	at com.carrotsearch.randomizedtesting.rules.StatementAdapter.evaluate(StatementAdapter.java:36)
	at com.carrotsearch.randomizedtesting.rules.SystemPropertiesRestoreRule$1.evaluate(SystemPropertiesRestoreRule.java:57)
	at org.apache.lucene.util.AbstractBeforeAfterRule$1.evaluate(AbstractBeforeAfterRule.java:45)
	at com.carrotsearch.randomizedtesting.rules.StatementAdapter.evaluate(StatementAdapter.java:36)
	at org.apache.lucene.util.TestRuleStoreClassName$1.evaluate(TestRuleStoreClassName.java:41)
	at com.carrotsearch.randomizedtesting.rules.NoShadowingOrOverridesOnMethodsRule$1.evaluate(NoShadowingOrOverridesOnMethodsRule.java:40)
	at com.carrotsearch.randomizedtesting.rules.NoShadowingOrOverridesOnMethodsRule$1.evaluate(NoShadowingOrOverridesOnMethodsRule.java:40)
	at com.carrotsearch.randomizedtesting.rules.StatementAdapter.evaluate(StatementAdapter.java:36)
	at com.carrotsearch.randomizedtesting.rules.StatementAdapter.evaluate(StatementAdapter.java:36)
	at org.apache.lucene.util.TestRuleAssertionsRequired$1.evaluate(TestRuleAssertionsRequired.java:53)
	at org.apache.lucene.util.TestRuleMarkFailure$1.evaluate(TestRuleMarkFailure.java:47)
	at org.apache.lucene.util.TestRuleIgnoreAfterMaxFailures$1.evaluate(TestRuleIgnoreAfterMaxFailures.java:64)
	at org.apache.lucene.util.TestRuleIgnoreTestSuites$1.evaluate(TestRuleIgnoreTestSuites.java:54)
	at com.carrotsearch.randomizedtesting.rules.StatementAdapter.evaluate(StatementAdapter.java:36)
	at com.carrotsearch.randomizedtesting.ThreadLeakControl$StatementRunner.run(ThreadLeakControl.java:368)
	at java.base/java.lang.Thread.run(Thread.java:844)


FAILED:  org.apache.solr.cloud.AddReplicaTest.testAddMultipleReplicas

Error Message:
expected:<COMPLETED> but was:<FAILED>

Stack Trace:
java.lang.AssertionError: expected:<COMPLETED> but was:<FAILED>
	at __randomizedtesting.SeedInfo.seed([5FA49BAF0BD869F3:B8F44475BB2B519D]:0)
	at org.junit.Assert.fail(Assert.java:93)
	at org.junit.Assert.failNotEquals(Assert.java:647)
	at org.junit.Assert.assertEquals(Assert.java:128)
	at org.junit.Assert.assertEquals(Assert.java:147)
	at org.apache.solr.cloud.AddReplicaTest.testAddMultipleReplicas(AddReplicaTest.java:110)
	at java.base/jdk.internal.reflect.NativeMethodAccessorImpl.invoke0(Native Method)
	at java.base/jdk.internal.reflect.NativeMethodAccessorImpl.invoke(NativeMethodAccessorImpl.java:62)
	at java.base/jdk.internal.reflect.DelegatingMethodAccessorImpl.invoke(DelegatingMethodAccessorImpl.java:43)
	at java.base/java.lang.reflect.Method.invoke(Method.java:564)
	at com.carrotsearch.randomizedtesting.RandomizedRunner.invoke(RandomizedRunner.java:1742)
	at com.carrotsearch.randomizedtesting.RandomizedRunner$8.evaluate(RandomizedRunner.java:935)
	at com.carrotsearch.randomizedtesting.RandomizedRunner$9.evaluate(RandomizedRunner.java:971)
	at com.carrotsearch.randomizedtesting.RandomizedRunner$10.evaluate(RandomizedRunner.java:985)
	at com.carrotsearch.randomizedtesting.rules.SystemPropertiesRestoreRule$1.evaluate(SystemPropertiesRestoreRule.java:57)
	at org.apache.lucene.util.TestRuleSetupTeardownChained$1.evaluate(TestRuleSetupTeardownChained.java:49)
	at org.apache.lucene.util.AbstractBeforeAfterRule$1.evaluate(AbstractBeforeAfterRule.java:45)
	at org.apache.lucene.util.TestRuleThreadAndTestName$1.evaluate(TestRuleThreadAndTestName.java:48)
	at org.apache.lucene.util.TestRuleIgnoreAfterMaxFailures$1.evaluate(TestRuleIgnoreAfterMaxFailures.java:64)
	at org.apache.lucene.util.TestRuleMarkFailure$1.evaluate(TestRuleMarkFailure.java:47)
	at com.carrotsearch.randomizedtesting.rules.StatementAdapter.evaluate(StatementAdapter.java:36)
	at com.carrotsearch.randomizedtesting.ThreadLeakControl$StatementRunner.run(ThreadLeakControl.java:368)
	at com.carrotsearch.randomizedtesting.ThreadLeakControl.forkTimeoutingTask(ThreadLeakControl.java:817)
	at com.carrotsearch.randomizedtesting.ThreadLeakControl$3.evaluate(ThreadLeakControl.java:468)
	at com.carrotsearch.randomizedtesting.RandomizedRunner.runSingleTest(RandomizedRunner.java:944)
	at com.carrotsearch.randomizedtesting.RandomizedRunner$5.evaluate(RandomizedRunner.java:830)
	at com.carrotsearch.randomizedtesting.RandomizedRunner$6.evaluate(RandomizedRunner.java:880)
	at com.carrotsearch.randomizedtesting.RandomizedRunner$7.evaluate(RandomizedRunner.java:891)
	at com.carrotsearch.randomizedtesting.rules.StatementAdapter.evaluate(StatementAdapter.java:36)
	at com.carrotsearch.randomizedtesting.rules.SystemPropertiesRestoreRule$1.evaluate(SystemPropertiesRestoreRule.java:57)
	at org.apache.lucene.util.AbstractBeforeAfterRule$1.evaluate(AbstractBeforeAfterRule.java:45)
	at com.carrotsearch.randomizedtesting.rules.StatementAdapter.evaluate(StatementAdapter.java:36)
	at org.apache.lucene.util.TestRuleStoreClassName$1.evaluate(TestRuleStoreClassName.java:41)
	at com.carrotsearch.randomizedtesting.rules.NoShadowingOrOverridesOnMethodsRule$1.evaluate(NoShadowingOrOverridesOnMethodsRule.java:40)
	at com.carrotsearch.randomizedtesting.rules.NoShadowingOrOverridesOnMethodsRule$1.evaluate(NoShadowingOrOverridesOnMethodsRule.java:40)
	at com.carrotsearch.randomizedtesting.rules.StatementAdapter.evaluate(StatementAdapter.java:36)
	at com.carrotsearch.randomizedtesting.rules.StatementAdapter.evaluate(StatementAdapter.java:36)
	at org.apache.lucene.util.TestRuleAssertionsRequired$1.evaluate(TestRuleAssertionsRequired.java:53)
	at org.apache.lucene.util.TestRuleMarkFailure$1.evaluate(TestRuleMarkFailure.java:47)
	at org.apache.lucene.util.TestRuleIgnoreAfterMaxFailures$1.evaluate(TestRuleIgnoreAfterMaxFailures.java:64)
	at org.apache.lucene.util.TestRuleIgnoreTestSuites$1.evaluate(TestRuleIgnoreTestSuites.java:54)
	at com.carrotsearch.randomizedtesting.rules.StatementAdapter.evaluate(StatementAdapter.java:36)
	at com.carrotsearch.randomizedtesting.ThreadLeakControl$StatementRunner.run(ThreadLeakControl.java:368)
	at java.base/java.lang.Thread.run(Thread.java:844)




Build Log:
[...truncated 12685 lines...]
   [junit4] Suite: org.apache.solr.cloud.AddReplicaTest
   [junit4]   2> Creating dataDir: C:\Users\jenkins\workspace\Lucene-Solr-master-Windows\solr\build\solr-core\test\J1\temp\solr.cloud.AddReplicaTest_5FA49BAF0BD869F3-001\init-core-data-001
   [junit4]   2> 355398 WARN  (SUITE-AddReplicaTest-seed#[5FA49BAF0BD869F3]-worker) [    ] o.a.s.SolrTestCaseJ4 startTrackingSearchers: numOpens=1 numCloses=1
   [junit4]   2> 355398 INFO  (SUITE-AddReplicaTest-seed#[5FA49BAF0BD869F3]-worker) [    ] o.a.s.SolrTestCaseJ4 Using PointFields (NUMERIC_POINTS_SYSPROP=true) w/NUMERIC_DOCVALUES_SYSPROP=true
   [junit4]   2> 355401 INFO  (SUITE-AddReplicaTest-seed#[5FA49BAF0BD869F3]-worker) [    ] o.a.s.SolrTestCaseJ4 Randomized ssl (false) and clientAuth (false) via: @org.apache.solr.util.RandomizeSSL(reason="", value=0.0/0.0, ssl=0.0/0.0, clientAuth=0.0/0.0)
   [junit4]   2> 355401 INFO  (SUITE-AddReplicaTest-seed#[5FA49BAF0BD869F3]-worker) [    ] o.a.s.SolrTestCaseJ4 SecureRandom sanity checks: test.solr.allowed.securerandom=null & java.security.egd=file:/dev/./urandom
   [junit4]   2> 355402 INFO  (SUITE-AddReplicaTest-seed#[5FA49BAF0BD869F3]-worker) [    ] o.a.s.c.MiniSolrCloudCluster Starting cluster of 4 servers in C:\Users\jenkins\workspace\Lucene-Solr-master-Windows\solr\build\solr-core\test\J1\temp\solr.cloud.AddReplicaTest_5FA49BAF0BD869F3-001\tempDir-001
   [junit4]   2> 355402 INFO  (SUITE-AddReplicaTest-seed#[5FA49BAF0BD869F3]-worker) [    ] o.a.s.c.ZkTestServer STARTING ZK TEST SERVER
   [junit4]   2> 355403 INFO  (Thread-651) [    ] o.a.s.c.ZkTestServer client port:0.0.0.0/0.0.0.0:0
   [junit4]   2> 355403 INFO  (Thread-651) [    ] o.a.s.c.ZkTestServer Starting server
   [junit4]   2> 355408 ERROR (Thread-651) [    ] o.a.z.s.ZooKeeperServer ZKShutdownHandler is not registered, so ZooKeeper server won't take any action on ERROR or SHUTDOWN server state changes
   [junit4]   2> 355503 INFO  (SUITE-AddReplicaTest-seed#[5FA49BAF0BD869F3]-worker) [    ] o.a.s.c.ZkTestServer start zk server on port:60581
   [junit4]   2> 355508 INFO  (zkConnectionManagerCallback-870-thread-1) [    ] o.a.s.c.c.ConnectionManager zkClient has connected
   [junit4]   2> 355516 INFO  (jetty-launcher-867-thread-2) [    ] o.e.j.s.Server jetty-9.4.11.v20180605; built: 2018-06-05T18:24:03.829Z; git: d5fc0523cfa96bfebfbda19606cad384d772f04c; jvm 10+46
   [junit4]   2> 355516 INFO  (jetty-launcher-867-thread-2) [    ] o.e.j.s.session DefaultSessionIdManager workerName=node0
   [junit4]   2> 355516 INFO  (jetty-launcher-867-thread-2) [    ] o.e.j.s.session No SessionScavenger set, using defaults
   [junit4]   2> 355516 INFO  (jetty-launcher-867-thread-2) [    ] o.e.j.s.session node0 Scavenging every 600000ms
   [junit4]   2> 355517 INFO  (jetty-launcher-867-thread-2) [    ] o.e.j.s.h.ContextHandler Started o.e.j.s.ServletContextHandler@28f51187{/solr,null,AVAILABLE}
   [junit4]   2> 355522 INFO  (jetty-launcher-867-thread-3) [    ] o.e.j.s.Server jetty-9.4.11.v20180605; built: 2018-06-05T18:24:03.829Z; git: d5fc0523cfa96bfebfbda19606cad384d772f04c; jvm 10+46
   [junit4]   2> 355522 INFO  (jetty-launcher-867-thread-3) [    ] o.e.j.s.session DefaultSessionIdManager workerName=node0
   [junit4]   2> 355522 INFO  (jetty-launcher-867-thread-3) [    ] o.e.j.s.session No SessionScavenger set, using defaults
   [junit4]   2> 355522 INFO  (jetty-launcher-867-thread-3) [    ] o.e.j.s.session node0 Scavenging every 600000ms
   [junit4]   2> 355522 INFO  (jetty-launcher-867-thread-3) [    ] o.e.j.s.h.ContextHandler Started o.e.j.s.ServletContextHandler@22b3691e{/solr,null,AVAILABLE}
   [junit4]   2> 355524 INFO  (jetty-launcher-867-thread-4) [    ] o.e.j.s.Server jetty-9.4.11.v20180605; built: 2018-06-05T18:24:03.829Z; git: d5fc0523cfa96bfebfbda19606cad384d772f04c; jvm 10+46
   [junit4]   2> 355526 INFO  (jetty-launcher-867-thread-2) [    ] o.e.j.s.AbstractConnector Started ServerConnector@3bb15a54{HTTP/1.1,[http/1.1]}{127.0.0.1:60585}
   [junit4]   2> 355526 INFO  (jetty-launcher-867-thread-2) [    ] o.e.j.s.Server Started @355574ms
   [junit4]   2> 355526 INFO  (jetty-launcher-867-thread-2) [    ] o.a.s.c.s.e.JettySolrRunner Jetty properties: {hostContext=/solr, hostPort=60585}
   [junit4]   2> 355526 INFO  (jetty-launcher-867-thread-4) [    ] o.e.j.s.session DefaultSessionIdManager workerName=node0
   [junit4]   2> 355526 INFO  (jetty-launcher-867-thread-4) [    ] o.e.j.s.session No SessionScavenger set, using defaults
   [junit4]   2> 355526 INFO  (jetty-launcher-867-thread-4) [    ] o.e.j.s.session node0 Scavenging every 600000ms
   [junit4]   2> 355526 ERROR (jetty-launcher-867-thread-2) [    ] o.a.s.u.StartupLoggingUtils Missing Java Option solr.log.dir. Logging may be missing or incomplete.
   [junit4]   2> 355526 INFO  (jetty-launcher-867-thread-2) [    ] o.a.s.s.SolrDispatchFilter Using logger factory org.apache.logging.slf4j.Log4jLoggerFactory
   [junit4]   2> 355526 INFO  (jetty-launcher-867-thread-2) [    ] o.a.s.s.SolrDispatchFilter  ___      _       Welcome to Apache Solr™ version 8.0.0
   [junit4]   2> 355526 INFO  (jetty-launcher-867-thread-2) [    ] o.a.s.s.SolrDispatchFilter / __| ___| |_ _   Starting in cloud mode on port null
   [junit4]   2> 355526 INFO  (jetty-launcher-867-thread-2) [    ] o.a.s.s.SolrDispatchFilter \__ \/ _ \ | '_|  Install dir: null
   [junit4]   2> 355526 INFO  (jetty-launcher-867-thread-2) [    ] o.a.s.s.SolrDispatchFilter |___/\___/_|_|    Start time: 2018-09-21T16:43:12.395002Z
   [junit4]   2> 355526 INFO  (jetty-launcher-867-thread-4) [    ] o.e.j.s.h.ContextHandler Started o.e.j.s.ServletContextHandler@6a5538a{/solr,null,AVAILABLE}
   [junit4]   2> 355526 INFO  (jetty-launcher-867-thread-4) [    ] o.e.j.s.AbstractConnector Started ServerConnector@1569ab6f{HTTP/1.1,[http/1.1]}{127.0.0.1:60591}
   [junit4]   2> 355526 INFO  (jetty-launcher-867-thread-4) [    ] o.e.j.s.Server Started @355576ms
   [junit4]   2> 355526 INFO  (jetty-launcher-867-thread-4) [    ] o.a.s.c.s.e.JettySolrRunner Jetty properties: {hostContext=/solr, hostPort=60591}
   [junit4]   2> 355526 ERROR (jetty-launcher-867-thread-4) [    ] o.a.s.u.StartupLoggingUtils Missing Java Option solr.log.dir. Logging may be missing or incomplete.
   [junit4]   2> 355526 INFO  (jetty-launcher-867-thread-4) [    ] o.a.s.s.SolrDispatchFilter Using logger factory org.apache.logging.slf4j.Log4jLoggerFactory
   [junit4]   2> 355526 INFO  (jetty-launcher-867-thread-4) [    ] o.a.s.s.SolrDispatchFilter  ___      _       Welcome to Apache Solr™ version 8.0.0
   [junit4]   2> 355526 INFO  (jetty-launcher-867-thread-4) [    ] o.a.s.s.SolrDispatchFilter / __| ___| |_ _   Starting in cloud mode on port null
   [junit4]   2> 355526 INFO  (jetty-launcher-867-thread-4) [    ] o.a.s.s.SolrDispatchFilter \__ \/ _ \ | '_|  Install dir: null
   [junit4]   2> 355526 INFO  (jetty-launcher-867-thread-4) [    ] o.a.s.s.SolrDispatchFilter |___/\___/_|_|    Start time: 2018-09-21T16:43:12.395833100Z
   [junit4]   2> 355528 INFO  (jetty-launcher-867-thread-3) [    ] o.e.j.s.AbstractConnector Started ServerConnector@71985cb4{HTTP/1.1,[http/1.1]}{127.0.0.1:60588}
   [junit4]   2> 355528 INFO  (jetty-launcher-867-thread-3) [    ] o.e.j.s.Server Started @355577ms
   [junit4]   2> 355528 INFO  (jetty-launcher-867-thread-3) [    ] o.a.s.c.s.e.JettySolrRunner Jetty properties: {hostContext=/solr, hostPort=60588}
   [junit4]   2> 355528 ERROR (jetty-launcher-867-thread-3) [    ] o.a.s.u.StartupLoggingUtils Missing Java Option solr.log.dir. Logging may be missing or incomplete.
   [junit4]   2> 355528 INFO  (jetty-launcher-867-thread-3) [    ] o.a.s.s.SolrDispatchFilter Using logger factory org.apache.logging.slf4j.Log4jLoggerFactory
   [junit4]   2> 355528 INFO  (jetty-launcher-867-thread-3) [    ] o.a.s.s.SolrDispatchFilter  ___      _       Welcome to Apache Solr™ version 8.0.0
   [junit4]   2> 355528 INFO  (jetty-launcher-867-thread-3) [    ] o.a.s.s.SolrDispatchFilter / __| ___| |_ _   Starting in cloud mode on port null
   [junit4]   2> 355528 INFO  (jetty-launcher-867-thread-3) [    ] o.a.s.s.SolrDispatchFilter \__ \/ _ \ | '_|  Install dir: null
   [junit4]   2> 355528 INFO  (jetty-launcher-867-thread-3) [    ] o.a.s.s.SolrDispatchFilter |___/\___/_|_|    Start time: 2018-09-21T16:43:12.397680900Z
   [junit4]   2> 355530 INFO  (jetty-launcher-867-thread-1) [    ] o.e.j.s.Server jetty-9.4.11.v20180605; built: 2018-06-05T18:24:03.829Z; git: d5fc0523cfa96bfebfbda19606cad384d772f04c; jvm 10+46
   [junit4]   2> 355530 INFO  (jetty-launcher-867-thread-1) [    ] o.e.j.s.session DefaultSessionIdManager workerName=node0
   [junit4]   2> 355530 INFO  (jetty-launcher-867-thread-1) [    ] o.e.j.s.session No SessionScavenger set, using defaults
   [junit4]   2> 355530 INFO  (jetty-launcher-867-thread-1) [    ] o.e.j.s.session node0 Scavenging every 600000ms
   [junit4]   2> 355530 INFO  (jetty-launcher-867-thread-1) [    ] o.e.j.s.h.ContextHandler Started o.e.j.s.ServletContextHandler@65fb0696{/solr,null,AVAILABLE}
   [junit4]   2> 355531 INFO  (jetty-launcher-867-thread-1) [    ] o.e.j.s.AbstractConnector Started ServerConnector@6b0c6611{HTTP/1.1,[http/1.1]}{127.0.0.1:60600}
   [junit4]   2> 355531 INFO  (jetty-launcher-867-thread-1) [    ] o.e.j.s.Server Started @355581ms
   [junit4]   2> 355531 INFO  (jetty-launcher-867-thread-1) [    ] o.a.s.c.s.e.JettySolrRunner Jetty properties: {hostContext=/solr, hostPort=60600}
   [junit4]   2> 355531 ERROR (jetty-launcher-867-thread-1) [    ] o.a.s.u.StartupLoggingUtils Missing Java Option solr.log.dir. Logging may be missing or incomplete.
   [junit4]   2> 355532 INFO  (jetty-launcher-867-thread-1) [    ] o.a.s.s.SolrDispatchFilter Using logger factory org.apache.logging.slf4j.Log4jLoggerFactory
   [junit4]   2> 355532 INFO  (jetty-launcher-867-thread-1) [    ] o.a.s.s.SolrDispatchFilter  ___      _       Welcome to Apache Solr™ version 8.0.0
   [junit4]   2> 355532 INFO  (jetty-launcher-867-thread-1) [    ] o.a.s.s.SolrDispatchFilter / __| ___| |_ _   Starting in cloud mode on port null
   [junit4]   2> 355532 INFO  (jetty-launcher-867-thread-1) [    ] o.a.s.s.SolrDispatchFilter \__ \/ _ \ | '_|  Install dir: null
   [junit4]   2> 355532 INFO  (jetty-launcher-867-thread-1) [    ] o.a.s.s.SolrDispatchFilter |___/\___/_|_|    Start time: 2018-09-21T16:43:12.401782200Z
   [junit4]   2> 355548 INFO  (zkConnectionManagerCallback-874-thread-1) [    ] o.a.s.c.c.ConnectionManager zkClient has connected
   [junit4]   2> 355548 INFO  (zkConnectionManagerCallback-872-thread-1) [    ] o.a.s.c.c.ConnectionManager zkClient has connected
   [junit4]   2> 355548 INFO  (zkConnectionManagerCallback-876-thread-1) [    ] o.a.s.c.c.ConnectionManager zkClient has connected
   [junit4]   2> 355549 INFO  (jetty-launcher-867-thread-2) [    ] o.a.s.s.SolrDispatchFilter solr.xml found in ZooKeeper. Loading...
   [junit4]   2> 355549 INFO  (jetty-launcher-867-thread-4) [    ] o.a.s.s.SolrDispatchFilter solr.xml found in ZooKeeper. Loading...
   [junit4]   2> 355549 INFO  (jetty-launcher-867-thread-3) [    ] o.a.s.s.SolrDispatchFilter solr.xml found in ZooKeeper. Loading...
   [junit4]   2> 355561 WARN  (NIOServerCxn.Factory:0.0.0.0/0.0.0.0:0) [    ] o.a.z.s.NIOServerCnxn Unable to read additional data from client sessionid 0x1001eee14dc0001, likely client has closed socket
   [junit4]   2> 355670 INFO  (jetty-launcher-867-thread-3) [    ] o.a.s.c.ZkContainer Zookeeper client=127.0.0.1:60581/solr
   [junit4]   2> 355676 INFO  (zkConnectionManagerCallback-878-thread-1) [    ] o.a.s.c.c.ConnectionManager zkClient has connected
   [junit4]   2> 355676 INFO  (jetty-launcher-867-thread-1) [    ] o.a.s.s.SolrDispatchFilter solr.xml found in ZooKeeper. Loading...
   [junit4]   2> 355839 INFO  (jetty-launcher-867-thread-1) [    ] o.a.s.c.ZkContainer Zookeeper client=127.0.0.1:60581/solr
   [junit4]   2> 355861 INFO  (zkConnectionManagerCallback-882-thread-1) [    ] o.a.s.c.c.ConnectionManager zkClient has connected
   [junit4]   2> 355863 DEBUG (jetty-launcher-867-thread-3) [n:127.0.0.1:60588_solr    ] o.a.s.c.ZkController Added new OnReconnect listener org.apache.solr.cloud.ZkController$$Lambda$436/2075809341@531defbd
   [junit4]   2> 355864 INFO  (zkConnectionManagerCallback-886-thread-1) [    ] o.a.s.c.c.ConnectionManager zkClient has connected
   [junit4]   2> 355867 DEBUG (jetty-launcher-867-thread-1) [n:127.0.0.1:60600_solr    ] o.a.s.c.ZkController Added new OnReconnect listener org.apache.solr.cloud.ZkController$$Lambda$436/2075809341@685c9b26
   [junit4]   2> 355869 INFO  (zkConnectionManagerCallback-888-thread-1) [    ] o.a.s.c.c.ConnectionManager zkClient has connected
   [junit4]   2> 355998 DEBUG (SyncThread:0) [    ] o.a.s.c.ZkTestServer Watch added: create/delete: /solr/clusterprops.json
   [junit4]   2> 355998 DEBUG (SyncThread:0) [    ] o.a.s.c.ZkTestServer Watch added: children: /solr/live_nodes
   [junit4]   2> 355999 DEBUG (SyncThread:0) [    ] o.a.s.c.ZkTestServer Watch added: data: /solr/clusterstate.json
   [junit4]   2> 355999 DEBUG (SyncThread:0) [    ] o.a.s.c.ZkTestServer Watch added: children: /solr/collections
   [junit4]   2> 355999 DEBUG (SyncThread:0) [    ] o.a.s.c.ZkTestServer Watch added: create/delete: /solr/aliases.json
   [junit4]   2> 355999 DEBUG (SyncThread:0) [    ] o.a.s.c.ZkTestServer Watch added: create/delete: /solr/security.json
   [junit4]   2> 356002 DEBUG (jetty-launcher-867-thread-3) [n:127.0.0.1:60588_solr    ] o.a.s.c.LeaderElector Joined leadership election with path: /overseer_elect/election/72091601938939911-127.0.0.1:60588_solr-n_0000000000
   [junit4]   2> 356002 INFO  (jetty-launcher-867-thread-3) [n:127.0.0.1:60588_solr    ] o.a.s.c.OverseerElectionContext I am going to be the leader 127.0.0.1:60588_solr
   [junit4]   2> 356003 INFO  (jetty-launcher-867-thread-3) [n:127.0.0.1:60588_solr    ] o.a.s.c.Overseer Overseer (id=72091601938939911-127.0.0.1:60588_solr-n_0000000000) starting
   [junit4]   2> 356151 INFO  (jetty-launcher-867-thread-2) [    ] o.a.s.c.ZkContainer Zookeeper client=127.0.0.1:60581/solr
   [junit4]   2> 356152 INFO  (zkConnectionManagerCallback-890-thread-1) [    ] o.a.s.c.c.ConnectionManager zkClient has connected
   [junit4]   2> 356158 DEBUG (SyncThread:0) [    ] o.a.s.c.ZkTestServer Watch added: create/delete: /solr/clusterprops.json
   [junit4]   2> 356159 DEBUG (SyncThread:0) [    ] o.a.s.c.ZkTestServer Watch added: children: /solr/live_nodes
   [junit4]   2> 356159 DEBUG (SyncThread:0) [    ] o.a.s.c.ZkTestServer Watch added: data: /solr/clusterstate.json
   [junit4]   2> 356159 DEBUG (SyncThread:0) [    ] o.a.s.c.ZkTestServer Watch added: children: /solr/collections
   [junit4]   2> 356159 DEBUG (SyncThread:0) [    ] o.a.s.c.ZkTestServer Watch added: create/delete: /solr/aliases.json
   [junit4]   2> 356160 DEBUG (SyncThread:0) [    ] o.a.s.c.ZkTestServer Watch added: create/delete: /solr/security.json
   [junit4]   2> 356162 DEBUG (jetty-launcher-867-thread-1) [n:127.0.0.1:60600_solr    ] o.a.s.c.LeaderElector Joined leadership election with path: /overseer_elect/election/72091601938939912-127.0.0.1:60600_solr-n_0000000001
   [junit4]   2> 356162 DEBUG (SyncThread:0) [    ] o.a.s.c.ZkTestServer Watch added: data: /solr/overseer_elect/election/72091601938939911-127.0.0.1:60588_solr-n_0000000000
   [junit4]   2> 356162 DEBUG (jetty-launcher-867-thread-1) [n:127.0.0.1:60600_solr    ] o.a.s.c.LeaderElector Watching path /overseer_elect/election/72091601938939911-127.0.0.1:60588_solr-n_0000000000 to know if I could be the leader
   [junit4]   2> 356162 INFO  (jetty-launcher-867-thread-1) [n:127.0.0.1:60600_solr    ] o.a.s.c.ZkController Register node as live in ZooKeeper:/live_nodes/127.0.0.1:60600_solr
   [junit4]   2> 356162 INFO  (zkConnectionManagerCallback-897-thread-1) [    ] o.a.s.c.c.ConnectionManager zkClient has connected
   [junit4]   2> 356162 DEBUG (SyncThread:0) [    ] o.a.s.c.ZkTestServer Watch fired: children: /solr/live_nodes
   [junit4]   2> 356162 DEBUG (SyncThread:0) [    ] o.a.s.c.ZkTestServer Watch fired: children: /solr/live_nodes
   [junit4]   2> 356163 DEBUG (SyncThread:0) [    ] o.a.s.c.ZkTestServer Watch added: create/delete: /solr/clusterprops.json
   [junit4]   2> 356163 DEBUG (SyncThread:0) [    ] o.a.s.c.ZkTestServer Watch added: children: /solr/live_nodes
   [junit4]   2> 356163 INFO  (jetty-launcher-867-thread-3) [n:127.0.0.1:60588_solr    ] o.a.s.c.c.ZkStateReader Updated live nodes from ZooKeeper... (0) -> (1)
   [junit4]   2> 356163 DEBUG (SyncThread:0) [    ] o.a.s.c.ZkTestServer Watch added: data: /solr/clusterstate.json
   [junit4]   2> 356163 INFO  (zkConnectionManagerCallback-901-thread-1) [    ] o.a.s.c.c.ConnectionManager zkClient has connected
   [junit4]   2> 356163 DEBUG (SyncThread:0) [    ] o.a.s.c.ZkTestServer Watch added: children: /solr/collections
   [junit4]   2> 356164 DEBUG (SyncThread:0) [    ] o.a.s.c.ZkTestServer Watch added: create/delete: /solr/aliases.json
   [junit4]   2> 356164 INFO  (jetty-launcher-867-thread-3) [n:127.0.0.1:60588_solr    ] o.a.s.c.s.i.ZkClientClusterStateProvider Cluster at 127.0.0.1:60581/solr ready
   [junit4]   2> 356166 DEBUG (jetty-launcher-867-thread-2) [n:127.0.0.1:60585_solr    ] o.a.s.c.ZkController Added new OnReconnect listener org.apache.solr.cloud.ZkController$$Lambda$436/2075809341@61790fb5
   [junit4]   2> 356167 DEBUG (OverseerCollectionConfigSetProcessor-72091601938939911-127.0.0.1:60588_solr-n_0000000000) [n:127.0.0.1:60588_solr    ] o.a.s.c.OverseerTaskProcessor Process current queue of overseer operations
   [junit4]   2> 356167 DEBUG (jetty-launcher-867-thread-3) [n:127.0.0.1:60588_solr    ] o.a.s.c.ZkController Publish node=127.0.0.1:60588_solr as DOWN
   [junit4]   2> 356168 DEBUG (OverseerAutoScalingTriggerThread-72091601938939911-127.0.0.1:60588_solr-n_0000000000) [    ] o.a.s.c.a.OverseerTriggerThread Adding .auto_add_replicas and .scheduled_maintenance triggers
   [junit4]   2> 356171 INFO  (jetty-launcher-867-thread-4) [    ] o.a.s.c.ZkContainer Zookeeper client=127.0.0.1:60581/solr
   [junit4]   2> 356171 INFO  (OverseerStateUpdate-72091601938939911-127.0.0.1:60588_solr-n_0000000000) [n:127.0.0.1:60588_solr    ] o.a.s.c.Overseer Starting to work on the main queue : 127.0.0.1:60588_solr
   [junit4]   2> 356172 DEBUG (SyncThread:0) [    ] o.a.s.c.ZkTestServer Watch added: children: /solr/live_nodes
   [junit4]   2> 356174 INFO  (zkCallback-889-thread-1) [    ] o.a.s.c.c.ZkStateReader Updated live nodes from ZooKeeper... (0) -> (1)
   [junit4]   2> 356175 DEBUG (SyncThread:0) [    ] o.a.s.c.ZkTestServer Watch added: children: /solr/live_nodes
   [junit4]   2> 356177 INFO  (zkCallback-887-thread-1) [    ] o.a.s.c.c.ZkStateReader Updated live nodes from ZooKeeper... (0) -> (1)
   [junit4]   2> 356177 DEBUG (SyncThread:0) [    ] o.a.s.c.ZkTestServer Watch added: data: /solr/autoscaling.json
   [junit4]   2> 356177 DEBUG (OverseerAutoScalingTriggerThread-72091601938939911-127.0.0.1:60588_solr-n_0000000000) [    ] o.a.s.c.a.OverseerTriggerThread Refreshing /autoscaling.json with znode version 1
   [junit4]   2> 356182 DEBUG (OverseerAutoScalingTriggerThread-72091601938939911-127.0.0.1:60588_solr-n_0000000000) [    ] o.a.s.c.a.OverseerTriggerThread Current znodeVersion 1, lastZnodeVersion -1
   [junit4]   2> 356182 DEBUG (OverseerAutoScalingTriggerThread-72091601938939911-127.0.0.1:60588_solr-n_0000000000) [    ] o.a.s.c.a.OverseerTriggerThread Processed trigger updates upto znodeVersion 1
   [junit4]   2> 356183 DEBUG (OverseerCollectionConfigSetProcessor-72091601938939911-127.0.0.1:60588_solr-n_0000000000) [n:127.0.0.1:60588_solr    ] o.a.s.c.OverseerTaskProcessor Cleaning up work-queue. #Running tasks: 0
   [junit4]   2> 356183 DEBUG (OverseerCollectionConfigSetProcessor-72091601938939911-127.0.0.1:60588_solr-n_0000000000) [n:127.0.0.1:60588_solr    ] o.a.s.c.OverseerTaskProcessor RunningTasks: []
   [junit4]   2> 356183 DEBUG (OverseerCollectionConfigSetProcessor-72091601938939911-127.0.0.1:60588_solr-n_0000000000) [n:127.0.0.1:60588_solr    ] o.a.s.c.OverseerTaskProcessor BlockedTasks: []
   [junit4]   2> 356183 DEBUG (OverseerCollectionConfigSetProcessor-72091601938939911-127.0.0.1:60588_solr-n_0000000000) [n:127.0.0.1:60588_solr    ] o.a.s.c.OverseerTaskProcessor CompletedTasks: []
   [junit4]   2> 356183 DEBUG (OverseerCollectionConfigSetProcessor-72091601938939911-127.0.0.1:60588_solr-n_0000000000) [n:127.0.0.1:60588_solr    ] o.a.s.c.OverseerTaskProcessor RunningZKTasks: []
   [junit4]   2> 356183 DEBUG (OverseerCollectionConfigSetProcessor-72091601938939911-127.0.0.1:60588_solr-n_0000000000) [n:127.0.0.1:60588_solr    ] o.a.s.c.OverseerTaskQueue Peeking for top 100 elements. ExcludeSet: []
   [junit4]   2> 356183 INFO  (jetty-launcher-867-thread-3) [n:127.0.0.1:60588_solr    ] o.a.s.c.TransientSolrCoreCacheDefault Allocating transient cache for 2147483647 transient cores
   [junit4]   2> 356183 INFO  (jetty-launcher-867-thread-3) [n:127.0.0.1:60588_solr    ] o.a.s.c.ZkController Register node as live in ZooKeeper:/live_nodes/127.0.0.1:60588_solr
   [junit4]   2> 356183 DEBUG (SyncThread:0) [    ] o.a.s.c.ZkTestServer Watch added: children: /solr/overseer/collection-queue-work
   [junit4]   2> 356184 DEBUG (SyncThread:0) [    ] o.a.s.c.ZkTestServer Watch added: children: /solr/overseer/queue-work
   [junit4]   2> 356184 DEBUG (SyncThread:0) [    ] o.a.s.c.ZkTestServer Watch fired: children: /solr/live_nodes
   [junit4]   2> 356184 DEBUG (SyncThread:0) [    ] o.a.s.c.ZkTestServer Watch fired: children: /solr/live_nodes
   [junit4]   2> 356184 DEBUG (SyncThread:0) [    ] o.a.s.c.ZkTestServer Watch fired: children: /solr/live_nodes
   [junit4]   2> 356191 DEBUG (SyncThread:0) [    ] o.a.s.c.ZkTestServer Watch added: children: /solr/overseer/queue
   [junit4]   2> 356192 DEBUG (SyncThread:0) [    ] o.a.s.c.ZkTestServer Watch added: children: /solr/live_nodes
   [junit4]   2> 356192 DEBUG (SyncThread:0) [    ] o.a.s.c.ZkTestServer Watch added: children: /solr/live_nodes
   [junit4]   2> 356192 INFO  (zkCallback-889-thread-1) [    ] o.a.s.c.c.ZkStateReader Updated live nodes from ZooKeeper... (1) -> (2)
   [junit4]   2> 356192 INFO  (zkCallback-887-thread-1) [    ] o.a.s.c.c.ZkStateReader Updated live nodes from ZooKeeper... (1) -> (2)
   [junit4]   2> 356192 DEBUG (OverseerStateUpdate-72091601938939911-127.0.0.1:60588_solr-n_0000000000) [n:127.0.0.1:60588_solr    ] o.a.s.c.Overseer processMessage: queueSize: 1, message = {
   [junit4]   2>   "operation":"downnode",
   [junit4]   2>   "node_name":"127.0.0.1:60588_solr"} current state version: 0
   [junit4]   2> 356192 DEBUG (OverseerStateUpdate-72091601938939911-127.0.0.1:60588_solr-n_0000000000) [n:127.0.0.1:60588_solr    ] o.a.s.c.o.NodeMutator DownNode state invoked for node: 127.0.0.1:60588_solr
   [junit4]   2> 356194 DEBUG (OverseerAutoScalingTriggerThread-72091601938939911-127.0.0.1:60588_solr-n_0000000000) [    ] o.a.s.c.a.NodeLostTrigger NodeLostTrigger .auto_add_replicas - Initial livenodes: [127.0.0.1:60600_solr]
   [junit4]   2> 356194 DEBUG (OverseerAutoScalingTriggerThread-72091601938939911-127.0.0.1:60588_solr-n_0000000000) [    ] o.a.s.c.a.OverseerTriggerThread -- clean old nodeAdded markers
   [junit4]   2> 356194 DEBUG (OverseerAutoScalingTriggerThread-72091601938939911-127.0.0.1:60588_solr-n_0000000000) [    ] o.a.s.c.a.OverseerTriggerThread Current znodeVersion 1, lastZnodeVersion 1
   [junit4]   2> 356208 INFO  (jetty-launcher-867-thread-3) [n:127.0.0.1:60588_solr    ] o.a.s.h.a.MetricsHistoryHandler No .system collection, keeping metrics history in memory.
   [junit4]   2> 356228 DEBUG (SyncThread:0) [    ] o.a.s.c.ZkTestServer Watch added: children: /solr/autoscaling/events/.scheduled_maintenance
   [junit4]   2> 356228 DEBUG (SyncThread:0) [    ] o.a.s.c.ZkTestServer Watch added: children: /solr/autoscaling/events/.auto_add_replicas
   [junit4]   2> 356231 INFO  (zkConnectionManagerCallback-905-thread-1) [    ] o.a.s.c.c.ConnectionManager zkClient has connected
   [junit4]   2> 356231 DEBUG (ScheduledTrigger-1530-thread-1) [    ] o.a.s.c.a.NodeLostTrigger Running NodeLostTrigger: .auto_add_replicas with currently live nodes: 1
   [junit4]   2> 356231 INFO  (zkConnectionManagerCallback-909-thread-1) [    ] o.a.s.c.c.ConnectionManager zkClient has connected
   [junit4]   2> 356239 INFO  (jetty-launcher-867-thread-3) [n:127.0.0.1:60588_solr    ] o.a.s.m.r.SolrJmxReporter JMX monitoring for 'solr_60588.solr.node' (registry 'solr.node') enabled at server: com.sun.jmx.mbeanserver.JmxMBeanServer@24587c08
   [junit4]   2> 356244 INFO  (jetty-launcher-867-thread-3) [n:127.0.0.1:60588_solr    ] o.a.s.m.r.SolrJmxReporter JMX monitoring for 'solr_60588.solr.jvm' (registry 'solr.jvm') enabled at server: com.sun.jmx.mbeanserver.JmxMBeanServer@24587c08
   [junit4]   2> 356244 INFO  (jetty-launcher-867-thread-3) [n:127.0.0.1:60588_solr    ] o.a.s.m.r.SolrJmxReporter JMX monitoring for 'solr_60588.solr.jetty' (registry 'solr.jetty') enabled at server: com.sun.jmx.mbeanserver.JmxMBeanServer@24587c08
   [junit4]   2> 356245 DEBUG (SyncThread:0) [    ] o.a.s.c.ZkTestServer Watch added: children: /solr/live_nodes
   [junit4]   2> 356245 INFO  (jetty-launcher-867-thread-3) [n:127.0.0.1:60588_solr    ] o.a.s.c.CorePropertiesLocator Found 0 core definitions underneath C:\Users\jenkins\workspace\Lucene-Solr-master-Windows\solr\build\solr-core\test\J1\temp\solr.cloud.AddReplicaTest_5FA49BAF0BD869F3-001\tempDir-001\node3\.
   [junit4]   2> 356246 INFO  (zkCallback-896-thread-1) [    ] o.a.s.c.c.ZkStateReader Updated live nodes from ZooKeeper... (1) -> (2)
   [junit4]   2> 356247 INFO  (zkConnectionManagerCallback-914-thread-1) [    ] o.a.s.c.c.ConnectionManager zkClient has connected
   [junit4]   2> 356251 DEBUG (jetty-launcher-867-thread-4) [n:127.0.0.1:60591_solr    ] o.a.s.c.ZkController Added new OnReconnect listener org.apache.solr.cloud.ZkController$$Lambda$436/2075809341@48fc314b
   [junit4]   2> 356251 DEBUG (SyncThread:0) [    ] o.a.s.c.ZkTestServer Watch added: create/delete: /solr/clusterprops.json
   [junit4]   2> 356252 DEBUG (SyncThread:0) [    ] o.a.s.c.ZkTestServer Watch added: children: /solr/live_nodes
   [junit4]   2> 356252 INFO  (jetty-launcher-867-thread-1) [n:127.0.0.1:60600_solr    ] o.a.s.c.c.ZkStateReader Updated live nodes from ZooKeeper... (0) -> (2)
   [junit4]   2> 356253 DEBUG (SyncThread:0) [    ] o.a.s.c.ZkTestServer Watch added: data: /solr/clusterstate.json
   [junit4]   2> 356253 DEBUG (SyncThread:0) [    ] o.a.s.c.ZkTestServer Watch added: children: /solr/collections
   [junit4]   2> 356254 DEBUG (SyncThread:0) [    ] o.a.s.c.ZkTestServer Watch added: create/delete: /solr/aliases.json
   [junit4]   2> 356254 INFO  (jetty-launcher-867-thread-1) [n:127.0.0.1:60600_solr    ] o.a.s.c.s.i.ZkClientClusterStateProvider Cluster at 127.0.0.1:60581/solr ready
   [junit4]   2> 356255 INFO  (jetty-launcher-867-thread-1) [n:127.0.0.1:60600_solr    ] o.a.s.h.a.MetricsHistoryHandler No .system collection, keeping metrics history in memory.
   [junit4]   2> 356272 DEBUG (SyncThread:0) [    ] o.a.s.c.ZkTestServer Watch added: create/delete: /solr/clusterprops.json
   [junit4]   2> 356272 DEBUG (SyncThread:0) [    ] o.a.s.c.ZkTestServer Watch added: children: /solr/live_nodes
   [junit4]   2> 356273 INFO  (jetty-launcher-867-thread-2) [n:127.0.0.1:60585_solr    ] o.a.s.c.c.ZkStateReader Updated live nodes from ZooKeeper... (0) -> (2)
   [junit4]   2> 356273 DEBUG (SyncThread:0) [    ] o.a.s.c.ZkTestServer Watch added: data: /solr/clusterstate.json
   [junit4]   2> 356273 DEBUG (SyncThread:0) [    ] o.a.s.c.ZkTestServer Watch added: children: /solr/collections
   [junit4]   2> 356274 DEBUG (SyncThread:0) [    ] o.a.s.c.ZkTestServer Watch added: create/delete: /solr/aliases.json
   [junit4]   2> 356274 DEBUG (SyncThread:0) [    ] o.a.s.c.ZkTestServer Watch added: create/delete: /solr/security.json
   [junit4]   2> 356275 DEBUG (jetty-launcher-867-thread-2) [n:127.0.0.1:60585_solr    ] o.a.s.c.LeaderElector Joined leadership election with path: /overseer_elect/election/72091601938939916-127.0.0.1:60585_solr-n_0000000002
   [junit4]   2> 356275 DEBUG (SyncThread:0) [    ] o.a.s.c.ZkTestServer Watch added: data: /solr/overseer_elect/election/72091601938939912-127.0.0.1:60600_solr-n_0000000001
   [junit4]   2> 356276 DEBUG (jetty-launcher-867-thread-2) [n:127.0.0.1:60585_solr    ] o.a.s.c.LeaderElector Watching path /overseer_elect/election/72091601938939912-127.0.0.1:60600_solr-n_0000000001 to know if I could be the leader
   [junit4]   2> 356276 DEBUG (jetty-launcher-867-thread-2) [n:127.0.0.1:60585_solr    ] o.a.s.c.ZkController Publish node=127.0.0.1:60585_solr as DOWN
   [junit4]   2> 356276 DEBUG (SyncThread:0) [    ] o.a.s.c.ZkTestServer Watch fired: children: /solr/overseer/queue
   [junit4]   2> 356277 INFO  (jetty-launcher-867-thread-2) [n:127.0.0.1:60585_solr    ] o.a.s.c.TransientSolrCoreCacheDefault Allocating transient cache for 2147483647 transient cores
   [junit4]   2> 356277 INFO  (jetty-launcher-867-thread-2) [n:127.0.0.1:60585_solr    ] o.a.s.c.ZkController Register node as live in ZooKeeper:/live_nodes/127.0.0.1:60585_solr
   [junit4]   2> 356277 INFO  (jetty-launcher-867-thread-1) [n:127.0.0.1:60600_solr    ] o.a.s.m.r.SolrJmxReporter JMX monitoring for 'solr_60600.solr.node' (registry 'solr.node') enabled at server: com.sun.jmx.mbeanserver.JmxMBeanServer@24587c08
   [junit4]   2> 356278 DEBUG (SyncThread:0) [    ] o.a.s.c.ZkTestServer Watch added: children: /solr/overseer/queue
   [junit4]   2> 356279 DEBUG (SyncThread:0) [    ] o.a.s.c.ZkTestServer Watch fired: children: /solr/live_nodes
   [junit4]   2> 356279 DEBUG (SyncThread:0) [    ] o.a.s.c.ZkTestServer Watch fired: children: /solr/live_nodes
   [junit4]   2> 356279 DEBUG (SyncThread:0) [    ] o.a.s.c.ZkTestServer Watch fired: children: /solr/live_nodes
   [junit4]   2> 356279 DEBUG (SyncThread:0) [    ] o.a.s.c.ZkTestServer Watch fired: children: /solr/live_nodes
   [junit4]   2> 356279 DEBUG (SyncThread:0) [    ] o.a.s.c.ZkTestServer Watch fired: children: /solr/live_nodes
   [junit4]   2> 356283 INFO  (jetty-launcher-867-thread-1) [n:127.0.0.1:60600_solr    ] o.a.s.m.r.SolrJmxReporter JMX monitoring for 'solr_60600.solr.jvm' (registry 'solr.jvm') enabled at server: com.sun.jmx.mbeanserver.JmxMBeanServer@24587c08
   [junit4]   2> 356283 INFO  (jetty-launcher-867-thread-1) [n:127.0.0.1:60600_solr    ] o.a.s.m.r.SolrJmxReporter JMX monitoring for 'solr_60600.solr.jetty' (registry 'solr.jetty') enabled at server: com.sun.jmx.mbeanserver.JmxMBeanServer@24587c08
   [junit4]   2> 356284 DEBUG (OverseerStateUpdate-72091601938939911-127.0.0.1:60588_solr-n_0000000000) [n:127.0.0.1:60588_solr    ] o.a.s.c.Overseer processMessage: queueSize: 2, message = {
   [junit4]   2>   "operation":"downnode",
   [junit4]   2>   "node_name":"127.0.0.1:60585_solr"} current state version: 0
   [junit4]   2> 356284 DEBUG (OverseerStateUpdate-72091601938939911-127.0.0.1:60588_solr-n_0000000000) [n:127.0.0.1:60588_solr    ] o.a.s.c.o.NodeMutator DownNode state invoked for node: 127.0.0.1:60585_solr
   [junit4]   2> 356284 INFO  (jetty-launcher-867-thread-1) [n:127.0.0.1:60600_solr    ] o.a.s.c.CorePropertiesLocator Found 0 core definitions underneath C:\Users\jenkins\workspace\Lucene-Solr-master-Windows\solr\build\solr-core\test\J1\temp\solr.cloud.AddReplicaTest_5FA49BAF0BD869F3-001\tempDir-001\node1\.
   [junit4]   2> 356284 DEBUG (SyncThread:0) [    ] o.a.s.c.ZkTestServer Watch added: children: /solr/live_nodes
   [junit4]   2> 356284 DEBUG (SyncThread:0) [    ] o.a.s.c.ZkTestServer Watch added: children: /solr/live_nodes
   [junit4]   2> 356284 DEBUG (SyncThread:0) [    ] o.a.s.c.ZkTestServer Watch added: children: /solr/live_nodes
   [junit4]   2> 356284 INFO  (zkCallback-889-thread-1) [    ] o.a.s.c.c.ZkStateReader Updated live nodes from ZooKeeper... (2) -> (3)
   [junit4]   2> 356284 INFO  (zkCallback-887-thread-1) [    ] o.a.s.c.c.ZkStateReader Updated live nodes from ZooKeeper... (2) -> (3)
   [junit4]   2> 356285 INFO  (zkCallback-896-thread-1) [    ] o.a.s.c.c.ZkStateReader Updated live nodes from ZooKeeper... (2) -> (3)
   [junit4]   2> 356285 INFO  (zkConnectionManagerCallback-917-thread-1) [    ] o.a.s.c.c.ConnectionManager zkClient has connected
   [junit4]   2> 356290 DEBUG (SyncThread:0) [    ] o.a.s.c.ZkTestServer Watch added: children: /solr/live_nodes
   [junit4]   2> 356290 INFO  (zkCallback-913-thread-1) [    ] o.a.s.c.c.ZkStateReader Updated live nodes from ZooKeeper... (2) -> (3)
   [junit4]   2> 356291 DEBUG (SyncThread:0) [    ] o.a.s.c.ZkTestServer Watch added: children: /solr/live_nodes
   [junit4]   2> 356291 INFO  (zkCallback-904-thread-1) [    ] o.a.s.c.c.ZkStateReader Updated live nodes from ZooKeeper... (2) -> (3)
   [junit4]   2> 356295 DEBUG (SyncThread:0) [    ] o.a.s.c.ZkTestServer Watch added: create/delete: /solr/clusterprops.json
   [junit4]   2> 356295 DEBUG (SyncThread:0) [    ] o.a.s.c.ZkTestServer Watch added: children: /solr/live_nodes
   [junit4]   2> 356295 INFO  (jetty-launcher-867-thread-4) [n:127.0.0.1:60591_solr    ] o.a.s.c.c.ZkStateReader Updated live nodes from ZooKeeper... (0) -> (3)
   [junit4]   2> 356295 DEBUG (SyncThread:0) [    ] o.a.s.c.ZkTestServer Watch added: data: /solr/clusterstate.json
   [junit4]   2> 356295 DEBUG (SyncThread:0) [    ] o.a.s.c.ZkTestServer Watch added: children: /solr/collections
   [junit4]   2> 356295 DEBUG (SyncThread:0) [    ] o.a.s.c.ZkTestServer Watch added: create/delete: /solr/aliases.json
   [junit4]   2> 356296 DEBUG (SyncThread:0) [    ] o.a.s.c.ZkTestServer Watch added: create/delete: /solr/security.json
   [junit4]   2> 356298 DEBUG (jetty-launcher-867-thread-4) [n:127.0.0.1:60591_solr    ] o.a.s.c.LeaderElector Joined leadership election with path: /overseer_elect/election/72091601938939918-127.0.0.1:60591_solr-n_0000000003
   [junit4]   2> 356298 DEBUG (SyncThread:0) [    ] o.a.s.c.ZkTestServer Watch added: data: /solr/overseer_elect/election/72091601938939916-127.0.0.1:60585_solr-n_0000000002
   [junit4]   2> 356298 DEBUG (jetty-launcher-867-thread-4) [n:127.0.0.1:60591_solr    ] o.a.s.c.LeaderElector Watching path /overseer_elect/election/72091601938939916-127.0.0.1:60585_solr-n_0000000002 to know if I could be the leader
   [junit4]   2> 356298 DEBUG (jetty-launcher-867-thread-4) [n:127.0.0.1:60591_solr    ] o.a.s.c.ZkController Publish node=127.0.0.1:60591_solr as DOWN
   [junit4]   2> 356299 DEBUG (SyncThread:0) [    ] o.a.s.c.ZkTestServer Watch fired: children: /solr/overseer/queue
   [junit4]   2> 356299 INFO  (jetty-launcher-867-thread-4) [n:127.0.0.1:60591_solr    ] o.a.s.c.TransientSolrCoreCacheDefault Allocating transient cache for 2147483647 transient cores
   [junit4]   2> 356299 INFO  (jetty-launcher-867-thread-4) [n:127.0.0.1:60591_solr    ] o.a.s.c.ZkController Register node as live in ZooKeeper:/live_nodes/127.0.0.1:60591_solr
   [junit4]   2> 356300 DEBUG (SyncThread:0) [    ] o.a.s.c.ZkTestServer Watch added: children: /solr/overseer/queue
   [junit4]   2> 356301 DEBUG (SyncThread:0) [    ] o.a.s.c.ZkTestServer Watch fired: children: /solr/live_nodes
   [junit4]   2> 356301 DEBUG (SyncThread:0) [    ] o.a.s.c.ZkTestServer Watch fired: children: /solr/live_nodes
   [junit4]   2> 356301 DEBUG (SyncThread:0) [    ] o.a.s.c.ZkTestServer Watch fired: children: /solr/live_nodes
   [junit4]   2> 356301 DEBUG (SyncThread:0) [    ] o.a.s.c.ZkTestServer Watch fired: children: /solr/live_nodes
   [junit4]   2> 356301 DEBUG (SyncThread:0) [    ] o.a.s.c.ZkTestServer Watch fired: children: /solr/live_nodes
   [junit4]   2> 356301 DEBUG (SyncThread:0) [    ] o.a.s.c.ZkTestServer Watch fired: children: /solr/live_nodes
   [junit4]   2> 356309 DEBUG (OverseerStateUpdate-72091601938939911-127.0.0.1:60588_solr-n_0000000000) [n:127.0.0.1:60588_solr    ] o.a.s.c.Overseer processMessage: queueSize: 3, message = {
   [junit4]   2>   "operation":"downnode",
   [junit4]   2>   "node_name":"127.0.0.1:60591_solr"} current state version: 0
   [junit4]   2> 356309 DEBUG (OverseerStateUpdate-72091601938939911-127.0.0.1:60588_solr-n_0000000000) [n:127.0.0.1:60588_solr    ] o.a.s.c.o.NodeMutator DownNode state invoked for node: 127.0.0.1:60591_solr
   [junit4]   2> 356309 DEBUG (SyncThread:0) [    ] o.a.s.c.ZkTestServer Watch added: children: /solr/live_nodes
   [junit4]   2> 356309 DEBUG (SyncThread:0) [    ] o.a.s.c.ZkTestServer Watch added: children: /solr/live_nodes
   [junit4]   2> 356309 DEBUG (SyncThread:0) [    ] o.a.s.c.ZkTestServer Watch added: children: /solr/live_nodes
   [junit4]   2> 356309 DEBUG (SyncThread:0) [    ] o.a.s.c.ZkTestServer Watch added: children: /solr/live_nodes
   [junit4]   2> 356309 DEBUG (SyncThread:0) [    ] o.a.s.c.ZkTestServer Watch added: children: /solr/live_nodes
   [junit4]   2> 356309 INFO  (zkCallback-913-thread-1) [    ] o.a.s.c.c.ZkStateReader Updated live nodes from ZooKeeper... (3) -> (4)
   [junit4]   2> 356309 INFO  (zkCallback-889-thread-1) [    ] o.a.s.c.c.ZkStateReader Updated live nodes from ZooKeeper... (3) -> (4)
   [junit4]   2> 356309 INFO  (zkCallback-887-thread-1) [    ] o.a.s.c.c.ZkStateReader Updated live nodes from ZooKeeper... (3) -> (4)
   [junit4]   2> 356309 INFO  (zkCallback-896-thread-1) [    ] o.a.s.c.c.ZkStateReader Updated live nodes from ZooKeeper... (3) -> (4)
   [junit4]   2> 356309 INFO  (zkCallback-904-thread-1) [    ] o.a.s.c.c.ZkStateReader Updated live nodes from ZooKeeper... (3) -> (4)
   [junit4]   2> 356311 DEBUG (SyncThread:0) [    ] o.a.s.c.ZkTestServer Watch added: children: /solr/live_nodes
   [junit4]   2> 356311 INFO  (zkCallback-916-thread-1) [    ] o.a.s.c.c.ZkStateReader Updated live nodes from ZooKeeper... (3) -> (4)
   [junit4]   2> 356315 INFO  (zkConnectionManagerCallback-927-thread-1) [    ] o.a.s.c.c.ConnectionManager zkClient has connected
   [junit4]   2> 356316 DEBUG (SyncThread:0) [    ] o.a.s.c.ZkTestServer Watch added: create/delete: /solr/clusterprops.json
   [junit4]   2> 356316 DEBUG (SyncThread:0) [    ] o.a.s.c.ZkTestServer Watch added: children: /solr/live_nodes
   [junit4]   2> 356316 INFO  (jetty-launcher-867-thread-2) [n:127.0.0.1:60585_solr    ] o.a.s.c.c.ZkStateReader Updated live nodes from ZooKeeper... (0) -> (4)
   [junit4]   2> 356316 DEBUG (SyncThread:0) [    ] o.a.s.c.ZkTestServer Watch added: data: /solr/clusterstate.json
   [junit4]   2> 356316 DEBUG (SyncThread:0) [    ] o.a.s.c.ZkTestServer Watch added: children: /solr/collections
   [junit4]   2> 356316 DEBUG (SyncThread:0) [    ] o.a.s.c.ZkTestServer Watch added: create/delete: /solr/aliases.json
   [junit4]   2> 356317 INFO  (jetty-launcher-867-thread-2) [n:127.0.0.1:60585_solr    ] o.a.s.c.s.i.ZkClientClusterStateProvider Cluster at 127.0.0.1:60581/solr ready
   [junit4]   2> 356317 INFO  (jetty-launcher-867-thread-2) [n:127.0.0.1:60585_solr    ] o.a.s.h.a.MetricsHistoryHandler No .system collection, keeping metrics history in memory.
   [junit4]   2> 356329 INFO  (zkConnectionManagerCallback-933-thread-1) [    ] o.a.s.c.c.ConnectionManager zkClient has connected
   [junit4]   2> 356330 DEBUG (SyncThread:0) [    ] o.a.s.c.ZkTestServer Watch added: create/delete: /solr/clusterprops.json
   [junit4]   2> 356330 DEBUG (SyncThread:0) [    ] o.a.s.c.ZkTestServer Watch added: children: /solr/live_nodes
   [junit4]   2> 356330 INFO  (jetty-launcher-867-thread-4) [n:127.0.0.1:60591_solr    ] o.a.s.c.c.ZkStateReader Updated live nodes from ZooKeeper... (0) -> (4)
   [junit4]   2> 356330 DEBUG (SyncThread:0) [    ] o.a.s.c.ZkTestServer Watch added: data: /solr/clusterstate.json
   [junit4]   2> 356331 DEBUG (SyncThread:0) [    ] o.a.s.c.ZkTestServer Watch added: children: /solr/collections
   [junit4]   2> 356331 DEBUG (SyncThread:0) [    ] o.a.s.c.ZkTestServer Watch added: create/delete: /solr/aliases.json
   [junit4]   2> 356331 INFO  (jetty-launcher-867-thread-2) [n:127.0.0.1:60585_solr    ] o.a.s.m.r.SolrJmxReporter JMX monitoring for 'solr_60585.solr.node' (registry 'solr.node') enabled at server: com.sun.jmx.mbeanserver.JmxMBeanServer@24587c08
   [junit4]   2> 356331 INFO  (jetty-launcher-867-thread-4) [n:127.0.0.1:60591_solr    ] o.a.s.c.s.i.ZkClientClusterStateProvider Cluster at 127.0.0.1:60581/solr ready
   [junit4]   2> 356332 INFO  (jetty-launcher-867-thread-4) [n:127.0.0.1:60591_solr    ] o.a.s.h.a.MetricsHistoryHandler No .system collection, keeping metrics history in memory.
   [junit4]   2> 356336 INFO  (jetty-launcher-867-thread-2) [n:127.0.0.1:60585_solr    ] o.a.s.m.r.SolrJmxReporter JMX monitoring for 'solr_60585.solr.jvm' (registry 'solr.jvm') enabled at server: com.sun.jmx.mbeanserver.JmxMBeanServer@24587c08
   [junit4]   2> 356336 INFO  (jetty-launcher-867-thread-2) [n:127.0.0.1:60585_solr    ] o.a.s.m.r.SolrJmxReporter JMX monitoring for 'solr_60585.solr.jetty' (registry 'solr.jetty') enabled at server: com.sun.jmx.mbeanserver.JmxMBeanServer@24587c08
   [junit4]   2> 356338 INFO  (jetty-launcher-867-thread-2) [n:127.0.0.1:60585_solr    ] o.a.s.c.CorePropertiesLocator Found 0 core definitions underneath C:\Users\jenkins\workspace\Lucene-Solr-master-Windows\solr\build\solr-core\test\J1\temp\solr.cloud.AddReplicaTest_5FA49BAF0BD869F3-001\tempDir-001\node2\.
   [junit4]   2> 356346 INFO  (jetty-launcher-867-thread-4) [n:127.0.0.1:60591_solr    ] o.a.s.m.r.SolrJmxReporter JMX monitoring for 'solr_60591.solr.node' (registry 'solr.node') enabled at server: com.sun.jmx.mbeanserver.JmxMBeanServer@24587c08
   [junit4]   2> 356352 INFO  (jetty-launcher-867-thread-4) [n:127.0.0.1:60591_solr    ] o.a.s.m.r.SolrJmxReporter JMX monitoring for 'solr_60591.solr.jvm' (registry 'solr.jvm') enabled at server: com.sun.jmx.mbeanserver.JmxMBeanServer@24587c08
   [junit4]   2> 356352 INFO  (jetty-launcher-867-thread-4) [n:127.0.0.1:60591_solr    ] o.a.s.m.r.SolrJmxReporter JMX monitoring for 'solr_60591.solr.jetty' (registry 'solr.jetty') enabled at server: com.sun.jmx.mbeanserver.JmxMBeanServer@24587c08
   [junit4]   2> 356353 INFO  (jetty-launcher-867-thread-4) [n:127.0.0.1:60591_solr    ] o.a.s.c.CorePropertiesLocator Found 0 core definitions underneath C:\Users\jenkins\workspace\Lucene-Solr-master-Windows\solr\build\solr-core\test\J1\temp\solr.cloud.AddReplicaTest_5FA49BAF0BD869F3-001\tempDir-001\node4\.
   [junit4]   2> 356410 DEBUG (SyncThread:0) [    ] o.a.s.c.ZkTestServer Watch fired: children: /solr/overseer/queue
   [junit4]   2> 356411 DEBUG (SyncThread:0) [    ] o.a.s.c.ZkTestServer Watch added: children: /solr/overseer/queue
   [junit4]   2> 356416 INFO  (zkConnectionManagerCallback-936-thread-1) [    ] o.a.s.c.c.ConnectionManager zkClient has connected
   [junit4]   2> 356422 INFO  (zkConnectionManagerCallback-941-thread-1) [    ] o.a.s.c.c.ConnectionManager zkClient has connected
   [junit4]   2> 356424 DEBUG (SyncThread:0) [    ] o.a.s.c.ZkTestServer Watch added: create/delete: /solr/clusterprops.json
   [junit4]   2> 356424 DEBUG (SyncThread:0) [    ] o.a.s.c.ZkTestServer Watch added: children: /solr/live_nodes
   [junit4]   2> 356425 INFO  (SUITE-AddReplicaTest-seed#[5FA49BAF0BD869F3]-worker) [    ] o.a.s.c.c.ZkStateReader Updated live nodes from ZooKeeper... (0) -> (4)
   [junit4]   2> 356425 DEBUG (SyncThread:0) [    ] o.a.s.c.ZkTestServer Watch added: data: /solr/clusterstate.json
   [junit4]   2> 356425 DEBUG (SyncThread:0) [    ] o.a.s.c.ZkTestServer Watch added: children: /solr/collections
   [junit4]   2> 356426 DEBUG (SyncThread:0) [    ] o.a.s.c.ZkTestServer Watch added: create/delete: /solr/aliases.json
   [junit4]   2> 356426 INFO  (SUITE-AddReplicaTest-seed#[5FA49BAF0BD869F3]-worker) [    ] o.a.s.c.s.i.ZkClientClusterStateProvider Cluster at 127.0.0.1:60581/solr ready
   [junit4]   2> 356464 INFO  (TEST-AddReplicaTest.test-seed#[5FA49BAF0BD869F3]) [    ] o.a.s.SolrTestCaseJ4 ###Starting test
   [junit4]   2> 356465 DEBUG (SyncThread:0) [    ] o.a.s.c.ZkTestServer Watch added: create/delete: /solr/clusterprops.json
   [junit4]   2> 356465 DEBUG (SyncThread:0) [    ] o.a.s.c.ZkTestServer Watch added: children: /solr/live_nodes
   [junit4]   2> 356465 INFO  (TEST-AddReplicaTest.test-seed#[5FA49BAF0BD869F3]) [    ] o.a.s.c.c.ZkStateReader Updated live nodes from ZooKeeper... (0) -> (4)
   [junit4]   2> 356465 DEBUG (SyncThread:0) [    ] o.a.s.c.ZkTestServer Watch added: data: /solr/clusterstate.json
   [junit4]   2> 356466 DEBUG (SyncThread:0) [    ] o.a.s.c.ZkTestServer Watch added: children: /solr/collections
   [junit4]   2> 356466 DEBUG (SyncThread:0) [    ] o.a.s.c.ZkTestServer Watch added: create/delete: /solr/aliases.json
   [junit4]   2> 356468 DEBUG (SyncThread:0) [    ] o.a.s.c.ZkTestServer Watch fired: data: /solr/aliases.json
   [junit4]   2> 356468 DEBUG (SyncThread:0) [    ] o.a.s.c.ZkTestServer Watch fired: data: /solr/aliases.json
   [junit4]   2> 356468 DEBUG (SyncThread:0) [    ] o.a.s.c.ZkTestServer Watch fired: data: /solr/aliases.json
   [junit4]   2> 356468 DEBUG (SyncThread:0) [    ] o.a.s.c.ZkTestServer Watch fired: data: /solr/aliases.json
   [junit4]   2> 356468 DEBUG (SyncThread:0) [    ] o.a.s.c.ZkTestServer Watch fired: data: /solr/aliases.json
   [junit4]   2> 356468 DEBUG (SyncThread:0) [    ] o.a.s.c.ZkTestServer Watch fired: data: /solr/aliases.json
   [junit4]   2> 356468 DEBUG (SyncThread:0) [    ] o.a.s.c.ZkTestServer Watch fired: data: /solr/aliases.json
   [junit4]   2> 356468 DEBUG (SyncThread:0) [    ] o.a.s.c.ZkTestServer Watch fired: data: /solr/aliases.json
   [junit4]   2> 356468 DEBUG (SyncThread:0) [    ] o.a.s.c.ZkTestServer Watch fired: data: /solr/aliases.json
   [junit4]   2> 356471 DEBUG (SyncThread:0) [    ] o.a.s.c.ZkTestServer Watch added: data: /solr/aliases.json
   [junit4]   2> 356472 DEBUG (SyncThread:0) [    ] o.a.s.c.ZkTestServer Watch added: data: /solr/aliases.json
   [junit4]   2> 356472 DEBUG (SyncThread:0) [    ] o.a.s.c.ZkTestServer Watch added: data: /solr/aliases.json
   [junit4]   2> 356472 DEBUG (SyncThread:0) [    ] o.a.s.c.ZkTestServer Watch added: data: /solr/aliases.json
   [junit4]   2> 356472 DEBUG (SyncThread:0) [    ] o.a.s.c.ZkTestServer Watch added: data: /solr/aliases.json
   [junit4]   2> 356472 DEBUG (SyncThread:0) [    ] o.a.s.c.ZkTestServer Watch added: data: /solr/aliases.json
   [junit4]   2> 356473 DEBUG (SyncThread:0) [    ] o.a.s.c.ZkTestServer Watch added: data: /solr/aliases.json
   [junit4]   2> 356473 DEBUG (SyncThread:0) [    ] o.a.s.c.ZkTestServer Watch added: data: /solr/aliases.json
   [junit4]   2> 356474 DEBUG (SyncThread:0) [    ] o.a.s.c.ZkTestServer Watch added: data: /solr/aliases.json
   [junit4]   2> 356474 DEBUG (SyncThread:0) [    ] o.a.s.c.ZkTestServer Watch added: data: /solr/aliases.json
   [junit4]   2> 356475 INFO  (zkConnectionManagerCallback-945-thread-1) [    ] o.a.s.c.c.ConnectionManager zkClient has connected
   [junit4]   2> 356480 INFO  (qtp232254105-3460) [n:127.0.0.1:60585_solr    ] o.a.s.h.a.CollectionsHandler Invoked Collection Action :create with params collection.configName=conf1&maxShardsPerNode=2&name=addreplicatest_coll&nrtReplicas=1&action=CREATE&numShards=2&wt=javabin&version=2 and sendToOCPQueue=true
   [junit4]   2> 356482 DEBUG (SyncThread:0) [    ] o.a.s.c.ZkTestServer Watch fired: children: /solr/overseer/collection-queue-work
   [junit4]   2> 356482 DEBUG (SyncThread:0) [    ] o.a.s.c.ZkTestServer Watch added: children: /solr/overseer/collection-queue-work
   [junit4]   2> 356482 DEBUG (SyncThread:0) [    ] o.a.s.c.ZkTestServer Watch added: create/delete: /solr/overseer/collection-queue-work/qnr-0000000000
   [junit4]   2> 356482 DEBUG (OverseerCollectionConfigSetProcessor-72091601938939911-127.0.0.1:60588_solr-n_0000000000) [n:127.0.0.1:60588_solr    ] o.a.s.c.ZkDistributedQueue Found child node with improper name: qnr-0000000000
   [junit4]   2> 356482 DEBUG (SyncThread:0) [    ] o.a.s.c.ZkTestServer Watch fired: children: /solr/overseer/collection-queue-work
   [junit4]   2> 356483 DEBUG (SyncThread:0) [    ] o.a.s.c.ZkTestServer Watch added: children: /solr/overseer/collection-queue-work
   [junit4]   2> 356483 DEBUG (OverseerCollectionConfigSetProcessor-72091601938939911-127.0.0.1:60588_solr-n_0000000000) [n:127.0.0.1:60588_solr    ] o.a.s.c.ZkDistributedQueue Found child node with improper name: qnr-0000000000
   [junit4]   2> 356483 DEBUG (OverseerCollectionConfigSetProcessor-72091601938939911-127.0.0.1:60588_solr-n_0000000000) [n:127.0.0.1:60588_solr    ] o.a.s.c.OverseerTaskQueue Returning topN elements: [/overseer/collection-queue-work/qn-0000000000, ]
   [junit4]   2> 356483 DEBUG (OverseerCollectionConfigSetProcessor-72091601938939911-127.0.0.1:60588_solr-n_0000000000) [n:127.0.0.1:60588_solr    ] o.a.s.c.OverseerTaskProcessor Got 1 tasks from work-queue : [[org.apache.solr.cloud.OverseerTaskQueue$QueueEvent@2e684ecf]]
   [junit4]   2> 356483 DEBUG (OverseerCollectionConfigSetProcessor-72091601938939911-127.0.0.1:60588_solr-n_0000000000) [n:127.0.0.1:60588_solr    ] o.a.s.c.OverseerTaskProcessor Marked task [/overseer/collection-queue-work/qn-0000000000] as running
   [junit4]   2> 356483 DEBUG (OverseerCollectionConfigSetProcessor-72091601938939911-127.0.0.1:60588_solr-n_0000000000) [n:127.0.0.1:60588_solr    ] o.a.s.c.OverseerTaskProcessor Overseer Collection Message Handler: Get the message id:/overseer/collection-queue-work/qn-0000000000 message:{
   [junit4]   2>   "name":"addreplicatest_coll",
   [junit4]   2>   "fromApi":"true",
   [junit4]   2>   "collection.configName":"conf1",
   [junit4]   2>   "numShards":"2",
   [junit4]   2>   "maxShardsPerNode":"2",
   [junit4]   2>   "nrtReplicas":"1",
   [junit4]   2>   "stateFormat":"2",
   [junit4]   2>   "replicationFactor":"1",
   [junit4]   2>   "operation":"create"}
   [junit4]   2> 356484 DEBUG (OverseerCollectionConfigSetProcessor-72091601938939911-127.0.0.1:60588_solr-n_0000000000) [n:127.0.0.1:60588_solr    ] o.a.s.c.OverseerTaskProcessor Cleaning up work-queue. #Running tasks: 1
   [junit4]   2> 356484 DEBUG (OverseerCollectionConfigSetProcessor-72091601938939911-127.0.0.1:60588_solr-n_0000000000) [n:127.0.0.1:60588_solr    ] o.a.s.c.OverseerTaskProcessor RunningTasks: [/overseer/collection-queue-work/qn-0000000000]
   [junit4]   2> 356484 DEBUG (OverseerCollectionConfigSetProcessor-72091601938939911-127.0.0.1:60588_solr-n_0000000000) [n:127.0.0.1:60588_solr    ] o.a.s.c.OverseerTaskProcessor BlockedTasks: []
   [junit4]   2> 356484 DEBUG (OverseerCollectionConfigSetProcessor-72091601938939911-127.0.0.1:60588_solr-n_0000000000) [n:127.0.0.1:60588_solr    ] o.a.s.c.OverseerTaskProcessor CompletedTasks: []
   [junit4]   2> 356484 DEBUG (OverseerCollectionConfigSetProcessor-72091601938939911-127.0.0.1:60588_solr-n_0000000000) [n:127.0.0.1:60588_solr    ] o.a.s.c.OverseerTaskProcessor RunningZKTasks: [/overseer/collection-queue-work/qn-0000000000]
   [junit4]   2> 356484 DEBUG (OverseerCollectionConfigSetProcessor-72091601938939911-127.0.0.1:60588_solr-n_0000000000) [n:127.0.0.1:60588_solr    ] o.a.s.c.OverseerTaskQueue Peeking for top 99 elements. ExcludeSet: [/overseer/collection-queue-work/qn-0000000000],[]
   [junit4]   2> 356484 DEBUG (OverseerThreadFactory-1535-thread-1-processing-n:127.0.0.1:60588_solr) [n:127.0.0.1:60588_solr    ] o.a.s.c.OverseerTaskProcessor Runner processing /overseer/collection-queue-work/qn-0000000000
   [junit4]   2> 356484 DEBUG (OverseerThreadFactory-1535-thread-1-processing-n:127.0.0.1:60588_solr) [n:127.0.0.1:60588_solr    ] o.a.s.c.a.c.OverseerCollectionMessageHandler OverseerCollectionMessageHandler.processMessage : create , {
   [junit4]   2>   "name":"addreplicatest_coll",
   [junit4]   2>   "fromApi":"true",
   [junit4]   2>   "collection.configName":"conf1",
   [junit4]   2>   "numShards":"2",
   [junit4]   2>   "maxShardsPerNode":"2",
   [junit4]   2>   "nrtReplicas":"1",
   [junit4]   2>   "stateFormat":"2",
   [junit4]   2>   "replicationFactor":"1",
   [junit4]   2>   "operation":"create"}
   [junit4]   2> 356484 INFO  (OverseerThreadFactory-1535-thread-1-processing-n:127.0.0.1:60588_solr) [n:127.0.0.1:60588_solr    ] o.a.s.c.a.c.CreateCollectionCmd Create collection addreplicatest_coll
   [junit4]   2> 356485 DEBUG (OverseerThreadFactory-1535-thread-1-processing-n:127.0.0.1:60588_solr) [n:127.0.0.1:60588_solr    ] o.a.s.c.a.c.OverseerCollectionMessageHandler creating collections conf node /collections/addreplicatest_coll 
   [junit4]   2> 356486 DEBUG (SyncThread:0) [    ] o.a.s.c.ZkTestServer Watch fired: children: /solr/collections
   [junit4]   2> 356486 DEBUG (SyncThread:0) [    ] o.a.s.c.ZkTestServer Watch fired: children: /solr/collections
   [junit4]   2> 356486 DEBUG (SyncThread:0) [    ] o.a.s.c.ZkTestServer Watch fired: children: /solr/collections
   [junit4]   2> 356486 DEBUG (SyncThread:0) [    ] o.a.s.c.ZkTestServer Watch fired: children: /solr/collections
   [junit4]   2> 356486 DEBUG (SyncThread:0) [    ] o.a.s.c.ZkTestServer Watch fired: children: /solr/collections
   [junit4]   2> 356486 DEBUG (SyncThread:0) [    ] o.a.s.c.ZkTestServer Watch fired: children: /solr/collections
   [junit4]   2> 356486 DEBUG (SyncThread:0) [    ] o.a.s.c.ZkTestServer Watch fired: children: /solr/collections
   [junit4]   2> 356486 DEBUG (SyncThread:0) [    ] o.a.s.c.ZkTestServer Watch fired: children: /solr/collections
   [junit4]   2> 356486 DEBUG (SyncThread:0) [    ] o.a.s.c.ZkTestServer Watch fired: children: /solr/collections
   [junit4]   2> 356487 DEBUG (SyncThread:0) [    ] o.a.s.c.ZkTestServer Watch added: children: /solr/collections
   [junit4]   2> 356487 DEBUG (SyncThread:0) [    ] o.a.s.c.ZkTestServer Watch added: children: /solr/collections
   [junit4]   2> 356487 DEBUG (SyncThread:0) [    ] o.a.s.c.ZkTestServer Watch added: children: /solr/collections
   [junit4]   2> 356488 DEBUG (SyncThread:0) [    ] o.a.s.c.ZkTestServer Watch added: children: /solr/collections
   [junit4]   2> 356488 DEBUG (SyncThread:0) [    ] o.a.s.c.ZkTestServer Watch added: children: /solr/collections
   [junit4]   2> 356488 DEBUG (SyncThread:0) [    ] o.a.s.c.ZkTestServer Watch added: children: /solr/collections
   [junit4]   2> 356489 DEBUG (SyncThread:0) [    ] o.a.s.c.ZkTestServer Watch added: children: /solr/collections
   [junit4]   2> 356489 DEBUG (SyncThread:0) [    ] o.a.s.c.ZkTestServer Watch added: children: /solr/collections
   [junit4]   2> 356489 DEBUG (SyncThread:0) [    ] o.a.s.c.ZkTestServer Watch added: children: /solr/collections
   [junit4]   2> 356489 DEBUG (SyncThread:0) [    ] o.a.s.c.ZkTestServer Watch added: children: /solr/collections
   [junit4]   2> 356490 DEBUG (OverseerThreadFactory-1535-thread-1-processing-n:127.0.0.1:60588_solr) [n:127.0.0.1:60588_solr    ] o.a.s.c.a.c.CreateCollectionCmd Check for collection zkNode:addreplicatest_coll
   [junit4]   2> 356492 DEBUG (OverseerThreadFactory-1535-thread-1-processing-n:127.0.0.1:60588_solr) [n:127.0.0.1:60588_solr    ] o.a.s.c.a.c.CreateCollectionCmd Collection zkNode exists
   [junit4]   2> 356494 DEBUG (SyncThread:0) [    ] o.a.s.c.ZkTestServer Watch fired: children: /solr/overseer/queue
   [junit4]   2> 356494 DEBUG (SyncThread:0) [    ] o.a.s.c.ZkTestServer Watch added: children: /solr/overseer/queue
   [junit4]   2> 356494 DEBUG (OverseerStateUpdate-72091601938939911-127.0.0.1:60588_solr-n_0000000000) [n:127.0.0.1:60588_solr    ] o.a.s.c.Overseer processMessage: queueSize: 1, message = {
   [junit4]   2>   "name":"addreplicatest_coll",
   [junit4]   2>   "fromApi":"true",
   [junit4]   2>   "collection.configName":"conf1",
   [junit4]   2>   "numShards":"2",
   [junit4]   2>   "maxShardsPerNode":"2",
   [junit4]   2>   "nrtReplicas":"1",
   [junit4]   2>   "stateFormat":"2",
   [junit4]   2>   "replicationFactor":"1",
   [junit4]   2>   "operation":"create"} current state version: 0
   [junit4]   2> 356494 DEBUG (OverseerStateUpdate-72091601938939911-127.0.0.1:60588_solr-n_0000000000) [n:127.0.0.1:60588_solr    ] o.a.s.c.o.ClusterStateMutator building a new cName: addreplicatest_coll
   [junit4]   2> 356495 DEBUG (OverseerStateUpdate-72091601938939911-127.0.0.1:60588_solr-n_0000000000) [n:127.0.0.1:60588_solr    ] o.a.s.c.o.ZkStateWriter going to create_collection /collections/addreplicatest_coll/state.json
   [junit4]   2> 356495 DEBUG (SyncThread:0) [    ] o.a.s.c.ZkTestServer Watch fired: children: /solr/overseer/queue
   [junit4]   2> 356496 DEBUG (SyncThread:0) [    ] o.a.s.c.ZkTestServer Watch added: children: /solr/overseer/queue
   [junit4]   2> 356596 DEBUG (OverseerThreadFactory-1535-thread-1-processing-n:127.0.0.1:60588_solr) [n:127.0.0.1:60588_solr    ] o.a.s.c.a.c.Assign Identify nodes using default
   [junit4]   2> 356596 DEBUG (OverseerThreadFactory-1535-thread-1-processing-n:127.0.0.1:60588_solr) [n:127.0.0.1:60588_solr    ] o.a.s.c.a.c.CreateCollectionCmd Creating SolrCores for new collection addreplicatest_coll, shardNames [shard1, shard2] , message : {
   [junit4]   2>   "name":"addreplicatest_coll",
   [junit4]   2>   "fromApi":"true",
   [junit4]   2>   "collection.configName":"conf1",
   [junit4]   2>   "numShards":"2",
   [junit4]   2>   "maxShardsPerNode":"2",
   [junit4]   2>   "nrtReplicas":"1",
   [junit4]   2>   "stateFormat":"2",
   [junit4]   2>   "replicationFactor":"1",
   [junit4]   2>   "operation":"create"}
   [junit4]   2> 356597 DEBUG (OverseerThreadFactory-1535-thread-1-processing-n:127.0.0.1:60588_solr) [n:127.0.0.1:60588_solr    ] o.a.s.c.a.c.CreateCollectionCmd Creating core addreplicatest_coll_shard1_replica_n1 as part of shard shard1 of collection addreplicatest_coll on 127.0.0.1:60588_solr
   [junit4]   2> 356598 DEBUG (SyncThread:0) [    ] o.a.s.c.ZkTestServer Watch fired: children: /solr/overseer/queue
   [junit4]   2> 356599 DEBUG (SyncThread:0) [    ] o.a.s.c.ZkTestServer Watch added: children: /solr/overseer/queue
   [junit4]   2> 356600 DEBUG (OverseerStateUpdate-72091601938939911-127.0.0.1:60588_solr-n_0000000000) [n:127.0.0.1:60588_solr    ] o.a.s.c.Overseer processMessage: queueSize: 1, message = {
   [junit4]   2>   "operation":"ADDREPLICA",
   [junit4]   2>   "collection":"addreplicatest_coll",
   [junit4]   2>   "shard":"shard1",
   [junit4]   2>   "core":"addreplicatest_coll_shard1_replica_n1",
   [junit4]   2>   "state":"down",
   [junit4]   2>   "base_url":"http://127.0.0.1:60588/solr",
   [junit4]   2>   "type":"NRT",
   [junit4]   2>   "waitForFinalState":"false"} current state version: 0
   [junit4]   2> 356600 INFO  (OverseerStateUpdate-72091601938939911-127.0.0.1:60588_solr-n_0000000000) [n:127.0.0.1:60588_solr    ] o.a.s.c.o.SliceMutator createReplica() {
   [junit4]   2>   "operation":"ADDREPLICA",
   [junit4]   2>   "collection":"addreplicatest_coll",
   [junit4]   2>   "shard":"shard1",
   [junit4]   2>   "core":"addreplicatest_coll_shard1_replica_n1",
   [junit4]   2>   "state":"down",
   [junit4]   2>   "base_url":"http://127.0.0.1:60588/solr",
   [junit4]   2>   "type":"NRT",
   [junit4]   2>   "waitForFinalState":"false"} 
   [junit4]   2> 356600 DEBUG (OverseerThreadFactory-1535-thread-1-processing-n:127.0.0.1:60588_solr) [n:127.0.0.1:60588_solr    ] o.a.s.c.a.c.CreateCollectionCmd Creating core addreplicatest_coll_shard2_replica_n2 as part of shard shard2 of collection addreplicatest_coll on 127.0.0.1:60591_solr
   [junit4]   2> 356601 DEBUG (SyncThread:0) [    ] o.a.s.c.ZkTestServer Watch fired: children: /solr/overseer/queue
   [junit4]   2> 356601 DEBUG (OverseerStateUpdate-72091601938939911-127.0.0.1:60588_solr-n_0000000000) [n:127.0.0.1:60588_solr    ] o.a.s.c.o.SliceMutator Old Slice: shard1:{
   [junit4]   2>   "range":"80000000-ffffffff",
   [junit4]   2>   "state":"active",
   [junit4]   2>   "replicas":{}}
   [junit4]   2> 356602 DEBUG (OverseerStateUpdate-72091601938939911-127.0.0.1:60588_solr-n_0000000000) [n:127.0.0.1:60588_solr    ] o.a.s.c.o.SliceMutator New Slice: shard1:{
   [junit4]   2>   "range":"80000000-ffffffff",
   [junit4]   2>   "state":"active",
   [junit4]   2>   "replicas":{"core_node3":{
   [junit4]   2>       "core":"addreplicatest_coll_shard1_replica_n1",
   [junit4]   2>       "base_url":"http://127.0.0.1:60588/solr",
   [junit4]   2>       "state":"down",
   [junit4]   2>       "node_name":null,
   [junit4]   2>       "type":"NRT"}}}
   [junit4]   2> 356602 DEBUG (SyncThread:0) [    ] o.a.s.c.ZkTestServer Watch added: children: /solr/overseer/queue
   [junit4]   2> 356602 DEBUG (OverseerThreadFactory-1535-thread-1-processing-n:127.0.0.1:60588_solr) [n:127.0.0.1:60588_solr    ] o.a.s.c.a.c.OverseerCollectionMessageHandler Expecting [addreplicatest_coll_shard1_replica_n1, addreplicatest_coll_shard2_replica_n2] cores but found {}
   [junit4]   2> 356602 DEBUG (OverseerStateUpdate-72091601938939911-127.0.0.1:60588_solr-n_0000000000) [n:127.0.0.1:60588_solr    ] o.a.s.c.Overseer processMessage: queueSize: 2, message = {
   [junit4]   2>   "operation":"ADDREPLICA",
   [junit4]   2>   "collection":"addreplicatest_coll",
   [junit4]   2>   "shard":"shard2",
   [junit4]   2>   "core":"addreplicatest_coll_shard2_replica_n2",
   [junit4]   2>   "state":"down",
   [junit4]   2>   "base_url":"http://127.0.0.1:60591/solr",
   [junit4]   2>   "type":"NRT",
   [junit4]   2>   "waitForFinalState":"false"} current state version: 0
   [junit4]   2> 356602 INFO  (OverseerStateUpdate-72091601938939911-127.0.0.1:60588_solr-n_0000000000) [n:127.0.0.1:60588_solr    ] o.a.s.c.o.SliceMutator createReplica() {
   [junit4]   2>   "operation":"ADDREPLICA",
   [junit4]   2>   "collection":"addreplicatest_coll",
   [junit4]   2>   "shard":"shard2",
   [junit4]   2>   "core":"addreplicatest_coll_shard2_replica_n2",
   [junit4]   2>   "state":"down",
   [junit4]   2>   "base_url":"http://127.0.0.1:60591/solr",
   [junit4]   2>   "type":"NRT",
   [junit4]   2>   "waitForFinalState":"false"} 
   [junit4]   2> 356604 DEBUG (OverseerStateUpdate-72091601938939911-127.0.0.1:60588_solr-n_0000000000) [n:127.0.0.1:60588_solr    ] o.a.s.c.o.SliceMutator Old Slice: shard2:{
   [junit4]   2>   "range":"0-7fffffff",
   [junit4]   2>   "state":"active",
   [junit4]   2>   "replicas":{}}
   [junit4]   2> 356604 DEBUG (OverseerStateUpdate-72091601938939911-127.0.0.1:60588_solr-n_0000000000) [n:127.0.0.1:60588_solr    ] o.a.s.c.o.SliceMutator New Slice: shard2:{
   [junit4]   2>   "range":"0-7fffffff",
   [junit4]   2>   "state":"active",
   [junit4]   2>   "replicas":{"core_node4":{
   [junit4]   2>       "core":"addreplicatest_coll_shard2_replica_n2",
   [junit4]   2>       "base_url":"http://127.0.0.1:60591/solr",
   [junit4]   2>       "state":"down",
   [junit4]   2>       "node_name":null,
   [junit4]   2>       "type":"NRT"}}}
   [junit4]   2> 356708 DEBUG (OverseerStateUpdate-72091601938939911-127.0.0.1:60588_solr-n_0000000000) [n:127.0.0.1:60588_solr    ] o.a.s.c.o.ZkStateWriter going to update_collection /collections/addreplicatest_coll/state.json version: 0
   [junit4]   2> 356709 DEBUG (SyncThread:0) [    ] o.a.s.c.ZkTestServer Watch fired: children: /solr/overseer/queue
   [junit4]   2> 356711 DEBUG (SyncThread:0) [    ] o.a.s.c.ZkTestServer Watch added: children: /solr/overseer/queue
   [junit4]   2> 356708 DEBUG (OverseerThreadFactory-1535-thread-1-processing-n:127.0.0.1:60588_solr) [n:127.0.0.1:60588_solr    ] o.a.s.c.a.c.OverseerCollectionMessageHandler Expecting [addreplicatest_coll_shard1_replica_n1, addreplicatest_coll_shard2_replica_n2] cores but found {}
   [junit4]   2> 356815 INFO  (qtp646852565-3476) [n:127.0.0.1:60591_solr    x:addreplicatest_coll_shard2_replica_n2] o.a.s.h.a.CoreAdminOperation core create command qt=/admin/cores&coreNodeName=core_node4&collection.configName=conf1&newCollection=true&name=addreplicatest_coll_shard2_replica_n2&action=CREATE&numShards=2&collection=addreplicatest_coll&shard=shard2&wt=javabin&version=2&replicaType=NRT
   [junit4]   2> 356815 INFO  (qtp31055677-3467) [n:127.0.0.1:60588_solr    x:addreplicatest_coll_shard1_replica_n1] o.a.s.h.a.CoreAdminOperation core create command qt=/admin/cores&coreNodeName=core_node3&collection.configName=conf1&newCollection=true&name=addreplicatest_coll_shard1_replica_n1&action=CREATE&numShards=2&collection=addreplicatest_coll&shard=shard1&wt=javabin&version=2&replicaType=NRT
   [junit4]   2> 356820 DEBUG (SyncThread:0) [    ] o.a.s.c.ZkTestServer Watch added: data: /solr/collections/addreplicatest_coll/state.json
   [junit4]   2> 356820 DEBUG (qtp646852565-3476) [n:127.0.0.1:60591_solr c:addreplicatest_coll s:shard2 r:core_node4 x:addreplicatest_coll_shard2_replica_n2] o.a.s.c.ZkController publishing state=down
   [junit4]   2> 356821 DEBUG (SyncThread:0) [    ] o.a.s.c.ZkTestServer Watch fired: children: /solr/overseer/queue
   [junit4]   2> 356822 DEBUG (qtp646852565-3476) [n:127.0.0.1:60591_solr c:addreplicatest_coll s:shard2 r:core_node4 x:addreplicatest_coll_shard2_replica_n2] o.a.s.c.ZkController Registering watch for collection addreplicatest_coll
   [junit4]   2> 356822 DEBUG (qtp646852565-3476) [n:127.0.0.1:60591_solr c:addreplicatest_coll s:shard2 r:core_node4 x:addreplicatest_coll_shard2_replica_n2] o.a.s.c.ZkController waiting to find shard id in clusterstate for addreplicatest_coll_shard2_replica_n2
   [junit4]   2> 356822 DEBUG (SyncThread:0) [    ] o.a.s.c.ZkTestServer Watch added: children: /solr/overseer/queue
   [junit4]   2> 356823 DEBUG (OverseerStateUpdate-72091601938939911-127.0.0.1:60588_solr-n_0000000000) [n:127.0.0.1:60588_solr    ] o.a.s.c.Overseer processMessage: queueSize: 1, message = {
   [junit4]   2>   "core":"addreplicatest_coll_shard2_replica_n2",
   [junit4]   2>   "core_node_name":"core_node4",
   [junit4]   2>   "roles":null,
   [junit4]   2>   "base_url":"http://127.0.0.1:60591/solr",
   [junit4]   2>   "node_name":"127.0.0.1:60591_solr",
   [junit4]   2>   "numShards":"2",
   [junit4]   2>   "state":"down",
   [junit4]   2>   "shard":"shard2",
   [junit4]   2>   "collection":"addreplicatest_coll",
   [junit4]   2>   "type":"NRT",
   [junit4]   2>   "force_set_state":"false",
   [junit4]   2>   "operation":"state"} current state version: 0
   [junit4]   2> 356823 DEBUG (OverseerStateUpdate-72091601938939911-127.0.0.1:60588_solr-n_0000000000) [n:127.0.0.1:60588_solr    ] o.a.s.c.o.ReplicaMutator Update state numShards=2 message={
   [junit4]   2>   "core":"addreplicatest_coll_shard2_replica_n2",
   [junit4]   2>   "core_node_name":"core_node4",
   [junit4]   2>   "roles":null,
   [junit4]   2>   "base_url":"http://127.0.0.1:60591/solr",
   [junit4]   2>   "node_name":"127.0.0.1:60591_solr",
   [junit4]   2>   "numShards":"2",
   [junit4]   2>   "state":"down",
   [junit4]   2>   "shard":"shard2",
   [junit4]   2>   "collection":"addreplicatest_coll",
   [junit4]   2>   "type":"NRT",
   [junit4]   2>   "force_set_state":"false",
   [junit4]   2>   "operation":"state"}
   [junit4]   2> 356823 DEBUG (OverseerStateUpdate-72091601938939911-127.0.0.1:60588_solr-n_0000000000) [n:127.0.0.1:60588_solr    ] o.a.s.c.o.ReplicaMutator Will update state for replica: core_node4:{"core":"addreplicatest_coll_shard2_replica_n2","base_url":"http://127.0.0.1:60591/solr","node_name":"127.0.0.1:60591_solr","state":"down","type":"NRT","force_set_state":"false"}
   [junit4]   2> 356823 DEBUG (OverseerStateUpdate-72091601938939911-127.0.0.1:60588_solr-n_0000000000) [n:127.0.0.1:60588_solr    ] o.a.s.c.o.ReplicaMutator Collection is now: DocCollection(addreplicatest_coll//collections/addreplicatest_coll/state.json/1)={
   [junit4]   2>   "pullReplicas":"0",
   [junit4]   2>   "replicationFactor":"1",
   [junit4]   2>   "router":{"name":"compositeId"},
   [junit4]   2>   "maxShardsPerNode":"2",
   [junit4]   2>   "autoAddReplicas":"false",
   [junit4]   2>   "nrtReplicas":"1",
   [junit4]   2>   "tlogReplicas":"0",
   [junit4

[...truncated too long message...]

.c.ZkTestServer Watch fired: create/delete: /solr/overseer_elect/election/72091947320475656-127.0.0.1:64781_solr-n_0000000002
   [junit4]   2> 71246 DEBUG (SyncThread:0) [    ] o.a.s.c.ZkTestServer Watch added: data: /solr/overseer_elect/election/72091947320475657-127.0.0.1:64791_solr-n_0000000000
   [junit4]   2> 71246 INFO  (jetty-closer-176-thread-2) [    ] o.e.j.s.h.ContextHandler Stopped o.e.j.s.ServletContextHandler@7a35ea8c{/solr,null,UNAVAILABLE}
   [junit4]   2> 71246 DEBUG (zkCallback-233-thread-2) [    ] o.a.s.c.LeaderElector Watching path /overseer_elect/election/72091947320475657-127.0.0.1:64791_solr-n_0000000000 to know if I could be the leader
   [junit4]   2> 71246 INFO  (jetty-closer-176-thread-2) [    ] o.e.j.s.session node0 Stopped scavenging
   [junit4]   2> 71247 INFO  (coreCloseExecutor-272-thread-1) [n:127.0.0.1:64791_solr c:testAddMultipleReplicas s:shard1 r:core_node6 x:testAddMultipleReplicas_shard1_replica_n3] o.a.s.m.SolrMetricManager Closing metric reporters for registry=solr.collection.testAddMultipleReplicas.shard1.leader, tag=81a6577
   [junit4]   2> 71248 DEBUG (coreCloseExecutor-272-thread-1) [n:127.0.0.1:64791_solr c:testAddMultipleReplicas s:shard1 r:core_node6 x:testAddMultipleReplicas_shard1_replica_n3] o.a.s.c.ZkController removed listener for config directory [/configs/conf1]
   [junit4]   2> 71248 DEBUG (coreCloseExecutor-272-thread-1) [n:127.0.0.1:64791_solr c:testAddMultipleReplicas s:shard1 r:core_node6 x:testAddMultipleReplicas_shard1_replica_n3] o.a.s.c.ZkController No more listeners for config directory [/configs/conf1]
   [junit4]   2> 71250 INFO  (coreCloseExecutor-275-thread-1) [n:127.0.0.1:64780_solr c:testAddMultipleReplicas s:shard1 r:core_node8 x:testAddMultipleReplicas_shard1_replica_p5] o.a.s.m.SolrMetricManager Closing metric reporters for registry=solr.collection.testAddMultipleReplicas.shard1.leader, tag=1ee1061b
   [junit4]   2> 71251 DEBUG (coreCloseExecutor-275-thread-1) [n:127.0.0.1:64780_solr c:testAddMultipleReplicas s:shard1 r:core_node8 x:testAddMultipleReplicas_shard1_replica_p5] o.a.s.c.ZkController removed listener for config directory [/configs/conf1]
   [junit4]   2> 71251 DEBUG (coreCloseExecutor-275-thread-1) [n:127.0.0.1:64780_solr c:testAddMultipleReplicas s:shard1 r:core_node8 x:testAddMultipleReplicas_shard1_replica_p5] o.a.s.c.ZkController No more listeners for config directory [/configs/conf1]
   [junit4]   2> 71253 INFO  (jetty-closer-176-thread-1) [    ] o.a.s.c.Overseer Overseer (id=72091947320475657-127.0.0.1:64791_solr-n_0000000000) closing
   [junit4]   2> 71253 INFO  (OverseerStateUpdate-72091947320475657-127.0.0.1:64791_solr-n_0000000000) [n:127.0.0.1:64791_solr    ] o.a.s.c.Overseer Overseer Loop exiting : 127.0.0.1:64791_solr
   [junit4]   2> 71255 WARN  (OverseerAutoScalingTriggerThread-72091947320475657-127.0.0.1:64791_solr-n_0000000000) [    ] o.a.s.c.a.OverseerTriggerThread OverseerTriggerThread woken up but we are closed, exiting.
   [junit4]   2> 71255 DEBUG (jetty-closer-176-thread-1) [    ] o.a.s.c.a.ScheduledTriggers Shutting down scheduled thread pool executor now
   [junit4]   2> 71255 DEBUG (jetty-closer-176-thread-1) [    ] o.a.s.c.a.ScheduledTriggers Shutting down action executor now
   [junit4]   2> 71255 DEBUG (jetty-closer-176-thread-1) [    ] o.a.s.c.a.ScheduledTriggers Awaiting termination for action executor
   [junit4]   2> 71255 DEBUG (jetty-closer-176-thread-1) [    ] o.a.s.c.a.ScheduledTriggers Awaiting termination for scheduled thread pool executor
   [junit4]   2> 71255 DEBUG (jetty-closer-176-thread-1) [    ] o.a.s.c.a.ScheduledTriggers ScheduledTriggers closed completely
   [junit4]   2> 71255 DEBUG (jetty-closer-176-thread-1) [    ] o.a.s.c.a.OverseerTriggerThread OverseerTriggerThread has been closed explicitly
   [junit4]   2> 71257 WARN  (NIOServerCxn.Factory:0.0.0.0/0.0.0.0:0) [    ] o.a.z.s.NIOServerCnxn Unable to read additional data from client sessionid 0x1001f3e7f34000b, likely client has closed socket
   [junit4]   2> 71258 WARN  (NIOServerCxn.Factory:0.0.0.0/0.0.0.0:0) [    ] o.a.z.s.NIOServerCnxn Unable to read additional data from client sessionid 0x1001f3e7f34000f, likely client has closed socket
   [junit4]   2> 71258 DEBUG (SyncThread:0) [    ] o.a.s.c.ZkTestServer Watch fired: create/delete: /solr/overseer_elect/election/72091947320475657-127.0.0.1:64791_solr-n_0000000000
   [junit4]   2> 71260 INFO  (jetty-closer-176-thread-4) [    ] o.e.j.s.h.ContextHandler Stopped o.e.j.s.ServletContextHandler@1c435e4a{/solr,null,UNAVAILABLE}
   [junit4]   2> 71260 INFO  (jetty-closer-176-thread-1) [    ] o.e.j.s.h.ContextHandler Stopped o.e.j.s.ServletContextHandler@457c516{/solr,null,UNAVAILABLE}
   [junit4]   2> 71260 INFO  (jetty-closer-176-thread-4) [    ] o.e.j.s.session node0 Stopped scavenging
   [junit4]   2> 71260 INFO  (jetty-closer-176-thread-1) [    ] o.e.j.s.session node0 Stopped scavenging
   [junit4]   2> 71262 ERROR (SUITE-AddReplicaTest-seed#[5FA49BAF0BD869F3]-worker) [    ] o.a.z.s.ZooKeeperServer ZKShutdownHandler is not registered, so ZooKeeper server won't take any action on ERROR or SHUTDOWN server state changes
   [junit4]   2> 71262 INFO  (SUITE-AddReplicaTest-seed#[5FA49BAF0BD869F3]-worker) [    ] o.a.s.c.ZkTestServer connecting to 127.0.0.1:64776 64776
   [junit4]   2> 71263 INFO  (Thread-89) [    ] o.a.s.c.ZkTestServer connecting to 127.0.0.1:64776 64776
   [junit4]   2> 71264 WARN  (Thread-89) [    ] o.a.s.c.ZkTestServer Watch limit violations: 
   [junit4]   2> Maximum concurrent create/delete watches above limit:
   [junit4]   2> 
   [junit4]   2> 	23	/solr/collections/testAddMultipleReplicas/terms/shard1
   [junit4]   2> 	22	/solr/collections/addreplicatest_coll/terms/shard1
   [junit4]   2> 	11	/solr/aliases.json
   [junit4]   2> 	11	/solr/clusterprops.json
   [junit4]   2> 	8	/solr/configs/conf1
   [junit4]   2> 	4	/solr/security.json
   [junit4]   2> 	2	/solr/collections/addreplicatest_coll/terms/shard2
   [junit4]   2> 
   [junit4]   2> Maximum concurrent data watches above limit:
   [junit4]   2> 
   [junit4]   2> 	24	/solr/collections/testAddMultipleReplicas/state.json
   [junit4]   2> 	11	/solr/clusterstate.json
   [junit4]   2> 	8	/solr/collections/addreplicatest_coll/state.json
   [junit4]   2> 	3	/solr/aliases.json
   [junit4]   2> 	3	/solr/overseer_elect/election/72091947320475657-127.0.0.1:64791_solr-n_0000000000
   [junit4]   2> 
   [junit4]   2> Maximum concurrent children watches above limit:
   [junit4]   2> 
   [junit4]   2> 	16	/solr/collections
   [junit4]   2> 	11	/solr/live_nodes
   [junit4]   2> 
   [junit4]   2> NOTE: leaving temporary files on disk at: C:\Users\jenkins\workspace\Lucene-Solr-master-Windows\solr\build\solr-core\test\J1\temp\solr.cloud.AddReplicaTest_5FA49BAF0BD869F3-003
   [junit4]   2> Sep 21, 2018 6:11:18 PM com.carrotsearch.randomizedtesting.ThreadLeakControl checkThreadLeaks
   [junit4]   2> WARNING: Will linger awaiting termination of 9 leaked thread(s).
   [junit4]   2> NOTE: test params are: codec=CheapBastard, sim=Asserting(org.apache.lucene.search.similarities.AssertingSimilarity@6fc8618f), locale=lb-LU, timezone=Europe/Paris
   [junit4]   2> NOTE: Windows 10 10.0 amd64/Oracle Corporation 10 (64-bit)/cpus=3,threads=1,free=47931288,total=100663296
   [junit4]   2> NOTE: All tests run in this JVM: [AddReplicaTest, AddReplicaTest, AddReplicaTest]
   [junit4] Completed [5/5 (5!)] on J1 in 16.72s, 2 tests, 1 failure <<< FAILURES!

[...truncated 14 lines...]
BUILD FAILED
C:\Users\jenkins\workspace\Lucene-Solr-master-Windows\lucene\common-build.xml:1567: The following error occurred while executing this line:
C:\Users\jenkins\workspace\Lucene-Solr-master-Windows\lucene\common-build.xml:1092: There were test failures: 5 suites, 10 tests, 5 failures [seed: 5FA49BAF0BD869F3]

Total time: 1 minute 14 seconds

[repro] Setting last failure code to 1

[repro] Failures:
[repro]   5/5 failed: org.apache.solr.cloud.AddReplicaTest
[repro] Exiting with code 1

C:\Users\jenkins\workspace\Lucene-Solr-master-Windows>IF EXIST lucene\build move /y lucene\build lucene\build.repro 
        1 dir(s) moved.

C:\Users\jenkins\workspace\Lucene-Solr-master-Windows>IF EXIST solr\build move /y solr\build solr\build.repro 
        1 dir(s) moved.

C:\Users\jenkins\workspace\Lucene-Solr-master-Windows>IF EXIST lucene\build.orig move /y lucene\build.orig lucene\build 
        1 dir(s) moved.

C:\Users\jenkins\workspace\Lucene-Solr-master-Windows>IF EXIST solr\build.orig move /y solr\build.orig solr\build 
        1 dir(s) moved.

C:\Users\jenkins\workspace\Lucene-Solr-master-Windows>exit 0 
Archiving artifacts
Setting ANT_1_8_2_HOME=C:\Users\jenkins\tools\hudson.tasks.Ant_AntInstallation\ANT_1.8.2
[WARNINGS] Parsing warnings in console log with parser Java Compiler (javac)
Setting ANT_1_8_2_HOME=C:\Users\jenkins\tools\hudson.tasks.Ant_AntInstallation\ANT_1.8.2
Setting ANT_1_8_2_HOME=C:\Users\jenkins\tools\hudson.tasks.Ant_AntInstallation\ANT_1.8.2
<Git Blamer> Using GitBlamer to create author and commit information for all warnings.
<Git Blamer> GIT_COMMIT=4bcace571ee1e512b2ca4aa3d93bc7bd522b55fe, workspace=C:\Users\jenkins\workspace\Lucene-Solr-master-Windows
[WARNINGS] Computing warning deltas based on reference build #7528
Recording test results
Setting ANT_1_8_2_HOME=C:\Users\jenkins\tools\hudson.tasks.Ant_AntInstallation\ANT_1.8.2
Build step 'Publish JUnit test result report' changed build result to UNSTABLE
Email was triggered for: Unstable (Test Failures)
Sending email for trigger: Unstable (Test Failures)
Setting ANT_1_8_2_HOME=C:\Users\jenkins\tools\hudson.tasks.Ant_AntInstallation\ANT_1.8.2
Setting ANT_1_8_2_HOME=C:\Users\jenkins\tools\hudson.tasks.Ant_AntInstallation\ANT_1.8.2
Setting ANT_1_8_2_HOME=C:\Users\jenkins\tools\hudson.tasks.Ant_AntInstallation\ANT_1.8.2
Setting ANT_1_8_2_HOME=C:\Users\jenkins\tools\hudson.tasks.Ant_AntInstallation\ANT_1.8.2

Mime
View raw message