lucene-dev mailing list archives

Site index · List index
Message view « Date » · « Thread »
Top « Date » · « Thread »
From Apache Jenkins Server <jenk...@builds.apache.org>
Subject [JENKINS] Lucene-Solr-Tests-7.x - Build # 841 - Unstable
Date Mon, 03 Sep 2018 10:52:30 GMT
Build: https://builds.apache.org/job/Lucene-Solr-Tests-7.x/841/

2 tests failed.
FAILED:  org.apache.solr.handler.RequestLoggingTest.testLogBeforeExecuteWithCoreLogger

Error Message:


Stack Trace:
java.lang.AssertionError
	at __randomizedtesting.SeedInfo.seed([F5AB4FA5CCA2718F:392D4F2B326B1A19]:0)
	at org.junit.Assert.fail(Assert.java:92)
	at org.junit.Assert.assertTrue(Assert.java:43)
	at org.junit.Assert.assertTrue(Assert.java:54)
	at org.apache.solr.handler.RequestLoggingTest.testLogBeforeExecute(RequestLoggingTest.java:88)
	at org.apache.solr.handler.RequestLoggingTest.testLogBeforeExecuteWithCoreLogger(RequestLoggingTest.java:65)
	at sun.reflect.NativeMethodAccessorImpl.invoke0(Native Method)
	at sun.reflect.NativeMethodAccessorImpl.invoke(NativeMethodAccessorImpl.java:62)
	at sun.reflect.DelegatingMethodAccessorImpl.invoke(DelegatingMethodAccessorImpl.java:43)
	at java.lang.reflect.Method.invoke(Method.java:498)
	at com.carrotsearch.randomizedtesting.RandomizedRunner.invoke(RandomizedRunner.java:1737)
	at com.carrotsearch.randomizedtesting.RandomizedRunner$8.evaluate(RandomizedRunner.java:934)
	at com.carrotsearch.randomizedtesting.RandomizedRunner$9.evaluate(RandomizedRunner.java:970)
	at com.carrotsearch.randomizedtesting.RandomizedRunner$10.evaluate(RandomizedRunner.java:984)
	at com.carrotsearch.randomizedtesting.rules.SystemPropertiesRestoreRule$1.evaluate(SystemPropertiesRestoreRule.java:57)
	at org.apache.lucene.util.TestRuleSetupTeardownChained$1.evaluate(TestRuleSetupTeardownChained.java:49)
	at org.apache.lucene.util.AbstractBeforeAfterRule$1.evaluate(AbstractBeforeAfterRule.java:45)
	at org.apache.lucene.util.TestRuleThreadAndTestName$1.evaluate(TestRuleThreadAndTestName.java:48)
	at org.apache.lucene.util.TestRuleIgnoreAfterMaxFailures$1.evaluate(TestRuleIgnoreAfterMaxFailures.java:64)
	at org.apache.lucene.util.TestRuleMarkFailure$1.evaluate(TestRuleMarkFailure.java:47)
	at com.carrotsearch.randomizedtesting.rules.StatementAdapter.evaluate(StatementAdapter.java:36)
	at com.carrotsearch.randomizedtesting.ThreadLeakControl$StatementRunner.run(ThreadLeakControl.java:368)
	at com.carrotsearch.randomizedtesting.ThreadLeakControl.forkTimeoutingTask(ThreadLeakControl.java:817)
	at com.carrotsearch.randomizedtesting.ThreadLeakControl$3.evaluate(ThreadLeakControl.java:468)
	at com.carrotsearch.randomizedtesting.RandomizedRunner.runSingleTest(RandomizedRunner.java:943)
	at com.carrotsearch.randomizedtesting.RandomizedRunner$5.evaluate(RandomizedRunner.java:829)
	at com.carrotsearch.randomizedtesting.RandomizedRunner$6.evaluate(RandomizedRunner.java:879)
	at com.carrotsearch.randomizedtesting.RandomizedRunner$7.evaluate(RandomizedRunner.java:890)
	at com.carrotsearch.randomizedtesting.rules.StatementAdapter.evaluate(StatementAdapter.java:36)
	at com.carrotsearch.randomizedtesting.rules.SystemPropertiesRestoreRule$1.evaluate(SystemPropertiesRestoreRule.java:57)
	at org.apache.lucene.util.AbstractBeforeAfterRule$1.evaluate(AbstractBeforeAfterRule.java:45)
	at com.carrotsearch.randomizedtesting.rules.StatementAdapter.evaluate(StatementAdapter.java:36)
	at org.apache.lucene.util.TestRuleStoreClassName$1.evaluate(TestRuleStoreClassName.java:41)
	at com.carrotsearch.randomizedtesting.rules.NoShadowingOrOverridesOnMethodsRule$1.evaluate(NoShadowingOrOverridesOnMethodsRule.java:40)
	at com.carrotsearch.randomizedtesting.rules.NoShadowingOrOverridesOnMethodsRule$1.evaluate(NoShadowingOrOverridesOnMethodsRule.java:40)
	at com.carrotsearch.randomizedtesting.rules.StatementAdapter.evaluate(StatementAdapter.java:36)
	at com.carrotsearch.randomizedtesting.rules.StatementAdapter.evaluate(StatementAdapter.java:36)
	at com.carrotsearch.randomizedtesting.rules.StatementAdapter.evaluate(StatementAdapter.java:36)
	at org.apache.lucene.util.TestRuleAssertionsRequired$1.evaluate(TestRuleAssertionsRequired.java:53)
	at org.apache.lucene.util.TestRuleMarkFailure$1.evaluate(TestRuleMarkFailure.java:47)
	at org.apache.lucene.util.TestRuleIgnoreAfterMaxFailures$1.evaluate(TestRuleIgnoreAfterMaxFailures.java:64)
	at org.apache.lucene.util.TestRuleIgnoreTestSuites$1.evaluate(TestRuleIgnoreTestSuites.java:54)
	at com.carrotsearch.randomizedtesting.rules.StatementAdapter.evaluate(StatementAdapter.java:36)
	at com.carrotsearch.randomizedtesting.ThreadLeakControl$StatementRunner.run(ThreadLeakControl.java:368)
	at java.lang.Thread.run(Thread.java:748)


FAILED:  org.apache.solr.handler.RequestLoggingTest.testLogBeforeExecuteWithRequestLogger

Error Message:


Stack Trace:
java.lang.AssertionError
	at __randomizedtesting.SeedInfo.seed([F5AB4FA5CCA2718F:44C26FAA6154C9C1]:0)
	at org.junit.Assert.fail(Assert.java:92)
	at org.junit.Assert.assertTrue(Assert.java:43)
	at org.junit.Assert.assertTrue(Assert.java:54)
	at org.apache.solr.handler.RequestLoggingTest.testLogBeforeExecute(RequestLoggingTest.java:88)
	at org.apache.solr.handler.RequestLoggingTest.testLogBeforeExecuteWithRequestLogger(RequestLoggingTest.java:71)
	at sun.reflect.NativeMethodAccessorImpl.invoke0(Native Method)
	at sun.reflect.NativeMethodAccessorImpl.invoke(NativeMethodAccessorImpl.java:62)
	at sun.reflect.DelegatingMethodAccessorImpl.invoke(DelegatingMethodAccessorImpl.java:43)
	at java.lang.reflect.Method.invoke(Method.java:498)
	at com.carrotsearch.randomizedtesting.RandomizedRunner.invoke(RandomizedRunner.java:1737)
	at com.carrotsearch.randomizedtesting.RandomizedRunner$8.evaluate(RandomizedRunner.java:934)
	at com.carrotsearch.randomizedtesting.RandomizedRunner$9.evaluate(RandomizedRunner.java:970)
	at com.carrotsearch.randomizedtesting.RandomizedRunner$10.evaluate(RandomizedRunner.java:984)
	at com.carrotsearch.randomizedtesting.rules.SystemPropertiesRestoreRule$1.evaluate(SystemPropertiesRestoreRule.java:57)
	at org.apache.lucene.util.TestRuleSetupTeardownChained$1.evaluate(TestRuleSetupTeardownChained.java:49)
	at org.apache.lucene.util.AbstractBeforeAfterRule$1.evaluate(AbstractBeforeAfterRule.java:45)
	at org.apache.lucene.util.TestRuleThreadAndTestName$1.evaluate(TestRuleThreadAndTestName.java:48)
	at org.apache.lucene.util.TestRuleIgnoreAfterMaxFailures$1.evaluate(TestRuleIgnoreAfterMaxFailures.java:64)
	at org.apache.lucene.util.TestRuleMarkFailure$1.evaluate(TestRuleMarkFailure.java:47)
	at com.carrotsearch.randomizedtesting.rules.StatementAdapter.evaluate(StatementAdapter.java:36)
	at com.carrotsearch.randomizedtesting.ThreadLeakControl$StatementRunner.run(ThreadLeakControl.java:368)
	at com.carrotsearch.randomizedtesting.ThreadLeakControl.forkTimeoutingTask(ThreadLeakControl.java:817)
	at com.carrotsearch.randomizedtesting.ThreadLeakControl$3.evaluate(ThreadLeakControl.java:468)
	at com.carrotsearch.randomizedtesting.RandomizedRunner.runSingleTest(RandomizedRunner.java:943)
	at com.carrotsearch.randomizedtesting.RandomizedRunner$5.evaluate(RandomizedRunner.java:829)
	at com.carrotsearch.randomizedtesting.RandomizedRunner$6.evaluate(RandomizedRunner.java:879)
	at com.carrotsearch.randomizedtesting.RandomizedRunner$7.evaluate(RandomizedRunner.java:890)
	at com.carrotsearch.randomizedtesting.rules.StatementAdapter.evaluate(StatementAdapter.java:36)
	at com.carrotsearch.randomizedtesting.rules.SystemPropertiesRestoreRule$1.evaluate(SystemPropertiesRestoreRule.java:57)
	at org.apache.lucene.util.AbstractBeforeAfterRule$1.evaluate(AbstractBeforeAfterRule.java:45)
	at com.carrotsearch.randomizedtesting.rules.StatementAdapter.evaluate(StatementAdapter.java:36)
	at org.apache.lucene.util.TestRuleStoreClassName$1.evaluate(TestRuleStoreClassName.java:41)
	at com.carrotsearch.randomizedtesting.rules.NoShadowingOrOverridesOnMethodsRule$1.evaluate(NoShadowingOrOverridesOnMethodsRule.java:40)
	at com.carrotsearch.randomizedtesting.rules.NoShadowingOrOverridesOnMethodsRule$1.evaluate(NoShadowingOrOverridesOnMethodsRule.java:40)
	at com.carrotsearch.randomizedtesting.rules.StatementAdapter.evaluate(StatementAdapter.java:36)
	at com.carrotsearch.randomizedtesting.rules.StatementAdapter.evaluate(StatementAdapter.java:36)
	at com.carrotsearch.randomizedtesting.rules.StatementAdapter.evaluate(StatementAdapter.java:36)
	at org.apache.lucene.util.TestRuleAssertionsRequired$1.evaluate(TestRuleAssertionsRequired.java:53)
	at org.apache.lucene.util.TestRuleMarkFailure$1.evaluate(TestRuleMarkFailure.java:47)
	at org.apache.lucene.util.TestRuleIgnoreAfterMaxFailures$1.evaluate(TestRuleIgnoreAfterMaxFailures.java:64)
	at org.apache.lucene.util.TestRuleIgnoreTestSuites$1.evaluate(TestRuleIgnoreTestSuites.java:54)
	at com.carrotsearch.randomizedtesting.rules.StatementAdapter.evaluate(StatementAdapter.java:36)
	at com.carrotsearch.randomizedtesting.ThreadLeakControl$StatementRunner.run(ThreadLeakControl.java:368)
	at java.lang.Thread.run(Thread.java:748)




Build Log:
[...truncated 14643 lines...]
   [junit4] Suite: org.apache.solr.handler.RequestLoggingTest
   [junit4]   2> Creating dataDir: /home/jenkins/jenkins-slave/workspace/Lucene-Solr-Tests-7.x/solr/build/solr-core/test/J2/temp/solr.handler.RequestLoggingTest_F5AB4FA5CCA2718F-001/init-core-data-001
   [junit4]   2> 4372233 WARN  (SUITE-RequestLoggingTest-seed#[F5AB4FA5CCA2718F]-worker) [    ] o.a.s.SolrTestCaseJ4 startTrackingSearchers: numOpens=5 numCloses=5
   [junit4]   2> 4372233 INFO  (SUITE-RequestLoggingTest-seed#[F5AB4FA5CCA2718F]-worker) [    ] o.a.s.SolrTestCaseJ4 Using PointFields (NUMERIC_POINTS_SYSPROP=true) w/NUMERIC_DOCVALUES_SYSPROP=false
   [junit4]   2> 4372236 INFO  (SUITE-RequestLoggingTest-seed#[F5AB4FA5CCA2718F]-worker) [    ] o.a.s.SolrTestCaseJ4 Randomized ssl (false) and clientAuth (false) via: @org.apache.solr.util.RandomizeSSL(reason=, ssl=NaN, value=NaN, clientAuth=NaN)
   [junit4]   2> 4372236 INFO  (SUITE-RequestLoggingTest-seed#[F5AB4FA5CCA2718F]-worker) [    ] o.a.s.SolrTestCaseJ4 SecureRandom sanity checks: test.solr.allowed.securerandom=null & java.security.egd=file:/dev/./urandom
   [junit4]   2> 4372237 INFO  (SUITE-RequestLoggingTest-seed#[F5AB4FA5CCA2718F]-worker) [    ] o.a.s.SolrTestCaseJ4 ####initCore
   [junit4]   2> 4372250 INFO  (SUITE-RequestLoggingTest-seed#[F5AB4FA5CCA2718F]-worker) [    ] o.a.s.c.SolrResourceLoader [null] Added 2 libs to classloader, from paths: [/home/jenkins/jenkins-slave/workspace/Lucene-Solr-Tests-7.x/solr/core/src/test-files/solr/collection1/lib, /home/jenkins/jenkins-slave/workspace/Lucene-Solr-Tests-7.x/solr/core/src/test-files/solr/collection1/lib/classes]
   [junit4]   2> 4372335 INFO  (SUITE-RequestLoggingTest-seed#[F5AB4FA5CCA2718F]-worker) [    ] o.a.s.c.SolrConfig Using Lucene MatchVersion: 7.5.0
   [junit4]   2> 4372378 INFO  (SUITE-RequestLoggingTest-seed#[F5AB4FA5CCA2718F]-worker) [    ] o.a.s.s.IndexSchema [null] Schema name=test
   [junit4]   2> 4372630 INFO  (SUITE-RequestLoggingTest-seed#[F5AB4FA5CCA2718F]-worker) [    ] o.a.s.s.IndexSchema Loaded schema test/1.0 with uniqueid field id
   [junit4]   2> 4372958 INFO  (SUITE-RequestLoggingTest-seed#[F5AB4FA5CCA2718F]-worker) [    ] o.a.s.c.TransientSolrCoreCacheDefault Allocating transient cache for 2147483647 transient cores
   [junit4]   2> 4372958 INFO  (SUITE-RequestLoggingTest-seed#[F5AB4FA5CCA2718F]-worker) [    ] o.a.s.h.a.MetricsHistoryHandler No .system collection, keeping metrics history in memory.
   [junit4]   2> 4373021 INFO  (SUITE-RequestLoggingTest-seed#[F5AB4FA5CCA2718F]-worker) [    ] o.a.s.m.r.SolrJmxReporter JMX monitoring for 'solr.node' (registry 'solr.node') enabled at server: com.sun.jmx.mbeanserver.JmxMBeanServer@794f6985
   [junit4]   2> 4373027 INFO  (SUITE-RequestLoggingTest-seed#[F5AB4FA5CCA2718F]-worker) [    ] o.a.s.m.r.SolrJmxReporter JMX monitoring for 'solr.jvm' (registry 'solr.jvm') enabled at server: com.sun.jmx.mbeanserver.JmxMBeanServer@794f6985
   [junit4]   2> 4373027 INFO  (SUITE-RequestLoggingTest-seed#[F5AB4FA5CCA2718F]-worker) [    ] o.a.s.m.r.SolrJmxReporter JMX monitoring for 'solr.jetty' (registry 'solr.jetty') enabled at server: com.sun.jmx.mbeanserver.JmxMBeanServer@794f6985
   [junit4]   2> 4373029 INFO  (coreLoadExecutor-10585-thread-1) [    x:collection1] o.a.s.c.SolrResourceLoader [null] Added 2 libs to classloader, from paths: [/home/jenkins/jenkins-slave/workspace/Lucene-Solr-Tests-7.x/solr/core/src/test-files/solr/collection1/lib, /home/jenkins/jenkins-slave/workspace/Lucene-Solr-Tests-7.x/solr/core/src/test-files/solr/collection1/lib/classes]
   [junit4]   2> 4373067 INFO  (coreLoadExecutor-10585-thread-1) [    x:collection1] o.a.s.c.SolrConfig Using Lucene MatchVersion: 7.5.0
   [junit4]   2> 4373093 INFO  (coreLoadExecutor-10585-thread-1) [    x:collection1] o.a.s.s.IndexSchema [collection1] Schema name=test
   [junit4]   2> 4373259 INFO  (coreLoadExecutor-10585-thread-1) [    x:collection1] o.a.s.s.IndexSchema Loaded schema test/1.0 with uniqueid field id
   [junit4]   2> 4373265 INFO  (coreLoadExecutor-10585-thread-1) [    x:collection1] o.a.s.c.CoreContainer Creating SolrCore 'collection1' using configuration from instancedir /home/jenkins/jenkins-slave/workspace/Lucene-Solr-Tests-7.x/solr/core/src/test-files/solr/collection1, trusted=true
   [junit4]   2> 4373266 INFO  (coreLoadExecutor-10585-thread-1) [    x:collection1] o.a.s.m.r.SolrJmxReporter JMX monitoring for 'solr.core.collection1' (registry 'solr.core.collection1') enabled at server: com.sun.jmx.mbeanserver.JmxMBeanServer@794f6985
   [junit4]   2> 4373266 INFO  (coreLoadExecutor-10585-thread-1) [    x:collection1] o.a.s.c.SolrCore solr.RecoveryStrategy.Builder
   [junit4]   2> 4373266 INFO  (coreLoadExecutor-10585-thread-1) [    x:collection1] o.a.s.c.SolrCore [[collection1] ] Opening new SolrCore at [/home/jenkins/jenkins-slave/workspace/Lucene-Solr-Tests-7.x/solr/core/src/test-files/solr/collection1], dataDir=[/home/jenkins/jenkins-slave/workspace/Lucene-Solr-Tests-7.x/solr/build/solr-core/test/J2/temp/solr.handler.RequestLoggingTest_F5AB4FA5CCA2718F-001/init-core-data-001/]
   [junit4]   2> 4373274 INFO  (coreLoadExecutor-10585-thread-1) [    x:collection1] o.a.s.u.RandomMergePolicy RandomMergePolicy wrapping class org.apache.lucene.index.AlcoholicMergePolicy: [AlcoholicMergePolicy: minMergeSize=0, mergeFactor=10, maxMergeSize=2052300149, maxMergeSizeForForcedMerge=9223372036854775807, calibrateSizeByDeletes=true, maxMergeDocs=2147483647, maxCFSSegmentSizeMB=8.796093022207999E12, noCFSRatio=0.1]
   [junit4]   2> 4373374 INFO  (coreLoadExecutor-10585-thread-1) [    x:collection1] o.a.s.u.UpdateHandler Using UpdateLog implementation: org.apache.solr.update.UpdateLog
   [junit4]   2> 4373374 INFO  (coreLoadExecutor-10585-thread-1) [    x:collection1] o.a.s.u.UpdateLog Initializing UpdateLog: dataDir= defaultSyncLevel=FLUSH numRecordsToKeep=100 maxNumLogsToKeep=10 numVersionBuckets=65536
   [junit4]   2> 4373375 INFO  (coreLoadExecutor-10585-thread-1) [    x:collection1] o.a.s.u.CommitTracker Hard AutoCommit: disabled
   [junit4]   2> 4373375 INFO  (coreLoadExecutor-10585-thread-1) [    x:collection1] o.a.s.u.CommitTracker Soft AutoCommit: disabled
   [junit4]   2> 4373376 INFO  (coreLoadExecutor-10585-thread-1) [    x:collection1] o.a.s.u.RandomMergePolicy RandomMergePolicy wrapping class org.apache.lucene.index.LogDocMergePolicy: [LogDocMergePolicy: minMergeSize=1000, mergeFactor=32, maxMergeSize=9223372036854775807, maxMergeSizeForForcedMerge=9223372036854775807, calibrateSizeByDeletes=true, maxMergeDocs=2147483647, maxCFSSegmentSizeMB=8.796093022207999E12, noCFSRatio=0.3571939066498817]
   [junit4]   2> 4373376 INFO  (coreLoadExecutor-10585-thread-1) [    x:collection1] o.a.s.s.SolrIndexSearcher Opening [Searcher@71d4f0b0[collection1] main]
   [junit4]   2> 4373376 INFO  (coreLoadExecutor-10585-thread-1) [    x:collection1] o.a.s.h.c.SpellCheckComponent Initializing spell checkers
   [junit4]   2> 4373384 INFO  (coreLoadExecutor-10585-thread-1) [    x:collection1] o.a.s.s.DirectSolrSpellChecker init: {name=direct,classname=DirectSolrSpellChecker,field=lowerfilt,minQueryLength=3}
   [junit4]   2> 4373417 INFO  (coreLoadExecutor-10585-thread-1) [    x:collection1] o.a.s.h.ReplicationHandler Commits will be reserved for 10000ms.
   [junit4]   2> 4373417 INFO  (coreLoadExecutor-10585-thread-1) [    x:collection1] o.a.s.u.UpdateLog Could not find max version in index or recent updates, using new clock 1610579460013162496
   [junit4]   2> 4373418 INFO  (searcherExecutor-10586-thread-1-processing-x:collection1) [    x:collection1] o.a.s.h.c.SpellCheckComponent Loading spell index for spellchecker: default
   [junit4]   2> 4373419 INFO  (searcherExecutor-10586-thread-1-processing-x:collection1) [    x:collection1] o.a.s.h.c.SpellCheckComponent Loading spell index for spellchecker: direct
   [junit4]   2> 4373419 INFO  (searcherExecutor-10586-thread-1-processing-x:collection1) [    x:collection1] o.a.s.h.c.SpellCheckComponent Loading spell index for spellchecker: wordbreak
   [junit4]   2> 4373419 INFO  (searcherExecutor-10586-thread-1-processing-x:collection1) [    x:collection1] o.a.s.h.c.SpellCheckComponent Loading spell index for spellchecker: multipleFields
   [junit4]   2> 4373419 INFO  (searcherExecutor-10586-thread-1-processing-x:collection1) [    x:collection1] o.a.s.h.c.SpellCheckComponent Loading spell index for spellchecker: jarowinkler
   [junit4]   2> 4373419 INFO  (searcherExecutor-10586-thread-1-processing-x:collection1) [    x:collection1] o.a.s.h.c.SpellCheckComponent Loading spell index for spellchecker: external
   [junit4]   2> 4373420 INFO  (searcherExecutor-10586-thread-1-processing-x:collection1) [    x:collection1] o.a.s.h.c.SpellCheckComponent Loading spell index for spellchecker: freq
   [junit4]   2> 4373420 INFO  (searcherExecutor-10586-thread-1-processing-x:collection1) [    x:collection1] o.a.s.h.c.SpellCheckComponent Loading spell index for spellchecker: fqcn
   [junit4]   2> 4373420 INFO  (searcherExecutor-10586-thread-1-processing-x:collection1) [    x:collection1] o.a.s.h.c.SpellCheckComponent Loading spell index for spellchecker: perDict
   [junit4]   2> 4373420 INFO  (SUITE-RequestLoggingTest-seed#[F5AB4FA5CCA2718F]-worker) [    ] o.a.s.SolrTestCaseJ4 ####initCore end
   [junit4]   2> 4373421 INFO  (searcherExecutor-10586-thread-1-processing-x:collection1) [    x:collection1] o.a.s.c.SolrCore [collection1] Registered new searcher Searcher@71d4f0b0[collection1] main{ExitableDirectoryReader(UninvertingDirectoryReader())}
   [junit4]   2> 4373451 INFO  (TEST-RequestLoggingTest.testLogBeforeExecuteWithCoreLogger-seed#[F5AB4FA5CCA2718F]) [    ] o.a.s.SolrTestCaseJ4 ###Starting testLogBeforeExecuteWithCoreLogger
   [junit4]   2> 4373468 DEBUG (TEST-RequestLoggingTest.testLogBeforeExecuteWithCoreLogger-seed#[F5AB4FA5CCA2718F]) [    ] o.a.s.c.S.Request [collection1]  webapp=null path=null params={q=*:*&wt=xml}
   [junit4]   2> 4373473 DEBUG (TEST-RequestLoggingTest.testLogBeforeExecuteWithCoreLogger-seed#[F5AB4FA5CCA2718F]) [    ] o.a.s.h.c.SearchHandler Adding  component:org.apache.solr.handler.component.QueryComponent@6d0cf6ec
   [junit4]   2> 4373473 DEBUG (TEST-RequestLoggingTest.testLogBeforeExecuteWithCoreLogger-seed#[F5AB4FA5CCA2718F]) [    ] o.a.s.h.c.SearchHandler Adding  component:org.apache.solr.handler.component.FacetComponent@3b2052f0
   [junit4]   2> 4373473 DEBUG (TEST-RequestLoggingTest.testLogBeforeExecuteWithCoreLogger-seed#[F5AB4FA5CCA2718F]) [    ] o.a.s.h.c.SearchHandler Adding  component:org.apache.solr.search.facet.FacetModule@235c12ef
   [junit4]   2> 4373473 DEBUG (TEST-RequestLoggingTest.testLogBeforeExecuteWithCoreLogger-seed#[F5AB4FA5CCA2718F]) [    ] o.a.s.h.c.SearchHandler Adding  component:org.apache.solr.handler.component.MoreLikeThisComponent@2f130809
   [junit4]   2> 4373473 DEBUG (TEST-RequestLoggingTest.testLogBeforeExecuteWithCoreLogger-seed#[F5AB4FA5CCA2718F]) [    ] o.a.s.h.c.SearchHandler Adding  component:org.apache.solr.handler.component.HighlightComponent@25a23091
   [junit4]   2> 4373473 DEBUG (TEST-RequestLoggingTest.testLogBeforeExecuteWithCoreLogger-seed#[F5AB4FA5CCA2718F]) [    ] o.a.s.h.c.SearchHandler Adding  component:org.apache.solr.handler.component.StatsComponent@1cac4107
   [junit4]   2> 4373473 DEBUG (TEST-RequestLoggingTest.testLogBeforeExecuteWithCoreLogger-seed#[F5AB4FA5CCA2718F]) [    ] o.a.s.h.c.SearchHandler Adding  component:org.apache.solr.handler.component.ExpandComponent@5f24e317
   [junit4]   2> 4373473 DEBUG (TEST-RequestLoggingTest.testLogBeforeExecuteWithCoreLogger-seed#[F5AB4FA5CCA2718F]) [    ] o.a.s.h.c.SearchHandler Adding  component:org.apache.solr.handler.component.TermsComponent@6840fbba
   [junit4]   2> 4373473 DEBUG (TEST-RequestLoggingTest.testLogBeforeExecuteWithCoreLogger-seed#[F5AB4FA5CCA2718F]) [    ] o.a.s.h.c.SearchHandler Adding  debug component:org.apache.solr.handler.component.DebugComponent@5cd2689b
   [junit4]   2> 4373473 DEBUG (TEST-RequestLoggingTest.testLogBeforeExecuteWithCoreLogger-seed#[F5AB4FA5CCA2718F]) [    ] o.a.s.h.c.QueryComponent process: q=*:*&df=text&wt=xml&indent=off
   [junit4]   2> 4373473 DEBUG (TEST-RequestLoggingTest.testLogBeforeExecuteWithCoreLogger-seed#[F5AB4FA5CCA2718F]) [    ] o.a.s.s.s.LocalStatsCache ## GET LocalSolrQueryRequest{q=*:*&df=text&wt=xml&indent=off}
   [junit4]   2> 4373473 INFO  (TEST-RequestLoggingTest.testLogBeforeExecuteWithCoreLogger-seed#[F5AB4FA5CCA2718F]) [    ] o.a.s.c.S.Request [collection1]  webapp=null path=null params={q=*:*&wt=xml} hits=0 status=0 QTime=4
   [junit4]   2> 4373479 INFO  (TEST-RequestLoggingTest.testLogBeforeExecuteWithCoreLogger-seed#[F5AB4FA5CCA2718F]) [    ] o.a.s.SolrTestCaseJ4 ###Ending testLogBeforeExecuteWithCoreLogger
   [junit4]   2> NOTE: reproduce with: ant test  -Dtestcase=RequestLoggingTest -Dtests.method=testLogBeforeExecuteWithCoreLogger -Dtests.seed=F5AB4FA5CCA2718F -Dtests.multiplier=2 -Dtests.slow=true -Dtests.locale=hr -Dtests.timezone=Europe/Tallinn -Dtests.asserts=true -Dtests.file.encoding=US-ASCII
   [junit4] FAILURE 0.06s J2 | RequestLoggingTest.testLogBeforeExecuteWithCoreLogger <<<
   [junit4]    > Throwable #1: java.lang.AssertionError
   [junit4]    > 	at __randomizedtesting.SeedInfo.seed([F5AB4FA5CCA2718F:392D4F2B326B1A19]:0)
   [junit4]    > 	at org.apache.solr.handler.RequestLoggingTest.testLogBeforeExecute(RequestLoggingTest.java:88)
   [junit4]    > 	at org.apache.solr.handler.RequestLoggingTest.testLogBeforeExecuteWithCoreLogger(RequestLoggingTest.java:65)
   [junit4]    > 	at java.lang.Thread.run(Thread.java:748)
   [junit4]   2> NOTE: reproduce with: ant test  -Dtestcase=RequestLoggingTest -Dtests.method=testLogBeforeExecuteWithRequestLogger -Dtests.seed=F5AB4FA5CCA2718F -Dtests.multiplier=2 -Dtests.slow=true -Dtests.locale=hr -Dtests.timezone=Europe/Tallinn -Dtests.asserts=true -Dtests.file.encoding=US-ASCII
   [junit4] FAILURE 0.05s J2 | RequestLoggingTest.testLogBeforeExecuteWithRequestLogger <<<
   [junit4]    > Throwable #1: java.lang.AssertionError
   [junit4]    > 	at __randomizedtesting.SeedInfo.seed([F5AB4FA5CCA2718F:44C26FAA6154C9C1]:0)
   [junit4]    > 	at org.apache.solr.handler.RequestLoggingTest.testLogBeforeExecute(RequestLoggingTest.java:88)
   [junit4]    > 	at org.apache.solr.handler.RequestLoggingTest.testLogBeforeExecuteWithRequestLogger(RequestLoggingTest.java:71)
   [junit4]    > 	at java.lang.Thread.run(Thread.java:748)
   [junit4]   2> 4373528 INFO  (TEST-RequestLoggingTest.testLogBeforeExecuteWithRequestLogger-seed#[F5AB4FA5CCA2718F]) [    ] o.a.s.SolrTestCaseJ4 ###Starting testLogBeforeExecuteWithRequestLogger
   [junit4]   2> 4373530 DEBUG (TEST-RequestLoggingTest.testLogBeforeExecuteWithRequestLogger-seed#[F5AB4FA5CCA2718F]) [    ] o.a.s.c.S.Request [collection1]  webapp=null path=null params={q=*:*&wt=xml}
   [junit4]   2> 4373530 DEBUG (TEST-RequestLoggingTest.testLogBeforeExecuteWithRequestLogger-seed#[F5AB4FA5CCA2718F]) [    ] o.a.s.h.c.QueryComponent process: q=*:*&df=text&wt=xml&indent=off
   [junit4]   2> 4373530 DEBUG (TEST-RequestLoggingTest.testLogBeforeExecuteWithRequestLogger-seed#[F5AB4FA5CCA2718F]) [    ] o.a.s.s.s.LocalStatsCache ## GET LocalSolrQueryRequest{q=*:*&df=text&wt=xml&indent=off}
   [junit4]   2> 4373530 INFO  (TEST-RequestLoggingTest.testLogBeforeExecuteWithRequestLogger-seed#[F5AB4FA5CCA2718F]) [    ] o.a.s.c.S.Request [collection1]  webapp=null path=null params={q=*:*&wt=xml} hits=0 status=0 QTime=0
   [junit4]   2> 4373531 INFO  (TEST-RequestLoggingTest.testLogBeforeExecuteWithRequestLogger-seed#[F5AB4FA5CCA2718F]) [    ] o.a.s.SolrTestCaseJ4 ###Ending testLogBeforeExecuteWithRequestLogger
   [junit4]   2> 4373532 INFO  (SUITE-RequestLoggingTest-seed#[F5AB4FA5CCA2718F]-worker) [    ] o.a.s.SolrTestCaseJ4 ###deleteCore
   [junit4]   2> 4373532 INFO  (SUITE-RequestLoggingTest-seed#[F5AB4FA5CCA2718F]-worker) [    ] o.a.s.c.CoreContainer Shutting down CoreContainer instance=1474652088
   [junit4]   2> 4373535 INFO  (SUITE-RequestLoggingTest-seed#[F5AB4FA5CCA2718F]-worker) [    ] o.a.s.m.SolrMetricManager Closing metric reporters for registry=solr.node, tag=null
   [junit4]   2> 4373536 INFO  (SUITE-RequestLoggingTest-seed#[F5AB4FA5CCA2718F]-worker) [    ] o.a.s.m.r.SolrJmxReporter Closing reporter [org.apache.solr.metrics.reporters.SolrJmxReporter@4de12711: rootName = null, domain = solr.node, service url = null, agent id = null] for registry solr.node / com.codahale.metrics.MetricRegistry@4f3a32b4
   [junit4]   2> 4373540 INFO  (SUITE-RequestLoggingTest-seed#[F5AB4FA5CCA2718F]-worker) [    ] o.a.s.m.SolrMetricManager Closing metric reporters for registry=solr.jvm, tag=null
   [junit4]   2> 4373541 INFO  (SUITE-RequestLoggingTest-seed#[F5AB4FA5CCA2718F]-worker) [    ] o.a.s.m.r.SolrJmxReporter Closing reporter [org.apache.solr.metrics.reporters.SolrJmxReporter@cadea24: rootName = null, domain = solr.jvm, service url = null, agent id = null] for registry solr.jvm / com.codahale.metrics.MetricRegistry@2729e734
   [junit4]   2> 4373543 INFO  (SUITE-RequestLoggingTest-seed#[F5AB4FA5CCA2718F]-worker) [    ] o.a.s.m.SolrMetricManager Closing metric reporters for registry=solr.jetty, tag=null
   [junit4]   2> 4373552 INFO  (SUITE-RequestLoggingTest-seed#[F5AB4FA5CCA2718F]-worker) [    ] o.a.s.m.r.SolrJmxReporter Closing reporter [org.apache.solr.metrics.reporters.SolrJmxReporter@2f0f5688: rootName = null, domain = solr.jetty, service url = null, agent id = null] for registry solr.jetty / com.codahale.metrics.MetricRegistry@6b7f9868
   [junit4]   2> 4373552 INFO  (coreCloseExecutor-10591-thread-1) [    x:collection1] o.a.s.c.SolrCore [collection1]  CLOSING SolrCore org.apache.solr.core.SolrCore@2185b86b
   [junit4]   2> 4373552 INFO  (coreCloseExecutor-10591-thread-1) [    x:collection1] o.a.s.m.SolrMetricManager Closing metric reporters for registry=solr.core.collection1, tag=2185b86b
   [junit4]   2> 4373552 INFO  (coreCloseExecutor-10591-thread-1) [    x:collection1] o.a.s.m.r.SolrJmxReporter Closing reporter [org.apache.solr.metrics.reporters.SolrJmxReporter@3a0023d9: rootName = null, domain = solr.core.collection1, service url = null, agent id = null] for registry solr.core.collection1 / com.codahale.metrics.MetricRegistry@2cd4a9c
   [junit4]   2> NOTE: leaving temporary files on disk at: /home/jenkins/jenkins-slave/workspace/Lucene-Solr-Tests-7.x/solr/build/solr-core/test/J2/temp/solr.handler.RequestLoggingTest_F5AB4FA5CCA2718F-001
   [junit4]   2> NOTE: test params are: codec=Asserting(Lucene70): {}, docValues:{}, maxPointsInLeafNode=917, maxMBSortInHeap=7.301495076119746, sim=RandomSimilarity(queryNorm=false): {}, locale=hr, timezone=Europe/Tallinn
   [junit4]   2> NOTE: Linux 4.4.0-112-generic amd64/Oracle Corporation 1.8.0_172 (64-bit)/cpus=4,threads=1,free=212089864,total=530055168
   [junit4]   2> NOTE: All tests run in this JVM: [TestSchemaNameResource, ConjunctionSolrSpellCheckerTest, InfoHandlerTest, TestAnalyzedSuggestions, TestInitQParser, TestClassicSimilarityFactory, NoCacheHeaderTest, ManagedSchemaRoundRobinCloudTest, IndexBasedSpellCheckerTest, LeaderElectionContextKeyTest, HLLSerializationTest, TestSmileRequest, TestLeaderElectionZkExpiry, TestSchemaVersionResource, DateFieldTest, DeleteInactiveReplicaTest, OverriddenZkACLAndCredentialsProvidersTest, TestSystemCollAutoCreate, TestRequestStatusCollectionAPI, TestShardHandlerFactory, TestDistribDocBasedVersion, TestInfoStreamLogging, TestCSVLoader, JSONWriterTest, TestRemoteStreaming, PeerSyncWithIndexFingerprintCachingTest, TestNumericTerms32, TestCloudPseudoReturnFields, InfixSuggestersTest, RecoveryZkTest, DocValuesMultiTest, TestSystemIdResolver, ScheduledTriggerIntegrationTest, GraphQueryTest, TestFieldResource, BasicZkTest, TestSimGenericDistributedQueue, CleanupOldIndexTest, RandomizedTaggerTest, TestManagedStopFilterFactory, TestReqParamsAPI, ShardRoutingCustomTest, TestLRUStatsCache, TestFilteredDocIdSet, ExitableDirectoryReaderTest, TestWithCollection, SpellPossibilityIteratorTest, PreAnalyzedFieldManagedSchemaCloudTest, XmlUpdateRequestHandlerTest, TestSolrCloudWithKerberosAlt, TestSchemaManager, TestRandomCollapseQParserPlugin, TestPhraseSuggestions, TestScoreJoinQPNoScore, TestPostingsSolrHighlighter, NodeAddedTriggerTest, TestSolrXml, TestExportWriter, AnalyticsMergeStrategyTest, TimeZoneUtilsTest, SpatialFilterTest, CdcrOpsAndBoundariesTest, SolrTestCaseJ4Test, IgnoreLargeDocumentProcessorFactoryTest, TestFastOutputStream, TestJettySolrRunner, TestFreeTextSuggestions, MultiThreadedOCPTest, SpellCheckComponentTest, HdfsBasicDistributedZk2Test, DOMUtilTest, LeaderFailoverAfterPartitionTest, MetricUtilsTest, TestQuerySenderListener, DistributedExpandComponentTest, DistributedSuggestComponentTest, DataDrivenBlockJoinTest, TestXmlQParserPlugin, TestClusterProperties, CustomCollectionTest, TestHdfsBackupRestoreCore, TestBinaryField, TestDynamicFieldCollectionResource, HdfsThreadLeakTest, PrimUtilsTest, TestSweetSpotSimilarityFactory, CloneFieldUpdateProcessorFactoryTest, TolerantUpdateProcessorTest, SolrCoreCheckLockOnStartupTest, DistributedFacetPivotWhiteBoxTest, TestDocumentBuilder, TestExclusionRuleCollectionAccess, ZkCLITest, TestStressUserVersions, TestTrieFacet, TestSimpleTrackingShardHandler, TestLazyCores, PropertiesRequestHandlerTest, UpdateLogTest, TestIBSimilarityFactory, NumericFieldsTest, TestQueryTypes, SolrIndexMetricsTest, OutputWriterTest, HdfsChaosMonkeySafeLeaderTest, TestDynamicLoading, TestApiFramework, TestMultiWordSynonyms, TestSolrCoreSnapshots, TestBadConfig, ReplaceNodeTest, TestHttpShardHandlerFactory, TestStressInPlaceUpdates, AddReplicaTest, TestNestedUpdateProcessor, TestCloudSchemaless, BadCopyFieldTest, DistribCursorPagingTest, AssignTest, TestRetrieveFieldsOptimizer, TestLegacyNumericRangeQueryBuilder, TestSortByMinMaxFunction, TestImpersonationWithHadoopAuth, ConvertedLegacyTest, TermsComponentTest, TestRandomRequestDistribution, TestChildDocTransformerHierarchy, TestPushWriter, TestRestManager, SuggesterTest, TestNonDefinedSimilarityFactory, CursorPagingTest, DisMaxRequestHandlerTest, DistributedIntervalFacetingTest, TestCrossCoreJoin, TestCursorMarkWithoutUniqueKey, TestDistributedGrouping, TestGroupingSearch, TestHighlightDedupGrouping, TestJoin, TestSolrCoreProperties, TestTolerantSearch, TestTrie, PathHierarchyTokenizerFactoryTest, ProtectedTermFilterFactoryTest, TestCharFilters, TestLuceneMatchVersion, TestReversedWildcardFilterFactory, TestWordDelimiterFilterFactory, TokenizerChainTest, TestLuceneIndexBackCompat, TestEmbeddedSolrServerAdminHandler, AliasIntegrationTest, AssignBackwardCompatibilityTest, AsyncCallRequestStatusResponseTest, ChaosMonkeyNothingIsSafeTest, ChaosMonkeyNothingIsSafeWithPullReplicasTest, ChaosMonkeySafeLeaderTest, CloudExitableDirectoryReaderTest, ClusterStateTest, ClusterStateUpdateTest, CollectionPropsTest, CollectionStateFormat2Test, CollectionsAPISolrJTest, ConcurrentCreateRoutedAliasTest, ConfigSetsAPITest, ConnectionManagerTest, DeleteNodeTest, DistribDocExpirationUpdateProcessorTest, DistribJoinFromCollectionTest, DocValuesNotIndexedTest, ForceLeaderTest, FullSolrCloudDistribCmdsTest, HttpPartitionOnCommitTest, LeaderTragicEventTest, LegacyCloudClusterPropTest, MetricsHistoryIntegrationTest, MigrateRouteKeyTest, MoveReplicaHDFSTest, ReplicationFactorTest, RestartWhileUpdatingTest, RollingRestartTest, ShardRoutingTest, TestAuthenticationFramework, TestCloudConsistency, TestConfigSetsAPIExclusivity, TestConfigSetsAPIZkFailure, TestLeaderInitiatedRecoveryThread, TestOnReconnectListenerSupport, TestPrepRecovery, TestShortCircuitedRequests, TestSizeLimitedDistributedMap, TestStressLiveNodes, TestZkChroot, TlogReplayBufferedWhileIndexingTest, TriLevelCompositeIdRoutingTest, ZkFailoverTest, TestCollectionsAPIViaSolrCloudCluster, TestHdfsCloudBackupRestore, AutoAddReplicasIntegrationTest, AutoAddReplicasPlanActionTest, AutoScalingHandlerTest, ExecutePlanActionTest, HdfsAutoAddReplicasIntegrationTest, IndexSizeTriggerTest, SearchRateTriggerTest, SystemLogListenerTest, TestPolicyCloud, TriggerIntegrationTest, HdfsNNFailoverTest, HdfsRecoverLeaseTest, TestClusterStateMutator, ZkStateReaderTest, ZkStateWriterTest, ImplicitSnitchTest, RuleEngineTest, RulesTest, CachingDirectoryFactoryTest, OpenCloseCoreStressTest, PluginInfoTest, QueryResultKeyTest, RAMDirectoryFactoryTest, RequestHandlersTest, TestConfig, TestConfigOverlay, TestConfigSetImmutable, TestCorePropertiesReload, TestSimpleTextCodec, TestSolrDeletionPolicy1, BinaryUpdateRequestHandlerTest, DocumentAnalysisRequestHandlerTest, JsonLoaderTest, RequestLoggingTest]
   [junit4] Completed [603/831 (1!)] on J2 in 1.46s, 2 tests, 2 failures <<< FAILURES!

[...truncated 49398 lines...]
[asciidoctor:convert] asciidoctor: ERROR: about-this-guide.adoc: line 1: invalid part, must have at least one section (e.g., chapter, appendix, etc.)
[asciidoctor:convert] asciidoctor: WARNING: simulations.adoc: line 25: section title out of sequence: expected level 3, got level 4
[asciidoctor:convert] asciidoctor: WARNING: simulations.adoc: line 92: section title out of sequence: expected level 3, got level 4
[asciidoctor:convert] asciidoctor: ERROR: solr-glossary.adoc: line 1: invalid part, must have at least one section (e.g., chapter, appendix, etc.)
[asciidoctor:convert] asciidoctor: WARNING: simulations.adoc: line 25: section title out of sequence: expected levels 0 or 1, got level 2
[asciidoctor:convert] asciidoctor: WARNING: simulations.adoc: line 92: section title out of sequence: expected levels 0 or 1, got level 2
     [java] Processed 2310 links (1863 relative) to 3131 anchors in 245 files
     [echo] Validated Links & Anchors via: /home/jenkins/jenkins-slave/workspace/Lucene-Solr-Tests-7.x/solr/build/solr-ref-guide/bare-bones-html/

-documentation-lint:
    [jtidy] Checking for broken html (such as invalid tags)...
   [delete] Deleting directory /home/jenkins/jenkins-slave/workspace/Lucene-Solr-Tests-7.x/lucene/build/jtidy_tmp
     [echo] Checking for broken links...
     [exec] 
     [exec] Crawl/parse...
     [exec] 
     [exec] Verify...
     [echo] Checking for malformed docs...

jar-checksums:

resolve:

ivy-availability-check:
[loadresource] Do not set property disallowed.ivy.jars.list as its length is 0.

-ivy-fail-disallowed-ivy-version:

ivy-fail:

ivy-configure:
[ivy:configure] :: loading settings :: file = /home/jenkins/jenkins-slave/workspace/Lucene-Solr-Tests-7.x/lucene/top-level-ivy-settings.xml

resolve:

ivy-availability-check:
[loadresource] Do not set property disallowed.ivy.jars.list as its length is 0.

-ivy-fail-disallowed-ivy-version:

ivy-fail:

ivy-configure:
[ivy:configure] :: loading settings :: file = /home/jenkins/jenkins-slave/workspace/Lucene-Solr-Tests-7.x/lucene/top-level-ivy-settings.xml

resolve:

resolve:

ivy-availability-check:
[loadresource] Do not set property disallowed.ivy.jars.list as its length is 0.

-ivy-fail-disallowed-ivy-version:

ivy-fail:

ivy-configure:
[ivy:configure] :: loading settings :: file = /home/jenkins/jenkins-slave/workspace/Lucene-Solr-Tests-7.x/lucene/top-level-ivy-settings.xml

resolve:

ivy-availability-check:
[loadresource] Do not set property disallowed.ivy.jars.list as its length is 0.

-ivy-fail-disallowed-ivy-version:

ivy-fail:

ivy-configure:
[ivy:configure] :: loading settings :: file = /home/jenkins/jenkins-slave/workspace/Lucene-Solr-Tests-7.x/lucene/top-level-ivy-settings.xml

resolve:

ivy-availability-check:
[loadresource] Do not set property disallowed.ivy.jars.list as its length is 0.

-ivy-fail-disallowed-ivy-version:

ivy-fail:

ivy-configure:
[ivy:configure] :: loading settings :: file = /home/jenkins/jenkins-slave/workspace/Lucene-Solr-Tests-7.x/lucene/top-level-ivy-settings.xml

resolve:

ivy-availability-check:
[loadresource] Do not set property disallowed.ivy.jars.list as its length is 0.

-ivy-fail-disallowed-ivy-version:

ivy-fail:

ivy-configure:
[ivy:configure] :: loading settings :: file = /home/jenkins/jenkins-slave/workspace/Lucene-Solr-Tests-7.x/lucene/top-level-ivy-settings.xml

resolve:

ivy-availability-check:
[loadresource] Do not set property disallowed.ivy.jars.list as its length is 0.

-ivy-fail-disallowed-ivy-version:

ivy-fail:

ivy-configure:
[ivy:configure] :: loading settings :: file = /home/jenkins/jenkins-slave/workspace/Lucene-Solr-Tests-7.x/lucene/top-level-ivy-settings.xml

resolve:

ivy-availability-check:
[loadresource] Do not set property disallowed.ivy.jars.list as its length is 0.

-ivy-fail-disallowed-ivy-version:

ivy-fail:

ivy-configure:
[ivy:configure] :: loading settings :: file = /home/jenkins/jenkins-slave/workspace/Lucene-Solr-Tests-7.x/lucene/top-level-ivy-settings.xml

resolve:

ivy-availability-check:
[loadresource] Do not set property disallowed.ivy.jars.list as its length is 0.

-ivy-fail-disallowed-ivy-version:

ivy-fail:

ivy-configure:
[ivy:configure] :: loading settings :: file = /home/jenkins/jenkins-slave/workspace/Lucene-Solr-Tests-7.x/lucene/top-level-ivy-settings.xml

resolve:

ivy-availability-check:
[loadresource] Do not set property disallowed.ivy.jars.list as its length is 0.

-ivy-fail-disallowed-ivy-version:

ivy-fail:

ivy-configure:
[ivy:configure] :: loading settings :: file = /home/jenkins/jenkins-slave/workspace/Lucene-Solr-Tests-7.x/lucene/top-level-ivy-settings.xml

resolve:

ivy-availability-check:
[loadresource] Do not set property disallowed.ivy.jars.list as its length is 0.

-ivy-fail-disallowed-ivy-version:

ivy-fail:

ivy-configure:
[ivy:configure] :: loading settings :: file = /home/jenkins/jenkins-slave/workspace/Lucene-Solr-Tests-7.x/lucene/top-level-ivy-settings.xml

resolve:

ivy-availability-check:
[loadresource] Do not set property disallowed.ivy.jars.list as its length is 0.

-ivy-fail-disallowed-ivy-version:

ivy-fail:

ivy-configure:
[ivy:configure] :: loading settings :: file = /home/jenkins/jenkins-slave/workspace/Lucene-Solr-Tests-7.x/lucene/top-level-ivy-settings.xml

resolve:

ivy-availability-check:
[loadresource] Do not set property disallowed.ivy.jars.list as its length is 0.

-ivy-fail-disallowed-ivy-version:

ivy-fail:

ivy-configure:
[ivy:configure] :: loading settings :: file = /home/jenkins/jenkins-slave/workspace/Lucene-Solr-Tests-7.x/lucene/top-level-ivy-settings.xml

resolve:

ivy-availability-check:
[loadresource] Do not set property disallowed.ivy.jars.list as its length is 0.

-ivy-fail-disallowed-ivy-version:

ivy-fail:

ivy-configure:
[ivy:configure] :: loading settings :: file = /home/jenkins/jenkins-slave/workspace/Lucene-Solr-Tests-7.x/lucene/top-level-ivy-settings.xml

resolve:

ivy-availability-check:
[loadresource] Do not set property disallowed.ivy.jars.list as its length is 0.

-ivy-fail-disallowed-ivy-version:

ivy-fail:

ivy-configure:
[ivy:configure] :: loading settings :: file = /home/jenkins/jenkins-slave/workspace/Lucene-Solr-Tests-7.x/lucene/top-level-ivy-settings.xml

resolve:

ivy-availability-check:
[loadresource] Do not set property disallowed.ivy.jars.list as its length is 0.

-ivy-fail-disallowed-ivy-version:

ivy-fail:

ivy-configure:
[ivy:configure] :: loading settings :: file = /home/jenkins/jenkins-slave/workspace/Lucene-Solr-Tests-7.x/lucene/top-level-ivy-settings.xml

resolve:

ivy-availability-check:
[loadresource] Do not set property disallowed.ivy.jars.list as its length is 0.

-ivy-fail-disallowed-ivy-version:

ivy-fail:

ivy-configure:
[ivy:configure] :: loading settings :: file = /home/jenkins/jenkins-slave/workspace/Lucene-Solr-Tests-7.x/lucene/top-level-ivy-settings.xml

resolve:

ivy-availability-check:
[loadresource] Do not set property disallowed.ivy.jars.list as its length is 0.

-ivy-fail-disallowed-ivy-version:

ivy-fail:

ivy-configure:
[ivy:configure] :: loading settings :: file = /home/jenkins/jenkins-slave/workspace/Lucene-Solr-Tests-7.x/lucene/top-level-ivy-settings.xml

resolve:

ivy-availability-check:
[loadresource] Do not set property disallowed.ivy.jars.list as its length is 0.

-ivy-fail-disallowed-ivy-version:

ivy-fail:

ivy-configure:
[ivy:configure] :: loading settings :: file = /home/jenkins/jenkins-slave/workspace/Lucene-Solr-Tests-7.x/lucene/top-level-ivy-settings.xml

resolve:

ivy-availability-check:
[loadresource] Do not set property disallowed.ivy.jars.list as its length is 0.

-ivy-fail-disallowed-ivy-version:

ivy-fail:

ivy-configure:
[ivy:configure] :: loading settings :: file = /home/jenkins/jenkins-slave/workspace/Lucene-Solr-Tests-7.x/lucene/top-level-ivy-settings.xml

resolve:

ivy-availability-check:
[loadresource] Do not set property disallowed.ivy.jars.list as its length is 0.

-ivy-fail-disallowed-ivy-version:

ivy-fail:

ivy-configure:
[ivy:configure] :: loading settings :: file = /home/jenkins/jenkins-slave/workspace/Lucene-Solr-Tests-7.x/lucene/top-level-ivy-settings.xml

resolve:

ivy-availability-check:
[loadresource] Do not set property disallowed.ivy.jars.list as its length is 0.

-ivy-fail-disallowed-ivy-version:

ivy-fail:

ivy-configure:
[ivy:configure] :: loading settings :: file = /home/jenkins/jenkins-slave/workspace/Lucene-Solr-Tests-7.x/lucene/top-level-ivy-settings.xml

resolve:

ivy-availability-check:
[loadresource] Do not set property disallowed.ivy.jars.list as its length is 0.

-ivy-fail-disallowed-ivy-version:

ivy-fail:

ivy-configure:
[ivy:configure] :: loading settings :: file = /home/jenkins/jenkins-slave/workspace/Lucene-Solr-Tests-7.x/lucene/top-level-ivy-settings.xml

resolve:

ivy-availability-check:
[loadresource] Do not set property disallowed.ivy.jars.list as its length is 0.

-ivy-fail-disallowed-ivy-version:

ivy-fail:

ivy-configure:
[ivy:configure] :: loading settings :: file = /home/jenkins/jenkins-slave/workspace/Lucene-Solr-Tests-7.x/lucene/top-level-ivy-settings.xml

resolve:

ivy-availability-check:
[loadresource] Do not set property disallowed.ivy.jars.list as its length is 0.

-ivy-fail-disallowed-ivy-version:

ivy-fail:

ivy-configure:
[ivy:configure] :: loading settings :: file = /home/jenkins/jenkins-slave/workspace/Lucene-Solr-Tests-7.x/lucene/top-level-ivy-settings.xml

resolve:

ivy-availability-check:
[loadresource] Do not set property disallowed.ivy.jars.list as its length is 0.

-ivy-fail-disallowed-ivy-version:

ivy-fail:

ivy-configure:
[ivy:configure] :: loading settings :: file = /home/jenkins/jenkins-slave/workspace/Lucene-Solr-Tests-7.x/lucene/top-level-ivy-settings.xml

common.resolve:

resolve:

ivy-availability-check:
[loadresource] Do not set property disallowed.ivy.jars.list as its length is 0.

-ivy-fail-disallowed-ivy-version:

ivy-fail:

ivy-configure:
[ivy:configure] :: loading settings :: file = /home/jenkins/jenkins-slave/workspace/Lucene-Solr-Tests-7.x/lucene/top-level-ivy-settings.xml

resolve:

ivy-availability-check:
[loadresource] Do not set property disallowed.ivy.jars.list as its length is 0.

-ivy-fail-disallowed-ivy-version:

ivy-fail:

ivy-configure:
[ivy:configure] :: loading settings :: file = /home/jenkins/jenkins-slave/workspace/Lucene-Solr-Tests-7.x/lucene/top-level-ivy-settings.xml

resolve:

ivy-availability-check:
[loadresource] Do not set property disallowed.ivy.jars.list as its length is 0.

-ivy-fail-disallowed-ivy-version:

ivy-fail:

ivy-configure:
[ivy:configure] :: loading settings :: file = /home/jenkins/jenkins-slave/workspace/Lucene-Solr-Tests-7.x/lucene/top-level-ivy-settings.xml

resolve:

ivy-availability-check:
[loadresource] Do not set property disallowed.ivy.jars.list as its length is 0.

-ivy-fail-disallowed-ivy-version:

ivy-fail:

ivy-configure:
[ivy:configure] :: loading settings :: file = /home/jenkins/jenkins-slave/workspace/Lucene-Solr-Tests-7.x/lucene/top-level-ivy-settings.xml

resolve:

ivy-availability-check:
[loadresource] Do not set property disallowed.ivy.jars.list as its length is 0.

-ivy-fail-disallowed-ivy-version:

ivy-fail:

ivy-configure:
[ivy:configure] :: loading settings :: file = /home/jenkins/jenkins-slave/workspace/Lucene-Solr-Tests-7.x/lucene/top-level-ivy-settings.xml

resolve:

jar-checksums:
    [mkdir] Created dir: /home/jenkins/jenkins-slave/workspace/Lucene-Solr-Tests-7.x/lucene/null1414438790
     [copy] Copying 35 files to /home/jenkins/jenkins-slave/workspace/Lucene-Solr-Tests-7.x/lucene/null1414438790
   [delete] Deleting directory /home/jenkins/jenkins-slave/workspace/Lucene-Solr-Tests-7.x/lucene/null1414438790

resolve-example:

ivy-availability-check:
[loadresource] Do not set property disallowed.ivy.jars.list as its length is 0.

-ivy-fail-disallowed-ivy-version:

ivy-fail:

ivy-configure:
[ivy:configure] :: loading settings :: file = /home/jenkins/jenkins-slave/workspace/Lucene-Solr-Tests-7.x/lucene/top-level-ivy-settings.xml

resolve:

resolve-server:

ivy-availability-check:
[loadresource] Do not set property disallowed.ivy.jars.list as its length is 0.

-ivy-fail-disallowed-ivy-version:

ivy-fail:

ivy-fail:

ivy-configure:
[ivy:configure] :: loading settings :: file = /home/jenkins/jenkins-slave/workspace/Lucene-Solr-Tests-7.x/lucene/top-level-ivy-settings.xml

resolve:

resolve:

ivy-availability-check:
[loadresource] Do not set property disallowed.ivy.jars.list as its length is 0.

-ivy-fail-disallowed-ivy-version:

ivy-fail:

ivy-fail:

ivy-configure:
[ivy:configure] :: loading settings :: file = /home/jenkins/jenkins-slave/workspace/Lucene-Solr-Tests-7.x/lucene/top-level-ivy-settings.xml

resolve:

ivy-availability-check:
[loadresource] Do not set property disallowed.ivy.jars.list as its length is 0.

-ivy-fail-disallowed-ivy-version:

ivy-fail:

ivy-fail:

ivy-configure:
[ivy:configure] :: loading settings :: file = /home/jenkins/jenkins-slave/workspace/Lucene-Solr-Tests-7.x/lucene/top-level-ivy-settings.xml

resolve:

ivy-availability-check:
[loadresource] Do not set property disallowed.ivy.jars.list as its length is 0.

-ivy-fail-disallowed-ivy-version:

ivy-fail:

ivy-configure:
[ivy:configure] :: loading settings :: file = /home/jenkins/jenkins-slave/workspace/Lucene-Solr-Tests-7.x/lucene/top-level-ivy-settings.xml

resolve:

ivy-availability-check:
[loadresource] Do not set property disallowed.ivy.jars.list as its length is 0.

-ivy-fail-disallowed-ivy-version:

ivy-fail:

ivy-fail:

ivy-configure:
[ivy:configure] :: loading settings :: file = /home/jenkins/jenkins-slave/workspace/Lucene-Solr-Tests-7.x/lucene/top-level-ivy-settings.xml

resolve:

ivy-availability-check:
[loadresource] Do not set property disallowed.ivy.jars.list as its length is 0.

-ivy-fail-disallowed-ivy-version:

ivy-fail:

ivy-configure:
[ivy:configure] :: loading settings :: file = /home/jenkins/jenkins-slave/workspace/Lucene-Solr-Tests-7.x/lucene/top-level-ivy-settings.xml

resolve:

ivy-availability-check:
[loadresource] Do not set property disallowed.ivy.jars.list as its length is 0.

-ivy-fail-disallowed-ivy-version:

ivy-fail:

ivy-fail:

ivy-configure:
[ivy:configure] :: loading settings :: file = /home/jenkins/jenkins-slave/workspace/Lucene-Solr-Tests-7.x/lucene/top-level-ivy-settings.xml

resolve:

ivy-availability-check:
[loadresource] Do not set property disallowed.ivy.jars.list as its length is 0.

-ivy-fail-disallowed-ivy-version:

ivy-fail:

ivy-fail:

ivy-configure:
[ivy:configure] :: loading settings :: file = /home/jenkins/jenkins-slave/workspace/Lucene-Solr-Tests-7.x/lucene/top-level-ivy-settings.xml

resolve:

ivy-availability-check:
[loadresource] Do not set property disallowed.ivy.jars.list as its length is 0.

-ivy-fail-disallowed-ivy-version:

ivy-fail:

ivy-fail:

ivy-configure:
[ivy:configure] :: loading settings :: file = /home/jenkins/jenkins-slave/workspace/Lucene-Solr-Tests-7.x/lucene/top-level-ivy-settings.xml

resolve:

ivy-availability-check:
[loadresource] Do not set property disallowed.ivy.jars.list as its length is 0.

-ivy-fail-disallowed-ivy-version:

ivy-fail:

ivy-fail:

ivy-configure:
[ivy:configure] :: loading settings :: file = /home/jenkins/jenkins-slave/workspace/Lucene-Solr-Tests-7.x/lucene/top-level-ivy-settings.xml

resolve:

ivy-availability-check:
[loadresource] Do not set property disallowed.ivy.jars.list as its length is 0.

-ivy-fail-disallowed-ivy-version:

ivy-fail:

ivy-fail:

ivy-configure:
[ivy:configure] :: loading settings :: file = /home/jenkins/jenkins-slave/workspace/Lucene-Solr-Tests-7.x/lucene/top-level-ivy-settings.xml

resolve:

ivy-availability-check:
[loadresource] Do not set property disallowed.ivy.jars.list as its length is 0.

-ivy-fail-disallowed-ivy-version:

ivy-fail:

ivy-fail:

ivy-configure:
[ivy:configure] :: loading settings :: file = /home/jenkins/jenkins-slave/workspace/Lucene-Solr-Tests-7.x/lucene/top-level-ivy-settings.xml

resolve:

ivy-availability-check:
[loadresource] Do not set property disallowed.ivy.jars.list as its length is 0.

-ivy-fail-disallowed-ivy-version:

ivy-fail:

ivy-fail:

ivy-configure:
[ivy:configure] :: loading settings :: file = /home/jenkins/jenkins-slave/workspace/Lucene-Solr-Tests-7.x/lucene/top-level-ivy-settings.xml

resolve:

ivy-availability-check:
[loadresource] Do not set property disallowed.ivy.jars.list as its length is 0.

-ivy-fail-disallowed-ivy-version:

ivy-fail:

ivy-fail:

ivy-configure:
[ivy:configure] :: loading settings :: file = /home/jenkins/jenkins-slave/workspace/Lucene-Solr-Tests-7.x/lucene/top-level-ivy-settings.xml

resolve:

ivy-availability-check:
[loadresource] Do not set property disallowed.ivy.jars.list as its length is 0.

-ivy-fail-disallowed-ivy-version:

ivy-fail:

ivy-fail:

ivy-configure:
[ivy:configure] :: loading settings :: file = /home/jenkins/jenkins-slave/workspace/Lucene-Solr-Tests-7.x/lucene/top-level-ivy-settings.xml

resolve:

ivy-availability-check:
[loadresource] Do not set property disallowed.ivy.jars.list as its length is 0.

-ivy-fail-disallowed-ivy-version:

ivy-fail:

ivy-fail:

ivy-configure:
[ivy:configure] :: loading settings :: file = /home/jenkins/jenkins-slave/workspace/Lucene-Solr-Tests-7.x/lucene/top-level-ivy-settings.xml

resolve:

jar-checksums:
    [mkdir] Created dir: /home/jenkins/jenkins-slave/workspace/Lucene-Solr-Tests-7.x/solr/null1378599395
     [copy] Copying 239 files to /home/jenkins/jenkins-slave/workspace/Lucene-Solr-Tests-7.x/solr/null1378599395
   [delete] Deleting directory /home/jenkins/jenkins-slave/workspace/Lucene-Solr-Tests-7.x/solr/null1378599395

check-working-copy:
[ivy:cachepath] :: resolving dependencies :: org.eclipse.jgit#org.eclipse.jgit-caller;working
[ivy:cachepath] 	confs: [default]
[ivy:cachepath] 	found org.eclipse.jgit#org.eclipse.jgit;4.6.0.201612231935-r in public
[ivy:cachepath] 	found com.jcraft#jsch;0.1.53 in public
[ivy:cachepath] 	found com.googlecode.javaewah#JavaEWAH;1.1.6 in public
[ivy:cachepath] 	found org.apache.httpcomponents#httpclient;4.3.6 in public
[ivy:cachepath] 	found org.apache.httpcomponents#httpcore;4.3.3 in public
[ivy:cachepath] 	found commons-logging#commons-logging;1.1.3 in public
[ivy:cachepath] 	found commons-codec#commons-codec;1.6 in public
[ivy:cachepath] 	found org.slf4j#slf4j-api;1.7.2 in public
[ivy:cachepath] :: resolution report :: resolve 76ms :: artifacts dl 5ms
	---------------------------------------------------------------------
	|                  |            modules            ||   artifacts   |
	|       conf       | number| search|dwnlded|evicted|| number|dwnlded|
	---------------------------------------------------------------------
	|      default     |   8   |   0   |   0   |   0   ||   8   |   0   |
	---------------------------------------------------------------------
[wc-checker] Initializing working copy...
[wc-checker] SLF4J: Failed to load class "org.slf4j.impl.StaticLoggerBinder".
[wc-checker] SLF4J: Defaulting to no-operation (NOP) logger implementation
[wc-checker] SLF4J: See http://www.slf4j.org/codes.html#StaticLoggerBinder for further details.
[wc-checker] Checking working copy status...

-jenkins-base:

BUILD SUCCESSFUL
Total time: 207 minutes 12 seconds
Archiving artifacts
java.lang.InterruptedException: no matches found within 10000
	at hudson.FilePath$34.hasMatch(FilePath.java:2678)
	at hudson.FilePath$34.invoke(FilePath.java:2557)
	at hudson.FilePath$34.invoke(FilePath.java:2547)
	at hudson.FilePath$FileCallableWrapper.call(FilePath.java:2918)
Also:   hudson.remoting.Channel$CallSiteStackTrace: Remote call to lucene2
		at hudson.remoting.Channel.attachCallSiteStackTrace(Channel.java:1741)
		at hudson.remoting.UserRequest$ExceptionResponse.retrieve(UserRequest.java:357)
		at hudson.remoting.Channel.call(Channel.java:955)
		at hudson.FilePath.act(FilePath.java:1036)
		at hudson.FilePath.act(FilePath.java:1025)
		at hudson.FilePath.validateAntFileMask(FilePath.java:2547)
		at hudson.tasks.ArtifactArchiver.perform(ArtifactArchiver.java:243)
		at hudson.tasks.BuildStepCompatibilityLayer.perform(BuildStepCompatibilityLayer.java:81)
		at hudson.tasks.BuildStepMonitor$1.perform(BuildStepMonitor.java:20)
		at hudson.model.AbstractBuild$AbstractBuildExecution.perform(AbstractBuild.java:744)
		at hudson.model.AbstractBuild$AbstractBuildExecution.performAllBuildSteps(AbstractBuild.java:690)
		at hudson.model.Build$BuildExecution.post2(Build.java:186)
		at hudson.model.AbstractBuild$AbstractBuildExecution.post(AbstractBuild.java:635)
		at hudson.model.Run.execute(Run.java:1819)
		at hudson.model.FreeStyleBuild.run(FreeStyleBuild.java:43)
		at hudson.model.ResourceController.execute(ResourceController.java:97)
		at hudson.model.Executor.run(Executor.java:429)
Caused: hudson.FilePath$TunneledInterruptedException
	at hudson.FilePath$FileCallableWrapper.call(FilePath.java:2920)
	at hudson.remoting.UserRequest.perform(UserRequest.java:212)
	at hudson.remoting.UserRequest.perform(UserRequest.java:54)
	at hudson.remoting.Request$2.run(Request.java:369)
	at hudson.remoting.InterceptingExecutorService$1.call(InterceptingExecutorService.java:72)
	at java.util.concurrent.FutureTask.run(FutureTask.java:266)
	at java.util.concurrent.ThreadPoolExecutor.runWorker(ThreadPoolExecutor.java:1142)
	at java.util.concurrent.ThreadPoolExecutor$Worker.run(ThreadPoolExecutor.java:617)
	at java.lang.Thread.run(Thread.java:748)
Caused: java.lang.InterruptedException: java.lang.InterruptedException: no matches found within 10000
	at hudson.FilePath.act(FilePath.java:1038)
	at hudson.FilePath.act(FilePath.java:1025)
	at hudson.FilePath.validateAntFileMask(FilePath.java:2547)
	at hudson.tasks.ArtifactArchiver.perform(ArtifactArchiver.java:243)
	at hudson.tasks.BuildStepCompatibilityLayer.perform(BuildStepCompatibilityLayer.java:81)
	at hudson.tasks.BuildStepMonitor$1.perform(BuildStepMonitor.java:20)
	at hudson.model.AbstractBuild$AbstractBuildExecution.perform(AbstractBuild.java:744)
	at hudson.model.AbstractBuild$AbstractBuildExecution.performAllBuildSteps(AbstractBuild.java:690)
	at hudson.model.Build$BuildExecution.post2(Build.java:186)
	at hudson.model.AbstractBuild$AbstractBuildExecution.post(AbstractBuild.java:635)
	at hudson.model.Run.execute(Run.java:1819)
	at hudson.model.FreeStyleBuild.run(FreeStyleBuild.java:43)
	at hudson.model.ResourceController.execute(ResourceController.java:97)
	at hudson.model.Executor.run(Executor.java:429)
No artifacts found that match the file pattern "**/*.events,heapdumps/**,**/hs_err_pid*". Configuration error?
Recording test results
Build step 'Publish JUnit test result report' changed build result to UNSTABLE
Email was triggered for: Unstable (Test Failures)
Sending email for trigger: Unstable (Test Failures)

Mime
View raw message