lucene-dev mailing list archives

Site index · List index
Message view « Date » · « Thread »
Top « Date » · « Thread »
From Apache Jenkins Server <jenk...@builds.apache.org>
Subject [JENKINS] Lucene-Solr-BadApples-Tests-7.x - Build # 159 - Still Unstable
Date Sat, 15 Sep 2018 02:01:19 GMT
Build: https://builds.apache.org/job/Lucene-Solr-BadApples-Tests-7.x/159/

2 tests failed.
FAILED:  org.apache.solr.cloud.autoscaling.sim.TestSimGenericDistributedQueue.testDistributedQueue

Error Message:
Test abandoned because suite timeout was reached.

Stack Trace:
java.lang.Exception: Test abandoned because suite timeout was reached.
	at __randomizedtesting.SeedInfo.seed([3221045EA9A92D1B]:0)


FAILED:  junit.framework.TestSuite.org.apache.solr.cloud.autoscaling.sim.TestSimGenericDistributedQueue

Error Message:
Suite timeout exceeded (>= 7200000 msec).

Stack Trace:
java.lang.Exception: Suite timeout exceeded (>= 7200000 msec).
	at __randomizedtesting.SeedInfo.seed([3221045EA9A92D1B]:0)




Build Log:
[...truncated 14878 lines...]
   [junit4] Suite: org.apache.solr.cloud.autoscaling.sim.TestSimGenericDistributedQueue
   [junit4]   2> 370953 INFO  (SUITE-TestSimGenericDistributedQueue-seed#[3221045EA9A92D1B]-worker)
[    ] o.a.s.SolrTestCaseJ4 SecureRandom sanity checks: test.solr.allowed.securerandom=null
& java.security.egd=file:/dev/./urandom
   [junit4]   2> Creating dataDir: /x1/jenkins/jenkins-slave/workspace/Lucene-Solr-BadApples-Tests-7.x/solr/build/solr-core/test/J0/temp/solr.cloud.autoscaling.sim.TestSimGenericDistributedQueue_3221045EA9A92D1B-001/init-core-data-001
   [junit4]   2> 370953 WARN  (SUITE-TestSimGenericDistributedQueue-seed#[3221045EA9A92D1B]-worker)
[    ] o.a.s.SolrTestCaseJ4 startTrackingSearchers: numOpens=16 numCloses=16
   [junit4]   2> 370953 INFO  (SUITE-TestSimGenericDistributedQueue-seed#[3221045EA9A92D1B]-worker)
[    ] o.a.s.SolrTestCaseJ4 Using TrieFields (NUMERIC_POINTS_SYSPROP=false) w/NUMERIC_DOCVALUES_SYSPROP=true
   [junit4]   2> 370955 INFO  (SUITE-TestSimGenericDistributedQueue-seed#[3221045EA9A92D1B]-worker)
[    ] o.a.s.SolrTestCaseJ4 Randomized ssl (false) and clientAuth (true) via: @org.apache.solr.util.RandomizeSSL(reason=,
ssl=NaN, value=NaN, clientAuth=NaN)
   [junit4]   2> 370961 INFO  (TEST-TestSimGenericDistributedQueue.testDistributedQueue-seed#[3221045EA9A92D1B])
[    ] o.a.s.SolrTestCaseJ4 ###Starting testDistributedQueue
   [junit4]   2> ??? 14, 2018 7:26:05 ? com.carrotsearch.randomizedtesting.ThreadLeakControl$2
evaluate
   [junit4]   2> WARNING: Suite execution timed out: org.apache.solr.cloud.autoscaling.sim.TestSimGenericDistributedQueue
   [junit4]   2> ==== jstack at approximately timeout time ====
   [junit4]   2> "TEST-TestSimGenericDistributedQueue.testDistributedQueue-seed#[3221045EA9A92D1B]"
ID=4243 TIMED_WAITING on java.util.concurrent.locks.AbstractQueuedSynchronizer$ConditionObject@3fef2d5d
   [junit4]   2> 	at sun.misc.Unsafe.park(Native Method)
   [junit4]   2> 	- timed waiting on java.util.concurrent.locks.AbstractQueuedSynchronizer$ConditionObject@3fef2d5d
   [junit4]   2> 	at java.util.concurrent.locks.LockSupport.parkNanos(LockSupport.java:215)
   [junit4]   2> 	at java.util.concurrent.locks.AbstractQueuedSynchronizer$ConditionObject.awaitNanos(AbstractQueuedSynchronizer.java:2078)
   [junit4]   2> 	at org.apache.solr.cloud.autoscaling.sim.GenericDistributedQueue.peek(GenericDistributedQueue.java:194)
   [junit4]   2> 	at org.apache.solr.cloud.autoscaling.sim.GenericDistributedQueue.peek(GenericDistributedQueue.java:167)
   [junit4]   2> 	at org.apache.solr.cloud.autoscaling.sim.TestSimDistributedQueue.testDistributedQueue(TestSimDistributedQueue.java:74)
   [junit4]   2> 	at org.apache.solr.cloud.autoscaling.sim.TestSimGenericDistributedQueue.testDistributedQueue(TestSimGenericDistributedQueue.java:36)
   [junit4]   2> 	at sun.reflect.NativeMethodAccessorImpl.invoke0(Native Method)
   [junit4]   2> 	at sun.reflect.NativeMethodAccessorImpl.invoke(NativeMethodAccessorImpl.java:62)
   [junit4]   2> 	at sun.reflect.DelegatingMethodAccessorImpl.invoke(DelegatingMethodAccessorImpl.java:43)
   [junit4]   2> 	at java.lang.reflect.Method.invoke(Method.java:498)
   [junit4]   2> 	at com.carrotsearch.randomizedtesting.RandomizedRunner.invoke(RandomizedRunner.java:1742)
   [junit4]   2> 	at com.carrotsearch.randomizedtesting.RandomizedRunner$8.evaluate(RandomizedRunner.java:935)
   [junit4]   2> 	at com.carrotsearch.randomizedtesting.RandomizedRunner$9.evaluate(RandomizedRunner.java:971)
   [junit4]   2> 	at com.carrotsearch.randomizedtesting.RandomizedRunner$10.evaluate(RandomizedRunner.java:985)
   [junit4]   2> 	at com.carrotsearch.randomizedtesting.rules.SystemPropertiesRestoreRule$1.evaluate(SystemPropertiesRestoreRule.java:57)
   [junit4]   2> 	at org.apache.lucene.util.TestRuleSetupTeardownChained$1.evaluate(TestRuleSetupTeardownChained.java:49)
   [junit4]   2> 	at org.apache.lucene.util.AbstractBeforeAfterRule$1.evaluate(AbstractBeforeAfterRule.java:45)
   [junit4]   2> 	at org.apache.lucene.util.TestRuleThreadAndTestName$1.evaluate(TestRuleThreadAndTestName.java:48)
   [junit4]   2> 	at org.apache.lucene.util.TestRuleIgnoreAfterMaxFailures$1.evaluate(TestRuleIgnoreAfterMaxFailures.java:64)
   [junit4]   2> 	at org.apache.lucene.util.TestRuleMarkFailure$1.evaluate(TestRuleMarkFailure.java:47)
   [junit4]   2> 	at com.carrotsearch.randomizedtesting.rules.StatementAdapter.evaluate(StatementAdapter.java:36)
   [junit4]   2> 	at com.carrotsearch.randomizedtesting.ThreadLeakControl$StatementRunner.run(ThreadLeakControl.java:368)
   [junit4]   2> 	at com.carrotsearch.randomizedtesting.ThreadLeakControl.forkTimeoutingTask(ThreadLeakControl.java:817)
   [junit4]   2> 	at com.carrotsearch.randomizedtesting.ThreadLeakControl$3.evaluate(ThreadLeakControl.java:468)
   [junit4]   2> 	at com.carrotsearch.randomizedtesting.RandomizedRunner.runSingleTest(RandomizedRunner.java:944)
   [junit4]   2> 	at com.carrotsearch.randomizedtesting.RandomizedRunner$5.evaluate(RandomizedRunner.java:830)
   [junit4]   2> 	at com.carrotsearch.randomizedtesting.RandomizedRunner$6.evaluate(RandomizedRunner.java:880)
   [junit4]   2> 	at com.carrotsearch.randomizedtesting.RandomizedRunner$7.evaluate(RandomizedRunner.java:891)
   [junit4]   2> 	at com.carrotsearch.randomizedtesting.rules.StatementAdapter.evaluate(StatementAdapter.java:36)
   [junit4]   2> 	at com.carrotsearch.randomizedtesting.rules.SystemPropertiesRestoreRule$1.evaluate(SystemPropertiesRestoreRule.java:57)
   [junit4]   2> 	at org.apache.lucene.util.AbstractBeforeAfterRule$1.evaluate(AbstractBeforeAfterRule.java:45)
   [junit4]   2> 	at com.carrotsearch.randomizedtesting.rules.StatementAdapter.evaluate(StatementAdapter.java:36)
   [junit4]   2> 	at org.apache.lucene.util.TestRuleStoreClassName$1.evaluate(TestRuleStoreClassName.java:41)
   [junit4]   2> 	at com.carrotsearch.randomizedtesting.rules.NoShadowingOrOverridesOnMethodsRule$1.evaluate(NoShadowingOrOverridesOnMethodsRule.java:40)
   [junit4]   2> 	at com.carrotsearch.randomizedtesting.rules.NoShadowingOrOverridesOnMethodsRule$1.evaluate(NoShadowingOrOverridesOnMethodsRule.java:40)
   [junit4]   2> 	at com.carrotsearch.randomizedtesting.rules.StatementAdapter.evaluate(StatementAdapter.java:36)
   [junit4]   2> 	at com.carrotsearch.randomizedtesting.rules.StatementAdapter.evaluate(StatementAdapter.java:36)
   [junit4]   2> 	at com.carrotsearch.randomizedtesting.rules.StatementAdapter.evaluate(StatementAdapter.java:36)
   [junit4]   2> 	at org.apache.lucene.util.TestRuleAssertionsRequired$1.evaluate(TestRuleAssertionsRequired.java:53)
   [junit4]   2> 	at org.apache.lucene.util.TestRuleMarkFailure$1.evaluate(TestRuleMarkFailure.java:47)
   [junit4]   2> 	at org.apache.lucene.util.TestRuleIgnoreAfterMaxFailures$1.evaluate(TestRuleIgnoreAfterMaxFailures.java:64)
   [junit4]   2> 	at org.apache.lucene.util.TestRuleIgnoreTestSuites$1.evaluate(TestRuleIgnoreTestSuites.java:54)
   [junit4]   2> 	at com.carrotsearch.randomizedtesting.rules.StatementAdapter.evaluate(StatementAdapter.java:36)
   [junit4]   2> 	at com.carrotsearch.randomizedtesting.ThreadLeakControl$StatementRunner.run(ThreadLeakControl.java:368)
   [junit4]   2> 	at java.lang.Thread.run(Thread.java:748)
   [junit4]   2> 
   [junit4]   2> "SUITE-TestSimGenericDistributedQueue-seed#[3221045EA9A92D1B]" ID=4242
RUNNABLE
   [junit4]   2> 	at sun.management.ThreadImpl.dumpThreads0(Native Method)
   [junit4]   2> 	at sun.management.ThreadImpl.dumpAllThreads(ThreadImpl.java:454)
   [junit4]   2> 	at com.carrotsearch.randomizedtesting.ThreadLeakControl.formatThreadStacksFull(ThreadLeakControl.java:681)
   [junit4]   2> 	at com.carrotsearch.randomizedtesting.ThreadLeakControl.access$1000(ThreadLeakControl.java:65)
   [junit4]   2> 	at com.carrotsearch.randomizedtesting.ThreadLeakControl$2.evaluate(ThreadLeakControl.java:415)
   [junit4]   2> 	- locked java.lang.Object@55aa6f1b
   [junit4]   2> 	at com.carrotsearch.randomizedtesting.RandomizedRunner.runSuite(RandomizedRunner.java:706)
   [junit4]   2> 	at com.carrotsearch.randomizedtesting.RandomizedRunner.access$200(RandomizedRunner.java:140)
   [junit4]   2> 	at com.carrotsearch.randomizedtesting.RandomizedRunner$2.run(RandomizedRunner.java:627)
   [junit4]   2> 
   [junit4]   2> "org.apache.hadoop.hdfs.PeerCache@8c91107" ID=1467 TIMED_WAITING
   [junit4]   2> 	at java.lang.Thread.sleep(Native Method)
   [junit4]   2> 	at org.apache.hadoop.hdfs.PeerCache.run(PeerCache.java:255)
   [junit4]   2> 	at org.apache.hadoop.hdfs.PeerCache.access$000(PeerCache.java:46)
   [junit4]   2> 	at org.apache.hadoop.hdfs.PeerCache$1.run(PeerCache.java:124)
   [junit4]   2> 	at java.lang.Thread.run(Thread.java:748)
   [junit4]   2> 
   [junit4]   2> "org.apache.hadoop.fs.FileSystem$Statistics$StatisticsDataReferenceCleaner"
ID=1290 WAITING on java.lang.ref.ReferenceQueue$Lock@743bff84
   [junit4]   2> 	at java.lang.Object.wait(Native Method)
   [junit4]   2> 	- waiting on java.lang.ref.ReferenceQueue$Lock@743bff84
   [junit4]   2> 	at java.lang.ref.ReferenceQueue.remove(ReferenceQueue.java:144)
   [junit4]   2> 	at java.lang.ref.ReferenceQueue.remove(ReferenceQueue.java:165)
   [junit4]   2> 	at org.apache.hadoop.fs.FileSystem$Statistics$StatisticsDataReferenceCleaner.run(FileSystem.java:3063)
   [junit4]   2> 	at java.lang.Thread.run(Thread.java:748)
   [junit4]   2> 
   [junit4]   2> "JUnit4-serializer-daemon" ID=9 TIMED_WAITING
   [junit4]   2> 	at java.lang.Thread.sleep(Native Method)
   [junit4]   2> 	at com.carrotsearch.ant.tasks.junit4.events.Serializer$1.run(Serializer.java:50)
   [junit4]   2> 
   [junit4]   2> "Signal Dispatcher" ID=4 RUNNABLE
   [junit4]   2> 
   [junit4]   2> "Finalizer" ID=3 WAITING on java.lang.ref.ReferenceQueue$Lock@15f9c9d2
   [junit4]   2> 	at java.lang.Object.wait(Native Method)
   [junit4]   2> 	- waiting on java.lang.ref.ReferenceQueue$Lock@15f9c9d2
   [junit4]   2> 	at java.lang.ref.ReferenceQueue.remove(ReferenceQueue.java:144)
   [junit4]   2> 	at java.lang.ref.ReferenceQueue.remove(ReferenceQueue.java:165)
   [junit4]   2> 	at java.lang.ref.Finalizer$FinalizerThread.run(Finalizer.java:216)
   [junit4]   2> 
   [junit4]   2> "Reference Handler" ID=2 WAITING on java.lang.ref.Reference$Lock@295cc191
   [junit4]   2> 	at java.lang.Object.wait(Native Method)
   [junit4]   2> 	- waiting on java.lang.ref.Reference$Lock@295cc191
   [junit4]   2> 	at java.lang.Object.wait(Object.java:502)
   [junit4]   2> 	at java.lang.ref.Reference.tryHandlePending(Reference.java:191)
   [junit4]   2> 	at java.lang.ref.Reference$ReferenceHandler.run(Reference.java:153)
   [junit4]   2> 
   [junit4]   2> "main" ID=1 WAITING on com.carrotsearch.randomizedtesting.RandomizedRunner$2@2539e2d1
   [junit4]   2> 	at java.lang.Object.wait(Native Method)
   [junit4]   2> 	- waiting on com.carrotsearch.randomizedtesting.RandomizedRunner$2@2539e2d1
   [junit4]   2> 	at java.lang.Thread.join(Thread.java:1252)
   [junit4]   2> 	at java.lang.Thread.join(Thread.java:1326)
   [junit4]   2> 	at com.carrotsearch.randomizedtesting.RandomizedRunner.runSuite(RandomizedRunner.java:637)
   [junit4]   2> 	at com.carrotsearch.randomizedtesting.RandomizedRunner.run(RandomizedRunner.java:494)
   [junit4]   2> 	at com.carrotsearch.ant.tasks.junit4.slave.SlaveMain.execute(SlaveMain.java:269)
   [junit4]   2> 	at com.carrotsearch.ant.tasks.junit4.slave.SlaveMain.main(SlaveMain.java:394)
   [junit4]   2> 	at com.carrotsearch.ant.tasks.junit4.slave.SlaveMainSafe.main(SlaveMainSafe.java:13)
   [junit4]   2> 
   [junit4]   2> ^^==============================================
   [junit4]   2> 
   [junit4]   2> NOTE: reproduce with: ant test  -Dtestcase=TestSimGenericDistributedQueue
-Dtests.method=testDistributedQueue -Dtests.seed=3221045EA9A92D1B -Dtests.multiplier=2 -Dtests.slow=true
-Dtests.badapples=true -Dtests.locale=ar-QA -Dtests.timezone=Canada/Saskatchewan -Dtests.asserts=true
-Dtests.file.encoding=US-ASCII
   [junit4] ERROR   7200s J0 | TestSimGenericDistributedQueue.testDistributedQueue <<<
   [junit4]    > Throwable #1: java.lang.Exception: Test abandoned because suite timeout
was reached.
   [junit4]    > 	at __randomizedtesting.SeedInfo.seed([3221045EA9A92D1B]:0)
   [junit4]   2> ??? 14, 2018 7:26:05 ? com.carrotsearch.randomizedtesting.ThreadLeakControl
checkThreadLeaks
   [junit4]   2> WARNING: Will linger awaiting termination of 1 leaked thread(s).
   [junit4]   2> ??? 14, 2018 7:27:25 ? com.carrotsearch.randomizedtesting.ThreadLeakControl
checkThreadLeaks
   [junit4]   2> SEVERE: 1 thread leaked from SUITE scope at org.apache.solr.cloud.autoscaling.sim.TestSimGenericDistributedQueue:

   [junit4]   2>    1) Thread[id=4243, name=TEST-TestSimGenericDistributedQueue.testDistributedQueue-seed#[3221045EA9A92D1B],
state=TIMED_WAITING, group=TGRP-TestSimGenericDistributedQueue]
   [junit4]   2>         at sun.misc.Unsafe.park(Native Method)
   [junit4]   2>         at java.util.concurrent.locks.LockSupport.parkNanos(LockSupport.java:215)
   [junit4]   2>         at java.util.concurrent.locks.AbstractQueuedSynchronizer$ConditionObject.awaitNanos(AbstractQueuedSynchronizer.java:2078)
   [junit4]   2>         at org.apache.solr.cloud.autoscaling.sim.GenericDistributedQueue.peek(GenericDistributedQueue.java:194)
   [junit4]   2>         at org.apache.solr.cloud.autoscaling.sim.GenericDistributedQueue.peek(GenericDistributedQueue.java:167)
   [junit4]   2>         at org.apache.solr.cloud.autoscaling.sim.TestSimDistributedQueue.testDistributedQueue(TestSimDistributedQueue.java:74)
   [junit4]   2>         at org.apache.solr.cloud.autoscaling.sim.TestSimGenericDistributedQueue.testDistributedQueue(TestSimGenericDistributedQueue.java:36)
   [junit4]   2>         at sun.reflect.NativeMethodAccessorImpl.invoke0(Native Method)
   [junit4]   2>         at sun.reflect.NativeMethodAccessorImpl.invoke(NativeMethodAccessorImpl.java:62)
   [junit4]   2>         at sun.reflect.DelegatingMethodAccessorImpl.invoke(DelegatingMethodAccessorImpl.java:43)
   [junit4]   2>         at java.lang.reflect.Method.invoke(Method.java:498)
   [junit4]   2>         at com.carrotsearch.randomizedtesting.RandomizedRunner.invoke(RandomizedRunner.java:1742)
   [junit4]   2>         at com.carrotsearch.randomizedtesting.RandomizedRunner$8.evaluate(RandomizedRunner.java:935)
   [junit4]   2>         at com.carrotsearch.randomizedtesting.RandomizedRunner$9.evaluate(RandomizedRunner.java:971)
   [junit4]   2>         at com.carrotsearch.randomizedtesting.RandomizedRunner$10.evaluate(RandomizedRunner.java:985)
   [junit4]   2>         at com.carrotsearch.randomizedtesting.rules.SystemPropertiesRestoreRule$1.evaluate(SystemPropertiesRestoreRule.java:57)
   [junit4]   2>         at org.apache.lucene.util.TestRuleSetupTeardownChained$1.evaluate(TestRuleSetupTeardownChained.java:49)
   [junit4]   2>         at org.apache.lucene.util.AbstractBeforeAfterRule$1.evaluate(AbstractBeforeAfterRule.java:45)
   [junit4]   2>         at org.apache.lucene.util.TestRuleThreadAndTestName$1.evaluate(TestRuleThreadAndTestName.java:48)
   [junit4]   2>         at org.apache.lucene.util.TestRuleIgnoreAfterMaxFailures$1.evaluate(TestRuleIgnoreAfterMaxFailures.java:64)
   [junit4]   2>         at org.apache.lucene.util.TestRuleMarkFailure$1.evaluate(TestRuleMarkFailure.java:47)
   [junit4]   2>         at com.carrotsearch.randomizedtesting.rules.StatementAdapter.evaluate(StatementAdapter.java:36)
   [junit4]   2>         at com.carrotsearch.randomizedtesting.ThreadLeakControl$StatementRunner.run(ThreadLeakControl.java:368)
   [junit4]   2>         at com.carrotsearch.randomizedtesting.ThreadLeakControl.forkTimeoutingTask(ThreadLeakControl.java:817)
   [junit4]   2>         at com.carrotsearch.randomizedtesting.ThreadLeakControl$3.evaluate(ThreadLeakControl.java:468)
   [junit4]   2>         at com.carrotsearch.randomizedtesting.RandomizedRunner.runSingleTest(RandomizedRunner.java:944)
   [junit4]   2>         at com.carrotsearch.randomizedtesting.RandomizedRunner$5.evaluate(RandomizedRunner.java:830)
   [junit4]   2>         at com.carrotsearch.randomizedtesting.RandomizedRunner$6.evaluate(RandomizedRunner.java:880)
   [junit4]   2>         at com.carrotsearch.randomizedtesting.RandomizedRunner$7.evaluate(RandomizedRunner.java:891)
   [junit4]   2>         at com.carrotsearch.randomizedtesting.rules.StatementAdapter.evaluate(StatementAdapter.java:36)
   [junit4]   2>         at com.carrotsearch.randomizedtesting.rules.SystemPropertiesRestoreRule$1.evaluate(SystemPropertiesRestoreRule.java:57)
   [junit4]   2>         at org.apache.lucene.util.AbstractBeforeAfterRule$1.evaluate(AbstractBeforeAfterRule.java:45)
   [junit4]   2>         at com.carrotsearch.randomizedtesting.rules.StatementAdapter.evaluate(StatementAdapter.java:36)
   [junit4]   2>         at org.apache.lucene.util.TestRuleStoreClassName$1.evaluate(TestRuleStoreClassName.java:41)
   [junit4]   2>         at com.carrotsearch.randomizedtesting.rules.NoShadowingOrOverridesOnMethodsRule$1.evaluate(NoShadowingOrOverridesOnMethodsRule.java:40)
   [junit4]   2>         at com.carrotsearch.randomizedtesting.rules.NoShadowingOrOverridesOnMethodsRule$1.evaluate(NoShadowingOrOverridesOnMethodsRule.java:40)
   [junit4]   2>         at com.carrotsearch.randomizedtesting.rules.StatementAdapter.evaluate(StatementAdapter.java:36)
   [junit4]   2>         at com.carrotsearch.randomizedtesting.rules.StatementAdapter.evaluate(StatementAdapter.java:36)
   [junit4]   2>         at com.carrotsearch.randomizedtesting.rules.StatementAdapter.evaluate(StatementAdapter.java:36)
   [junit4]   2>         at org.apache.lucene.util.TestRuleAssertionsRequired$1.evaluate(TestRuleAssertionsRequired.java:53)
   [junit4]   2>         at org.apache.lucene.util.TestRuleMarkFailure$1.evaluate(TestRuleMarkFailure.java:47)
   [junit4]   2>         at org.apache.lucene.util.TestRuleIgnoreAfterMaxFailures$1.evaluate(TestRuleIgnoreAfterMaxFailures.java:64)
   [junit4]   2>         at org.apache.lucene.util.TestRuleIgnoreTestSuites$1.evaluate(TestRuleIgnoreTestSuites.java:54)
   [junit4]   2>         at com.carrotsearch.randomizedtesting.rules.StatementAdapter.evaluate(StatementAdapter.java:36)
   [junit4]   2>         at com.carrotsearch.randomizedtesting.ThreadLeakControl$StatementRunner.run(ThreadLeakControl.java:368)
   [junit4]   2>         at java.lang.Thread.run(Thread.java:748)
   [junit4]   2> ??? 14, 2018 7:27:25 ? com.carrotsearch.randomizedtesting.ThreadLeakControl
tryToInterruptAll
   [junit4]   2> INFO: Starting to interrupt leaked threads:
   [junit4]   2>    1) Thread[id=4243, name=TEST-TestSimGenericDistributedQueue.testDistributedQueue-seed#[3221045EA9A92D1B],
state=TIMED_WAITING, group=TGRP-TestSimGenericDistributedQueue]
   [junit4]   2> 7651194 INFO  (TEST-TestSimGenericDistributedQueue.testDistributedQueue-seed#[3221045EA9A92D1B])
[    ] o.a.s.SolrTestCaseJ4 ###Ending testDistributedQueue
   [junit4]   2> NOTE: leaving temporary files on disk at: /x1/jenkins/jenkins-slave/workspace/Lucene-Solr-BadApples-Tests-7.x/solr/build/solr-core/test/J0/temp/solr.cloud.autoscaling.sim.TestSimGenericDistributedQueue_3221045EA9A92D1B-001
   [junit4]   2> Sep 15, 2018 1:27:25 AM com.carrotsearch.randomizedtesting.ThreadLeakControl
tryToInterruptAll
   [junit4]   2> INFO: All leaked threads terminated.
   [junit4]   2> NOTE: test params are: codec=Asserting(Lucene70): {}, docValues:{}, maxPointsInLeafNode=1512,
maxMBSortInHeap=7.844641807395444, sim=RandomSimilarity(queryNorm=false): {}, locale=ar-QA,
timezone=Canada/Saskatchewan
   [junit4]   2> NOTE: Linux 4.4.0-130-generic amd64/Oracle Corporation 1.8.0_172 (64-bit)/cpus=4,threads=1,free=90197584,total=479723520
   [junit4]   2> NOTE: All tests run in this JVM: [LeaderElectionIntegrationTest, TestLMJelinekMercerSimilarityFactory,
BasicDistributedZk2Test, HdfsAutoAddReplicasIntegrationTest, TestExpandComponent, CollectionPropsTest,
TestRandomDVFaceting, TestUninvertingReader, PropertiesRequestHandlerTest, TestSolr4Spatial2,
ChaosMonkeySafeLeaderWithPullReplicasTest, TestCollationFieldDocValues, BJQParserTest, TestMiniSolrCloudClusterSSL,
LegacyCloudClusterPropTest, TestPointFields, TestMissingGroups, FullHLLTest, TestSimGenericDistributedQueue]
   [junit4]   2> NOTE: reproduce with: ant test  -Dtestcase=TestSimGenericDistributedQueue
-Dtests.seed=3221045EA9A92D1B -Dtests.multiplier=2 -Dtests.slow=true -Dtests.badapples=true
-Dtests.locale=ar-QA -Dtests.timezone=Canada/Saskatchewan -Dtests.asserts=true -Dtests.file.encoding=US-ASCII
   [junit4] ERROR   0.00s J0 | TestSimGenericDistributedQueue (suite) <<<
   [junit4]    > Throwable #1: java.lang.Exception: Suite timeout exceeded (>= 7200000
msec).
   [junit4]    > 	at __randomizedtesting.SeedInfo.seed([3221045EA9A92D1B]:0)
   [junit4] Completed [713/833 (1!)] on J0 in 7280.26s, 1 test, 2 errors <<< FAILURES!

[...truncated 48949 lines...]
[asciidoctor:convert] asciidoctor: ERROR: about-this-guide.adoc: line 1: invalid part, must
have at least one section (e.g., chapter, appendix, etc.)
[asciidoctor:convert] asciidoctor: WARNING: simulations.adoc: line 25: section title out of
sequence: expected level 3, got level 4
[asciidoctor:convert] asciidoctor: WARNING: simulations.adoc: line 92: section title out of
sequence: expected level 3, got level 4
[asciidoctor:convert] asciidoctor: WARNING: simulations.adoc: line 138: section title out
of sequence: expected level 3, got level 4
[asciidoctor:convert] asciidoctor: ERROR: solr-glossary.adoc: line 1: invalid part, must have
at least one section (e.g., chapter, appendix, etc.)
[asciidoctor:convert] asciidoctor: WARNING: simulations.adoc: line 25: section title out of
sequence: expected levels 0 or 1, got level 2
[asciidoctor:convert] asciidoctor: WARNING: simulations.adoc: line 92: section title out of
sequence: expected levels 0 or 1, got level 2
[asciidoctor:convert] asciidoctor: WARNING: simulations.adoc: line 138: section title out
of sequence: expected levels 0 or 1, got level 2
     [java] Processed 2343 links (1894 relative) to 3145 anchors in 245 files
     [echo] Validated Links & Anchors via: /x1/jenkins/jenkins-slave/workspace/Lucene-Solr-BadApples-Tests-7.x/solr/build/solr-ref-guide/bare-bones-html/

-documentation-lint:
    [jtidy] Checking for broken html (such as invalid tags)...
   [delete] Deleting directory /x1/jenkins/jenkins-slave/workspace/Lucene-Solr-BadApples-Tests-7.x/lucene/build/jtidy_tmp
     [echo] Checking for broken links...
     [exec] 
     [exec] Crawl/parse...
     [exec] 
     [exec] Verify...
     [echo] Checking for malformed docs...

jar-checksums:

resolve:

ivy-availability-check:
[loadresource] Do not set property disallowed.ivy.jars.list as its length is 0.

-ivy-fail-disallowed-ivy-version:

ivy-fail:

ivy-configure:
[ivy:configure] :: loading settings :: file = /x1/jenkins/jenkins-slave/workspace/Lucene-Solr-BadApples-Tests-7.x/lucene/top-level-ivy-settings.xml

resolve:

ivy-availability-check:
[loadresource] Do not set property disallowed.ivy.jars.list as its length is 0.

-ivy-fail-disallowed-ivy-version:

ivy-fail:

ivy-configure:
[ivy:configure] :: loading settings :: file = /x1/jenkins/jenkins-slave/workspace/Lucene-Solr-BadApples-Tests-7.x/lucene/top-level-ivy-settings.xml

resolve:

resolve:

ivy-availability-check:
[loadresource] Do not set property disallowed.ivy.jars.list as its length is 0.

-ivy-fail-disallowed-ivy-version:

ivy-fail:

ivy-configure:
[ivy:configure] :: loading settings :: file = /x1/jenkins/jenkins-slave/workspace/Lucene-Solr-BadApples-Tests-7.x/lucene/top-level-ivy-settings.xml

resolve:

ivy-availability-check:
[loadresource] Do not set property disallowed.ivy.jars.list as its length is 0.

-ivy-fail-disallowed-ivy-version:

ivy-fail:

ivy-configure:
[ivy:configure] :: loading settings :: file = /x1/jenkins/jenkins-slave/workspace/Lucene-Solr-BadApples-Tests-7.x/lucene/top-level-ivy-settings.xml

resolve:

ivy-availability-check:
[loadresource] Do not set property disallowed.ivy.jars.list as its length is 0.

-ivy-fail-disallowed-ivy-version:

ivy-fail:

ivy-configure:
[ivy:configure] :: loading settings :: file = /x1/jenkins/jenkins-slave/workspace/Lucene-Solr-BadApples-Tests-7.x/lucene/top-level-ivy-settings.xml

resolve:

ivy-availability-check:
[loadresource] Do not set property disallowed.ivy.jars.list as its length is 0.

-ivy-fail-disallowed-ivy-version:

ivy-fail:

ivy-configure:
[ivy:configure] :: loading settings :: file = /x1/jenkins/jenkins-slave/workspace/Lucene-Solr-BadApples-Tests-7.x/lucene/top-level-ivy-settings.xml

resolve:

ivy-availability-check:
[loadresource] Do not set property disallowed.ivy.jars.list as its length is 0.

-ivy-fail-disallowed-ivy-version:

ivy-fail:

ivy-configure:
[ivy:configure] :: loading settings :: file = /x1/jenkins/jenkins-slave/workspace/Lucene-Solr-BadApples-Tests-7.x/lucene/top-level-ivy-settings.xml

resolve:

ivy-availability-check:
[loadresource] Do not set property disallowed.ivy.jars.list as its length is 0.

-ivy-fail-disallowed-ivy-version:

ivy-fail:

ivy-configure:
[ivy:configure] :: loading settings :: file = /x1/jenkins/jenkins-slave/workspace/Lucene-Solr-BadApples-Tests-7.x/lucene/top-level-ivy-settings.xml

resolve:

ivy-availability-check:
[loadresource] Do not set property disallowed.ivy.jars.list as its length is 0.

-ivy-fail-disallowed-ivy-version:

ivy-fail:

ivy-configure:
[ivy:configure] :: loading settings :: file = /x1/jenkins/jenkins-slave/workspace/Lucene-Solr-BadApples-Tests-7.x/lucene/top-level-ivy-settings.xml

resolve:

ivy-availability-check:
[loadresource] Do not set property disallowed.ivy.jars.list as its length is 0.

-ivy-fail-disallowed-ivy-version:

ivy-fail:

ivy-configure:
[ivy:configure] :: loading settings :: file = /x1/jenkins/jenkins-slave/workspace/Lucene-Solr-BadApples-Tests-7.x/lucene/top-level-ivy-settings.xml

resolve:

ivy-availability-check:
[loadresource] Do not set property disallowed.ivy.jars.list as its length is 0.

-ivy-fail-disallowed-ivy-version:

ivy-fail:

ivy-configure:
[ivy:configure] :: loading settings :: file = /x1/jenkins/jenkins-slave/workspace/Lucene-Solr-BadApples-Tests-7.x/lucene/top-level-ivy-settings.xml

resolve:

ivy-availability-check:
[loadresource] Do not set property disallowed.ivy.jars.list as its length is 0.

-ivy-fail-disallowed-ivy-version:

ivy-fail:

ivy-configure:
[ivy:configure] :: loading settings :: file = /x1/jenkins/jenkins-slave/workspace/Lucene-Solr-BadApples-Tests-7.x/lucene/top-level-ivy-settings.xml

resolve:

ivy-availability-check:
[loadresource] Do not set property disallowed.ivy.jars.list as its length is 0.

-ivy-fail-disallowed-ivy-version:

ivy-fail:

ivy-configure:
[ivy:configure] :: loading settings :: file = /x1/jenkins/jenkins-slave/workspace/Lucene-Solr-BadApples-Tests-7.x/lucene/top-level-ivy-settings.xml

resolve:

ivy-availability-check:
[loadresource] Do not set property disallowed.ivy.jars.list as its length is 0.

-ivy-fail-disallowed-ivy-version:

ivy-fail:

ivy-configure:
[ivy:configure] :: loading settings :: file = /x1/jenkins/jenkins-slave/workspace/Lucene-Solr-BadApples-Tests-7.x/lucene/top-level-ivy-settings.xml

resolve:

ivy-availability-check:
[loadresource] Do not set property disallowed.ivy.jars.list as its length is 0.

-ivy-fail-disallowed-ivy-version:

ivy-fail:

ivy-configure:
[ivy:configure] :: loading settings :: file = /x1/jenkins/jenkins-slave/workspace/Lucene-Solr-BadApples-Tests-7.x/lucene/top-level-ivy-settings.xml

resolve:

ivy-availability-check:
[loadresource] Do not set property disallowed.ivy.jars.list as its length is 0.

-ivy-fail-disallowed-ivy-version:

ivy-fail:

ivy-configure:
[ivy:configure] :: loading settings :: file = /x1/jenkins/jenkins-slave/workspace/Lucene-Solr-BadApples-Tests-7.x/lucene/top-level-ivy-settings.xml

resolve:

ivy-availability-check:
[loadresource] Do not set property disallowed.ivy.jars.list as its length is 0.

-ivy-fail-disallowed-ivy-version:

ivy-fail:

ivy-configure:
[ivy:configure] :: loading settings :: file = /x1/jenkins/jenkins-slave/workspace/Lucene-Solr-BadApples-Tests-7.x/lucene/top-level-ivy-settings.xml

resolve:

ivy-availability-check:
[loadresource] Do not set property disallowed.ivy.jars.list as its length is 0.

-ivy-fail-disallowed-ivy-version:

ivy-fail:

ivy-configure:
[ivy:configure] :: loading settings :: file = /x1/jenkins/jenkins-slave/workspace/Lucene-Solr-BadApples-Tests-7.x/lucene/top-level-ivy-settings.xml

resolve:

ivy-availability-check:
[loadresource] Do not set property disallowed.ivy.jars.list as its length is 0.

-ivy-fail-disallowed-ivy-version:

ivy-fail:

ivy-configure:
[ivy:configure] :: loading settings :: file = /x1/jenkins/jenkins-slave/workspace/Lucene-Solr-BadApples-Tests-7.x/lucene/top-level-ivy-settings.xml

resolve:

ivy-availability-check:
[loadresource] Do not set property disallowed.ivy.jars.list as its length is 0.

-ivy-fail-disallowed-ivy-version:

ivy-fail:

ivy-configure:
[ivy:configure] :: loading settings :: file = /x1/jenkins/jenkins-slave/workspace/Lucene-Solr-BadApples-Tests-7.x/lucene/top-level-ivy-settings.xml

resolve:

ivy-availability-check:
[loadresource] Do not set property disallowed.ivy.jars.list as its length is 0.

-ivy-fail-disallowed-ivy-version:

ivy-fail:

ivy-configure:
[ivy:configure] :: loading settings :: file = /x1/jenkins/jenkins-slave/workspace/Lucene-Solr-BadApples-Tests-7.x/lucene/top-level-ivy-settings.xml

resolve:

ivy-availability-check:
[loadresource] Do not set property disallowed.ivy.jars.list as its length is 0.

-ivy-fail-disallowed-ivy-version:

ivy-fail:

ivy-configure:
[ivy:configure] :: loading settings :: file = /x1/jenkins/jenkins-slave/workspace/Lucene-Solr-BadApples-Tests-7.x/lucene/top-level-ivy-settings.xml

resolve:

ivy-availability-check:
[loadresource] Do not set property disallowed.ivy.jars.list as its length is 0.

-ivy-fail-disallowed-ivy-version:

ivy-fail:

ivy-configure:
[ivy:configure] :: loading settings :: file = /x1/jenkins/jenkins-slave/workspace/Lucene-Solr-BadApples-Tests-7.x/lucene/top-level-ivy-settings.xml

resolve:

ivy-availability-check:
[loadresource] Do not set property disallowed.ivy.jars.list as its length is 0.

-ivy-fail-disallowed-ivy-version:

ivy-fail:

ivy-configure:
[ivy:configure] :: loading settings :: file = /x1/jenkins/jenkins-slave/workspace/Lucene-Solr-BadApples-Tests-7.x/lucene/top-level-ivy-settings.xml

resolve:

ivy-availability-check:
[loadresource] Do not set property disallowed.ivy.jars.list as its length is 0.

-ivy-fail-disallowed-ivy-version:

ivy-fail:

ivy-configure:
[ivy:configure] :: loading settings :: file = /x1/jenkins/jenkins-slave/workspace/Lucene-Solr-BadApples-Tests-7.x/lucene/top-level-ivy-settings.xml

resolve:

ivy-availability-check:
[loadresource] Do not set property disallowed.ivy.jars.list as its length is 0.

-ivy-fail-disallowed-ivy-version:

ivy-fail:

ivy-configure:
[ivy:configure] :: loading settings :: file = /x1/jenkins/jenkins-slave/workspace/Lucene-Solr-BadApples-Tests-7.x/lucene/top-level-ivy-settings.xml

common.resolve:

resolve:

ivy-availability-check:
[loadresource] Do not set property disallowed.ivy.jars.list as its length is 0.

-ivy-fail-disallowed-ivy-version:

ivy-fail:

ivy-configure:
[ivy:configure] :: loading settings :: file = /x1/jenkins/jenkins-slave/workspace/Lucene-Solr-BadApples-Tests-7.x/lucene/top-level-ivy-settings.xml

resolve:

ivy-availability-check:
[loadresource] Do not set property disallowed.ivy.jars.list as its length is 0.

-ivy-fail-disallowed-ivy-version:

ivy-fail:

ivy-configure:
[ivy:configure] :: loading settings :: file = /x1/jenkins/jenkins-slave/workspace/Lucene-Solr-BadApples-Tests-7.x/lucene/top-level-ivy-settings.xml

resolve:

ivy-availability-check:
[loadresource] Do not set property disallowed.ivy.jars.list as its length is 0.

-ivy-fail-disallowed-ivy-version:

ivy-fail:

ivy-configure:
[ivy:configure] :: loading settings :: file = /x1/jenkins/jenkins-slave/workspace/Lucene-Solr-BadApples-Tests-7.x/lucene/top-level-ivy-settings.xml

resolve:

ivy-availability-check:
[loadresource] Do not set property disallowed.ivy.jars.list as its length is 0.

-ivy-fail-disallowed-ivy-version:

ivy-fail:

ivy-configure:
[ivy:configure] :: loading settings :: file = /x1/jenkins/jenkins-slave/workspace/Lucene-Solr-BadApples-Tests-7.x/lucene/top-level-ivy-settings.xml

resolve:

ivy-availability-check:
[loadresource] Do not set property disallowed.ivy.jars.list as its length is 0.

-ivy-fail-disallowed-ivy-version:

ivy-fail:

ivy-configure:
[ivy:configure] :: loading settings :: file = /x1/jenkins/jenkins-slave/workspace/Lucene-Solr-BadApples-Tests-7.x/lucene/top-level-ivy-settings.xml

resolve:

jar-checksums:
    [mkdir] Created dir: /x1/jenkins/jenkins-slave/workspace/Lucene-Solr-BadApples-Tests-7.x/lucene/null786551718
     [copy] Copying 35 files to /x1/jenkins/jenkins-slave/workspace/Lucene-Solr-BadApples-Tests-7.x/lucene/null786551718
   [delete] Deleting directory /x1/jenkins/jenkins-slave/workspace/Lucene-Solr-BadApples-Tests-7.x/lucene/null786551718

resolve-example:

ivy-availability-check:
[loadresource] Do not set property disallowed.ivy.jars.list as its length is 0.

-ivy-fail-disallowed-ivy-version:

ivy-fail:

ivy-configure:
[ivy:configure] :: loading settings :: file = /x1/jenkins/jenkins-slave/workspace/Lucene-Solr-BadApples-Tests-7.x/lucene/top-level-ivy-settings.xml

resolve:

resolve-server:

ivy-availability-check:
[loadresource] Do not set property disallowed.ivy.jars.list as its length is 0.

-ivy-fail-disallowed-ivy-version:

ivy-fail:

ivy-fail:

ivy-configure:
[ivy:configure] :: loading settings :: file = /x1/jenkins/jenkins-slave/workspace/Lucene-Solr-BadApples-Tests-7.x/lucene/top-level-ivy-settings.xml

resolve:

resolve:

ivy-availability-check:
[loadresource] Do not set property disallowed.ivy.jars.list as its length is 0.

-ivy-fail-disallowed-ivy-version:

ivy-fail:

ivy-fail:

ivy-configure:
[ivy:configure] :: loading settings :: file = /x1/jenkins/jenkins-slave/workspace/Lucene-Solr-BadApples-Tests-7.x/lucene/top-level-ivy-settings.xml

resolve:

ivy-availability-check:
[loadresource] Do not set property disallowed.ivy.jars.list as its length is 0.

-ivy-fail-disallowed-ivy-version:

ivy-fail:

ivy-fail:

ivy-configure:
[ivy:configure] :: loading settings :: file = /x1/jenkins/jenkins-slave/workspace/Lucene-Solr-BadApples-Tests-7.x/lucene/top-level-ivy-settings.xml

resolve:

ivy-availability-check:
[loadresource] Do not set property disallowed.ivy.jars.list as its length is 0.

-ivy-fail-disallowed-ivy-version:

ivy-fail:

ivy-configure:
[ivy:configure] :: loading settings :: file = /x1/jenkins/jenkins-slave/workspace/Lucene-Solr-BadApples-Tests-7.x/lucene/top-level-ivy-settings.xml

resolve:

ivy-availability-check:
[loadresource] Do not set property disallowed.ivy.jars.list as its length is 0.

-ivy-fail-disallowed-ivy-version:

ivy-fail:

ivy-fail:

ivy-configure:
[ivy:configure] :: loading settings :: file = /x1/jenkins/jenkins-slave/workspace/Lucene-Solr-BadApples-Tests-7.x/lucene/top-level-ivy-settings.xml

resolve:

ivy-availability-check:
[loadresource] Do not set property disallowed.ivy.jars.list as its length is 0.

-ivy-fail-disallowed-ivy-version:

ivy-fail:

ivy-configure:
[ivy:configure] :: loading settings :: file = /x1/jenkins/jenkins-slave/workspace/Lucene-Solr-BadApples-Tests-7.x/lucene/top-level-ivy-settings.xml

resolve:

ivy-availability-check:
[loadresource] Do not set property disallowed.ivy.jars.list as its length is 0.

-ivy-fail-disallowed-ivy-version:

ivy-fail:

ivy-fail:

ivy-configure:
[ivy:configure] :: loading settings :: file = /x1/jenkins/jenkins-slave/workspace/Lucene-Solr-BadApples-Tests-7.x/lucene/top-level-ivy-settings.xml

resolve:

ivy-availability-check:
[loadresource] Do not set property disallowed.ivy.jars.list as its length is 0.

-ivy-fail-disallowed-ivy-version:

ivy-fail:

ivy-fail:

ivy-configure:
[ivy:configure] :: loading settings :: file = /x1/jenkins/jenkins-slave/workspace/Lucene-Solr-BadApples-Tests-7.x/lucene/top-level-ivy-settings.xml

resolve:

ivy-availability-check:
[loadresource] Do not set property disallowed.ivy.jars.list as its length is 0.

-ivy-fail-disallowed-ivy-version:

ivy-fail:

ivy-fail:

ivy-configure:
[ivy:configure] :: loading settings :: file = /x1/jenkins/jenkins-slave/workspace/Lucene-Solr-BadApples-Tests-7.x/lucene/top-level-ivy-settings.xml

resolve:

ivy-availability-check:
[loadresource] Do not set property disallowed.ivy.jars.list as its length is 0.

-ivy-fail-disallowed-ivy-version:

ivy-fail:

ivy-fail:

ivy-configure:
[ivy:configure] :: loading settings :: file = /x1/jenkins/jenkins-slave/workspace/Lucene-Solr-BadApples-Tests-7.x/lucene/top-level-ivy-settings.xml

resolve:

ivy-availability-check:
[loadresource] Do not set property disallowed.ivy.jars.list as its length is 0.

-ivy-fail-disallowed-ivy-version:

ivy-fail:

ivy-fail:

ivy-configure:
[ivy:configure] :: loading settings :: file = /x1/jenkins/jenkins-slave/workspace/Lucene-Solr-BadApples-Tests-7.x/lucene/top-level-ivy-settings.xml

resolve:

ivy-availability-check:
[loadresource] Do not set property disallowed.ivy.jars.list as its length is 0.

-ivy-fail-disallowed-ivy-version:

ivy-fail:

ivy-fail:

ivy-configure:
[ivy:configure] :: loading settings :: file = /x1/jenkins/jenkins-slave/workspace/Lucene-Solr-BadApples-Tests-7.x/lucene/top-level-ivy-settings.xml

resolve:

ivy-availability-check:
[loadresource] Do not set property disallowed.ivy.jars.list as its length is 0.

-ivy-fail-disallowed-ivy-version:

ivy-fail:

ivy-fail:

ivy-configure:
[ivy:configure] :: loading settings :: file = /x1/jenkins/jenkins-slave/workspace/Lucene-Solr-BadApples-Tests-7.x/lucene/top-level-ivy-settings.xml

resolve:

ivy-availability-check:
[loadresource] Do not set property disallowed.ivy.jars.list as its length is 0.

-ivy-fail-disallowed-ivy-version:

ivy-fail:

ivy-fail:

ivy-configure:
[ivy:configure] :: loading settings :: file = /x1/jenkins/jenkins-slave/workspace/Lucene-Solr-BadApples-Tests-7.x/lucene/top-level-ivy-settings.xml

resolve:

ivy-availability-check:
[loadresource] Do not set property disallowed.ivy.jars.list as its length is 0.

-ivy-fail-disallowed-ivy-version:

ivy-fail:

ivy-fail:

ivy-configure:
[ivy:configure] :: loading settings :: file = /x1/jenkins/jenkins-slave/workspace/Lucene-Solr-BadApples-Tests-7.x/lucene/top-level-ivy-settings.xml

resolve:

ivy-availability-check:
[loadresource] Do not set property disallowed.ivy.jars.list as its length is 0.

-ivy-fail-disallowed-ivy-version:

ivy-fail:

ivy-fail:

ivy-configure:
[ivy:configure] :: loading settings :: file = /x1/jenkins/jenkins-slave/workspace/Lucene-Solr-BadApples-Tests-7.x/lucene/top-level-ivy-settings.xml

resolve:

jar-checksums:
    [mkdir] Created dir: /x1/jenkins/jenkins-slave/workspace/Lucene-Solr-BadApples-Tests-7.x/solr/null1627862487
     [copy] Copying 239 files to /x1/jenkins/jenkins-slave/workspace/Lucene-Solr-BadApples-Tests-7.x/solr/null1627862487
   [delete] Deleting directory /x1/jenkins/jenkins-slave/workspace/Lucene-Solr-BadApples-Tests-7.x/solr/null1627862487

check-working-copy:
[ivy:cachepath] :: resolving dependencies :: org.eclipse.jgit#org.eclipse.jgit-caller;working
[ivy:cachepath] 	confs: [default]
[ivy:cachepath] 	found org.eclipse.jgit#org.eclipse.jgit;4.6.0.201612231935-r in public
[ivy:cachepath] 	found com.jcraft#jsch;0.1.53 in public
[ivy:cachepath] 	found com.googlecode.javaewah#JavaEWAH;1.1.6 in public
[ivy:cachepath] 	found org.apache.httpcomponents#httpclient;4.3.6 in public
[ivy:cachepath] 	found org.apache.httpcomponents#httpcore;4.3.3 in public
[ivy:cachepath] 	found commons-logging#commons-logging;1.1.3 in public
[ivy:cachepath] 	found commons-codec#commons-codec;1.6 in public
[ivy:cachepath] 	found org.slf4j#slf4j-api;1.7.2 in public
[ivy:cachepath] :: resolution report :: resolve 32ms :: artifacts dl 1ms
	---------------------------------------------------------------------
	|                  |            modules            ||   artifacts   |
	|       conf       | number| search|dwnlded|evicted|| number|dwnlded|
	---------------------------------------------------------------------
	|      default     |   8   |   0   |   0   |   0   ||   8   |   0   |
	---------------------------------------------------------------------
[wc-checker] Initializing working copy...
[wc-checker] SLF4J: Failed to load class "org.slf4j.impl.StaticLoggerBinder".
[wc-checker] SLF4J: Defaulting to no-operation (NOP) logger implementation
[wc-checker] SLF4J: See http://www.slf4j.org/codes.html#StaticLoggerBinder for further details.
[wc-checker] Checking working copy status...

-jenkins-base:

BUILD SUCCESSFUL
Total time: 189 minutes 20 seconds
Archiving artifacts
java.lang.InterruptedException: no matches found within 10000
	at hudson.FilePath$34.hasMatch(FilePath.java:2678)
	at hudson.FilePath$34.invoke(FilePath.java:2557)
	at hudson.FilePath$34.invoke(FilePath.java:2547)
	at hudson.FilePath$FileCallableWrapper.call(FilePath.java:2918)
Also:   hudson.remoting.Channel$CallSiteStackTrace: Remote call to lucene
		at hudson.remoting.Channel.attachCallSiteStackTrace(Channel.java:1741)
		at hudson.remoting.UserRequest$ExceptionResponse.retrieve(UserRequest.java:357)
		at hudson.remoting.Channel.call(Channel.java:955)
		at hudson.FilePath.act(FilePath.java:1036)
		at hudson.FilePath.act(FilePath.java:1025)
		at hudson.FilePath.validateAntFileMask(FilePath.java:2547)
		at hudson.tasks.ArtifactArchiver.perform(ArtifactArchiver.java:243)
		at hudson.tasks.BuildStepCompatibilityLayer.perform(BuildStepCompatibilityLayer.java:81)
		at hudson.tasks.BuildStepMonitor$1.perform(BuildStepMonitor.java:20)
		at hudson.model.AbstractBuild$AbstractBuildExecution.perform(AbstractBuild.java:744)
		at hudson.model.AbstractBuild$AbstractBuildExecution.performAllBuildSteps(AbstractBuild.java:690)
		at hudson.model.Build$BuildExecution.post2(Build.java:186)
		at hudson.model.AbstractBuild$AbstractBuildExecution.post(AbstractBuild.java:635)
		at hudson.model.Run.execute(Run.java:1819)
		at hudson.model.FreeStyleBuild.run(FreeStyleBuild.java:43)
		at hudson.model.ResourceController.execute(ResourceController.java:97)
		at hudson.model.Executor.run(Executor.java:429)
Caused: hudson.FilePath$TunneledInterruptedException
	at hudson.FilePath$FileCallableWrapper.call(FilePath.java:2920)
	at hudson.remoting.UserRequest.perform(UserRequest.java:212)
	at hudson.remoting.UserRequest.perform(UserRequest.java:54)
	at hudson.remoting.Request$2.run(Request.java:369)
	at hudson.remoting.InterceptingExecutorService$1.call(InterceptingExecutorService.java:72)
	at java.util.concurrent.FutureTask.run(FutureTask.java:266)
	at java.util.concurrent.ThreadPoolExecutor.runWorker(ThreadPoolExecutor.java:1142)
	at java.util.concurrent.ThreadPoolExecutor$Worker.run(ThreadPoolExecutor.java:617)
	at java.lang.Thread.run(Thread.java:748)
Caused: java.lang.InterruptedException: java.lang.InterruptedException: no matches found within
10000
	at hudson.FilePath.act(FilePath.java:1038)
	at hudson.FilePath.act(FilePath.java:1025)
	at hudson.FilePath.validateAntFileMask(FilePath.java:2547)
	at hudson.tasks.ArtifactArchiver.perform(ArtifactArchiver.java:243)
	at hudson.tasks.BuildStepCompatibilityLayer.perform(BuildStepCompatibilityLayer.java:81)
	at hudson.tasks.BuildStepMonitor$1.perform(BuildStepMonitor.java:20)
	at hudson.model.AbstractBuild$AbstractBuildExecution.perform(AbstractBuild.java:744)
	at hudson.model.AbstractBuild$AbstractBuildExecution.performAllBuildSteps(AbstractBuild.java:690)
	at hudson.model.Build$BuildExecution.post2(Build.java:186)
	at hudson.model.AbstractBuild$AbstractBuildExecution.post(AbstractBuild.java:635)
	at hudson.model.Run.execute(Run.java:1819)
	at hudson.model.FreeStyleBuild.run(FreeStyleBuild.java:43)
	at hudson.model.ResourceController.execute(ResourceController.java:97)
	at hudson.model.Executor.run(Executor.java:429)
No artifacts found that match the file pattern "**/*.events,heapdumps/**,**/hs_err_pid*".
Configuration error?
Recording test results
Build step 'Publish JUnit test result report' changed build result to UNSTABLE
Email was triggered for: Unstable (Test Failures)
Sending email for trigger: Unstable (Test Failures)

Mime
View raw message