lucene-dev mailing list archives

Site index · List index
Message view « Date » · « Thread »
Top « Date » · « Thread »
From Policeman Jenkins Server <jenk...@thetaphi.de>
Subject [JENKINS-EA] Lucene-Solr-7.x-Linux (64bit/jdk-11-ea+28) - Build # 2746 - Unstable!
Date Sat, 15 Sep 2018 07:52:27 GMT
Build: https://jenkins.thetaphi.de/job/Lucene-Solr-7.x-Linux/2746/
Java: 64bit/jdk-11-ea+28 -XX:+UseCompressedOops -XX:+UseConcMarkSweepGC

6 tests failed.
FAILED:  org.apache.solr.cloud.autoscaling.ComputePlanActionTest.testNodeAddedTriggerWithAddReplicaPreferredOp_2Shard

Error Message:
Timed out waiting for replicas of new collection to be active null Live Nodes: [127.0.0.1:41101_solr, 127.0.0.1:43367_solr] Last available state: null

Stack Trace:
java.lang.AssertionError: Timed out waiting for replicas of new collection to be active
null
Live Nodes: [127.0.0.1:41101_solr, 127.0.0.1:43367_solr]
Last available state: null
	at __randomizedtesting.SeedInfo.seed([3120F479E06A32F2:88BBCFA67336E134]:0)
	at org.junit.Assert.fail(Assert.java:93)
	at org.apache.solr.cloud.SolrCloudTestCase.waitForState(SolrCloudTestCase.java:280)
	at org.apache.solr.cloud.autoscaling.ComputePlanActionTest.nodeAddedTriggerWithAddReplicaPreferredOp(ComputePlanActionTest.java:585)
	at org.apache.solr.cloud.autoscaling.ComputePlanActionTest.testNodeAddedTriggerWithAddReplicaPreferredOp_2Shard(ComputePlanActionTest.java:524)
	at java.base/jdk.internal.reflect.NativeMethodAccessorImpl.invoke0(Native Method)
	at java.base/jdk.internal.reflect.NativeMethodAccessorImpl.invoke(NativeMethodAccessorImpl.java:62)
	at java.base/jdk.internal.reflect.DelegatingMethodAccessorImpl.invoke(DelegatingMethodAccessorImpl.java:43)
	at java.base/java.lang.reflect.Method.invoke(Method.java:566)
	at com.carrotsearch.randomizedtesting.RandomizedRunner.invoke(RandomizedRunner.java:1742)
	at com.carrotsearch.randomizedtesting.RandomizedRunner$8.evaluate(RandomizedRunner.java:935)
	at com.carrotsearch.randomizedtesting.RandomizedRunner$9.evaluate(RandomizedRunner.java:971)
	at com.carrotsearch.randomizedtesting.RandomizedRunner$10.evaluate(RandomizedRunner.java:985)
	at com.carrotsearch.randomizedtesting.rules.SystemPropertiesRestoreRule$1.evaluate(SystemPropertiesRestoreRule.java:57)
	at org.apache.lucene.util.TestRuleSetupTeardownChained$1.evaluate(TestRuleSetupTeardownChained.java:49)
	at org.apache.lucene.util.AbstractBeforeAfterRule$1.evaluate(AbstractBeforeAfterRule.java:45)
	at org.apache.lucene.util.TestRuleThreadAndTestName$1.evaluate(TestRuleThreadAndTestName.java:48)
	at org.apache.lucene.util.TestRuleIgnoreAfterMaxFailures$1.evaluate(TestRuleIgnoreAfterMaxFailures.java:64)
	at org.apache.lucene.util.TestRuleMarkFailure$1.evaluate(TestRuleMarkFailure.java:47)
	at com.carrotsearch.randomizedtesting.rules.StatementAdapter.evaluate(StatementAdapter.java:36)
	at com.carrotsearch.randomizedtesting.ThreadLeakControl$StatementRunner.run(ThreadLeakControl.java:368)
	at com.carrotsearch.randomizedtesting.ThreadLeakControl.forkTimeoutingTask(ThreadLeakControl.java:817)
	at com.carrotsearch.randomizedtesting.ThreadLeakControl$3.evaluate(ThreadLeakControl.java:468)
	at com.carrotsearch.randomizedtesting.RandomizedRunner.runSingleTest(RandomizedRunner.java:944)
	at com.carrotsearch.randomizedtesting.RandomizedRunner$5.evaluate(RandomizedRunner.java:830)
	at com.carrotsearch.randomizedtesting.RandomizedRunner$6.evaluate(RandomizedRunner.java:880)
	at com.carrotsearch.randomizedtesting.RandomizedRunner$7.evaluate(RandomizedRunner.java:891)
	at com.carrotsearch.randomizedtesting.rules.StatementAdapter.evaluate(StatementAdapter.java:36)
	at com.carrotsearch.randomizedtesting.rules.SystemPropertiesRestoreRule$1.evaluate(SystemPropertiesRestoreRule.java:57)
	at org.apache.lucene.util.AbstractBeforeAfterRule$1.evaluate(AbstractBeforeAfterRule.java:45)
	at com.carrotsearch.randomizedtesting.rules.StatementAdapter.evaluate(StatementAdapter.java:36)
	at org.apache.lucene.util.TestRuleStoreClassName$1.evaluate(TestRuleStoreClassName.java:41)
	at com.carrotsearch.randomizedtesting.rules.NoShadowingOrOverridesOnMethodsRule$1.evaluate(NoShadowingOrOverridesOnMethodsRule.java:40)
	at com.carrotsearch.randomizedtesting.rules.NoShadowingOrOverridesOnMethodsRule$1.evaluate(NoShadowingOrOverridesOnMethodsRule.java:40)
	at com.carrotsearch.randomizedtesting.rules.StatementAdapter.evaluate(StatementAdapter.java:36)
	at com.carrotsearch.randomizedtesting.rules.StatementAdapter.evaluate(StatementAdapter.java:36)
	at org.apache.lucene.util.TestRuleAssertionsRequired$1.evaluate(TestRuleAssertionsRequired.java:53)
	at org.apache.lucene.util.TestRuleMarkFailure$1.evaluate(TestRuleMarkFailure.java:47)
	at org.apache.lucene.util.TestRuleIgnoreAfterMaxFailures$1.evaluate(TestRuleIgnoreAfterMaxFailures.java:64)
	at org.apache.lucene.util.TestRuleIgnoreTestSuites$1.evaluate(TestRuleIgnoreTestSuites.java:54)
	at com.carrotsearch.randomizedtesting.rules.StatementAdapter.evaluate(StatementAdapter.java:36)
	at com.carrotsearch.randomizedtesting.ThreadLeakControl$StatementRunner.run(ThreadLeakControl.java:368)
	at java.base/java.lang.Thread.run(Thread.java:834)


FAILED:  org.apache.solr.cloud.autoscaling.ComputePlanActionTest.testNodeAddedTriggerWithAddReplicaPreferredOp_2Shard

Error Message:
Timed out waiting for replicas of new collection to be active null Live Nodes: [127.0.0.1:37083_solr, 127.0.0.1:39591_solr] Last available state: null

Stack Trace:
java.lang.AssertionError: Timed out waiting for replicas of new collection to be active
null
Live Nodes: [127.0.0.1:37083_solr, 127.0.0.1:39591_solr]
Last available state: null
	at __randomizedtesting.SeedInfo.seed([3120F479E06A32F2:88BBCFA67336E134]:0)
	at org.junit.Assert.fail(Assert.java:93)
	at org.apache.solr.cloud.SolrCloudTestCase.waitForState(SolrCloudTestCase.java:280)
	at org.apache.solr.cloud.autoscaling.ComputePlanActionTest.nodeAddedTriggerWithAddReplicaPreferredOp(ComputePlanActionTest.java:585)
	at org.apache.solr.cloud.autoscaling.ComputePlanActionTest.testNodeAddedTriggerWithAddReplicaPreferredOp_2Shard(ComputePlanActionTest.java:524)
	at java.base/jdk.internal.reflect.NativeMethodAccessorImpl.invoke0(Native Method)
	at java.base/jdk.internal.reflect.NativeMethodAccessorImpl.invoke(NativeMethodAccessorImpl.java:62)
	at java.base/jdk.internal.reflect.DelegatingMethodAccessorImpl.invoke(DelegatingMethodAccessorImpl.java:43)
	at java.base/java.lang.reflect.Method.invoke(Method.java:566)
	at com.carrotsearch.randomizedtesting.RandomizedRunner.invoke(RandomizedRunner.java:1742)
	at com.carrotsearch.randomizedtesting.RandomizedRunner$8.evaluate(RandomizedRunner.java:935)
	at com.carrotsearch.randomizedtesting.RandomizedRunner$9.evaluate(RandomizedRunner.java:971)
	at com.carrotsearch.randomizedtesting.RandomizedRunner$10.evaluate(RandomizedRunner.java:985)
	at com.carrotsearch.randomizedtesting.rules.SystemPropertiesRestoreRule$1.evaluate(SystemPropertiesRestoreRule.java:57)
	at org.apache.lucene.util.TestRuleSetupTeardownChained$1.evaluate(TestRuleSetupTeardownChained.java:49)
	at org.apache.lucene.util.AbstractBeforeAfterRule$1.evaluate(AbstractBeforeAfterRule.java:45)
	at org.apache.lucene.util.TestRuleThreadAndTestName$1.evaluate(TestRuleThreadAndTestName.java:48)
	at org.apache.lucene.util.TestRuleIgnoreAfterMaxFailures$1.evaluate(TestRuleIgnoreAfterMaxFailures.java:64)
	at org.apache.lucene.util.TestRuleMarkFailure$1.evaluate(TestRuleMarkFailure.java:47)
	at com.carrotsearch.randomizedtesting.rules.StatementAdapter.evaluate(StatementAdapter.java:36)
	at com.carrotsearch.randomizedtesting.ThreadLeakControl$StatementRunner.run(ThreadLeakControl.java:368)
	at com.carrotsearch.randomizedtesting.ThreadLeakControl.forkTimeoutingTask(ThreadLeakControl.java:817)
	at com.carrotsearch.randomizedtesting.ThreadLeakControl$3.evaluate(ThreadLeakControl.java:468)
	at com.carrotsearch.randomizedtesting.RandomizedRunner.runSingleTest(RandomizedRunner.java:944)
	at com.carrotsearch.randomizedtesting.RandomizedRunner$5.evaluate(RandomizedRunner.java:830)
	at com.carrotsearch.randomizedtesting.RandomizedRunner$6.evaluate(RandomizedRunner.java:880)
	at com.carrotsearch.randomizedtesting.RandomizedRunner$7.evaluate(RandomizedRunner.java:891)
	at com.carrotsearch.randomizedtesting.rules.StatementAdapter.evaluate(StatementAdapter.java:36)
	at com.carrotsearch.randomizedtesting.rules.SystemPropertiesRestoreRule$1.evaluate(SystemPropertiesRestoreRule.java:57)
	at org.apache.lucene.util.AbstractBeforeAfterRule$1.evaluate(AbstractBeforeAfterRule.java:45)
	at com.carrotsearch.randomizedtesting.rules.StatementAdapter.evaluate(StatementAdapter.java:36)
	at org.apache.lucene.util.TestRuleStoreClassName$1.evaluate(TestRuleStoreClassName.java:41)
	at com.carrotsearch.randomizedtesting.rules.NoShadowingOrOverridesOnMethodsRule$1.evaluate(NoShadowingOrOverridesOnMethodsRule.java:40)
	at com.carrotsearch.randomizedtesting.rules.NoShadowingOrOverridesOnMethodsRule$1.evaluate(NoShadowingOrOverridesOnMethodsRule.java:40)
	at com.carrotsearch.randomizedtesting.rules.StatementAdapter.evaluate(StatementAdapter.java:36)
	at com.carrotsearch.randomizedtesting.rules.StatementAdapter.evaluate(StatementAdapter.java:36)
	at org.apache.lucene.util.TestRuleAssertionsRequired$1.evaluate(TestRuleAssertionsRequired.java:53)
	at org.apache.lucene.util.TestRuleMarkFailure$1.evaluate(TestRuleMarkFailure.java:47)
	at org.apache.lucene.util.TestRuleIgnoreAfterMaxFailures$1.evaluate(TestRuleIgnoreAfterMaxFailures.java:64)
	at org.apache.lucene.util.TestRuleIgnoreTestSuites$1.evaluate(TestRuleIgnoreTestSuites.java:54)
	at com.carrotsearch.randomizedtesting.rules.StatementAdapter.evaluate(StatementAdapter.java:36)
	at com.carrotsearch.randomizedtesting.ThreadLeakControl$StatementRunner.run(ThreadLeakControl.java:368)
	at java.base/java.lang.Thread.run(Thread.java:834)


FAILED:  org.apache.solr.cloud.autoscaling.ComputePlanActionTest.testNodeAddedTriggerWithAddReplicaPreferredOp_2Shard

Error Message:
Timed out waiting for replicas of new collection to be active null Live Nodes: [127.0.0.1:33799_solr, 127.0.0.1:38097_solr] Last available state: null

Stack Trace:
java.lang.AssertionError: Timed out waiting for replicas of new collection to be active
null
Live Nodes: [127.0.0.1:33799_solr, 127.0.0.1:38097_solr]
Last available state: null
	at __randomizedtesting.SeedInfo.seed([3120F479E06A32F2:88BBCFA67336E134]:0)
	at org.junit.Assert.fail(Assert.java:93)
	at org.apache.solr.cloud.SolrCloudTestCase.waitForState(SolrCloudTestCase.java:280)
	at org.apache.solr.cloud.autoscaling.ComputePlanActionTest.nodeAddedTriggerWithAddReplicaPreferredOp(ComputePlanActionTest.java:585)
	at org.apache.solr.cloud.autoscaling.ComputePlanActionTest.testNodeAddedTriggerWithAddReplicaPreferredOp_2Shard(ComputePlanActionTest.java:524)
	at java.base/jdk.internal.reflect.NativeMethodAccessorImpl.invoke0(Native Method)
	at java.base/jdk.internal.reflect.NativeMethodAccessorImpl.invoke(NativeMethodAccessorImpl.java:62)
	at java.base/jdk.internal.reflect.DelegatingMethodAccessorImpl.invoke(DelegatingMethodAccessorImpl.java:43)
	at java.base/java.lang.reflect.Method.invoke(Method.java:566)
	at com.carrotsearch.randomizedtesting.RandomizedRunner.invoke(RandomizedRunner.java:1742)
	at com.carrotsearch.randomizedtesting.RandomizedRunner$8.evaluate(RandomizedRunner.java:935)
	at com.carrotsearch.randomizedtesting.RandomizedRunner$9.evaluate(RandomizedRunner.java:971)
	at com.carrotsearch.randomizedtesting.RandomizedRunner$10.evaluate(RandomizedRunner.java:985)
	at com.carrotsearch.randomizedtesting.rules.SystemPropertiesRestoreRule$1.evaluate(SystemPropertiesRestoreRule.java:57)
	at org.apache.lucene.util.TestRuleSetupTeardownChained$1.evaluate(TestRuleSetupTeardownChained.java:49)
	at org.apache.lucene.util.AbstractBeforeAfterRule$1.evaluate(AbstractBeforeAfterRule.java:45)
	at org.apache.lucene.util.TestRuleThreadAndTestName$1.evaluate(TestRuleThreadAndTestName.java:48)
	at org.apache.lucene.util.TestRuleIgnoreAfterMaxFailures$1.evaluate(TestRuleIgnoreAfterMaxFailures.java:64)
	at org.apache.lucene.util.TestRuleMarkFailure$1.evaluate(TestRuleMarkFailure.java:47)
	at com.carrotsearch.randomizedtesting.rules.StatementAdapter.evaluate(StatementAdapter.java:36)
	at com.carrotsearch.randomizedtesting.ThreadLeakControl$StatementRunner.run(ThreadLeakControl.java:368)
	at com.carrotsearch.randomizedtesting.ThreadLeakControl.forkTimeoutingTask(ThreadLeakControl.java:817)
	at com.carrotsearch.randomizedtesting.ThreadLeakControl$3.evaluate(ThreadLeakControl.java:468)
	at com.carrotsearch.randomizedtesting.RandomizedRunner.runSingleTest(RandomizedRunner.java:944)
	at com.carrotsearch.randomizedtesting.RandomizedRunner$5.evaluate(RandomizedRunner.java:830)
	at com.carrotsearch.randomizedtesting.RandomizedRunner$6.evaluate(RandomizedRunner.java:880)
	at com.carrotsearch.randomizedtesting.RandomizedRunner$7.evaluate(RandomizedRunner.java:891)
	at com.carrotsearch.randomizedtesting.rules.StatementAdapter.evaluate(StatementAdapter.java:36)
	at com.carrotsearch.randomizedtesting.rules.SystemPropertiesRestoreRule$1.evaluate(SystemPropertiesRestoreRule.java:57)
	at org.apache.lucene.util.AbstractBeforeAfterRule$1.evaluate(AbstractBeforeAfterRule.java:45)
	at com.carrotsearch.randomizedtesting.rules.StatementAdapter.evaluate(StatementAdapter.java:36)
	at org.apache.lucene.util.TestRuleStoreClassName$1.evaluate(TestRuleStoreClassName.java:41)
	at com.carrotsearch.randomizedtesting.rules.NoShadowingOrOverridesOnMethodsRule$1.evaluate(NoShadowingOrOverridesOnMethodsRule.java:40)
	at com.carrotsearch.randomizedtesting.rules.NoShadowingOrOverridesOnMethodsRule$1.evaluate(NoShadowingOrOverridesOnMethodsRule.java:40)
	at com.carrotsearch.randomizedtesting.rules.StatementAdapter.evaluate(StatementAdapter.java:36)
	at com.carrotsearch.randomizedtesting.rules.StatementAdapter.evaluate(StatementAdapter.java:36)
	at org.apache.lucene.util.TestRuleAssertionsRequired$1.evaluate(TestRuleAssertionsRequired.java:53)
	at org.apache.lucene.util.TestRuleMarkFailure$1.evaluate(TestRuleMarkFailure.java:47)
	at org.apache.lucene.util.TestRuleIgnoreAfterMaxFailures$1.evaluate(TestRuleIgnoreAfterMaxFailures.java:64)
	at org.apache.lucene.util.TestRuleIgnoreTestSuites$1.evaluate(TestRuleIgnoreTestSuites.java:54)
	at com.carrotsearch.randomizedtesting.rules.StatementAdapter.evaluate(StatementAdapter.java:36)
	at com.carrotsearch.randomizedtesting.ThreadLeakControl$StatementRunner.run(ThreadLeakControl.java:368)
	at java.base/java.lang.Thread.run(Thread.java:834)


FAILED:  org.apache.solr.cloud.autoscaling.ComputePlanActionTest.testNodeAddedTriggerWithAddReplicaPreferredOp_2Shard

Error Message:
Timed out waiting for replicas of new collection to be active null Live Nodes: [127.0.0.1:36779_solr, 127.0.0.1:39509_solr] Last available state: null

Stack Trace:
java.lang.AssertionError: Timed out waiting for replicas of new collection to be active
null
Live Nodes: [127.0.0.1:36779_solr, 127.0.0.1:39509_solr]
Last available state: null
	at __randomizedtesting.SeedInfo.seed([3120F479E06A32F2:88BBCFA67336E134]:0)
	at org.junit.Assert.fail(Assert.java:93)
	at org.apache.solr.cloud.SolrCloudTestCase.waitForState(SolrCloudTestCase.java:280)
	at org.apache.solr.cloud.autoscaling.ComputePlanActionTest.nodeAddedTriggerWithAddReplicaPreferredOp(ComputePlanActionTest.java:585)
	at org.apache.solr.cloud.autoscaling.ComputePlanActionTest.testNodeAddedTriggerWithAddReplicaPreferredOp_2Shard(ComputePlanActionTest.java:524)
	at java.base/jdk.internal.reflect.NativeMethodAccessorImpl.invoke0(Native Method)
	at java.base/jdk.internal.reflect.NativeMethodAccessorImpl.invoke(NativeMethodAccessorImpl.java:62)
	at java.base/jdk.internal.reflect.DelegatingMethodAccessorImpl.invoke(DelegatingMethodAccessorImpl.java:43)
	at java.base/java.lang.reflect.Method.invoke(Method.java:566)
	at com.carrotsearch.randomizedtesting.RandomizedRunner.invoke(RandomizedRunner.java:1742)
	at com.carrotsearch.randomizedtesting.RandomizedRunner$8.evaluate(RandomizedRunner.java:935)
	at com.carrotsearch.randomizedtesting.RandomizedRunner$9.evaluate(RandomizedRunner.java:971)
	at com.carrotsearch.randomizedtesting.RandomizedRunner$10.evaluate(RandomizedRunner.java:985)
	at com.carrotsearch.randomizedtesting.rules.SystemPropertiesRestoreRule$1.evaluate(SystemPropertiesRestoreRule.java:57)
	at org.apache.lucene.util.TestRuleSetupTeardownChained$1.evaluate(TestRuleSetupTeardownChained.java:49)
	at org.apache.lucene.util.AbstractBeforeAfterRule$1.evaluate(AbstractBeforeAfterRule.java:45)
	at org.apache.lucene.util.TestRuleThreadAndTestName$1.evaluate(TestRuleThreadAndTestName.java:48)
	at org.apache.lucene.util.TestRuleIgnoreAfterMaxFailures$1.evaluate(TestRuleIgnoreAfterMaxFailures.java:64)
	at org.apache.lucene.util.TestRuleMarkFailure$1.evaluate(TestRuleMarkFailure.java:47)
	at com.carrotsearch.randomizedtesting.rules.StatementAdapter.evaluate(StatementAdapter.java:36)
	at com.carrotsearch.randomizedtesting.ThreadLeakControl$StatementRunner.run(ThreadLeakControl.java:368)
	at com.carrotsearch.randomizedtesting.ThreadLeakControl.forkTimeoutingTask(ThreadLeakControl.java:817)
	at com.carrotsearch.randomizedtesting.ThreadLeakControl$3.evaluate(ThreadLeakControl.java:468)
	at com.carrotsearch.randomizedtesting.RandomizedRunner.runSingleTest(RandomizedRunner.java:944)
	at com.carrotsearch.randomizedtesting.RandomizedRunner$5.evaluate(RandomizedRunner.java:830)
	at com.carrotsearch.randomizedtesting.RandomizedRunner$6.evaluate(RandomizedRunner.java:880)
	at com.carrotsearch.randomizedtesting.RandomizedRunner$7.evaluate(RandomizedRunner.java:891)
	at com.carrotsearch.randomizedtesting.rules.StatementAdapter.evaluate(StatementAdapter.java:36)
	at com.carrotsearch.randomizedtesting.rules.SystemPropertiesRestoreRule$1.evaluate(SystemPropertiesRestoreRule.java:57)
	at org.apache.lucene.util.AbstractBeforeAfterRule$1.evaluate(AbstractBeforeAfterRule.java:45)
	at com.carrotsearch.randomizedtesting.rules.StatementAdapter.evaluate(StatementAdapter.java:36)
	at org.apache.lucene.util.TestRuleStoreClassName$1.evaluate(TestRuleStoreClassName.java:41)
	at com.carrotsearch.randomizedtesting.rules.NoShadowingOrOverridesOnMethodsRule$1.evaluate(NoShadowingOrOverridesOnMethodsRule.java:40)
	at com.carrotsearch.randomizedtesting.rules.NoShadowingOrOverridesOnMethodsRule$1.evaluate(NoShadowingOrOverridesOnMethodsRule.java:40)
	at com.carrotsearch.randomizedtesting.rules.StatementAdapter.evaluate(StatementAdapter.java:36)
	at com.carrotsearch.randomizedtesting.rules.StatementAdapter.evaluate(StatementAdapter.java:36)
	at org.apache.lucene.util.TestRuleAssertionsRequired$1.evaluate(TestRuleAssertionsRequired.java:53)
	at org.apache.lucene.util.TestRuleMarkFailure$1.evaluate(TestRuleMarkFailure.java:47)
	at org.apache.lucene.util.TestRuleIgnoreAfterMaxFailures$1.evaluate(TestRuleIgnoreAfterMaxFailures.java:64)
	at org.apache.lucene.util.TestRuleIgnoreTestSuites$1.evaluate(TestRuleIgnoreTestSuites.java:54)
	at com.carrotsearch.randomizedtesting.rules.StatementAdapter.evaluate(StatementAdapter.java:36)
	at com.carrotsearch.randomizedtesting.ThreadLeakControl$StatementRunner.run(ThreadLeakControl.java:368)
	at java.base/java.lang.Thread.run(Thread.java:834)


FAILED:  org.apache.solr.handler.component.CustomHighlightComponentTest.test

Error Message:
java.lang.NullPointerException

Stack Trace:
org.apache.solr.client.solrj.SolrServerException: java.lang.NullPointerException
	at __randomizedtesting.SeedInfo.seed([3120F479E06A32F2:B974CBA34E965F0A]:0)
	at org.apache.solr.client.solrj.impl.CloudSolrClient.requestWithRetryOnStaleState(CloudSolrClient.java:999)
	at org.apache.solr.client.solrj.impl.CloudSolrClient.request(CloudSolrClient.java:817)
	at org.apache.solr.client.solrj.SolrRequest.process(SolrRequest.java:194)
	at org.apache.solr.client.solrj.request.UpdateRequest.commit(UpdateRequest.java:233)
	at org.apache.solr.handler.component.CustomHighlightComponentTest.test(CustomHighlightComponentTest.java:177)
	at java.base/jdk.internal.reflect.NativeMethodAccessorImpl.invoke0(Native Method)
	at java.base/jdk.internal.reflect.NativeMethodAccessorImpl.invoke(NativeMethodAccessorImpl.java:62)
	at java.base/jdk.internal.reflect.DelegatingMethodAccessorImpl.invoke(DelegatingMethodAccessorImpl.java:43)
	at java.base/java.lang.reflect.Method.invoke(Method.java:566)
	at com.carrotsearch.randomizedtesting.RandomizedRunner.invoke(RandomizedRunner.java:1742)
	at com.carrotsearch.randomizedtesting.RandomizedRunner$8.evaluate(RandomizedRunner.java:935)
	at com.carrotsearch.randomizedtesting.RandomizedRunner$9.evaluate(RandomizedRunner.java:971)
	at com.carrotsearch.randomizedtesting.RandomizedRunner$10.evaluate(RandomizedRunner.java:985)
	at com.carrotsearch.randomizedtesting.rules.SystemPropertiesRestoreRule$1.evaluate(SystemPropertiesRestoreRule.java:57)
	at org.apache.lucene.util.TestRuleSetupTeardownChained$1.evaluate(TestRuleSetupTeardownChained.java:49)
	at org.apache.lucene.util.AbstractBeforeAfterRule$1.evaluate(AbstractBeforeAfterRule.java:45)
	at org.apache.lucene.util.TestRuleThreadAndTestName$1.evaluate(TestRuleThreadAndTestName.java:48)
	at org.apache.lucene.util.TestRuleIgnoreAfterMaxFailures$1.evaluate(TestRuleIgnoreAfterMaxFailures.java:64)
	at org.apache.lucene.util.TestRuleMarkFailure$1.evaluate(TestRuleMarkFailure.java:47)
	at com.carrotsearch.randomizedtesting.rules.StatementAdapter.evaluate(StatementAdapter.java:36)
	at com.carrotsearch.randomizedtesting.ThreadLeakControl$StatementRunner.run(ThreadLeakControl.java:368)
	at com.carrotsearch.randomizedtesting.ThreadLeakControl.forkTimeoutingTask(ThreadLeakControl.java:817)
	at com.carrotsearch.randomizedtesting.ThreadLeakControl$3.evaluate(ThreadLeakControl.java:468)
	at com.carrotsearch.randomizedtesting.RandomizedRunner.runSingleTest(RandomizedRunner.java:944)
	at com.carrotsearch.randomizedtesting.RandomizedRunner$5.evaluate(RandomizedRunner.java:830)
	at com.carrotsearch.randomizedtesting.RandomizedRunner$6.evaluate(RandomizedRunner.java:880)
	at com.carrotsearch.randomizedtesting.RandomizedRunner$7.evaluate(RandomizedRunner.java:891)
	at com.carrotsearch.randomizedtesting.rules.StatementAdapter.evaluate(StatementAdapter.java:36)
	at com.carrotsearch.randomizedtesting.rules.SystemPropertiesRestoreRule$1.evaluate(SystemPropertiesRestoreRule.java:57)
	at org.apache.lucene.util.AbstractBeforeAfterRule$1.evaluate(AbstractBeforeAfterRule.java:45)
	at com.carrotsearch.randomizedtesting.rules.StatementAdapter.evaluate(StatementAdapter.java:36)
	at org.apache.lucene.util.TestRuleStoreClassName$1.evaluate(TestRuleStoreClassName.java:41)
	at com.carrotsearch.randomizedtesting.rules.NoShadowingOrOverridesOnMethodsRule$1.evaluate(NoShadowingOrOverridesOnMethodsRule.java:40)
	at com.carrotsearch.randomizedtesting.rules.NoShadowingOrOverridesOnMethodsRule$1.evaluate(NoShadowingOrOverridesOnMethodsRule.java:40)
	at com.carrotsearch.randomizedtesting.rules.StatementAdapter.evaluate(StatementAdapter.java:36)
	at com.carrotsearch.randomizedtesting.rules.StatementAdapter.evaluate(StatementAdapter.java:36)
	at org.apache.lucene.util.TestRuleAssertionsRequired$1.evaluate(TestRuleAssertionsRequired.java:53)
	at org.apache.lucene.util.TestRuleMarkFailure$1.evaluate(TestRuleMarkFailure.java:47)
	at org.apache.lucene.util.TestRuleIgnoreAfterMaxFailures$1.evaluate(TestRuleIgnoreAfterMaxFailures.java:64)
	at org.apache.lucene.util.TestRuleIgnoreTestSuites$1.evaluate(TestRuleIgnoreTestSuites.java:54)
	at com.carrotsearch.randomizedtesting.rules.StatementAdapter.evaluate(StatementAdapter.java:36)
	at com.carrotsearch.randomizedtesting.ThreadLeakControl$StatementRunner.run(ThreadLeakControl.java:368)
	at java.base/java.lang.Thread.run(Thread.java:834)
Caused by: java.lang.NullPointerException
	at org.apache.solr.client.solrj.impl.CloudSolrClient.buildUrlMap(CloudSolrClient.java:639)
	at org.apache.solr.client.solrj.impl.CloudSolrClient.directUpdate(CloudSolrClient.java:502)
	at org.apache.solr.client.solrj.impl.CloudSolrClient.sendRequest(CloudSolrClient.java:1016)
	at org.apache.solr.client.solrj.impl.CloudSolrClient.requestWithRetryOnStaleState(CloudSolrClient.java:884)
	... 42 more


FAILED:  junit.framework.TestSuite.org.apache.solr.handler.component.CustomHighlightComponentTest

Error Message:
Could not find collection:collection26

Stack Trace:
java.lang.AssertionError: Could not find collection:collection26
	at __randomizedtesting.SeedInfo.seed([3120F479E06A32F2]:0)
	at org.junit.Assert.fail(Assert.java:93)
	at org.junit.Assert.assertTrue(Assert.java:43)
	at org.junit.Assert.assertNotNull(Assert.java:526)
	at org.apache.solr.cloud.AbstractDistribZkTestBase.waitForRecoveriesToFinish(AbstractDistribZkTestBase.java:155)
	at org.apache.solr.handler.component.CustomHighlightComponentTest.setupCluster(CustomHighlightComponentTest.java:125)
	at java.base/jdk.internal.reflect.NativeMethodAccessorImpl.invoke0(Native Method)
	at java.base/jdk.internal.reflect.NativeMethodAccessorImpl.invoke(NativeMethodAccessorImpl.java:62)
	at java.base/jdk.internal.reflect.DelegatingMethodAccessorImpl.invoke(DelegatingMethodAccessorImpl.java:43)
	at java.base/java.lang.reflect.Method.invoke(Method.java:566)
	at com.carrotsearch.randomizedtesting.RandomizedRunner.invoke(RandomizedRunner.java:1742)
	at com.carrotsearch.randomizedtesting.RandomizedRunner$6.evaluate(RandomizedRunner.java:875)
	at com.carrotsearch.randomizedtesting.RandomizedRunner$7.evaluate(RandomizedRunner.java:891)
	at com.carrotsearch.randomizedtesting.rules.StatementAdapter.evaluate(StatementAdapter.java:36)
	at com.carrotsearch.randomizedtesting.rules.SystemPropertiesRestoreRule$1.evaluate(SystemPropertiesRestoreRule.java:57)
	at org.apache.lucene.util.AbstractBeforeAfterRule$1.evaluate(AbstractBeforeAfterRule.java:45)
	at com.carrotsearch.randomizedtesting.rules.StatementAdapter.evaluate(StatementAdapter.java:36)
	at org.apache.lucene.util.TestRuleStoreClassName$1.evaluate(TestRuleStoreClassName.java:41)
	at com.carrotsearch.randomizedtesting.rules.NoShadowingOrOverridesOnMethodsRule$1.evaluate(NoShadowingOrOverridesOnMethodsRule.java:40)
	at com.carrotsearch.randomizedtesting.rules.NoShadowingOrOverridesOnMethodsRule$1.evaluate(NoShadowingOrOverridesOnMethodsRule.java:40)
	at com.carrotsearch.randomizedtesting.rules.StatementAdapter.evaluate(StatementAdapter.java:36)
	at com.carrotsearch.randomizedtesting.rules.StatementAdapter.evaluate(StatementAdapter.java:36)
	at org.apache.lucene.util.TestRuleAssertionsRequired$1.evaluate(TestRuleAssertionsRequired.java:53)
	at org.apache.lucene.util.TestRuleMarkFailure$1.evaluate(TestRuleMarkFailure.java:47)
	at org.apache.lucene.util.TestRuleIgnoreAfterMaxFailures$1.evaluate(TestRuleIgnoreAfterMaxFailures.java:64)
	at org.apache.lucene.util.TestRuleIgnoreTestSuites$1.evaluate(TestRuleIgnoreTestSuites.java:54)
	at com.carrotsearch.randomizedtesting.rules.StatementAdapter.evaluate(StatementAdapter.java:36)
	at com.carrotsearch.randomizedtesting.ThreadLeakControl$StatementRunner.run(ThreadLeakControl.java:368)
	at java.base/java.lang.Thread.run(Thread.java:834)




Build Log:
[...truncated 1908 lines...]
   [junit4] JVM J1: stderr was not empty, see: /home/jenkins/workspace/Lucene-Solr-7.x-Linux/lucene/build/core/test/temp/junit4-J1-20180915_061415_98112974285592219183676.syserr
   [junit4] >>> JVM J1 emitted unexpected output (verbatim) ----
   [junit4] OpenJDK 64-Bit Server VM warning: Option UseConcMarkSweepGC was deprecated in version 9.0 and will likely be removed in a future release.
   [junit4] <<< JVM J1: EOF ----

[...truncated 5 lines...]
   [junit4] JVM J2: stderr was not empty, see: /home/jenkins/workspace/Lucene-Solr-7.x-Linux/lucene/build/core/test/temp/junit4-J2-20180915_061415_9868013900671264333679.syserr
   [junit4] >>> JVM J2 emitted unexpected output (verbatim) ----
   [junit4] OpenJDK 64-Bit Server VM warning: Option UseConcMarkSweepGC was deprecated in version 9.0 and will likely be removed in a future release.
   [junit4] <<< JVM J2: EOF ----

[...truncated 5 lines...]
   [junit4] JVM J0: stderr was not empty, see: /home/jenkins/workspace/Lucene-Solr-7.x-Linux/lucene/build/core/test/temp/junit4-J0-20180915_061415_98715705093949580548003.syserr
   [junit4] >>> JVM J0 emitted unexpected output (verbatim) ----
   [junit4] OpenJDK 64-Bit Server VM warning: Option UseConcMarkSweepGC was deprecated in version 9.0 and will likely be removed in a future release.
   [junit4] <<< JVM J0: EOF ----

[...truncated 286 lines...]
   [junit4] JVM J1: stderr was not empty, see: /home/jenkins/workspace/Lucene-Solr-7.x-Linux/lucene/build/test-framework/test/temp/junit4-J1-20180915_062137_7445282971024402418998.syserr
   [junit4] >>> JVM J1 emitted unexpected output (verbatim) ----
   [junit4] OpenJDK 64-Bit Server VM warning: Option UseConcMarkSweepGC was deprecated in version 9.0 and will likely be removed in a future release.
   [junit4] <<< JVM J1: EOF ----

[...truncated 3 lines...]
   [junit4] JVM J0: stderr was not empty, see: /home/jenkins/workspace/Lucene-Solr-7.x-Linux/lucene/build/test-framework/test/temp/junit4-J0-20180915_062137_7441467594156799249984.syserr
   [junit4] >>> JVM J0 emitted unexpected output (verbatim) ----
   [junit4] OpenJDK 64-Bit Server VM warning: Option UseConcMarkSweepGC was deprecated in version 9.0 and will likely be removed in a future release.
   [junit4] <<< JVM J0: EOF ----

[...truncated 18 lines...]
   [junit4] JVM J2: stderr was not empty, see: /home/jenkins/workspace/Lucene-Solr-7.x-Linux/lucene/build/test-framework/test/temp/junit4-J2-20180915_062137_7444074327420047169058.syserr
   [junit4] >>> JVM J2 emitted unexpected output (verbatim) ----
   [junit4] OpenJDK 64-Bit Server VM warning: Option UseConcMarkSweepGC was deprecated in version 9.0 and will likely be removed in a future release.
   [junit4] <<< JVM J2: EOF ----

[...truncated 1080 lines...]
   [junit4] JVM J2: stderr was not empty, see: /home/jenkins/workspace/Lucene-Solr-7.x-Linux/lucene/build/analysis/common/test/temp/junit4-J2-20180915_062621_1542441265089176102213.syserr
   [junit4] >>> JVM J2 emitted unexpected output (verbatim) ----
   [junit4] OpenJDK 64-Bit Server VM warning: Option UseConcMarkSweepGC was deprecated in version 9.0 and will likely be removed in a future release.
   [junit4] <<< JVM J2: EOF ----

[...truncated 3 lines...]
   [junit4] JVM J0: stderr was not empty, see: /home/jenkins/workspace/Lucene-Solr-7.x-Linux/lucene/build/analysis/common/test/temp/junit4-J0-20180915_062621_15410771790861989170913.syserr
   [junit4] >>> JVM J0 emitted unexpected output (verbatim) ----
   [junit4] OpenJDK 64-Bit Server VM warning: Option UseConcMarkSweepGC was deprecated in version 9.0 and will likely be removed in a future release.
   [junit4] <<< JVM J0: EOF ----

[...truncated 3 lines...]
   [junit4] JVM J1: stderr was not empty, see: /home/jenkins/workspace/Lucene-Solr-7.x-Linux/lucene/build/analysis/common/test/temp/junit4-J1-20180915_062621_1542480504331659185725.syserr
   [junit4] >>> JVM J1 emitted unexpected output (verbatim) ----
   [junit4] OpenJDK 64-Bit Server VM warning: Option UseConcMarkSweepGC was deprecated in version 9.0 and will likely be removed in a future release.
   [junit4] <<< JVM J1: EOF ----

[...truncated 255 lines...]
   [junit4] JVM J2: stderr was not empty, see: /home/jenkins/workspace/Lucene-Solr-7.x-Linux/lucene/build/analysis/icu/test/temp/junit4-J2-20180915_062851_04317022042271578667745.syserr
   [junit4] >>> JVM J2 emitted unexpected output (verbatim) ----
   [junit4] OpenJDK 64-Bit Server VM warning: Option UseConcMarkSweepGC was deprecated in version 9.0 and will likely be removed in a future release.
   [junit4] <<< JVM J2: EOF ----

[...truncated 3 lines...]
   [junit4] JVM J1: stderr was not empty, see: /home/jenkins/workspace/Lucene-Solr-7.x-Linux/lucene/build/analysis/icu/test/temp/junit4-J1-20180915_062851_04414736186276173542375.syserr
   [junit4] >>> JVM J1 emitted unexpected output (verbatim) ----
   [junit4] OpenJDK 64-Bit Server VM warning: Option UseConcMarkSweepGC was deprecated in version 9.0 and will likely be removed in a future release.
   [junit4] <<< JVM J1: EOF ----

[...truncated 3 lines...]
   [junit4] JVM J0: stderr was not empty, see: /home/jenkins/workspace/Lucene-Solr-7.x-Linux/lucene/build/analysis/icu/test/temp/junit4-J0-20180915_062851_04311131276190565285093.syserr
   [junit4] >>> JVM J0 emitted unexpected output (verbatim) ----
   [junit4] OpenJDK 64-Bit Server VM warning: Option UseConcMarkSweepGC was deprecated in version 9.0 and will likely be removed in a future release.
   [junit4] <<< JVM J0: EOF ----

[...truncated 250 lines...]
   [junit4] JVM J0: stderr was not empty, see: /home/jenkins/workspace/Lucene-Solr-7.x-Linux/lucene/build/analysis/kuromoji/test/temp/junit4-J0-20180915_062909_40015249500555054988575.syserr
   [junit4] >>> JVM J0 emitted unexpected output (verbatim) ----
   [junit4] OpenJDK 64-Bit Server VM warning: Option UseConcMarkSweepGC was deprecated in version 9.0 and will likely be removed in a future release.
   [junit4] <<< JVM J0: EOF ----

   [junit4] JVM J1: stderr was not empty, see: /home/jenkins/workspace/Lucene-Solr-7.x-Linux/lucene/build/analysis/kuromoji/test/temp/junit4-J1-20180915_062909_4007723986603542058996.syserr
   [junit4] >>> JVM J1 emitted unexpected output (verbatim) ----
   [junit4] OpenJDK 64-Bit Server VM warning: Option UseConcMarkSweepGC was deprecated in version 9.0 and will likely be removed in a future release.
   [junit4] <<< JVM J1: EOF ----

[...truncated 9 lines...]
   [junit4] JVM J2: stderr was not empty, see: /home/jenkins/workspace/Lucene-Solr-7.x-Linux/lucene/build/analysis/kuromoji/test/temp/junit4-J2-20180915_062909_4001560588010772883217.syserr
   [junit4] >>> JVM J2 emitted unexpected output (verbatim) ----
   [junit4] OpenJDK 64-Bit Server VM warning: Option UseConcMarkSweepGC was deprecated in version 9.0 and will likely be removed in a future release.
   [junit4] <<< JVM J2: EOF ----

[...truncated 162 lines...]
   [junit4] JVM J1: stderr was not empty, see: /home/jenkins/workspace/Lucene-Solr-7.x-Linux/lucene/build/analysis/morfologik/test/temp/junit4-J1-20180915_062932_46017042687662888438678.syserr
   [junit4] >>> JVM J1 emitted unexpected output (verbatim) ----
   [junit4] OpenJDK 64-Bit Server VM warning: Option UseConcMarkSweepGC was deprecated in version 9.0 and will likely be removed in a future release.
   [junit4] <<< JVM J1: EOF ----

[...truncated 3 lines...]
   [junit4] JVM J0: stderr was not empty, see: /home/jenkins/workspace/Lucene-Solr-7.x-Linux/lucene/build/analysis/morfologik/test/temp/junit4-J0-20180915_062932_46013205228348584152942.syserr
   [junit4] >>> JVM J0 emitted unexpected output (verbatim) ----
   [junit4] OpenJDK 64-Bit Server VM warning: Option UseConcMarkSweepGC was deprecated in version 9.0 and will likely be removed in a future release.
   [junit4] <<< JVM J0: EOF ----

[...truncated 3 lines...]
   [junit4] JVM J2: stderr was not empty, see: /home/jenkins/workspace/Lucene-Solr-7.x-Linux/lucene/build/analysis/morfologik/test/temp/junit4-J2-20180915_062932_466657433145256006293.syserr
   [junit4] >>> JVM J2 emitted unexpected output (verbatim) ----
   [junit4] OpenJDK 64-Bit Server VM warning: Option UseConcMarkSweepGC was deprecated in version 9.0 and will likely be removed in a future release.
   [junit4] <<< JVM J2: EOF ----

[...truncated 207 lines...]
   [junit4] JVM J2: stderr was not empty, see: /home/jenkins/workspace/Lucene-Solr-7.x-Linux/lucene/build/analysis/nori/test/temp/junit4-J2-20180915_062936_77518388141424168214376.syserr
   [junit4] >>> JVM J2 emitted unexpected output (verbatim) ----
   [junit4] OpenJDK 64-Bit Server VM warning: Option UseConcMarkSweepGC was deprecated in version 9.0 and will likely be removed in a future release.
   [junit4] <<< JVM J2: EOF ----

   [junit4] JVM J0: stderr was not empty, see: /home/jenkins/workspace/Lucene-Solr-7.x-Linux/lucene/build/analysis/nori/test/temp/junit4-J0-20180915_062936_7734739866485149551838.syserr
   [junit4] >>> JVM J0 emitted unexpected output (verbatim) ----
   [junit4] OpenJDK 64-Bit Server VM warning: Option UseConcMarkSweepGC was deprecated in version 9.0 and will likely be removed in a future release.
   [junit4] <<< JVM J0: EOF ----

[...truncated 6 lines...]
   [junit4] JVM J1: stderr was not empty, see: /home/jenkins/workspace/Lucene-Solr-7.x-Linux/lucene/build/analysis/nori/test/temp/junit4-J1-20180915_062936_7734106153492044502329.syserr
   [junit4] >>> JVM J1 emitted unexpected output (verbatim) ----
   [junit4] OpenJDK 64-Bit Server VM warning: Option UseConcMarkSweepGC was deprecated in version 9.0 and will likely be removed in a future release.
   [junit4] <<< JVM J1: EOF ----

[...truncated 174 lines...]
   [junit4] JVM J1: stderr was not empty, see: /home/jenkins/workspace/Lucene-Solr-7.x-Linux/lucene/build/analysis/opennlp/test/temp/junit4-J1-20180915_062946_28015784019619659805761.syserr
   [junit4] >>> JVM J1 emitted unexpected output (verbatim) ----
   [junit4] OpenJDK 64-Bit Server VM warning: Option UseConcMarkSweepGC was deprecated in version 9.0 and will likely be removed in a future release.
   [junit4] <<< JVM J1: EOF ----

   [junit4] JVM J2: stderr was not empty, see: /home/jenkins/workspace/Lucene-Solr-7.x-Linux/lucene/build/analysis/opennlp/test/temp/junit4-J2-20180915_062946_28016770623250549300818.syserr
   [junit4] >>> JVM J2 emitted unexpected output (verbatim) ----
   [junit4] OpenJDK 64-Bit Server VM warning: Option UseConcMarkSweepGC was deprecated in version 9.0 and will likely be removed in a future release.
   [junit4] <<< JVM J2: EOF ----

   [junit4] JVM J0: stderr was not empty, see: /home/jenkins/workspace/Lucene-Solr-7.x-Linux/lucene/build/analysis/opennlp/test/temp/junit4-J0-20180915_062946_2691733857520728565560.syserr
   [junit4] >>> JVM J0 emitted unexpected output (verbatim) ----
   [junit4] OpenJDK 64-Bit Server VM warning: Option UseConcMarkSweepGC was deprecated in version 9.0 and will likely be removed in a future release.
   [junit4] <<< JVM J0: EOF ----

[...truncated 176 lines...]
   [junit4] JVM J2: stderr was not empty, see: /home/jenkins/workspace/Lucene-Solr-7.x-Linux/lucene/build/analysis/phonetic/test/temp/junit4-J2-20180915_062949_1801532041408550436428.syserr
   [junit4] >>> JVM J2 emitted unexpected output (verbatim) ----
   [junit4] OpenJDK 64-Bit Server VM warning: Option UseConcMarkSweepGC was deprecated in version 9.0 and will likely be removed in a future release.
   [junit4] <<< JVM J2: EOF ----

[...truncated 3 lines...]
   [junit4] JVM J1: stderr was not empty, see: /home/jenkins/workspace/Lucene-Solr-7.x-Linux/lucene/build/analysis/phonetic/test/temp/junit4-J1-20180915_062949_1804995168335380607123.syserr
   [junit4] >>> JVM J1 emitted unexpected output (verbatim) ----
   [junit4] OpenJDK 64-Bit Server VM warning: Option UseConcMarkSweepGC was deprecated in version 9.0 and will likely be removed in a future release.
   [junit4] <<< JVM J1: EOF ----

[...truncated 3 lines...]
   [junit4] JVM J0: stderr was not empty, see: /home/jenkins/workspace/Lucene-Solr-7.x-Linux/lucene/build/analysis/phonetic/test/temp/junit4-J0-20180915_062949_18017987167845395149024.syserr
   [junit4] >>> JVM J0 emitted unexpected output (verbatim) ----
   [junit4] OpenJDK 64-Bit Server VM warning: Option UseConcMarkSweepGC was deprecated in version 9.0 and will likely be removed in a future release.
   [junit4] <<< JVM J0: EOF ----

[...truncated 161 lines...]
   [junit4] JVM J0: stderr was not empty, see: /home/jenkins/workspace/Lucene-Solr-7.x-Linux/lucene/build/analysis/smartcn/test/temp/junit4-J0-20180915_063000_2287463779066690596401.syserr
   [junit4] >>> JVM J0 emitted unexpected output (verbatim) ----
   [junit4] OpenJDK 64-Bit Server VM warning: Option UseConcMarkSweepGC was deprecated in version 9.0 and will likely be removed in a future release.
   [junit4] <<< JVM J0: EOF ----

[...truncated 3 lines...]
   [junit4] JVM J1: stderr was not empty, see: /home/jenkins/workspace/Lucene-Solr-7.x-Linux/lucene/build/analysis/smartcn/test/temp/junit4-J1-20180915_063000_22810042576295955062021.syserr
   [junit4] >>> JVM J1 emitted unexpected output (verbatim) ----
   [junit4] OpenJDK 64-Bit Server VM warning: Option UseConcMarkSweepGC was deprecated in version 9.0 and will likely be removed in a future release.
   [junit4] <<< JVM J1: EOF ----

[...truncated 165 lines...]
   [junit4] JVM J1: stderr was not empty, see: /home/jenkins/workspace/Lucene-Solr-7.x-Linux/lucene/build/analysis/stempel/test/temp/junit4-J1-20180915_063009_2577445542829248747648.syserr
   [junit4] >>> JVM J1 emitted unexpected output (verbatim) ----
   [junit4] OpenJDK 64-Bit Server VM warning: Option UseConcMarkSweepGC was deprecated in version 9.0 and will likely be removed in a future release.
   [junit4] <<< JVM J1: EOF ----

   [junit4] JVM J2: stderr was not empty, see: /home/jenkins/workspace/Lucene-Solr-7.x-Linux/lucene/build/analysis/stempel/test/temp/junit4-J2-20180915_063009_26414842162404983587417.syserr
   [junit4] >>> JVM J2 emitted unexpected output (verbatim) ----
   [junit4] OpenJDK 64-Bit Server VM warning: Option UseConcMarkSweepGC was deprecated in version 9.0 and will likely be removed in a future release.
   [junit4] <<< JVM J2: EOF ----

[...truncated 3 lines...]
   [junit4] JVM J0: stderr was not empty, see: /home/jenkins/workspace/Lucene-Solr-7.x-Linux/lucene/build/analysis/stempel/test/temp/junit4-J0-20180915_063009_2575800759736298964996.syserr
   [junit4] >>> JVM J0 emitted unexpected output (verbatim) ----
   [junit4] OpenJDK 64-Bit Server VM warning: Option UseConcMarkSweepGC was deprecated in version 9.0 and will likely be removed in a future release.
   [junit4] <<< JVM J0: EOF ----

[...truncated 198 lines...]
   [junit4] JVM J1: stderr was not empty, see: /home/jenkins/workspace/Lucene-Solr-7.x-Linux/lucene/build/backward-codecs/test/temp/junit4-J1-20180915_063012_5469333701158335197772.syserr
   [junit4] >>> JVM J1 emitted unexpected output (verbatim) ----
   [junit4] OpenJDK 64-Bit Server VM warning: Option UseConcMarkSweepGC was deprecated in version 9.0 and will likely be removed in a future release.
   [junit4] <<< JVM J1: EOF ----

[...truncated 22 lines...]
   [junit4] JVM J2: stderr was not empty, see: /home/jenkins/workspace/Lucene-Solr-7.x-Linux/lucene/build/backward-codecs/test/temp/junit4-J2-20180915_063012_54615181491713574330799.syserr
   [junit4] >>> JVM J2 emitted unexpected output (verbatim) ----
   [junit4] OpenJDK 64-Bit Server VM warning: Option UseConcMarkSweepGC was deprecated in version 9.0 and will likely be removed in a future release.
   [junit4] <<< JVM J2: EOF ----

[...truncated 14 lines...]
   [junit4] JVM J0: stderr was not empty, see: /home/jenkins/workspace/Lucene-Solr-7.x-Linux/lucene/build/backward-codecs/test/temp/junit4-J0-20180915_063012_54613110377822817849739.syserr
   [junit4] >>> JVM J0 emitted unexpected output (verbatim) ----
   [junit4] OpenJDK 64-Bit Server VM warning: Option UseConcMarkSweepGC was deprecated in version 9.0 and will likely be removed in a future release.
   [junit4] <<< JVM J0: EOF ----

[...truncated 1412 lines...]
   [junit4] JVM J1: stderr was not empty, see: /home/jenkins/workspace/Lucene-Solr-7.x-Linux/lucene/build/benchmark/test/temp/junit4-J1-20180915_063207_91616205495408183795650.syserr
   [junit4] >>> JVM J1 emitted unexpected output (verbatim) ----
   [junit4] OpenJDK 64-Bit Server VM warning: Option UseConcMarkSweepGC was deprecated in version 9.0 and will likely be removed in a future release.
   [junit4] <<< JVM J1: EOF ----

[...truncated 3 lines...]
   [junit4] JVM J2: stderr was not empty, see: /home/jenkins/workspace/Lucene-Solr-7.x-Linux/lucene/build/benchmark/test/temp/junit4-J2-20180915_063207_91616190187642366613225.syserr
   [junit4] >>> JVM J2 emitted unexpected output (verbatim) ----
   [junit4] OpenJDK 64-Bit Server VM warning: Option UseConcMarkSweepGC was deprecated in version 9.0 and will likely be removed in a future release.
   [junit4] <<< JVM J2: EOF ----

[...truncated 3 lines...]
   [junit4] JVM J0: stderr was not empty, see: /home/jenkins/workspace/Lucene-Solr-7.x-Linux/lucene/build/benchmark/test/temp/junit4-J0-20180915_063207_9161537844665786051840.syserr
   [junit4] >>> JVM J0 emitted unexpected output (verbatim) ----
   [junit4] OpenJDK 64-Bit Server VM warning: Option UseConcMarkSweepGC was deprecated in version 9.0 and will likely be removed in a future release.
   [junit4] <<< JVM J0: EOF ----

[...truncated 250 lines...]
   [junit4] JVM J2: stderr was not empty, see: /home/jenkins/workspace/Lucene-Solr-7.x-Linux/lucene/build/classification/test/temp/junit4-J2-20180915_063216_9584296873351321731129.syserr
   [junit4] >>> JVM J2 emitted unexpected output (verbatim) ----
   [junit4] OpenJDK 64-Bit Server VM warning: Option UseConcMarkSweepGC was deprecated in version 9.0 and will likely be removed in a future release.
   [junit4] <<< JVM J2: EOF ----

[...truncated 3 lines...]
   [junit4] JVM J1: stderr was not empty, see: /home/jenkins/workspace/Lucene-Solr-7.x-Linux/lucene/build/classification/test/temp/junit4-J1-20180915_063216_9588249373924352009461.syserr
   [junit4] >>> JVM J1 emitted unexpected output (verbatim) ----
   [junit4] OpenJDK 64-Bit Server VM warning: Option UseConcMarkSweepGC was deprecated in version 9.0 and will likely be removed in a future release.
   [junit4] <<< JVM J1: EOF ----

[...truncated 3 lines...]
   [junit4] JVM J0: stderr was not empty, see: /home/jenkins/workspace/Lucene-Solr-7.x-Linux/lucene/build/classification/test/temp/junit4-J0-20180915_063216_95815471087301913796263.syserr
   [junit4] >>> JVM J0 emitted unexpected output (verbatim) ----
   [junit4] OpenJDK 64-Bit Server VM warning: Option UseConcMarkSweepGC was deprecated in version 9.0 and will likely be removed in a future release.
   [junit4] <<< JVM J0: EOF ----

[...truncated 267 lines...]
   [junit4] JVM J0: stderr was not empty, see: /home/jenkins/workspace/Lucene-Solr-7.x-Linux/lucene/build/codecs/test/temp/junit4-J0-20180915_063229_30310569891917492052889.syserr
   [junit4] >>> JVM J0 emitted unexpected output (verbatim) ----
   [junit4] OpenJDK 64-Bit Server VM warning: Option UseConcMarkSweepGC was deprecated in version 9.0 and will likely be removed in a future release.
   [junit4] <<< JVM J0: EOF ----

[...truncated 3 lines...]
   [junit4] JVM J2: stderr was not empty, see: /home/jenkins/workspace/Lucene-Solr-7.x-Linux/lucene/build/codecs/test/temp/junit4-J2-20180915_063229_303926635636441176980.syserr
   [junit4] >>> JVM J2 emitted unexpected output (verbatim) ----
   [junit4] OpenJDK 64-Bit Server VM warning: Option UseConcMarkSweepGC was deprecated in version 9.0 and will likely be removed in a future release.
   [junit4] <<< JVM J2: EOF ----

[...truncated 4 lines...]
   [junit4] JVM J1: stderr was not empty, see: /home/jenkins/workspace/Lucene-Solr-7.x-Linux/lucene/build/codecs/test/temp/junit4-J1-20180915_063229_30314655999656246369370.syserr
   [junit4] >>> JVM J1 emitted unexpected output (verbatim) ----
   [junit4] OpenJDK 64-Bit Server VM warning: Option UseConcMarkSweepGC was deprecated in version 9.0 and will likely be removed in a future release.
   [junit4] <<< JVM J1: EOF ----

[...truncated 233 lines...]
   [junit4] JVM J1: stderr was not empty, see: /home/jenkins/workspace/Lucene-Solr-7.x-Linux/lucene/build/demo/test/temp/junit4-J1-20180915_063528_66915702802247394743146.syserr
   [junit4] >>> JVM J1 emitted unexpected output (verbatim) ----
   [junit4] OpenJDK 64-Bit Server VM warning: Option UseConcMarkSweepGC was deprecated in version 9.0 and will likely be removed in a future release.
   [junit4] <<< JVM J1: EOF ----

   [junit4] JVM J0: stderr was not empty, see: /home/jenkins/workspace/Lucene-Solr-7.x-Linux/lucene/build/demo/test/temp/junit4-J0-20180915_063528_66915275204926777417667.syserr
   [junit4] >>> JVM J0 emitted unexpected output (verbatim) ----
   [junit4] OpenJDK 64-Bit Server VM warning: Option UseConcMarkSweepGC was deprecated in version 9.0 and will likely be removed in a future release.
   [junit4] <<< JVM J0: EOF ----

[...truncated 3 lines...]
   [junit4] JVM J2: stderr was not empty, see: /home/jenkins/workspace/Lucene-Solr-7.x-Linux/lucene/build/demo/test/temp/junit4-J2-20180915_063528_6697469884554991042057.syserr
   [junit4] >>> JVM J2 emitted unexpected output (verbatim) ----
   [junit4] OpenJDK 64-Bit Server VM warning: Option UseConcMarkSweepGC was deprecated in version 9.0 and will likely be removed in a future release.
   [junit4] <<< JVM J2: EOF ----

[...truncated 176 lines...]
   [junit4] JVM J2: stderr was not empty, see: /home/jenkins/workspace/Lucene-Solr-7.x-Linux/lucene/build/expressions/test/temp/junit4-J2-20180915_063532_0802435909681170099118.syserr
   [junit4] >>> JVM J2 emitted unexpected output (verbatim) ----
   [junit4] OpenJDK 64-Bit Server VM warning: Option UseConcMarkSweepGC was deprecated in version 9.0 and will likely be removed in a future release.
   [junit4] <<< JVM J2: EOF ----

   [junit4] JVM J1: stderr was not empty, see: /home/jenkins/workspace/Lucene-Solr-7.x-Linux/lucene/build/expressions/test/temp/junit4-J1-20180915_063532_08014755442959043434827.syserr
   [junit4] >>> JVM J1 emitted unexpected output (verbatim) ----
   [junit4] OpenJDK 64-Bit Server VM warning: Option UseConcMarkSweepGC was deprecated in version 9.0 and will likely be removed in a future release.
   [junit4] <<< JVM J1: EOF ----

[...truncated 3 lines...]
   [junit4] JVM J0: stderr was not empty, see: /home/jenkins/workspace/Lucene-Solr-7.x-Linux/lucene/build/expressions/test/temp/junit4-J0-20180915_063532_0808237647967714211139.syserr
   [junit4] >>> JVM J0 emitted unexpected output (verbatim) ----
   [junit4] OpenJDK 64-Bit Server VM warning: Option UseConcMarkSweepGC was deprecated in version 9.0 and will likely be removed in a future release.
   [junit4] <<< JVM J0: EOF ----

[...truncated 222 lines...]
   [junit4] JVM J1: stderr was not empty, see: /home/jenkins/workspace/Lucene-Solr-7.x-Linux/lucene/build/facet/test/temp/junit4-J1-20180915_063538_0585964459065195257372.syserr
   [junit4] >>> JVM J1 emitted unexpected output (verbatim) ----
   [junit4] OpenJDK 64-Bit Server VM warning: Option UseConcMarkSweepGC was deprecated in version 9.0 and will likely be removed in a future release.
   [junit4] <<< JVM J1: EOF ----

[...truncated 3 lines...]
   [junit4] JVM J2: stderr was not empty, see: /home/jenkins/workspace/Lucene-Solr-7.x-Linux/lucene/build/facet/test/temp/junit4-J2-20180915_063538_05915986341268442654602.syserr
   [junit4] >>> JVM J2 emitted unexpected output (verbatim) ----
   [junit4] OpenJDK 64-Bit Server VM warning: Option UseConcMarkSweepGC was deprecated in version 9.0 and will likely be removed in a future release.
   [junit4] <<< JVM J2: EOF ----

[...truncated 15 lines...]
   [junit4] JVM J0: stderr was not empty, see: /home/jenkins/workspace/Lucene-Solr-7.x-Linux/lucene/build/facet/test/temp/junit4-J0-20180915_063538_05217523252103124935293.syserr
   [junit4] >>> JVM J0 emitted unexpected output (verbatim) ----
   [junit4] OpenJDK 64-Bit Server VM warning: Option UseConcMarkSweepGC was deprecated in version 9.0 and will likely be removed in a future release.
   [junit4] <<< JVM J0: EOF ----

[...truncated 182 lines...]
   [junit4] JVM J0: stderr was not empty, see: /home/jenkins/workspace/Lucene-Solr-7.x-Linux/lucene/build/grouping/test/temp/junit4-J0-20180915_063608_3302880278223747311841.syserr
   [junit4] >>> JVM J0 emitted unexpected output (verbatim) ----
   [junit4] OpenJDK 64-Bit Server VM warning: Option UseConcMarkSweepGC was deprecated in version 9.0 and will likely be removed in a future release.
   [junit4] <<< JVM J0: EOF ----

[...truncated 6 lines...]
   [junit4] JVM J2: stderr was not empty, see: /home/jenkins/workspace/Lucene-Solr-7.x-Linux/lucene/build/grouping/test/temp/junit4-J2-20180915_063608_330362435852969941877.syserr
   [junit4] >>> JVM J2 emitted unexpected output (verbatim) ----
   [junit4] OpenJDK 64-Bit Server VM warning: Option UseConcMarkSweepGC was deprecated in version 9.0 and will likely be removed in a future release.
   [junit4] <<< JVM J2: EOF ----

   [junit4] JVM J1: stderr was not empty, see: /home/jenkins/workspace/Lucene-Solr-7.x-Linux/lucene/build/grouping/test/temp/junit4-J1-20180915_063608_33010566839551103834259.syserr
   [junit4] >>> JVM J1 emitted unexpected output (verbatim) ----
   [junit4] OpenJDK 64-Bit Server VM warning: Option UseConcMarkSweepGC was deprecated in version 9.0 and will likely be removed in a future release.
   [junit4] <<< JVM J1: EOF ----

[...truncated 251 lines...]
   [junit4] JVM J1: stderr was not empty, see: /home/jenkins/workspace/Lucene-Solr-7.x-Linux/lucene/build/highlighter/test/temp/junit4-J1-20180915_063620_1238550062941331657517.syserr
   [junit4] >>> JVM J1 emitted unexpected output (verbatim) ----
   [junit4] OpenJDK 64-Bit Server VM warning: Option UseConcMarkSweepGC was deprecated in version 9.0 and will likely be removed in a future release.
   [junit4] <<< JVM J1: EOF ----

   [junit4] JVM J0: stderr was not empty, see: /home/jenkins/workspace/Lucene-Solr-7.x-Linux/lucene/build/highlighter/test/temp/junit4-J0-20180915_063620_1236840896319075300825.syserr
   [junit4] >>> JVM J0 emitted unexpected output (verbatim) ----
   [junit4] OpenJDK 64-Bit Server VM warning: Option UseConcMarkSweepGC was deprecated in version 9.0 and will likely be removed in a future release.
   [junit4] <<< JVM J0: EOF ----

[...truncated 3 lines...]
   [junit4] JVM J2: stderr was not empty, see: /home/jenkins/workspace/Lucene-Solr-7.x-Linux/lucene/build/highlighter/test/temp/junit4-J2-20180915_063620_12311429523596612248049.syserr
   [junit4] >>> JVM J2 emitted unexpected output (verbatim) ----
   [junit4] OpenJDK 64-Bit Server VM warning: Option UseConcMarkSweepGC was deprecated in version 9.0 and will likely be removed in a future release.
   [junit4] <<< JVM J2: EOF ----

[...truncated 163 lines...]
   [junit4] JVM J1: stderr was not empty, see: /home/jenkins/workspace/Lucene-Solr-7.x-Linux/lucene/build/join/test/temp/junit4-J1-20180915_063646_9776398893217878308564.syserr
   [junit4] >>> JVM J1 emitted unexpected output (verbatim) ----
   [junit4] OpenJDK 64-Bit Server VM warning: Option UseConcMarkSweepGC was deprecated in version 9.0 and will likely be removed in a future release.
   [junit4] <<< JVM J1: EOF ----

[...truncated 3 lines...]
   [junit4] JVM J2: stderr was not empty, see: /home/jenkins/workspace/Lucene-Solr-7.x-Linux/lucene/build/join/test/temp/junit4-J2-20180915_063646_9776813007319864196635.syserr
   [junit4] >>> JVM J2 emitted unexpected output (verbatim) ----
   [junit4] OpenJDK 64-Bit Server VM warning: Option UseConcMarkSweepGC was deprecated in version 9.0 and will likely be removed in a future release.
   [junit4] <<< JVM J2: EOF ----

[...truncated 6 lines...]
   [junit4] JVM J0: stderr was not empty, see: /home/jenkins/workspace/Lucene-Solr-7.x-Linux/lucene/build/join/test/temp/junit4-J0-20180915_063646_97710529737955165024548.syserr
   [junit4] >>> JVM J0 emitted unexpected output (verbatim) ----
   [junit4] OpenJDK 64-Bit Server VM warning: Option UseConcMarkSweepGC was deprecated in version 9.0 and will likely be removed in a future release.
   [junit4] <<< JVM J0: EOF ----

[...truncated 157 lines...]
   [junit4] JVM J0: stderr was not empty, see: /home/jenkins/workspace/Lucene-Solr-7.x-Linux/lucene/build/memory/test/temp/junit4-J0-20180915_063710_8611132360295452603696.syserr
   [junit4] >>> JVM J0 emitted unexpected output (verbatim) ----
   [junit4] OpenJDK 64-Bit Server VM warning: Option UseConcMarkSweepGC was deprecated in version 9.0 and will likely be removed in a future release.
   [junit4] <<< JVM J0: EOF ----

[...truncated 3 lines...]
   [junit4] JVM J1: stderr was not empty, see: /home/jenkins/workspace/Lucene-Solr-7.x-Linux/lucene/build/memory/test/temp/junit4-J1-20180915_063710_86114881523072648380544.syserr
   [junit4] >>> JVM J1 emitted unexpected output (verbatim) ----
   [junit4] OpenJDK 64-Bit Server VM warning: Option UseConcMarkSweepGC was deprecated in version 9.0 and will likely be removed in a future release.
   [junit4] <<< JVM J1: EOF ----

[...truncated 187 lines...]
   [junit4] JVM J2: stderr was not empty, see: /home/jenkins/workspace/Lucene-Solr-7.x-Linux/lucene/build/misc/test/temp/junit4-J2-20180915_063721_37515998755743613232541.syserr
   [junit4] >>> JVM J2 emitted unexpected output (verbatim) ----
   [junit4] OpenJDK 64-Bit Server VM warning: Option UseConcMarkSweepGC was deprecated in version 9.0 and will likely be removed in a future release.
   [junit4] <<< JVM J2: EOF ----

[...truncated 5 lines...]
   [junit4] JVM J1: stderr was not empty, see: /home/jenkins/workspace/Lucene-Solr-7.x-Linux/lucene/build/misc/test/temp/junit4-J1-20180915_063721_3754483250585227699444.syserr
   [junit4] >>> JVM J1 emitted unexpected output (verbatim) ----
   [junit4] OpenJDK 64-Bit Server VM warning: Option UseConcMarkSweepGC was deprecated in version 9.0 and will likely be removed in a future release.
   [junit4] <<< JVM J1: EOF ----

[...truncated 3 lines...]
   [junit4] JVM J0: stderr was not empty, see: /home/jenkins/workspace/Lucene-Solr-7.x-Linux/lucene/build/misc/test/temp/junit4-J0-20180915_063721_3751067473286329336593.syserr
   [junit4] >>> JVM J0 emitted unexpected output (verbatim) ----
   [junit4] OpenJDK 64-Bit Server VM warning: Option UseConcMarkSweepGC was deprecated in version 9.0 and will likely be removed in a future release.
   [junit4] <<< JVM J0: EOF ----

[...truncated 341 lines...]
   [junit4] JVM J2: stderr was not empty, see: /home/jenkins/workspace/Lucene-Solr-7.x-Linux/lucene/build/queries/test/temp/junit4-J2-20180915_063739_50211064910475417483122.syserr
   [junit4] >>> JVM J2 emitted unexpected output (verbatim) ----
   [junit4] OpenJDK 64-Bit Server VM warning: Option UseConcMarkSweepGC was deprecated in version 9.0 and will likely be removed in a future release.
   [junit4] <<< JVM J2: EOF ----

[...truncated 3 lines...]
   [junit4] JVM J0: stderr was not empty, see: /home/jenkins/workspace/Lucene-Solr-7.x-Linux/lucene/build/queries/test/temp/junit4-J0-20180915_063739_5029451355321116683394.syserr
   [junit4] >>> JVM J0 emitted unexpected output (verbatim) ----
   [junit4] OpenJDK 64-Bit Server VM warning: Option UseConcMarkSweepGC was deprecated in version 9.0 and will likely be removed in a future release.
   [junit4] <<< JVM J0: EOF ----

   [junit4] JVM J1: stderr was not empty, see: /home/jenkins/workspace/Lucene-Solr-7.x-Linux/lucene/build/queries/test/temp/junit4-J1-20180915_063739_5028571424176813961977.syserr
   [junit4] >>> JVM J1 emitted unexpected output (verbatim) ----
   [junit4] OpenJDK 64-Bit Server VM warning: Option UseConcMarkSweepGC was deprecated in version 9.0 and will likely be removed in a future release.
   [junit4] <<< JVM J1: EOF ----

[...truncated 237 lines...]
   [junit4] JVM J0: stderr was not empty, see: /home/jenkins/workspace/Lucene-Solr-7.x-Linux/lucene/build/queryparser/test/temp/junit4-J0-20180915_063747_46117835481497830773707.syserr
   [junit4] >>> JVM J0 emitted unexpected output (verbatim) ----
   [junit4] OpenJDK 64-Bit Server VM warning: Option UseConcMarkSweepGC was deprecated in version 9.0 and will likely be removed in a future release.
   [junit4] <<< JVM J0: EOF ----

   [junit4] JVM J2: stderr was not empty, see: /home/jenkins/workspace/Lucene-Solr-7.x-Linux/lucene/build/queryparser/test/temp/junit4-J2-20180915_063747_46116391502476666298525.syserr
   [junit4] >>> JVM J2 emitted unexpected output (verbatim) ----
   [junit4] OpenJDK 64-Bit Server VM warning: Option UseConcMarkSweepGC was deprecated in version 9.0 and will likely be removed in a future release.
   [junit4] <<< JVM J2: EOF ----

   [junit4] JVM J1: stderr was not empty, see: /home/jenkins/workspace/Lucene-Solr-7.x-Linux/lucene/build/queryparser/test/temp/junit4-J1-20180915_063747_4612468522820012204273.syserr
   [junit4] >>> JVM J1 emitted unexpected output (verbatim) ----
   [junit4] OpenJDK 64-Bit Server VM warning: Option UseConcMarkSweepGC was deprecated in version 9.0 and will likely be removed in a future release.
   [junit4] <<< JVM J1: EOF ----

[...truncated 216 lines...]
   [junit4] JVM J1: stderr was not empty, see: /home/jenkins/workspace/Lucene-Solr-7.x-Linux/lucene/build/replicator/test/temp/junit4-J1-20180915_063754_7259894786927008439870.syserr
   [junit4] >>> JVM J1 emitted unexpected output (verbatim) ----
   [junit4] OpenJDK 64-Bit Server VM warning: Option UseConcMarkSweepGC was deprecated in version 9.0 and will likely be removed in a future release.
   [junit4] <<< JVM J1: EOF ----

[...truncated 3 lines...]
   [junit4] JVM J2: stderr was not empty, see: /home/jenkins/workspace/Lucene-Solr-7.x-Linux/lucene/build/replicator/test/temp/junit4-J2-20180915_063754_7254935420464915466511.syserr
   [junit4] >>> JVM J2 emitted unexpected output (verbatim) ----
   [junit4] OpenJDK 64-Bit Server VM warning: Option UseConcMarkSweepGC was deprecated in version 9.0 and will likely be removed in a future release.
   [junit4] <<< JVM J2: EOF ----

[...truncated 3 lines...]
   [junit4] JVM J0: stderr was not empty, see: /home/jenkins/workspace/Lucene-Solr-7.x-Linux/lucene/build/replicator/test/temp/junit4-J0-20180915_063754_7257706513616900861679.syserr
   [junit4] >>> JVM J0 emitted unexpected output (verbatim) ----
   [junit4] OpenJDK 64-Bit Server VM warning: Option UseConcMarkSweepGC was deprecated in version 9.0 and will likely be removed in a future release.
   [junit4] <<< JVM J0: EOF ----

[...truncated 217 lines...]
   [junit4] JVM J0: stderr was not empty, see: /home/jenkins/workspace/Lucene-Solr-7.x-Linux/lucene/build/sandbox/test/temp/junit4-J0-20180915_063806_7427797995481494590135.syserr
   [junit4] >>> JVM J0 emitted unexpected output (verbatim) ----
   [junit4] OpenJDK 64-Bit Server VM warning: Option UseConcMarkSweepGC was deprecated in version 9.0 and will likely be removed in a future release.
   [junit4] <<< JVM J0: EOF ----

[...truncated 3 lines...]
   [junit4] JVM J2: stderr was not empty, see: /home/jenkins/workspace/Lucene-Solr-7.x-Linux/lucene/build/sandbox/test/temp/junit4-J2-20180915_063806_7427456639095034245620.syserr
   [junit4] >>> JVM J2 emitted unexpected output (verbatim) ----
   [junit4] OpenJDK 64-Bit Server VM warning: Option UseConcMarkSweepGC was deprecated in version 9.0 and will likely be removed in a future release.
   [junit4] <<< JVM J2: EOF ----

[...truncated 5 lines...]
   [junit4] JVM J1: stderr was not empty, see: /home/jenkins/workspace/Lucene-Solr-7.x-Linux/lucene/build/sandbox/test/temp/junit4-J1-20180915_063806_7428280095399234927122.syserr
   [junit4] >>> JVM J1 emitted unexpected output (verbatim) ----
   [junit4] OpenJDK 64-Bit Server VM warning: Option UseConcMarkSweepGC was deprecated in version 9.0 and will likely be removed in a future release.
   [junit4] <<< JVM J1: EOF ----

[...truncated 296 lines...]
   [junit4] JVM J2: stderr was not empty, see: /home/jenkins/workspace/Lucene-Solr-7.x-Linux/lucene/build/spatial-extras/test/temp/junit4-J2-20180915_063910_9876694549847694510334.syserr
   [junit4] >>> JVM J2 emitted unexpected output (verbatim) ----
   [junit4] OpenJDK 64-Bit Server VM warning: Option UseConcMarkSweepGC was deprecated in version 9.0 and will likely be removed in a future release.
   [junit4] <<< JVM J2: EOF ----

[...truncated 3 lines...]
   [junit4] JVM J0: stderr was not empty, see: /home/jenkins/workspace/Lucene-Solr-7.x-Linux/lucene/build/spatial-extras/test/temp/junit4-J0-20180915_063910_98717989074694639051590.syserr
   [junit4] >>> JVM J0 emitted unexpected output (verbatim) ----
   [junit4] OpenJDK 64-Bit Server VM warning: Option UseConcMarkSweepGC was deprecated in version 9.0 and will likely be removed in a future release.
   [junit4] <<< JVM J0: EOF ----

[...truncated 3 lines...]
   [junit4] JVM J1: stderr was not empty, see: /home/jenkins/workspace/Lucene-Solr-7.x-Linux/lucene/build/spatial-extras/test/temp/junit4-J1-20180915_063910_9875802034761569395103.syserr
   [junit4] >>> JVM J1 emitted unexpected output (verbatim) ----
   [junit4] OpenJDK 64-Bit Server VM warning: Option UseConcMarkSweepGC was deprecated in version 9.0 and will likely be removed in a future release.
   [junit4] <<< JVM J1: EOF ----

[...truncated 153 lines...]
   [junit4] JVM J0: stderr was not empty, see: /home/jenkins/workspace/Lucene-Solr-7.x-Linux/lucene/build/spatial/test/temp/junit4-J0-20180915_063940_7702688702519113952916.syserr
   [junit4] >>> JVM J0 emitted unexpected output (verbatim) ----
   [junit4] OpenJDK 64-Bit Server VM warning: Option UseConcMarkSweepGC was deprecated in version 9.0 and will likely be removed in a future release.
   [junit4] <<< JVM J0: EOF ----

[...truncated 184 lines...]
   [junit4] JVM J2: stderr was not empty, see: /home/jenkins/workspace/Lucene-Solr-7.x-Linux/lucene/build/spatial3d/test/temp/junit4-J2-20180915_063942_63715619028520727854685.syserr
   [junit4] >>> JVM J2 emitted unexpected output (verbatim) ----
   [junit4] OpenJDK 64-Bit Server VM warning: Option UseConcMarkSweepGC was deprecated in version 9.0 and will likely be removed in a future release.
   [junit4] <<< JVM J2: EOF ----

[...truncated 3 lines...]
   [junit4] JVM J0: stderr was not empty, see: /home/jenkins/workspace/Lucene-Solr-7.x-Linux/lucene/build/spatial3d/test/temp/junit4-J0-20180915_063942_6375633609075167673198.syserr
   [junit4] >>> JVM J0 emitted unexpected output (verbatim) ----
   [junit4] OpenJDK 64-Bit Server VM warning: Option UseConcMarkSweepGC was deprecated in version 9.0 and will likely be removed in a future release.
   [junit4] <<< JVM J0: EOF ----

[...truncated 5 lines...]
   [junit4] JVM J1: stderr was not empty, see: /home/jenkins/workspace/Lucene-Solr-7.x-Linux/lucene/build/spatial3d/test/temp/junit4-J1-20180915_063942_6379695960633511101864.syserr
   [junit4] >>> JVM J1 emitted unexpected output (verbatim) ----
   [junit4] OpenJDK 64-Bit Server VM warning: Option UseConcMarkSweepGC was deprecated in version 9.0 and will likely be removed in a future release.
   [junit4] <<< JVM J1: EOF ----

[...truncated 246 lines...]
   [junit4] JVM J1: stderr was not empty, see: /home/jenkins/workspace/Lucene-Solr-7.x-Linux/lucene/build/suggest/test/temp/junit4-J1-20180915_064045_4867702252242579812219.syserr
   [junit4] >>> JVM J1 emitted unexpected output (verbatim) ----
   [junit4] OpenJDK 64-Bit Server VM warning: Option UseConcMarkSweepGC was deprecated in version 9.0 and will likely be removed in a future release.
   [junit4] <<< JVM J1: EOF ----

[...truncated 9 lines...]
   [junit4] JVM J2: stderr was not empty, see: /home/jenkins/workspace/Lucene-Solr-7.x-Linux/lucene/build/suggest/test/temp/junit4-J2-20180915_064045_486766403162681507262.syserr
   [junit4] >>> JVM J2 emitted unexpected output (verbatim) ----
   [junit4] OpenJDK 64-Bit Server VM warning: Option UseConcMarkSweepGC was deprecated in version 9.0 and will likely be removed in a future release.
   [junit4] <<< JVM J2: EOF ----

[...truncated 12 lines...]
   [junit4] JVM J0: stderr was not empty, see: /home/jenkins/workspace/Lucene-Solr-7.x-Linux/lucene/build/suggest/test/temp/junit4-J0-20180915_064045_48617197971543096316245.syserr
   [junit4] >>> JVM J0 emitted unexpected output (verbatim) ----
   [junit4] OpenJDK 64-Bit Server VM warning: Option UseConcMarkSweepGC was deprecated in version 9.0 and will likely be removed in a future release.
   [junit4] <<< JVM J0: EOF ----

[...truncated 3701 lines...]
   [junit4] Suite: org.apache.solr.cloud.autoscaling.ComputePlanActionTest
   [junit4]   2> 1609578 INFO  (SUITE-ComputePlanActionTest-seed#[3120F479E06A32F2]-worker) [    ] o.a.s.SolrTestCaseJ4 SecureRandom sanity checks: test.solr.allowed.securerandom=null & java.security.egd=file:/dev/./urandom
   [junit4]   2> Creating dataDir: /home/jenkins/workspace/Lucene-Solr-7.x-Linux/solr/build/solr-core/test/J0/temp/solr.cloud.autoscaling.ComputePlanActionTest_3120F479E06A32F2-001/init-core-data-001
   [junit4]   2> 1609579 WARN  (SUITE-ComputePlanActionTest-seed#[3120F479E06A32F2]-worker) [    ] o.a.s.SolrTestCaseJ4 startTrackingSearchers: numOpens=1 numCloses=1
   [junit4]   2> 1609579 INFO  (SUITE-ComputePlanActionTest-seed#[3120F479E06A32F2]-worker) [    ] o.a.s.SolrTestCaseJ4 Using PointFields (NUMERIC_POINTS_SYSPROP=true) w/NUMERIC_DOCVALUES_SYSPROP=false
   [junit4]   2> 1609580 INFO  (SUITE-ComputePlanActionTest-seed#[3120F479E06A32F2]-worker) [    ] o.a.s.SolrTestCaseJ4 Randomized ssl (true) and clientAuth (false) via: @org.apache.solr.util.RandomizeSSL(reason="", ssl=0.0/0.0, value=0.0/0.0, clientAuth=0.0/0.0)
   [junit4]   2> 1609580 INFO  (SUITE-ComputePlanActionTest-seed#[3120F479E06A32F2]-worker) [    ] o.a.s.c.MiniSolrCloudCluster Starting cluster of 1 servers in /home/jenkins/workspace/Lucene-Solr-7.x-Linux/solr/build/solr-core/test/J0/temp/solr.cloud.autoscaling.ComputePlanActionTest_3120F479E06A32F2-001/tempDir-001
   [junit4]   2> 1609580 INFO  (SUITE-ComputePlanActionTest-seed#[3120F479E06A32F2]-worker) [    ] o.a.s.c.ZkTestServer STARTING ZK TEST SERVER
   [junit4]   2> 1609580 INFO  (Thread-4957) [    ] o.a.s.c.ZkTestServer client port:0.0.0.0/0.0.0.0:0
   [junit4]   2> 1609580 INFO  (Thread-4957) [    ] o.a.s.c.ZkTestServer Starting server
   [junit4]   2> 1609582 ERROR (Thread-4957) [    ] o.a.z.s.ZooKeeperServer ZKShutdownHandler is not registered, so ZooKeeper server won't take any action on ERROR or SHUTDOWN server state changes
   [junit4]   2> 1609680 INFO  (SUITE-ComputePlanActionTest-seed#[3120F479E06A32F2]-worker) [    ] o.a.s.c.ZkTestServer start zk server on port:45299
   [junit4]   2> 1609682 INFO  (zkConnectionManagerCallback-5018-thread-1) [    ] o.a.s.c.c.ConnectionManager zkClient has connected
   [junit4]   2> 1609684 INFO  (jetty-launcher-5015-thread-1) [    ] o.e.j.s.Server jetty-9.4.11.v20180605; built: 2018-06-05T18:24:03.829Z; git: d5fc0523cfa96bfebfbda19606cad384d772f04c; jvm 11+28
   [junit4]   2> 1609685 INFO  (jetty-launcher-5015-thread-1) [    ] o.e.j.s.session DefaultSessionIdManager workerName=node0
   [junit4]   2> 1609685 INFO  (jetty-launcher-5015-thread-1) [    ] o.e.j.s.session No SessionScavenger set, using defaults
   [junit4]   2> 1609685 INFO  (jetty-launcher-5015-thread-1) [    ] o.e.j.s.session node0 Scavenging every 660000ms
   [junit4]   2> 1609685 INFO  (jetty-launcher-5015-thread-1) [    ] o.e.j.s.h.ContextHandler Started o.e.j.s.ServletContextHandler@31c61b77{/solr,null,AVAILABLE}
   [junit4]   2> 1609685 INFO  (jetty-launcher-5015-thread-1) [    ] o.e.j.s.AbstractConnector Started ServerConnector@4db102fa{SSL,[ssl, http/1.1]}{127.0.0.1:?????}
   [junit4]   2> 1609685 INFO  (jetty-launcher-5015-thread-1) [    ] o.e.j.s.Server Started @???????ms
   [junit4]   2> 1609685 INFO  (jetty-launcher-5015-thread-1) [    ] o.a.s.c.s.e.JettySolrRunner Jetty properties: {hostContext=/solr, hostPort=44165}
   [junit4]   2> 1609685 ERROR (jetty-launcher-5015-thread-1) [    ] o.a.s.u.StartupLoggingUtils Missing Java Option solr.log.dir. Logging may be missing or incomplete.
   [junit4]   2> 1609685 INFO  (jetty-launcher-5015-thread-1) [    ] o.a.s.s.SolrDispatchFilter Using logger factory org.apache.logging.slf4j.Log4jLoggerFactory
   [junit4]   2> 1609685 INFO  (jetty-launcher-5015-thread-1) [    ] o.a.s.s.SolrDispatchFilter  ___      _       Welcome to Apache Solr? version 7.6.0
   [junit4]   2> 1609686 INFO  (jetty-launcher-5015-thread-1) [    ] o.a.s.s.SolrDispatchFilter / __| ___| |_ _   Starting in cloud mode on port null
   [junit4]   2> 1609686 INFO  (jetty-launcher-5015-thread-1) [    ] o.a.s.s.SolrDispatchFilter \__ \/ _ \ | '_|  Install dir: null
   [junit4]   2> 1609686 INFO  (jetty-launcher-5015-thread-1) [    ] o.a.s.s.SolrDispatchFilter |___/\___/_|_|    Start time: 2018-09-15T07:08:46.763034Z
   [junit4]   2> 1609686 INFO  (zkConnectionManagerCallback-5020-thread-1) [    ] o.a.s.c.c.ConnectionManager zkClient has connected
   [junit4]   2> 1609687 INFO  (jetty-launcher-5015-thread-1) [    ] o.a.s.s.SolrDispatchFilter solr.xml found in ZooKeeper. Loading...
   [junit4]   2> 1609747 INFO  (jetty-launcher-5015-thread-1) [    ] o.a.s.c.ZkContainer Zookeeper client=127.0.0.1:45299/solr
   [junit4]   2> 1609748 INFO  (zkConnectionManagerCallback-5024-thread-1) [    ] o.a.s.c.c.ConnectionManager zkClient has connected
   [junit4]   2> 1609749 INFO  (zkConnectionManagerCallback-5026-thread-1) [    ] o.a.s.c.c.ConnectionManager zkClient has connected
   [junit4]   2> 1609780 INFO  (jetty-launcher-5015-thread-1) [n:127.0.0.1:44165_solr    ] o.a.s.c.OverseerElectionContext I am going to be the leader 127.0.0.1:44165_solr
   [junit4]   2> 1609780 INFO  (jetty-launcher-5015-thread-1) [n:127.0.0.1:44165_solr    ] o.a.s.c.Overseer Overseer (id=72227398094880771-127.0.0.1:44165_solr-n_0000000000) starting
   [junit4]   2> 1609783 INFO  (zkConnectionManagerCallback-5033-thread-1) [    ] o.a.s.c.c.ConnectionManager zkClient has connected
   [junit4]   2> 1609784 INFO  (jetty-launcher-5015-thread-1) [n:127.0.0.1:44165_solr    ] o.a.s.c.s.i.ZkClientClusterStateProvider Cluster at 127.0.0.1:45299/solr ready
   [junit4]   2> 1609784 INFO  (OverseerStateUpdate-72227398094880771-127.0.0.1:44165_solr-n_0000000000) [n:127.0.0.1:44165_solr    ] o.a.s.c.Overseer Starting to work on the main queue : 127.0.0.1:44165_solr
   [junit4]   2> 1609784 DEBUG (OverseerAutoScalingTriggerThread-72227398094880771-127.0.0.1:44165_solr-n_0000000000) [    ] o.a.s.c.a.OverseerTriggerThread Adding .auto_add_replicas and .scheduled_maintenance triggers
   [junit4]   2> 1609784 INFO  (jetty-launcher-5015-thread-1) [n:127.0.0.1:44165_solr    ] o.a.s.c.ZkController Register node as live in ZooKeeper:/live_nodes/127.0.0.1:44165_solr
   [junit4]   2> 1609784 DEBUG (OverseerAutoScalingTriggerThread-72227398094880771-127.0.0.1:44165_solr-n_0000000000) [    ] o.a.s.c.a.OverseerTriggerThread Refreshing /autoscaling.json with znode version 1
   [junit4]   2> 1609785 DEBUG (OverseerAutoScalingTriggerThread-72227398094880771-127.0.0.1:44165_solr-n_0000000000) [    ] o.a.s.c.a.OverseerTriggerThread Current znodeVersion 1, lastZnodeVersion -1
   [junit4]   2> 1609785 DEBUG (OverseerAutoScalingTriggerThread-72227398094880771-127.0.0.1:44165_solr-n_0000000000) [    ] o.a.s.c.a.OverseerTriggerThread Processed trigger updates upto znodeVersion 1
   [junit4]   2> 1609786 INFO  (zkCallback-5032-thread-1) [    ] o.a.s.c.c.ZkStateReader Updated live nodes from ZooKeeper... (0) -> (1)
   [junit4]   2> 1609786 INFO  (zkCallback-5025-thread-1) [    ] o.a.s.c.c.ZkStateReader Updated live nodes from ZooKeeper... (0) -> (1)
   [junit4]   2> 1609787 DEBUG (OverseerAutoScalingTriggerThread-72227398094880771-127.0.0.1:44165_solr-n_0000000000) [    ] o.a.s.c.a.NodeLostTrigger NodeLostTrigger .auto_add_replicas - Initial livenodes: [127.0.0.1:44165_solr]
   [junit4]   2> 1609787 DEBUG (OverseerAutoScalingTriggerThread-72227398094880771-127.0.0.1:44165_solr-n_0000000000) [    ] o.a.s.c.a.OverseerTriggerThread -- clean old nodeAdded markers
   [junit4]   2> 1609787 DEBUG (OverseerAutoScalingTriggerThread-72227398094880771-127.0.0.1:44165_solr-n_0000000000) [    ] o.a.s.c.a.OverseerTriggerThread Current znodeVersion 1, lastZnodeVersion 1
   [junit4]   2> 1609787 DEBUG (ScheduledTrigger-6939-thread-1) [    ] o.a.s.c.a.NodeLostTrigger Running NodeLostTrigger: .auto_add_replicas with currently live nodes: 1
   [junit4]   2> 1609796 INFO  (jetty-launcher-5015-thread-1) [n:127.0.0.1:44165_solr    ] o.a.s.h.a.MetricsHistoryHandler No .system collection, keeping metrics history in memory.
   [junit4]   2> 1609811 INFO  (jetty-launcher-5015-thread-1) [n:127.0.0.1:44165_solr    ] o.a.s.m.r.SolrJmxReporter JMX monitoring for 'solr_44165.solr.node' (registry 'solr.node') enabled at server: com.sun.jmx.mbeanserver.JmxMBeanServer@56e99d72
   [junit4]   2> 1609819 INFO  (jetty-launcher-5015-thread-1) [n:127.0.0.1:44165_solr    ] o.a.s.m.r.SolrJmxReporter JMX monitoring for 'solr_44165.solr.jvm' (registry 'solr.jvm') enabled at server: com.sun.jmx.mbeanserver.JmxMBeanServer@56e99d72
   [junit4]   2> 1609819 INFO  (jetty-launcher-5015-thread-1) [n:127.0.0.1:44165_solr    ] o.a.s.m.r.SolrJmxReporter JMX monitoring for 'solr_44165.solr.jetty' (registry 'solr.jetty') enabled at server: com.sun.jmx.mbeanserver.JmxMBeanServer@56e99d72
   [junit4]   2> 1609820 INFO  (jetty-launcher-5015-thread-1) [n:127.0.0.1:44165_solr    ] o.a.s.c.CorePropertiesLocator Found 0 core definitions underneath /home/jenkins/workspace/Lucene-Solr-7.x-Linux/solr/build/solr-core/test/J0/temp/solr.cloud.autoscaling.ComputePlanActionTest_3120F479E06A32F2-001/tempDir-001/node1/.
   [junit4]   2> 1609832 INFO  (zkConnectionManagerCallback-5036-thread-1) [    ] o.a.s.c.c.ConnectionManager zkClient has connected
   [junit4]   2> 1609834 INFO  (zkConnectionManagerCallback-5041-thread-1) [    ] o.a.s.c.c.ConnectionManager zkClient has connected
   [junit4]   2> 1609834 INFO  (SUITE-ComputePlanActionTest-seed#[3120F479E06A32F2]-worker) [    ] o.a.s.c.c.ZkStateReader Updated live nodes from ZooKeeper... (0) -> (1)
   [junit4]   2> 1609834 INFO  (SUITE-ComputePlanActionTest-seed#[3120F479E06A32F2]-worker) [    ] o.a.s.c.s.i.ZkClientClusterStateProvider Cluster at 127.0.0.1:45299/solr ready
   [junit4]   2> 1609840 INFO  (TEST-ComputePlanActionTest.testNodeAddedTriggerWithAddReplicaPreferredOp_1Shard-seed#[3120F479E06A32F2]) [    ] o.a.s.SolrTestCaseJ4 ###Starting testNodeAddedTriggerWithAddReplicaPreferredOp_1Shard
   [junit4]   2> 1609841 DEBUG (zkCallback-5032-thread-1) [    ] o.a.s.c.a.OverseerTriggerThread Refreshing /autoscaling.json with znode version 2
   [junit4]   2> 1609841 DEBUG (OverseerAutoScalingTriggerThread-72227398094880771-127.0.0.1:44165_solr-n_0000000000) [    ] o.a.s.c.a.OverseerTriggerThread Processed trigger updates upto znodeVersion 2
   [junit4]   2> 1609841 INFO  (TEST-ComputePlanActionTest.testNodeAddedTriggerWithAddReplicaPreferredOp_1Shard-seed#[3120F479E06A32F2]) [    ] o.a.s.c.c.ZkStateReader Updated live nodes from ZooKeeper... (0) -> (1)
   [junit4]   2> 1609842 DEBUG (OverseerAutoScalingTriggerThread-72227398094880771-127.0.0.1:44165_solr-n_0000000000) [    ] o.a.s.c.a.OverseerTriggerThread -- clean old nodeLost markers
   [junit4]   2> 1609842 DEBUG (OverseerAutoScalingTriggerThread-72227398094880771-127.0.0.1:44165_solr-n_0000000000) [    ] o.a.s.c.a.OverseerTriggerThread -- clean old nodeAdded markers
   [junit4]   2> 1609842 DEBUG (OverseerAutoScalingTriggerThread-72227398094880771-127.0.0.1:44165_solr-n_0000000000) [    ] o.a.s.c.a.OverseerTriggerThread Current znodeVersion 2, lastZnodeVersion 2
   [junit4]   2> 1609864 INFO  (qtp950958068-19173) [n:127.0.0.1:44165_solr    ] o.a.s.s.HttpSolrCall [admin] webapp=null path=/admin/metrics params={prefix=CONTAINER.fs.usableSpace,CORE.coreName&wt=javabin&version=2&group=solr.node,solr.core} status=0 QTime=0
   [junit4]   2> 1609864 DEBUG (qtp950958068-19172) [n:127.0.0.1:44165_solr    ] o.a.s.c.a.AutoScalingHandler Verified autoscaling configuration
   [junit4]   2> 1609864 INFO  (qtp950958068-19172) [n:127.0.0.1:44165_solr    ] o.a.s.s.HttpSolrCall [admin] webapp=null path=/cluster/autoscaling params={wt=javabin&version=2} status=0 QTime=11
   [junit4]   2> 1609864 DEBUG (zkCallback-5032-thread-1) [    ] o.a.s.c.a.OverseerTriggerThread Refreshing /autoscaling.json with znode version 3
   [junit4]   2> 1609864 DEBUG (OverseerAutoScalingTriggerThread-72227398094880771-127.0.0.1:44165_solr-n_0000000000) [    ] o.a.s.c.a.OverseerTriggerThread Processed trigger updates upto znodeVersion 3
   [junit4]   2> 1609864 DEBUG (OverseerAutoScalingTriggerThread-72227398094880771-127.0.0.1:44165_solr-n_0000000000) [    ] o.a.s.c.a.OverseerTriggerThread -- clean old nodeLost markers
   [junit4]   2> 1609864 DEBUG (OverseerAutoScalingTriggerThread-72227398094880771-127.0.0.1:44165_solr-n_0000000000) [    ] o.a.s.c.a.OverseerTriggerThread -- clean old nodeAdded markers
   [junit4]   2> 1609864 DEBUG (OverseerAutoScalingTriggerThread-72227398094880771-127.0.0.1:44165_solr-n_0000000000) [    ] o.a.s.c.a.OverseerTriggerThread Current znodeVersion 3, lastZnodeVersion 3
   [junit4]   2> 1609865 INFO  (qtp950958068-19215) [n:127.0.0.1:44165_solr    ] o.a.s.s.HttpSolrCall [admin] webapp=null path=/admin/metrics params={prefix=CONTAINER.fs.usableSpace,CORE.coreName&wt=javabin&version=2&group=solr.node,solr.core} status=0 QTime=0
   [junit4]   2> 1609865 DEBUG (qtp950958068-19172) [n:127.0.0.1:44165_solr    ] o.a.s.c.a.AutoScalingHandler Verified autoscaling configuration
   [junit4]   2> 1609866 INFO  (qtp950958068-19172) [n:127.0.0.1:44165_solr    ] o.a.s.s.HttpSolrCall [admin] webapp=null path=/admin/autoscaling params={wt=javabin&version=2} status=0 QTime=1
   [junit4]   2> 1609866 DEBUG (zkCallback-5032-thread-1) [    ] o.a.s.c.a.OverseerTriggerThread Refreshing /autoscaling.json with znode version 4
   [junit4]   2> 1609866 DEBUG (OverseerAutoScalingTriggerThread-72227398094880771-127.0.0.1:44165_solr-n_0000000000) [    ] o.a.s.c.a.OverseerTriggerThread Processed trigger updates upto znodeVersion 4
   [junit4]   2> 1609866 DEBUG (OverseerAutoScalingTriggerThread-72227398094880771-127.0.0.1:44165_solr-n_0000000000) [    ] o.a.s.c.a.OverseerTriggerThread -- clean old nodeLost markers
   [junit4]   2> 1609866 DEBUG (OverseerAutoScalingTriggerThread-72227398094880771-127.0.0.1:44165_solr-n_0000000000) [    ] o.a.s.c.a.OverseerTriggerThread -- clean old nodeAdded markers
   [junit4]   2> 1609866 DEBUG (OverseerAutoScalingTriggerThread-72227398094880771-127.0.0.1:44165_solr-n_0000000000) [    ] o.a.s.c.a.OverseerTriggerThread Current znodeVersion 4, lastZnodeVersion 4
   [junit4]   2> 1609868 INFO  (qtp950958068-19173) [n:127.0.0.1:44165_solr    ] o.a.s.s.HttpSolrCall [admin] webapp=null path=/admin/metrics params={prefix=CONTAINER.fs.usableSpace,CONTAINER.fs.totalSpace,CORE.coreName&wt=javabin&version=2&group=solr.node,solr.core} status=0 QTime=0
   [junit4]   2> 1609868 DEBUG (qtp950958068-19171) [n:127.0.0.1:44165_solr    ] o.a.s.c.a.AutoScalingHandler Verified autoscaling configuration
   [junit4]   2> 1609868 INFO  (qtp950958068-19171) [n:127.0.0.1:44165_solr    ] o.a.s.s.HttpSolrCall [admin] webapp=null path=/admin/autoscaling params={wt=javabin&version=2} status=0 QTime=1
   [junit4]   2> 1609869 DEBUG (zkCallback-5032-thread-1) [    ] o.a.s.c.a.OverseerTriggerThread Refreshing /autoscaling.json with znode version 5
   [junit4]   2> 1609869 DEBUG (OverseerAutoScalingTriggerThread-72227398094880771-127.0.0.1:44165_solr-n_0000000000) [    ] o.a.s.c.a.OverseerTriggerThread Processed trigger updates upto znodeVersion 5
   [junit4]   2> 1609870 INFO  (qtp950958068-19215) [n:127.0.0.1:44165_solr    ] o.a.s.s.HttpSolrCall [admin] webapp=null path=/admin/metrics params={prefix=CONTAINER.fs.usableSpace,CORE.coreName&wt=javabin&version=2&group=solr.node,solr.core} status=0 QTime=0
   [junit4]   2> 1609870 DEBUG (qtp950958068-19172) [n:127.0.0.1:44165_solr    ] o.a.s.c.a.AutoScalingHandler Verified autoscaling configuration
   [junit4]   2> 1609870 DEBUG (OverseerAutoScalingTriggerThread-72227398094880771-127.0.0.1:44165_solr-n_0000000000) [    ] o.a.s.c.a.NodeAddedTrigger NodeAddedTrigger node_added_trigger - Initial livenodes: [127.0.0.1:44165_solr]
   [junit4]   2> 1609870 INFO  (qtp950958068-19172) [n:127.0.0.1:44165_solr    ] o.a.s.s.HttpSolrCall [admin] webapp=null path=/cluster/autoscaling params={wt=javabin&version=2} status=0 QTime=1
   [junit4]   2> 1609870 DEBUG (OverseerAutoScalingTriggerThread-72227398094880771-127.0.0.1:44165_solr-n_0000000000) [    ] o.a.s.c.a.NodeAddedTrigger NodeAddedTrigger node_added_trigger instantiated with properties: {preferredOperation=addreplica, event=nodeAdded, waitFor=1, actions=[{name=compute_plan, class=solr.ComputePlanAction}, {name=test, class=org.apache.solr.cloud.autoscaling.ComputePlanActionTest$AssertingTriggerAction}], enabled=true}
   [junit4]   2> 1609871 DEBUG (zkCallback-5032-thread-1) [    ] o.a.s.c.a.OverseerTriggerThread Refreshing /autoscaling.json with znode version 6
   [junit4]   2> 1609871 DEBUG (OverseerAutoScalingTriggerThread-72227398094880771-127.0.0.1:44165_solr-n_0000000000) [    ] o.a.s.c.a.OverseerTriggerThread -- clean old nodeLost markers
   [junit4]   2> 1609871 DEBUG (OverseerAutoScalingTriggerThread-72227398094880771-127.0.0.1:44165_solr-n_0000000000) [    ] o.a.s.c.a.OverseerTriggerThread Current znodeVersion 6, lastZnodeVersion 5
   [junit4]   2> 1609871 DEBUG (OverseerAutoScalingTriggerThread-72227398094880771-127.0.0.1:44165_solr-n_0000000000) [    ] o.a.s.c.a.OverseerTriggerThread Processed trigger updates upto znodeVersion 6
   [junit4]   2> 1609871 INFO  (qtp950958068-19172) [n:127.0.0.1:44165_solr    ] o.a.s.h.a.CollectionsHandler Invoked Collection Action :create with params collection.configName=conf&name=testNodeAddedTriggerWithAddReplicaPreferredOp_1Shard_0&nrtReplicas=1&action=CREATE&numShards=1&wt=javabin&version=2 and sendToOCPQueue=true
   [junit4]   2> 1609871 DEBUG (ScheduledTrigger-6939-thread-2) [    ] o.a.s.c.a.NodeAddedTrigger Running NodeAddedTrigger node_added_trigger
   [junit4]   2> 1609871 DEBUG (ScheduledTrigger-6939-thread-2) [    ] o.a.s.c.a.NodeAddedTrigger Found livenodes: 1
   [junit4]   2> 1609872 DEBUG (OverseerAutoScalingTriggerThread-72227398094880771-127.0.0.1:44165_solr-n_0000000000) [    ] o.a.s.c.a.OverseerTriggerThread -- clean old nodeLost markers
   [junit4]   2> 1609872 DEBUG (OverseerAutoScalingTriggerThread-72227398094880771-127.0.0.1:44165_solr-n_0000000000) [    ] o.a.s.c.a.OverseerTriggerThread Current znodeVersion 6, lastZnodeVersion 6
   [junit4]   2> 1609873 INFO  (OverseerThreadFactory-6941-thread-1-processing-n:127.0.0.1:44165_solr) [n:127.0.0.1:44165_solr    ] o.a.s.c.a.c.CreateCollectionCmd Create collection testNodeAddedTriggerWithAddReplicaPreferredOp_1Shard_0
   [junit4]   2> 1609874 DEBUG (OverseerStateUpdate-72227398094880771-127.0.0.1:44165_solr-n_0000000000) [n:127.0.0.1:44165_solr    ] o.a.s.c.Overseer processMessage: queueSize: 1, message = {
   [junit4]   2>   "name":"testNodeAddedTriggerWithAddReplicaPreferredOp_1Shard_0",
   [junit4]   2>   "fromApi":"true",
   [junit4]   2>   "collection.configName":"conf",
   [junit4]   2>   "numShards":"1",
   [junit4]   2>   "nrtReplicas":"1",
   [junit4]   2>   "stateFormat":"2",
   [junit4]   2>   "replicationFactor":"1",
   [junit4]   2>   "operation":"create"} current state version: 0
   [junit4]   2> 1609874 DEBUG (OverseerStateUpdate-72227398094880771-127.0.0.1:44165_solr-n_0000000000) [n:127.0.0.1:44165_solr    ] o.a.s.c.o.ClusterStateMutator building a new cName: testNodeAddedTriggerWithAddReplicaPreferredOp_1Shard_0
   [junit4]   2> 1609874 DEBUG (OverseerStateUpdate-72227398094880771-127.0.0.1:44165_solr-n_0000000000) [n:127.0.0.1:44165_solr    ] o.a.s.c.o.ZkStateWriter going to create_collection /collections/testNodeAddedTriggerWithAddReplicaPreferredOp_1Shard_0/state.json
   [junit4]   2> 1609976 INFO  (qtp950958068-19173) [n:127.0.0.1:44165_solr    ] o.a.s.s.HttpSolrCall [admin] webapp=null path=/admin/metrics params={prefix=CONTAINER.fs.usableSpace,CONTAINER.fs.totalSpace,CORE.coreName&wt=javabin&version=2&group=solr.node,solr.core} status=0 QTime=0
   [junit4]   2> 1609977 INFO  (OverseerThreadFactory-6941-thread-1-processing-n:127.0.0.1:44165_solr) [n:127.0.0.1:44165_solr    ] o.a.s.c.s.c.a.PolicyHelper returnSession, curr-time 2591004683 sessionWrapper.createTime 2591004682215624, this.sessionWrapper.createTime 2591004682215624 
   [junit4]   2> 1609979 DEBUG (OverseerStateUpdate-72227398094880771-127.0.0.1:44165_solr-n_0000000000) [n:127.0.0.1:44165_solr    ] o.a.s.c.Overseer processMessage: queueSize: 1, message = {
   [junit4]   2>   "operation":"ADDREPLICA",
   [junit4]   2>   "collection":"testNodeAddedTriggerWithAddReplicaPreferredOp_1Shard_0",
   [junit4]   2>   "shard":"shard1",
   [junit4]   2>   "core":"testNodeAddedTriggerWithAddReplicaPreferredOp_1Shard_0_shard1_replica_n1",
   [junit4]   2>   "state":"down",
   [junit4]   2>   "base_url":"https://127.0.0.1:44165/solr",
   [junit4]   2>   "type":"NRT",
   [junit4]   2>   "waitForFinalState":"false"} current state version: 0
   [junit4]   2> 1609979 INFO  (OverseerStateUpdate-72227398094880771-127.0.0.1:44165_solr-n_0000000000) [n:127.0.0.1:44165_solr    ] o.a.s.c.o.SliceMutator createReplica() {
   [junit4]   2>   "operation":"ADDREPLICA",
   [junit4]   2>   "collection":"testNodeAddedTriggerWithAddReplicaPreferredOp_1Shard_0",
   [junit4]   2>   "shard":"shard1",
   [junit4]   2>   "core":"testNodeAddedTriggerWithAddReplicaPreferredOp_1Shard_0_shard1_replica_n1",
   [junit4]   2>   "state":"down",
   [junit4]   2>   "base_url":"https://127.0.0.1:44165/solr",
   [junit4]   2>   "type":"NRT",
   [junit4]   2>   "waitForFinalState":"false"} 
   [junit4]   2> 1609979 DEBUG (OverseerStateUpdate-72227398094880771-127.0.0.1:44165_solr-n_0000000000) [n:127.0.0.1:44165_solr    ] o.a.s.c.o.SliceMutator Old Slice: shard1:{
   [junit4]   2>   "range":"80000000-7fffffff",
   [junit4]   2>   "state":"active",
   [junit4]   2>   "replicas":{}}
   [junit4]   2> 1609979 DEBUG (OverseerStateUpdate-72227398094880771-127.0.0.1:44165_solr-n_0000000000) [n:127.0.0.1:44165_solr    ] o.a.s.c.o.SliceMutator New Slice: shard1:{
   [junit4]   2>   "range":"80000000-7fffffff",
   [junit4]   2>   "state":"active",
   [junit4]   2>   "replicas":{"core_node2":{
   [junit4]   2>       "core":"testNodeAddedTriggerWithAddReplicaPreferredOp_1Shard_0_shard1_replica_n1",
   [junit4]   2>       "base_url":"https://127.0.0.1:44165/solr",
   [junit4]   2>       "state":"down",
   [junit4]   2>       "node_name":null,
   [junit4]   2>       "type":"NRT"}}}
   [junit4]   2> 1610080 DEBUG (OverseerStateUpdate-72227398094880771-127.0.0.1:44165_solr-n_0000000000) [n:127.0.0.1:44165_solr    ] o.a.s.c.o.ZkStateWriter going to update_collection /colle

[...truncated too long message...]

24029745-127.0.0.1:38097_solr-n_0000000010) closing
   [junit4]   2> 261400 INFO  (OverseerStateUpdate-72227535024029745-127.0.0.1:38097_solr-n_0000000010) [n:127.0.0.1:38097_solr    ] o.a.s.c.Overseer Overseer Loop exiting : 127.0.0.1:38097_solr
   [junit4]   2> 261401 WARN  (OverseerAutoScalingTriggerThread-72227535024029745-127.0.0.1:38097_solr-n_0000000010) [    ] o.a.s.c.a.OverseerTriggerThread OverseerTriggerThread woken up but we are closed, exiting.
   [junit4]   2> 261401 DEBUG (jetty-closer-261-thread-1) [    ] o.a.s.c.a.ScheduledTriggers Shutting down scheduled thread pool executor now
   [junit4]   2> 261402 DEBUG (jetty-closer-261-thread-1) [    ] o.a.s.c.a.ScheduledTriggers Shutting down action executor now
   [junit4]   2> 261402 DEBUG (jetty-closer-261-thread-1) [    ] o.a.s.c.a.ScheduledTriggers Awaiting termination for action executor
   [junit4]   2> 261402 DEBUG (jetty-closer-261-thread-1) [    ] o.a.s.c.a.ScheduledTriggers Awaiting termination for scheduled thread pool executor
   [junit4]   2> 261402 DEBUG (jetty-closer-261-thread-1) [    ] o.a.s.c.a.ScheduledTriggers ScheduledTriggers closed completely
   [junit4]   2> 261402 DEBUG (jetty-closer-261-thread-1) [    ] o.a.s.c.a.OverseerTriggerThread OverseerTriggerThread has been closed explicitly
   [junit4]   2> 261403 INFO  (jetty-closer-261-thread-1) [    ] o.e.j.s.h.ContextHandler Stopped o.e.j.s.ServletContextHandler@57d086c9{/solr,null,UNAVAILABLE}
   [junit4]   2> 261403 INFO  (jetty-closer-261-thread-1) [    ] o.e.j.s.session node0 Stopped scavenging
   [junit4]   2> 261404 ERROR (SUITE-ComputePlanActionTest-seed#[3120F479E06A32F2]-worker) [    ] o.a.z.s.ZooKeeperServer ZKShutdownHandler is not registered, so ZooKeeper server won't take any action on ERROR or SHUTDOWN server state changes
   [junit4]   2> 261404 INFO  (SUITE-ComputePlanActionTest-seed#[3120F479E06A32F2]-worker) [    ] o.a.s.c.ZkTestServer connecting to 127.0.0.1:37403 37403
   [junit4]   2> 261504 INFO  (Thread-158) [    ] o.a.s.c.ZkTestServer connecting to 127.0.0.1:37403 37403
   [junit4]   2> 261505 WARN  (Thread-158) [    ] o.a.s.c.ZkTestServer Watch limit violations: 
   [junit4]   2> Maximum concurrent create/delete watches above limit:
   [junit4]   2> 
   [junit4]   2> 	36	/solr/aliases.json
   [junit4]   2> 	17	/solr/configs/conf
   [junit4]   2> 	14	/solr/security.json
   [junit4]   2> 	9	/solr/collections/testNodeWithMultipleReplicasLost/terms/shard2
   [junit4]   2> 	9	/solr/collections/testNodeWithMultipleReplicasLost/terms/shard1
   [junit4]   2> 	8	/solr/collections/testNodeAddedTriggerWithAddReplicaPreferredOp_2Shard_1/terms/shard2
   [junit4]   2> 	7	/solr/collections/testSelected1/terms/shard1
   [junit4]   2> 	6	/solr/collections/testNodeLost/terms/shard1
   [junit4]   2> 	6	/solr/collections/testSelected2/terms/shard1
   [junit4]   2> 	6	/solr/collections/testSelected3/terms/shard1
   [junit4]   2> 	6	/solr/collections/testNodeLostTriggerWithDeleteNodePreferredOp_0/terms/shard1
   [junit4]   2> 	6	/solr/collections/testNodeAddedTriggerWithAddReplicaPreferredOp_1Shard_4/terms/shard1
   [junit4]   2> 	5	/solr/collections/testNodeAddedTriggerWithAddReplicaPreferredOp_1Shard_1/terms/shard1
   [junit4]   2> 	5	/solr/collections/testNodeAddedTriggerWithAddReplicaPreferredOp_1Shard_3/terms/shard1
   [junit4]   2> 	5	/solr/collections/testSelected1/terms/shard2
   [junit4]   2> 	5	/solr/collections/testSelected2/terms/shard2
   [junit4]   2> 	5	/solr/collections/testSelected3/terms/shard2
   [junit4]   2> 	5	/solr/collections/testNodeAdded/terms/shard1
   [junit4]   2> 	5	/solr/collections/testNodeAddedTriggerWithAddReplicaPreferredOp_1Shard_2/terms/shard1
   [junit4]   2> 	3	/solr/collections/testNodeAddedTriggerWithAddReplicaPreferredOp_2Shard_1/terms/shard1
   [junit4]   2> 	2	/solr/collections/testNodeAddedTriggerWithAddReplicaPreferredOp_2Shard_0/terms/shard2
   [junit4]   2> 	2	/solr/collections/testNodeAddedTriggerWithAddReplicaPreferredOp_2Shard_0/terms/shard1
   [junit4]   2> 	2	/solr/collections/testNodeAddedTriggerWithAddReplicaPreferredOp_1Shard_0/terms/shard1
   [junit4]   2> 
   [junit4]   2> Maximum concurrent data watches above limit:
   [junit4]   2> 
   [junit4]   2> 	36	/solr/clusterprops.json
   [junit4]   2> 	36	/solr/clusterstate.json
   [junit4]   2> 	28	/solr/aliases.json
   [junit4]   2> 	9	/solr/collections/testNodeWithMultipleReplicasLost/state.json
   [junit4]   2> 	5	/solr/collections/testSelected1/state.json
   [junit4]   2> 	5	/solr/collections/testSelected2/state.json
   [junit4]   2> 	5	/solr/overseer_elect/election/72227535024029717-127.0.0.1:36043_solr-n_0000000004
   [junit4]   2> 	5	/solr/collections/testSelected3/state.json
   [junit4]   2> 	4	/solr/collections/testNodeAdded/state.json
   [junit4]   2> 	4	/solr/autoscaling.json
   [junit4]   2> 	4	/solr/collections/testNodeAddedTriggerWithAddReplicaPreferredOp_2Shard_0/state.json
   [junit4]   2> 	3	/solr/collections/testNodeAddedTriggerWithAddReplicaPreferredOp_1Shard_4/state.json
   [junit4]   2> 	3	/solr/collections/testNodeAddedTriggerWithAddReplicaPreferredOp_1Shard_1/state.json
   [junit4]   2> 	3	/solr/collections/testNodeAddedTriggerWithAddReplicaPreferredOp_2Shard_1/state.json
   [junit4]   2> 	3	/solr/collections/testNodeLost/state.json
   [junit4]   2> 	3	/solr/collections/testNodeAddedTriggerWithAddReplicaPreferredOp_1Shard_3/state.json
   [junit4]   2> 	3	/solr/collections/testNodeAddedTriggerWithAddReplicaPreferredOp_1Shard_2/state.json
   [junit4]   2> 	3	/solr/collections/testNodeLostTriggerWithDeleteNodePreferredOp_0/state.json
   [junit4]   2> 	2	/solr/collections/testNodeAddedTriggerWithAddReplicaPreferredOp_1Shard_0/state.json
   [junit4]   2> 	2	/solr/overseer_elect/election/72227535024029709-127.0.0.1:41957_solr-n_0000000002
   [junit4]   2> 	2	/solr/overseer_elect/election/72227535024029699-127.0.0.1:46153_solr-n_0000000000
   [junit4]   2> 	2	/solr/overseer_elect/election/72227535024029745-127.0.0.1:38097_solr-n_0000000010
   [junit4]   2> 
   [junit4]   2> Maximum concurrent children watches above limit:
   [junit4]   2> 
   [junit4]   2> 	143	/solr/collections
   [junit4]   2> 	133	/solr/live_nodes
   [junit4]   2> 	4	/solr/overseer/queue
   [junit4]   2> 	4	/solr/autoscaling/events/.scheduled_maintenance
   [junit4]   2> 	4	/solr/autoscaling/events/.auto_add_replicas
   [junit4]   2> 	4	/solr/overseer/collection-queue-work
   [junit4]   2> 	4	/solr/overseer/queue-work
   [junit4]   2> 	2	/solr/autoscaling/events/node_lost_trigger
   [junit4]   2> 
   [junit4]   2> NOTE: leaving temporary files on disk at: /home/jenkins/workspace/Lucene-Solr-7.x-Linux/solr/build/solr-core/test/J0/temp/solr.cloud.autoscaling.ComputePlanActionTest_3120F479E06A32F2-002
   [junit4]   2> Sep 15, 2018 7:45:43 AM com.carrotsearch.randomizedtesting.ThreadLeakControl checkThreadLeaks
   [junit4]   2> WARNING: Will linger awaiting termination of 1 leaked thread(s).
   [junit4]   2> NOTE: test params are: codec=Asserting(Lucene70): {}, docValues:{}, maxPointsInLeafNode=647, maxMBSortInHeap=7.9850139054989215, sim=RandomSimilarity(queryNorm=true): {}, locale=ar-IQ, timezone=America/Puerto_Rico
   [junit4]   2> NOTE: Linux 4.15.0-32-generic amd64/Oracle Corporation 11 (64-bit)/cpus=8,threads=1,free=244438512,total=518979584
   [junit4]   2> NOTE: All tests run in this JVM: [ComputePlanActionTest, ComputePlanActionTest]
   [junit4] Completed [10/10 (5!)] on J0 in 127.44s, 7 tests, 1 failure <<< FAILURES!

[...truncated 1 lines...]
   [junit4] JVM J0: stderr was not empty, see: /home/jenkins/workspace/Lucene-Solr-7.x-Linux/solr/build/solr-core/test/temp/junit4-J0-20180915_074121_5573415431775099238416.syserr
   [junit4] >>> JVM J0 emitted unexpected output (verbatim) ----
   [junit4] OpenJDK 64-Bit Server VM warning: Option UseConcMarkSweepGC was deprecated in version 9.0 and will likely be removed in a future release.
   [junit4] <<< JVM J0: EOF ----

[...truncated 14 lines...]
BUILD FAILED
/home/jenkins/workspace/Lucene-Solr-7.x-Linux/lucene/common-build.xml:1567: The following error occurred while executing this line:
/home/jenkins/workspace/Lucene-Solr-7.x-Linux/lucene/common-build.xml:1092: There were test failures: 10 suites, 40 tests, 1 error, 4 failures [seed: 3120F479E06A32F2]

Total time: 4 minutes 23 seconds

[repro] Setting last failure code to 256

[repro] Failures:
[repro]   1/5 failed: org.apache.solr.handler.component.CustomHighlightComponentTest
[repro]   4/5 failed: org.apache.solr.cloud.autoscaling.ComputePlanActionTest
[repro] Exiting with code 256
+ mv lucene/build lucene/build.repro
+ mv solr/build solr/build.repro
+ mv lucene/build.orig lucene/build
+ mv solr/build.orig solr/build
Archiving artifacts
Setting ANT_1_8_2_HOME=/var/lib/jenkins/tools/hudson.tasks.Ant_AntInstallation/ANT_1.8.2
[WARNINGS] Parsing warnings in console log with parser Java Compiler (javac)
Setting ANT_1_8_2_HOME=/var/lib/jenkins/tools/hudson.tasks.Ant_AntInstallation/ANT_1.8.2
Setting ANT_1_8_2_HOME=/var/lib/jenkins/tools/hudson.tasks.Ant_AntInstallation/ANT_1.8.2
<Git Blamer> Using GitBlamer to create author and commit information for all warnings.
<Git Blamer> GIT_COMMIT=4febf778369d7db708ac07fe42a46b194b495c8a, workspace=/var/lib/jenkins/workspace/Lucene-Solr-7.x-Linux
[WARNINGS] Computing warning deltas based on reference build #2745
Recording test results
Setting ANT_1_8_2_HOME=/var/lib/jenkins/tools/hudson.tasks.Ant_AntInstallation/ANT_1.8.2
Build step 'Publish JUnit test result report' changed build result to UNSTABLE
Email was triggered for: Unstable (Test Failures)
Sending email for trigger: Unstable (Test Failures)
Setting ANT_1_8_2_HOME=/var/lib/jenkins/tools/hudson.tasks.Ant_AntInstallation/ANT_1.8.2
Setting ANT_1_8_2_HOME=/var/lib/jenkins/tools/hudson.tasks.Ant_AntInstallation/ANT_1.8.2
Setting ANT_1_8_2_HOME=/var/lib/jenkins/tools/hudson.tasks.Ant_AntInstallation/ANT_1.8.2
Setting ANT_1_8_2_HOME=/var/lib/jenkins/tools/hudson.tasks.Ant_AntInstallation/ANT_1.8.2

Mime
View raw message