lucene-dev mailing list archives

Site index · List index
Message view « Date » · « Thread »
Top « Date » · « Thread »
From Policeman Jenkins Server <jenk...@thetaphi.de>
Subject [JENKINS] Lucene-Solr-master-MacOSX (64bit/jdk-9) - Build # 4810 - Still Unstable!
Date Mon, 03 Sep 2018 01:41:04 GMT
Build: https://jenkins.thetaphi.de/job/Lucene-Solr-master-MacOSX/4810/
Java: 64bit/jdk-9 -XX:-UseCompressedOops -XX:+UseSerialGC

3 tests failed.
FAILED:  org.apache.solr.cloud.LeaderVoteWaitTimeoutTest.testMostInSyncReplicasCanWinElection

Error Message:
Timeout waiting for new leader null Live Nodes: [127.0.0.1:53554_solr, 127.0.0.1:53560_solr, 127.0.0.1:53566_solr] Last available state: DocCollection(collection1//collections/collection1/state.json/14)={   "pullReplicas":"0",   "replicationFactor":"3",   "shards":{"shard1":{       "range":"80000000-7fffffff",       "state":"active",       "replicas":{         "core_node62":{           "core":"collection1_shard1_replica_n61",           "base_url":"http://127.0.0.1:53548/solr",           "node_name":"127.0.0.1:53548_solr",           "state":"down",           "type":"NRT",           "force_set_state":"false"},         "core_node64":{           "core":"collection1_shard1_replica_n63",           "base_url":"http://127.0.0.1:53554/solr",           "node_name":"127.0.0.1:53554_solr",           "state":"active",           "type":"NRT",           "force_set_state":"false"},         "core_node66":{           "core":"collection1_shard1_replica_n65",           "base_url":"http://127.0.0.1:53560/solr",           "node_name":"127.0.0.1:53560_solr",           "state":"active",           "type":"NRT",           "force_set_state":"false"}}}},   "router":{"name":"compositeId"},   "maxShardsPerNode":"1",   "autoAddReplicas":"false",   "nrtReplicas":"3",   "tlogReplicas":"0"}

Stack Trace:
java.lang.AssertionError: Timeout waiting for new leader
null
Live Nodes: [127.0.0.1:53554_solr, 127.0.0.1:53560_solr, 127.0.0.1:53566_solr]
Last available state: DocCollection(collection1//collections/collection1/state.json/14)={
  "pullReplicas":"0",
  "replicationFactor":"3",
  "shards":{"shard1":{
      "range":"80000000-7fffffff",
      "state":"active",
      "replicas":{
        "core_node62":{
          "core":"collection1_shard1_replica_n61",
          "base_url":"http://127.0.0.1:53548/solr",
          "node_name":"127.0.0.1:53548_solr",
          "state":"down",
          "type":"NRT",
          "force_set_state":"false"},
        "core_node64":{
          "core":"collection1_shard1_replica_n63",
          "base_url":"http://127.0.0.1:53554/solr",
          "node_name":"127.0.0.1:53554_solr",
          "state":"active",
          "type":"NRT",
          "force_set_state":"false"},
        "core_node66":{
          "core":"collection1_shard1_replica_n65",
          "base_url":"http://127.0.0.1:53560/solr",
          "node_name":"127.0.0.1:53560_solr",
          "state":"active",
          "type":"NRT",
          "force_set_state":"false"}}}},
  "router":{"name":"compositeId"},
  "maxShardsPerNode":"1",
  "autoAddReplicas":"false",
  "nrtReplicas":"3",
  "tlogReplicas":"0"}
	at __randomizedtesting.SeedInfo.seed([1D0D818F380CCB95:B5119D35FA4CFFBF]:0)
	at org.junit.Assert.fail(Assert.java:93)
	at org.apache.solr.cloud.SolrCloudTestCase.waitForState(SolrCloudTestCase.java:280)
	at org.apache.solr.cloud.LeaderVoteWaitTimeoutTest.testMostInSyncReplicasCanWinElection(LeaderVoteWaitTimeoutTest.java:198)
	at java.base/jdk.internal.reflect.NativeMethodAccessorImpl.invoke0(Native Method)
	at java.base/jdk.internal.reflect.NativeMethodAccessorImpl.invoke(NativeMethodAccessorImpl.java:62)
	at java.base/jdk.internal.reflect.DelegatingMethodAccessorImpl.invoke(DelegatingMethodAccessorImpl.java:43)
	at java.base/java.lang.reflect.Method.invoke(Method.java:564)
	at com.carrotsearch.randomizedtesting.RandomizedRunner.invoke(RandomizedRunner.java:1737)
	at com.carrotsearch.randomizedtesting.RandomizedRunner$8.evaluate(RandomizedRunner.java:934)
	at com.carrotsearch.randomizedtesting.RandomizedRunner$9.evaluate(RandomizedRunner.java:970)
	at com.carrotsearch.randomizedtesting.RandomizedRunner$10.evaluate(RandomizedRunner.java:984)
	at com.carrotsearch.randomizedtesting.rules.SystemPropertiesRestoreRule$1.evaluate(SystemPropertiesRestoreRule.java:57)
	at org.apache.lucene.util.TestRuleSetupTeardownChained$1.evaluate(TestRuleSetupTeardownChained.java:49)
	at org.apache.lucene.util.AbstractBeforeAfterRule$1.evaluate(AbstractBeforeAfterRule.java:45)
	at org.apache.lucene.util.TestRuleThreadAndTestName$1.evaluate(TestRuleThreadAndTestName.java:48)
	at org.apache.lucene.util.TestRuleIgnoreAfterMaxFailures$1.evaluate(TestRuleIgnoreAfterMaxFailures.java:64)
	at org.apache.lucene.util.TestRuleMarkFailure$1.evaluate(TestRuleMarkFailure.java:47)
	at com.carrotsearch.randomizedtesting.rules.StatementAdapter.evaluate(StatementAdapter.java:36)
	at com.carrotsearch.randomizedtesting.ThreadLeakControl$StatementRunner.run(ThreadLeakControl.java:368)
	at com.carrotsearch.randomizedtesting.ThreadLeakControl.forkTimeoutingTask(ThreadLeakControl.java:817)
	at com.carrotsearch.randomizedtesting.ThreadLeakControl$3.evaluate(ThreadLeakControl.java:468)
	at com.carrotsearch.randomizedtesting.RandomizedRunner.runSingleTest(RandomizedRunner.java:943)
	at com.carrotsearch.randomizedtesting.RandomizedRunner$5.evaluate(RandomizedRunner.java:829)
	at com.carrotsearch.randomizedtesting.RandomizedRunner$6.evaluate(RandomizedRunner.java:879)
	at com.carrotsearch.randomizedtesting.RandomizedRunner$7.evaluate(RandomizedRunner.java:890)
	at com.carrotsearch.randomizedtesting.rules.StatementAdapter.evaluate(StatementAdapter.java:36)
	at com.carrotsearch.randomizedtesting.rules.SystemPropertiesRestoreRule$1.evaluate(SystemPropertiesRestoreRule.java:57)
	at org.apache.lucene.util.AbstractBeforeAfterRule$1.evaluate(AbstractBeforeAfterRule.java:45)
	at com.carrotsearch.randomizedtesting.rules.StatementAdapter.evaluate(StatementAdapter.java:36)
	at org.apache.lucene.util.TestRuleStoreClassName$1.evaluate(TestRuleStoreClassName.java:41)
	at com.carrotsearch.randomizedtesting.rules.NoShadowingOrOverridesOnMethodsRule$1.evaluate(NoShadowingOrOverridesOnMethodsRule.java:40)
	at com.carrotsearch.randomizedtesting.rules.NoShadowingOrOverridesOnMethodsRule$1.evaluate(NoShadowingOrOverridesOnMethodsRule.java:40)
	at com.carrotsearch.randomizedtesting.rules.StatementAdapter.evaluate(StatementAdapter.java:36)
	at com.carrotsearch.randomizedtesting.rules.StatementAdapter.evaluate(StatementAdapter.java:36)
	at org.apache.lucene.util.TestRuleAssertionsRequired$1.evaluate(TestRuleAssertionsRequired.java:53)
	at org.apache.lucene.util.TestRuleMarkFailure$1.evaluate(TestRuleMarkFailure.java:47)
	at org.apache.lucene.util.TestRuleIgnoreAfterMaxFailures$1.evaluate(TestRuleIgnoreAfterMaxFailures.java:64)
	at org.apache.lucene.util.TestRuleIgnoreTestSuites$1.evaluate(TestRuleIgnoreTestSuites.java:54)
	at com.carrotsearch.randomizedtesting.rules.StatementAdapter.evaluate(StatementAdapter.java:36)
	at com.carrotsearch.randomizedtesting.ThreadLeakControl$StatementRunner.run(ThreadLeakControl.java:368)
	at java.base/java.lang.Thread.run(Thread.java:844)


FAILED:  org.apache.solr.cloud.LeaderVoteWaitTimeoutTest.basicTest

Error Message:
Collection not found: basicTest

Stack Trace:
org.apache.solr.common.SolrException: Collection not found: basicTest
	at __randomizedtesting.SeedInfo.seed([1D0D818F380CCB95:EFF996ED7CA9C6A6]:0)
	at org.apache.solr.client.solrj.impl.CloudSolrClient.requestWithRetryOnStaleState(CloudSolrClient.java:853)
	at org.apache.solr.client.solrj.impl.CloudSolrClient.request(CloudSolrClient.java:819)
	at org.apache.solr.client.solrj.SolrRequest.process(SolrRequest.java:194)
	at org.apache.solr.client.solrj.SolrClient.add(SolrClient.java:173)
	at org.apache.solr.client.solrj.SolrClient.add(SolrClient.java:138)
	at org.apache.solr.cloud.LeaderVoteWaitTimeoutTest.basicTest(LeaderVoteWaitTimeoutTest.java:105)
	at java.base/jdk.internal.reflect.NativeMethodAccessorImpl.invoke0(Native Method)
	at java.base/jdk.internal.reflect.NativeMethodAccessorImpl.invoke(NativeMethodAccessorImpl.java:62)
	at java.base/jdk.internal.reflect.DelegatingMethodAccessorImpl.invoke(DelegatingMethodAccessorImpl.java:43)
	at java.base/java.lang.reflect.Method.invoke(Method.java:564)
	at com.carrotsearch.randomizedtesting.RandomizedRunner.invoke(RandomizedRunner.java:1737)
	at com.carrotsearch.randomizedtesting.RandomizedRunner$8.evaluate(RandomizedRunner.java:934)
	at com.carrotsearch.randomizedtesting.RandomizedRunner$9.evaluate(RandomizedRunner.java:970)
	at com.carrotsearch.randomizedtesting.RandomizedRunner$10.evaluate(RandomizedRunner.java:984)
	at com.carrotsearch.randomizedtesting.rules.SystemPropertiesRestoreRule$1.evaluate(SystemPropertiesRestoreRule.java:57)
	at org.apache.lucene.util.TestRuleSetupTeardownChained$1.evaluate(TestRuleSetupTeardownChained.java:49)
	at org.apache.lucene.util.AbstractBeforeAfterRule$1.evaluate(AbstractBeforeAfterRule.java:45)
	at org.apache.lucene.util.TestRuleThreadAndTestName$1.evaluate(TestRuleThreadAndTestName.java:48)
	at org.apache.lucene.util.TestRuleIgnoreAfterMaxFailures$1.evaluate(TestRuleIgnoreAfterMaxFailures.java:64)
	at org.apache.lucene.util.TestRuleMarkFailure$1.evaluate(TestRuleMarkFailure.java:47)
	at com.carrotsearch.randomizedtesting.rules.StatementAdapter.evaluate(StatementAdapter.java:36)
	at com.carrotsearch.randomizedtesting.ThreadLeakControl$StatementRunner.run(ThreadLeakControl.java:368)
	at com.carrotsearch.randomizedtesting.ThreadLeakControl.forkTimeoutingTask(ThreadLeakControl.java:817)
	at com.carrotsearch.randomizedtesting.ThreadLeakControl$3.evaluate(ThreadLeakControl.java:468)
	at com.carrotsearch.randomizedtesting.RandomizedRunner.runSingleTest(RandomizedRunner.java:943)
	at com.carrotsearch.randomizedtesting.RandomizedRunner$5.evaluate(RandomizedRunner.java:829)
	at com.carrotsearch.randomizedtesting.RandomizedRunner$6.evaluate(RandomizedRunner.java:879)
	at com.carrotsearch.randomizedtesting.RandomizedRunner$7.evaluate(RandomizedRunner.java:890)
	at com.carrotsearch.randomizedtesting.rules.StatementAdapter.evaluate(StatementAdapter.java:36)
	at com.carrotsearch.randomizedtesting.rules.SystemPropertiesRestoreRule$1.evaluate(SystemPropertiesRestoreRule.java:57)
	at org.apache.lucene.util.AbstractBeforeAfterRule$1.evaluate(AbstractBeforeAfterRule.java:45)
	at com.carrotsearch.randomizedtesting.rules.StatementAdapter.evaluate(StatementAdapter.java:36)
	at org.apache.lucene.util.TestRuleStoreClassName$1.evaluate(TestRuleStoreClassName.java:41)
	at com.carrotsearch.randomizedtesting.rules.NoShadowingOrOverridesOnMethodsRule$1.evaluate(NoShadowingOrOverridesOnMethodsRule.java:40)
	at com.carrotsearch.randomizedtesting.rules.NoShadowingOrOverridesOnMethodsRule$1.evaluate(NoShadowingOrOverridesOnMethodsRule.java:40)
	at com.carrotsearch.randomizedtesting.rules.StatementAdapter.evaluate(StatementAdapter.java:36)
	at com.carrotsearch.randomizedtesting.rules.StatementAdapter.evaluate(StatementAdapter.java:36)
	at org.apache.lucene.util.TestRuleAssertionsRequired$1.evaluate(TestRuleAssertionsRequired.java:53)
	at org.apache.lucene.util.TestRuleMarkFailure$1.evaluate(TestRuleMarkFailure.java:47)
	at org.apache.lucene.util.TestRuleIgnoreAfterMaxFailures$1.evaluate(TestRuleIgnoreAfterMaxFailures.java:64)
	at org.apache.lucene.util.TestRuleIgnoreTestSuites$1.evaluate(TestRuleIgnoreTestSuites.java:54)
	at com.carrotsearch.randomizedtesting.rules.StatementAdapter.evaluate(StatementAdapter.java:36)
	at com.carrotsearch.randomizedtesting.ThreadLeakControl$StatementRunner.run(ThreadLeakControl.java:368)
	at java.base/java.lang.Thread.run(Thread.java:844)


FAILED:  org.apache.solr.update.MaxSizeAutoCommitTest.testAdds

Error Message:
Current tlog size is larger than the max bound

Stack Trace:
java.lang.AssertionError: Current tlog size is larger than the max bound
	at __randomizedtesting.SeedInfo.seed([1D0D818F380CCB95:B457A60D2F8C6C69]:0)
	at org.junit.Assert.fail(Assert.java:93)
	at org.junit.Assert.assertTrue(Assert.java:43)
	at org.apache.solr.update.MaxSizeAutoCommitTest.testAdds(MaxSizeAutoCommitTest.java:98)
	at java.base/jdk.internal.reflect.NativeMethodAccessorImpl.invoke0(Native Method)
	at java.base/jdk.internal.reflect.NativeMethodAccessorImpl.invoke(NativeMethodAccessorImpl.java:62)
	at java.base/jdk.internal.reflect.DelegatingMethodAccessorImpl.invoke(DelegatingMethodAccessorImpl.java:43)
	at java.base/java.lang.reflect.Method.invoke(Method.java:564)
	at com.carrotsearch.randomizedtesting.RandomizedRunner.invoke(RandomizedRunner.java:1737)
	at com.carrotsearch.randomizedtesting.RandomizedRunner$8.evaluate(RandomizedRunner.java:934)
	at com.carrotsearch.randomizedtesting.RandomizedRunner$9.evaluate(RandomizedRunner.java:970)
	at com.carrotsearch.randomizedtesting.RandomizedRunner$10.evaluate(RandomizedRunner.java:984)
	at com.carrotsearch.randomizedtesting.rules.SystemPropertiesRestoreRule$1.evaluate(SystemPropertiesRestoreRule.java:57)
	at org.apache.lucene.util.TestRuleSetupTeardownChained$1.evaluate(TestRuleSetupTeardownChained.java:49)
	at org.apache.lucene.util.AbstractBeforeAfterRule$1.evaluate(AbstractBeforeAfterRule.java:45)
	at org.apache.lucene.util.TestRuleThreadAndTestName$1.evaluate(TestRuleThreadAndTestName.java:48)
	at org.apache.lucene.util.TestRuleIgnoreAfterMaxFailures$1.evaluate(TestRuleIgnoreAfterMaxFailures.java:64)
	at org.apache.lucene.util.TestRuleMarkFailure$1.evaluate(TestRuleMarkFailure.java:47)
	at com.carrotsearch.randomizedtesting.rules.StatementAdapter.evaluate(StatementAdapter.java:36)
	at com.carrotsearch.randomizedtesting.ThreadLeakControl$StatementRunner.run(ThreadLeakControl.java:368)
	at com.carrotsearch.randomizedtesting.ThreadLeakControl.forkTimeoutingTask(ThreadLeakControl.java:817)
	at com.carrotsearch.randomizedtesting.ThreadLeakControl$3.evaluate(ThreadLeakControl.java:468)
	at com.carrotsearch.randomizedtesting.RandomizedRunner.runSingleTest(RandomizedRunner.java:943)
	at com.carrotsearch.randomizedtesting.RandomizedRunner$5.evaluate(RandomizedRunner.java:829)
	at com.carrotsearch.randomizedtesting.RandomizedRunner$6.evaluate(RandomizedRunner.java:879)
	at com.carrotsearch.randomizedtesting.RandomizedRunner$7.evaluate(RandomizedRunner.java:890)
	at com.carrotsearch.randomizedtesting.rules.StatementAdapter.evaluate(StatementAdapter.java:36)
	at com.carrotsearch.randomizedtesting.rules.SystemPropertiesRestoreRule$1.evaluate(SystemPropertiesRestoreRule.java:57)
	at org.apache.lucene.util.AbstractBeforeAfterRule$1.evaluate(AbstractBeforeAfterRule.java:45)
	at com.carrotsearch.randomizedtesting.rules.StatementAdapter.evaluate(StatementAdapter.java:36)
	at org.apache.lucene.util.TestRuleStoreClassName$1.evaluate(TestRuleStoreClassName.java:41)
	at com.carrotsearch.randomizedtesting.rules.NoShadowingOrOverridesOnMethodsRule$1.evaluate(NoShadowingOrOverridesOnMethodsRule.java:40)
	at com.carrotsearch.randomizedtesting.rules.NoShadowingOrOverridesOnMethodsRule$1.evaluate(NoShadowingOrOverridesOnMethodsRule.java:40)
	at com.carrotsearch.randomizedtesting.rules.StatementAdapter.evaluate(StatementAdapter.java:36)
	at com.carrotsearch.randomizedtesting.rules.StatementAdapter.evaluate(StatementAdapter.java:36)
	at org.apache.lucene.util.TestRuleAssertionsRequired$1.evaluate(TestRuleAssertionsRequired.java:53)
	at org.apache.lucene.util.TestRuleMarkFailure$1.evaluate(TestRuleMarkFailure.java:47)
	at org.apache.lucene.util.TestRuleIgnoreAfterMaxFailures$1.evaluate(TestRuleIgnoreAfterMaxFailures.java:64)
	at org.apache.lucene.util.TestRuleIgnoreTestSuites$1.evaluate(TestRuleIgnoreTestSuites.java:54)
	at com.carrotsearch.randomizedtesting.rules.StatementAdapter.evaluate(StatementAdapter.java:36)
	at com.carrotsearch.randomizedtesting.ThreadLeakControl$StatementRunner.run(ThreadLeakControl.java:368)
	at java.base/java.lang.Thread.run(Thread.java:844)




Build Log:
[...truncated 13547 lines...]
   [junit4] Suite: org.apache.solr.cloud.LeaderVoteWaitTimeoutTest
   [junit4]   2> 2016183 INFO  (SUITE-LeaderVoteWaitTimeoutTest-seed#[1D0D818F380CCB95]-worker) [    ] o.a.s.SolrTestCaseJ4 SecureRandom sanity checks: test.solr.allowed.securerandom=null & java.security.egd=file:/dev/./urandom
   [junit4]   2> Creating dataDir: /Users/jenkins/workspace/Lucene-Solr-master-MacOSX/solr/build/solr-core/test/J0/temp/solr.cloud.LeaderVoteWaitTimeoutTest_1D0D818F380CCB95-001/init-core-data-001
   [junit4]   2> 2016184 WARN  (SUITE-LeaderVoteWaitTimeoutTest-seed#[1D0D818F380CCB95]-worker) [    ] o.a.s.SolrTestCaseJ4 startTrackingSearchers: numOpens=7 numCloses=7
   [junit4]   2> 2016186 INFO  (SUITE-LeaderVoteWaitTimeoutTest-seed#[1D0D818F380CCB95]-worker) [    ] o.a.s.SolrTestCaseJ4 Using TrieFields (NUMERIC_POINTS_SYSPROP=false) w/NUMERIC_DOCVALUES_SYSPROP=false
   [junit4]   2> 2016187 INFO  (SUITE-LeaderVoteWaitTimeoutTest-seed#[1D0D818F380CCB95]-worker) [    ] o.a.s.SolrTestCaseJ4 Randomized ssl (false) and clientAuth (false) via: @org.apache.solr.util.RandomizeSSL(reason="", value=0.0/0.0, ssl=0.0/0.0, clientAuth=0.0/0.0) w/ MAC_OS_X supressed clientAuth
   [junit4]   2> 2016187 INFO  (SUITE-LeaderVoteWaitTimeoutTest-seed#[1D0D818F380CCB95]-worker) [    ] o.a.s.c.MiniSolrCloudCluster Starting cluster of 4 servers in /Users/jenkins/workspace/Lucene-Solr-master-MacOSX/solr/build/solr-core/test/J0/temp/solr.cloud.LeaderVoteWaitTimeoutTest_1D0D818F380CCB95-001/tempDir-001
   [junit4]   2> 2016187 INFO  (SUITE-LeaderVoteWaitTimeoutTest-seed#[1D0D818F380CCB95]-worker) [    ] o.a.s.c.ZkTestServer STARTING ZK TEST SERVER
   [junit4]   2> 2016188 INFO  (Thread-2182) [    ] o.a.s.c.ZkTestServer client port:0.0.0.0/0.0.0.0:0
   [junit4]   2> 2016188 INFO  (Thread-2182) [    ] o.a.s.c.ZkTestServer Starting server
   [junit4]   2> 2016191 ERROR (Thread-2182) [    ] o.a.z.s.ZooKeeperServer ZKShutdownHandler is not registered, so ZooKeeper server won't take any action on ERROR or SHUTDOWN server state changes
   [junit4]   2> 2016303 INFO  (SUITE-LeaderVoteWaitTimeoutTest-seed#[1D0D818F380CCB95]-worker) [    ] o.a.s.c.ZkTestServer start zk server on port:53524
   [junit4]   2> 2016328 INFO  (zkConnectionManagerCallback-5282-thread-1) [    ] o.a.s.c.c.ConnectionManager zkClient has connected
   [junit4]   2> 2016340 INFO  (jetty-launcher-5279-thread-1) [    ] o.e.j.s.Server jetty-9.4.11.v20180605; built: 2018-06-05T18:24:03.829Z; git: d5fc0523cfa96bfebfbda19606cad384d772f04c; jvm 9+181
   [junit4]   2> 2016340 INFO  (jetty-launcher-5279-thread-2) [    ] o.e.j.s.Server jetty-9.4.11.v20180605; built: 2018-06-05T18:24:03.829Z; git: d5fc0523cfa96bfebfbda19606cad384d772f04c; jvm 9+181
   [junit4]   2> 2016340 INFO  (jetty-launcher-5279-thread-3) [    ] o.e.j.s.Server jetty-9.4.11.v20180605; built: 2018-06-05T18:24:03.829Z; git: d5fc0523cfa96bfebfbda19606cad384d772f04c; jvm 9+181
   [junit4]   2> 2016340 INFO  (jetty-launcher-5279-thread-4) [    ] o.e.j.s.Server jetty-9.4.11.v20180605; built: 2018-06-05T18:24:03.829Z; git: d5fc0523cfa96bfebfbda19606cad384d772f04c; jvm 9+181
   [junit4]   2> 2016344 INFO  (jetty-launcher-5279-thread-3) [    ] o.e.j.s.session DefaultSessionIdManager workerName=node0
   [junit4]   2> 2016344 INFO  (jetty-launcher-5279-thread-3) [    ] o.e.j.s.session No SessionScavenger set, using defaults
   [junit4]   2> 2016344 INFO  (jetty-launcher-5279-thread-3) [    ] o.e.j.s.session node0 Scavenging every 660000ms
   [junit4]   2> 2016345 INFO  (jetty-launcher-5279-thread-2) [    ] o.e.j.s.session DefaultSessionIdManager workerName=node0
   [junit4]   2> 2016345 INFO  (jetty-launcher-5279-thread-2) [    ] o.e.j.s.session No SessionScavenger set, using defaults
   [junit4]   2> 2016345 INFO  (jetty-launcher-5279-thread-2) [    ] o.e.j.s.session node0 Scavenging every 600000ms
   [junit4]   2> 2016346 INFO  (jetty-launcher-5279-thread-2) [    ] o.e.j.s.h.ContextHandler Started o.e.j.s.ServletContextHandler@3107d462{/solr,null,AVAILABLE}
   [junit4]   2> 2016346 INFO  (jetty-launcher-5279-thread-1) [    ] o.e.j.s.session DefaultSessionIdManager workerName=node0
   [junit4]   2> 2016346 INFO  (jetty-launcher-5279-thread-1) [    ] o.e.j.s.session No SessionScavenger set, using defaults
   [junit4]   2> 2016346 INFO  (jetty-launcher-5279-thread-1) [    ] o.e.j.s.session node0 Scavenging every 660000ms
   [junit4]   2> 2016351 INFO  (jetty-launcher-5279-thread-2) [    ] o.e.j.s.AbstractConnector Started ServerConnector@28266acc{HTTP/1.1,[http/1.1]}{127.0.0.1:53526}
   [junit4]   2> 2016351 INFO  (jetty-launcher-5279-thread-2) [    ] o.e.j.s.Server Started @2016420ms
   [junit4]   2> 2016351 INFO  (jetty-launcher-5279-thread-2) [    ] o.a.s.c.s.e.JettySolrRunner Jetty properties: {hostContext=/solr, hostPort=53526}
   [junit4]   2> 2016351 ERROR (jetty-launcher-5279-thread-2) [    ] o.a.s.u.StartupLoggingUtils Missing Java Option solr.log.dir. Logging may be missing or incomplete.
   [junit4]   2> 2016351 INFO  (jetty-launcher-5279-thread-2) [    ] o.a.s.s.SolrDispatchFilter Using logger factory org.apache.logging.slf4j.Log4jLoggerFactory
   [junit4]   2> 2016352 INFO  (jetty-launcher-5279-thread-1) [    ] o.e.j.s.h.ContextHandler Started o.e.j.s.ServletContextHandler@7851c196{/solr,null,AVAILABLE}
   [junit4]   2> 2016352 INFO  (jetty-launcher-5279-thread-1) [    ] o.e.j.s.AbstractConnector Started ServerConnector@4ff55c87{HTTP/1.1,[http/1.1]}{127.0.0.1:53527}
   [junit4]   2> 2016352 INFO  (jetty-launcher-5279-thread-1) [    ] o.e.j.s.Server Started @2016421ms
   [junit4]   2> 2016352 INFO  (jetty-launcher-5279-thread-2) [    ] o.a.s.s.SolrDispatchFilter  ___      _       Welcome to Apache Solr™ version 8.0.0
   [junit4]   2> 2016353 INFO  (jetty-launcher-5279-thread-2) [    ] o.a.s.s.SolrDispatchFilter / __| ___| |_ _   Starting in cloud mode on port null
   [junit4]   2> 2016353 INFO  (jetty-launcher-5279-thread-2) [    ] o.a.s.s.SolrDispatchFilter \__ \/ _ \ | '_|  Install dir: null
   [junit4]   2> 2016353 INFO  (jetty-launcher-5279-thread-2) [    ] o.a.s.s.SolrDispatchFilter |___/\___/_|_|    Start time: 2018-09-03T00:49:42.645045Z
   [junit4]   2> 2016352 INFO  (jetty-launcher-5279-thread-1) [    ] o.a.s.c.s.e.JettySolrRunner Jetty properties: {hostContext=/solr, hostPort=53527}
   [junit4]   2> 2016366 ERROR (jetty-launcher-5279-thread-1) [    ] o.a.s.u.StartupLoggingUtils Missing Java Option solr.log.dir. Logging may be missing or incomplete.
   [junit4]   2> 2016366 INFO  (jetty-launcher-5279-thread-1) [    ] o.a.s.s.SolrDispatchFilter Using logger factory org.apache.logging.slf4j.Log4jLoggerFactory
   [junit4]   2> 2016366 INFO  (jetty-launcher-5279-thread-1) [    ] o.a.s.s.SolrDispatchFilter  ___      _       Welcome to Apache Solr™ version 8.0.0
   [junit4]   2> 2016366 INFO  (jetty-launcher-5279-thread-1) [    ] o.a.s.s.SolrDispatchFilter / __| ___| |_ _   Starting in cloud mode on port null
   [junit4]   2> 2016366 INFO  (jetty-launcher-5279-thread-1) [    ] o.a.s.s.SolrDispatchFilter \__ \/ _ \ | '_|  Install dir: null
   [junit4]   2> 2016366 INFO  (jetty-launcher-5279-thread-1) [    ] o.a.s.s.SolrDispatchFilter |___/\___/_|_|    Start time: 2018-09-03T00:49:42.658282Z
   [junit4]   2> 2016367 INFO  (jetty-launcher-5279-thread-4) [    ] o.e.j.s.session DefaultSessionIdManager workerName=node0
   [junit4]   2> 2016367 INFO  (jetty-launcher-5279-thread-4) [    ] o.e.j.s.session No SessionScavenger set, using defaults
   [junit4]   2> 2016367 INFO  (jetty-launcher-5279-thread-4) [    ] o.e.j.s.session node0 Scavenging every 600000ms
   [junit4]   2> 2016367 INFO  (jetty-launcher-5279-thread-4) [    ] o.e.j.s.h.ContextHandler Started o.e.j.s.ServletContextHandler@e105a60{/solr,null,AVAILABLE}
   [junit4]   2> 2016368 INFO  (jetty-launcher-5279-thread-4) [    ] o.e.j.s.AbstractConnector Started ServerConnector@7e69e6bd{HTTP/1.1,[http/1.1]}{127.0.0.1:53529}
   [junit4]   2> 2016368 INFO  (jetty-launcher-5279-thread-4) [    ] o.e.j.s.Server Started @2016436ms
   [junit4]   2> 2016368 INFO  (jetty-launcher-5279-thread-4) [    ] o.a.s.c.s.e.JettySolrRunner Jetty properties: {hostContext=/solr, hostPort=53529}
   [junit4]   2> 2016368 ERROR (jetty-launcher-5279-thread-4) [    ] o.a.s.u.StartupLoggingUtils Missing Java Option solr.log.dir. Logging may be missing or incomplete.
   [junit4]   2> 2016368 INFO  (jetty-launcher-5279-thread-4) [    ] o.a.s.s.SolrDispatchFilter Using logger factory org.apache.logging.slf4j.Log4jLoggerFactory
   [junit4]   2> 2016369 INFO  (jetty-launcher-5279-thread-4) [    ] o.a.s.s.SolrDispatchFilter  ___      _       Welcome to Apache Solr™ version 8.0.0
   [junit4]   2> 2016369 INFO  (jetty-launcher-5279-thread-4) [    ] o.a.s.s.SolrDispatchFilter / __| ___| |_ _   Starting in cloud mode on port null
   [junit4]   2> 2016369 INFO  (jetty-launcher-5279-thread-4) [    ] o.a.s.s.SolrDispatchFilter \__ \/ _ \ | '_|  Install dir: null
   [junit4]   2> 2016369 INFO  (jetty-launcher-5279-thread-4) [    ] o.a.s.s.SolrDispatchFilter |___/\___/_|_|    Start time: 2018-09-03T00:49:42.661182Z
   [junit4]   2> 2016372 INFO  (jetty-launcher-5279-thread-3) [    ] o.e.j.s.h.ContextHandler Started o.e.j.s.ServletContextHandler@1f3acde{/solr,null,AVAILABLE}
   [junit4]   2> 2016372 INFO  (jetty-launcher-5279-thread-3) [    ] o.e.j.s.AbstractConnector Started ServerConnector@4c6a2a52{HTTP/1.1,[http/1.1]}{127.0.0.1:53531}
   [junit4]   2> 2016372 INFO  (jetty-launcher-5279-thread-3) [    ] o.e.j.s.Server Started @2016441ms
   [junit4]   2> 2016373 INFO  (zkConnectionManagerCallback-5288-thread-1) [    ] o.a.s.c.c.ConnectionManager zkClient has connected
   [junit4]   2> 2016372 INFO  (jetty-launcher-5279-thread-3) [    ] o.a.s.c.s.e.JettySolrRunner Jetty properties: {hostContext=/solr, hostPort=53531}
   [junit4]   2> 2016374 INFO  (zkConnectionManagerCallback-5284-thread-1) [    ] o.a.s.c.c.ConnectionManager zkClient has connected
   [junit4]   2> 2016374 ERROR (jetty-launcher-5279-thread-3) [    ] o.a.s.u.StartupLoggingUtils Missing Java Option solr.log.dir. Logging may be missing or incomplete.
   [junit4]   2> 2016374 INFO  (jetty-launcher-5279-thread-3) [    ] o.a.s.s.SolrDispatchFilter Using logger factory org.apache.logging.slf4j.Log4jLoggerFactory
   [junit4]   2> 2016375 INFO  (jetty-launcher-5279-thread-3) [    ] o.a.s.s.SolrDispatchFilter  ___      _       Welcome to Apache Solr™ version 8.0.0
   [junit4]   2> 2016375 INFO  (jetty-launcher-5279-thread-3) [    ] o.a.s.s.SolrDispatchFilter / __| ___| |_ _   Starting in cloud mode on port null
   [junit4]   2> 2016375 INFO  (jetty-launcher-5279-thread-3) [    ] o.a.s.s.SolrDispatchFilter \__ \/ _ \ | '_|  Install dir: null
   [junit4]   2> 2016375 INFO  (jetty-launcher-5279-thread-3) [    ] o.a.s.s.SolrDispatchFilter |___/\___/_|_|    Start time: 2018-09-03T00:49:42.667210Z
   [junit4]   2> 2016378 INFO  (jetty-launcher-5279-thread-2) [    ] o.a.s.s.SolrDispatchFilter solr.xml found in ZooKeeper. Loading...
   [junit4]   2> 2016384 INFO  (zkConnectionManagerCallback-5286-thread-1) [    ] o.a.s.c.c.ConnectionManager zkClient has connected
   [junit4]   2> 2016384 INFO  (jetty-launcher-5279-thread-4) [    ] o.a.s.s.SolrDispatchFilter solr.xml found in ZooKeeper. Loading...
   [junit4]   2> 2016410 INFO  (jetty-launcher-5279-thread-1) [    ] o.a.s.s.SolrDispatchFilter solr.xml found in ZooKeeper. Loading...
   [junit4]   2> 2016422 INFO  (zkConnectionManagerCallback-5290-thread-1) [    ] o.a.s.c.c.ConnectionManager zkClient has connected
   [junit4]   2> 2016475 INFO  (jetty-launcher-5279-thread-3) [    ] o.a.s.s.SolrDispatchFilter solr.xml found in ZooKeeper. Loading...
   [junit4]   2> 2016504 INFO  (jetty-launcher-5279-thread-4) [    ] o.a.s.c.ZkContainer Zookeeper client=127.0.0.1:53524/solr
   [junit4]   2> 2016511 INFO  (zkConnectionManagerCallback-5295-thread-1) [    ] o.a.s.c.c.ConnectionManager zkClient has connected
   [junit4]   2> 2016512 INFO  (jetty-launcher-5279-thread-1) [    ] o.a.s.c.ZkContainer Zookeeper client=127.0.0.1:53524/solr
   [junit4]   2> 2016517 INFO  (zkConnectionManagerCallback-5298-thread-1) [    ] o.a.s.c.c.ConnectionManager zkClient has connected
   [junit4]   2> 2016520 INFO  (jetty-launcher-5279-thread-2) [    ] o.a.s.c.ZkContainer Zookeeper client=127.0.0.1:53524/solr
   [junit4]   2> 2016523 INFO  (zkConnectionManagerCallback-5302-thread-1) [    ] o.a.s.c.c.ConnectionManager zkClient has connected
   [junit4]   2> 2016524 INFO  (zkConnectionManagerCallback-5304-thread-1) [    ] o.a.s.c.c.ConnectionManager zkClient has connected
   [junit4]   2> 2016526 INFO  (zkConnectionManagerCallback-5306-thread-1) [    ] o.a.s.c.c.ConnectionManager zkClient has connected
   [junit4]   2> 2016532 INFO  (zkConnectionManagerCallback-5308-thread-1) [    ] o.a.s.c.c.ConnectionManager zkClient has connected
   [junit4]   2> 2016840 INFO  (jetty-launcher-5279-thread-3) [    ] o.a.s.c.ZkContainer Zookeeper client=127.0.0.1:53524/solr
   [junit4]   2> 2016848 INFO  (zkConnectionManagerCallback-5318-thread-1) [    ] o.a.s.c.c.ConnectionManager zkClient has connected
   [junit4]   2> 2016884 INFO  (zkConnectionManagerCallback-5320-thread-1) [    ] o.a.s.c.c.ConnectionManager zkClient has connected
   [junit4]   2> 2016955 INFO  (jetty-launcher-5279-thread-1) [n:127.0.0.1:53527_solr    ] o.a.s.c.OverseerElectionContext I am going to be the leader 127.0.0.1:53527_solr
   [junit4]   2> 2016963 INFO  (jetty-launcher-5279-thread-2) [n:127.0.0.1:53526_solr    ] o.a.s.c.ZkController Register node as live in ZooKeeper:/live_nodes/127.0.0.1:53526_solr
   [junit4]   2> 2016963 INFO  (jetty-launcher-5279-thread-4) [n:127.0.0.1:53529_solr    ] o.a.s.c.ZkController Register node as live in ZooKeeper:/live_nodes/127.0.0.1:53529_solr
   [junit4]   2> 2016965 INFO  (jetty-launcher-5279-thread-1) [n:127.0.0.1:53527_solr    ] o.a.s.c.Overseer Overseer (id=72269760404389897-127.0.0.1:53527_solr-n_0000000000) starting
   [junit4]   2> 2016975 INFO  (zkCallback-5319-thread-1) [    ] o.a.s.c.c.ZkStateReader Updated live nodes from ZooKeeper... (0) -> (2)
   [junit4]   2> 2016976 INFO  (zkCallback-5303-thread-1) [    ] o.a.s.c.c.ZkStateReader Updated live nodes from ZooKeeper... (0) -> (2)
   [junit4]   2> 2016978 INFO  (zkCallback-5305-thread-1) [    ] o.a.s.c.c.ZkStateReader Updated live nodes from ZooKeeper... (0) -> (2)
   [junit4]   2> 2016987 INFO  (zkCallback-5307-thread-1) [    ] o.a.s.c.c.ZkStateReader Updated live nodes from ZooKeeper... (0) -> (2)
   [junit4]   2> 2016994 INFO  (jetty-launcher-5279-thread-3) [n:127.0.0.1:53531_solr    ] o.a.s.c.TransientSolrCoreCacheDefault Allocating transient cache for 2147483647 transient cores
   [junit4]   2> 2016994 INFO  (jetty-launcher-5279-thread-3) [n:127.0.0.1:53531_solr    ] o.a.s.c.ZkController Register node as live in ZooKeeper:/live_nodes/127.0.0.1:53531_solr
   [junit4]   2> 2017004 INFO  (zkCallback-5319-thread-1) [    ] o.a.s.c.c.ZkStateReader Updated live nodes from ZooKeeper... (2) -> (3)
   [junit4]   2> 2017007 INFO  (zkCallback-5303-thread-1) [    ] o.a.s.c.c.ZkStateReader Updated live nodes from ZooKeeper... (2) -> (3)
   [junit4]   2> 2017007 INFO  (zkCallback-5305-thread-1) [    ] o.a.s.c.c.ZkStateReader Updated live nodes from ZooKeeper... (2) -> (3)
   [junit4]   2> 2017007 INFO  (zkCallback-5307-thread-1) [    ] o.a.s.c.c.ZkStateReader Updated live nodes from ZooKeeper... (2) -> (3)
   [junit4]   2> 2017008 INFO  (zkConnectionManagerCallback-5327-thread-1) [    ] o.a.s.c.c.ConnectionManager zkClient has connected
   [junit4]   2> 2017011 INFO  (jetty-launcher-5279-thread-4) [n:127.0.0.1:53529_solr    ] o.a.s.c.c.ZkStateReader Updated live nodes from ZooKeeper... (0) -> (3)
   [junit4]   2> 2017013 INFO  (jetty-launcher-5279-thread-4) [n:127.0.0.1:53529_solr    ] o.a.s.c.s.i.ZkClientClusterStateProvider Cluster at 127.0.0.1:53524/solr ready
   [junit4]   2> 2017014 INFO  (jetty-launcher-5279-thread-4) [n:127.0.0.1:53529_solr    ] o.a.s.h.a.MetricsHistoryHandler No .system collection, keeping metrics history in memory.
   [junit4]   2> 2017021 INFO  (zkConnectionManagerCallback-5333-thread-1) [    ] o.a.s.c.c.ConnectionManager zkClient has connected
   [junit4]   2> 2017027 INFO  (jetty-launcher-5279-thread-1) [n:127.0.0.1:53527_solr    ] o.a.s.c.c.ZkStateReader Updated live nodes from ZooKeeper... (0) -> (3)
   [junit4]   2> 2017029 INFO  (jetty-launcher-5279-thread-1) [n:127.0.0.1:53527_solr    ] o.a.s.c.s.i.ZkClientClusterStateProvider Cluster at 127.0.0.1:53524/solr ready
   [junit4]   2> 2017031 INFO  (OverseerStateUpdate-72269760404389897-127.0.0.1:53527_solr-n_0000000000) [n:127.0.0.1:53527_solr    ] o.a.s.c.Overseer Starting to work on the main queue : 127.0.0.1:53527_solr
   [junit4]   2> 2017034 INFO  (zkConnectionManagerCallback-5338-thread-1) [    ] o.a.s.c.c.ConnectionManager zkClient has connected
   [junit4]   2> 2017038 INFO  (jetty-launcher-5279-thread-2) [n:127.0.0.1:53526_solr    ] o.a.s.c.c.ZkStateReader Updated live nodes from ZooKeeper... (0) -> (3)
   [junit4]   2> 2017038 INFO  (jetty-launcher-5279-thread-1) [n:127.0.0.1:53527_solr    ] o.a.s.c.TransientSolrCoreCacheDefault Allocating transient cache for 2147483647 transient cores
   [junit4]   2> 2017038 INFO  (jetty-launcher-5279-thread-1) [n:127.0.0.1:53527_solr    ] o.a.s.c.ZkController Register node as live in ZooKeeper:/live_nodes/127.0.0.1:53527_solr
   [junit4]   2> 2017040 INFO  (jetty-launcher-5279-thread-2) [n:127.0.0.1:53526_solr    ] o.a.s.c.s.i.ZkClientClusterStateProvider Cluster at 127.0.0.1:53524/solr ready
   [junit4]   2> 2017041 INFO  (zkCallback-5326-thread-1) [    ] o.a.s.c.c.ZkStateReader Updated live nodes from ZooKeeper... (3) -> (4)
   [junit4]   2> 2017041 INFO  (jetty-launcher-5279-thread-2) [n:127.0.0.1:53526_solr    ] o.a.s.h.a.MetricsHistoryHandler No .system collection, keeping metrics history in memory.
   [junit4]   2> 2017042 INFO  (zkCallback-5332-thread-1) [    ] o.a.s.c.c.ZkStateReader Updated live nodes from ZooKeeper... (3) -> (4)
   [junit4]   2> 2017042 INFO  (zkCallback-5337-thread-1) [    ] o.a.s.c.c.ZkStateReader Updated live nodes from ZooKeeper... (3) -> (4)
   [junit4]   2> 2017042 INFO  (zkCallback-5319-thread-1) [    ] o.a.s.c.c.ZkStateReader Updated live nodes from ZooKeeper... (3) -> (4)
   [junit4]   2> 2017042 INFO  (zkCallback-5303-thread-1) [    ] o.a.s.c.c.ZkStateReader Updated live nodes from ZooKeeper... (3) -> (4)
   [junit4]   2> 2017042 INFO  (zkCallback-5307-thread-1) [    ] o.a.s.c.c.ZkStateReader Updated live nodes from ZooKeeper... (3) -> (4)
   [junit4]   2> 2017053 INFO  (zkCallback-5305-thread-1) [    ] o.a.s.c.c.ZkStateReader Updated live nodes from ZooKeeper... (3) -> (4)
   [junit4]   2> 2017060 INFO  (zkConnectionManagerCallback-5344-thread-1) [    ] o.a.s.c.c.ConnectionManager zkClient has connected
   [junit4]   2> 2017064 INFO  (jetty-launcher-5279-thread-3) [n:127.0.0.1:53531_solr    ] o.a.s.c.c.ZkStateReader Updated live nodes from ZooKeeper... (0) -> (4)
   [junit4]   2> 2017067 INFO  (jetty-launcher-5279-thread-3) [n:127.0.0.1:53531_solr    ] o.a.s.c.s.i.ZkClientClusterStateProvider Cluster at 127.0.0.1:53524/solr ready
   [junit4]   2> 2017067 INFO  (jetty-launcher-5279-thread-3) [n:127.0.0.1:53531_solr    ] o.a.s.h.a.MetricsHistoryHandler No .system collection, keeping metrics history in memory.
   [junit4]   2> 2017088 INFO  (jetty-launcher-5279-thread-1) [n:127.0.0.1:53527_solr    ] o.a.s.h.a.MetricsHistoryHandler No .system collection, keeping metrics history in memory.
   [junit4]   2> 2017100 INFO  (jetty-launcher-5279-thread-4) [n:127.0.0.1:53529_solr    ] o.a.s.m.r.SolrJmxReporter JMX monitoring for 'solr_53529.solr.node' (registry 'solr.node') enabled at server: com.sun.jmx.mbeanserver.JmxMBeanServer@36115f2
   [junit4]   2> 2017150 INFO  (jetty-launcher-5279-thread-2) [n:127.0.0.1:53526_solr    ] o.a.s.m.r.SolrJmxReporter JMX monitoring for 'solr_53526.solr.node' (registry 'solr.node') enabled at server: com.sun.jmx.mbeanserver.JmxMBeanServer@36115f2
   [junit4]   2> 2017233 INFO  (jetty-launcher-5279-thread-4) [n:127.0.0.1:53529_solr    ] o.a.s.m.r.SolrJmxReporter JMX monitoring for 'solr_53529.solr.jvm' (registry 'solr.jvm') enabled at server: com.sun.jmx.mbeanserver.JmxMBeanServer@36115f2
   [junit4]   2> 2017233 INFO  (jetty-launcher-5279-thread-4) [n:127.0.0.1:53529_solr    ] o.a.s.m.r.SolrJmxReporter JMX monitoring for 'solr_53529.solr.jetty' (registry 'solr.jetty') enabled at server: com.sun.jmx.mbeanserver.JmxMBeanServer@36115f2
   [junit4]   2> 2017238 INFO  (jetty-launcher-5279-thread-3) [n:127.0.0.1:53531_solr    ] o.a.s.m.r.SolrJmxReporter JMX monitoring for 'solr_53531.solr.node' (registry 'solr.node') enabled at server: com.sun.jmx.mbeanserver.JmxMBeanServer@36115f2
   [junit4]   2> 2017250 INFO  (jetty-launcher-5279-thread-4) [n:127.0.0.1:53529_solr    ] o.a.s.c.CorePropertiesLocator Found 0 core definitions underneath /Users/jenkins/workspace/Lucene-Solr-master-MacOSX/solr/build/solr-core/test/J0/temp/solr.cloud.LeaderVoteWaitTimeoutTest_1D0D818F380CCB95-001/tempDir-001/node4/.
   [junit4]   2> 2017256 INFO  (jetty-launcher-5279-thread-1) [n:127.0.0.1:53527_solr    ] o.a.s.m.r.SolrJmxReporter JMX monitoring for 'solr_53527.solr.node' (registry 'solr.node') enabled at server: com.sun.jmx.mbeanserver.JmxMBeanServer@36115f2
   [junit4]   2> 2017258 INFO  (jetty-launcher-5279-thread-3) [n:127.0.0.1:53531_solr    ] o.a.s.m.r.SolrJmxReporter JMX monitoring for 'solr_53531.solr.jvm' (registry 'solr.jvm') enabled at server: com.sun.jmx.mbeanserver.JmxMBeanServer@36115f2
   [junit4]   2> 2017263 INFO  (jetty-launcher-5279-thread-3) [n:127.0.0.1:53531_solr    ] o.a.s.m.r.SolrJmxReporter JMX monitoring for 'solr_53531.solr.jetty' (registry 'solr.jetty') enabled at server: com.sun.jmx.mbeanserver.JmxMBeanServer@36115f2
   [junit4]   2> 2017267 INFO  (jetty-launcher-5279-thread-3) [n:127.0.0.1:53531_solr    ] o.a.s.c.CorePropertiesLocator Found 0 core definitions underneath /Users/jenkins/workspace/Lucene-Solr-master-MacOSX/solr/build/solr-core/test/J0/temp/solr.cloud.LeaderVoteWaitTimeoutTest_1D0D818F380CCB95-001/tempDir-001/node3/.
   [junit4]   2> 2017278 INFO  (jetty-launcher-5279-thread-2) [n:127.0.0.1:53526_solr    ] o.a.s.m.r.SolrJmxReporter JMX monitoring for 'solr_53526.solr.jvm' (registry 'solr.jvm') enabled at server: com.sun.jmx.mbeanserver.JmxMBeanServer@36115f2
   [junit4]   2> 2017279 INFO  (jetty-launcher-5279-thread-2) [n:127.0.0.1:53526_solr    ] o.a.s.m.r.SolrJmxReporter JMX monitoring for 'solr_53526.solr.jetty' (registry 'solr.jetty') enabled at server: com.sun.jmx.mbeanserver.JmxMBeanServer@36115f2
   [junit4]   2> 2017280 INFO  (jetty-launcher-5279-thread-2) [n:127.0.0.1:53526_solr    ] o.a.s.c.CorePropertiesLocator Found 0 core definitions underneath /Users/jenkins/workspace/Lucene-Solr-master-MacOSX/solr/build/solr-core/test/J0/temp/solr.cloud.LeaderVoteWaitTimeoutTest_1D0D818F380CCB95-001/tempDir-001/node2/.
   [junit4]   2> 2017292 INFO  (jetty-launcher-5279-thread-1) [n:127.0.0.1:53527_solr    ] o.a.s.m.r.SolrJmxReporter JMX monitoring for 'solr_53527.solr.jvm' (registry 'solr.jvm') enabled at server: com.sun.jmx.mbeanserver.JmxMBeanServer@36115f2
   [junit4]   2> 2017293 INFO  (jetty-launcher-5279-thread-1) [n:127.0.0.1:53527_solr    ] o.a.s.m.r.SolrJmxReporter JMX monitoring for 'solr_53527.solr.jetty' (registry 'solr.jetty') enabled at server: com.sun.jmx.mbeanserver.JmxMBeanServer@36115f2
   [junit4]   2> 2017294 INFO  (jetty-launcher-5279-thread-1) [n:127.0.0.1:53527_solr    ] o.a.s.c.CorePropertiesLocator Found 0 core definitions underneath /Users/jenkins/workspace/Lucene-Solr-master-MacOSX/solr/build/solr-core/test/J0/temp/solr.cloud.LeaderVoteWaitTimeoutTest_1D0D818F380CCB95-001/tempDir-001/node1/.
   [junit4]   2> 2017484 INFO  (zkConnectionManagerCallback-5348-thread-1) [    ] o.a.s.c.c.ConnectionManager zkClient has connected
   [junit4]   2> 2017488 INFO  (zkConnectionManagerCallback-5353-thread-1) [    ] o.a.s.c.c.ConnectionManager zkClient has connected
   [junit4]   2> 2017490 INFO  (SUITE-LeaderVoteWaitTimeoutTest-seed#[1D0D818F380CCB95]-worker) [    ] o.a.s.c.c.ZkStateReader Updated live nodes from ZooKeeper... (0) -> (4)
   [junit4]   2> 2017498 INFO  (SUITE-LeaderVoteWaitTimeoutTest-seed#[1D0D818F380CCB95]-worker) [    ] o.a.s.c.s.i.ZkClientClusterStateProvider Cluster at 127.0.0.1:53524/solr ready
   [junit4]   2> 2017517 INFO  (SUITE-LeaderVoteWaitTimeoutTest-seed#[1D0D818F380CCB95]-worker) [    ] o.e.j.s.AbstractConnector Stopped ServerConnector@4c6a2a52{HTTP/1.1,[http/1.1]}{127.0.0.1:0}
   [junit4]   2> 2017517 INFO  (SUITE-LeaderVoteWaitTimeoutTest-seed#[1D0D818F380CCB95]-worker) [    ] o.a.s.c.CoreContainer Shutting down CoreContainer instance=1836711477
   [junit4]   2> 2017518 INFO  (SUITE-LeaderVoteWaitTimeoutTest-seed#[1D0D818F380CCB95]-worker) [    ] o.a.s.m.SolrMetricManager Closing metric reporters for registry=solr.node, tag=null
   [junit4]   2> 2017518 INFO  (SUITE-LeaderVoteWaitTimeoutTest-seed#[1D0D818F380CCB95]-worker) [    ] o.a.s.m.r.SolrJmxReporter Closing reporter [org.apache.solr.metrics.reporters.SolrJmxReporter@38a44957: rootName = solr_53531, domain = solr.node, service url = null, agent id = null] for registry solr.node / com.codahale.metrics.MetricRegistry@1cd7000a
   [junit4]   2> 2017529 INFO  (SUITE-LeaderVoteWaitTimeoutTest-seed#[1D0D818F380CCB95]-worker) [    ] o.a.s.m.SolrMetricManager Closing metric reporters for registry=solr.jvm, tag=null
   [junit4]   2> 2017529 INFO  (SUITE-LeaderVoteWaitTimeoutTest-seed#[1D0D818F380CCB95]-worker) [    ] o.a.s.m.r.SolrJmxReporter Closing reporter [org.apache.solr.metrics.reporters.SolrJmxReporter@553de825: rootName = solr_53531, domain = solr.jvm, service url = null, agent id = null] for registry solr.jvm / com.codahale.metrics.MetricRegistry@77bca6c7
   [junit4]   2> 2017536 INFO  (SUITE-LeaderVoteWaitTimeoutTest-seed#[1D0D818F380CCB95]-worker) [    ] o.a.s.m.SolrMetricManager Closing metric reporters for registry=solr.jetty, tag=null
   [junit4]   2> 2017536 INFO  (SUITE-LeaderVoteWaitTimeoutTest-seed#[1D0D818F380CCB95]-worker) [    ] o.a.s.m.r.SolrJmxReporter Closing reporter [org.apache.solr.metrics.reporters.SolrJmxReporter@7ebec9eb: rootName = solr_53531, domain = solr.jetty, service url = null, agent id = null] for registry solr.jetty / com.codahale.metrics.MetricRegistry@25a40bd4
   [junit4]   2> 2017539 INFO  (SUITE-LeaderVoteWaitTimeoutTest-seed#[1D0D818F380CCB95]-worker) [    ] o.a.s.c.ZkController Remove node as live in ZooKeeper:/live_nodes/127.0.0.1:53531_solr
   [junit4]   2> 2017542 INFO  (zkCallback-5303-thread-1) [    ] o.a.s.c.c.ZkStateReader Updated live nodes from ZooKeeper... (4) -> (3)
   [junit4]   2> 2017542 INFO  (zkCallback-5337-thread-1) [    ] o.a.s.c.c.ZkStateReader Updated live nodes from ZooKeeper... (4) -> (3)
   [junit4]   2> 2017542 INFO  (zkCallback-5326-thread-1) [    ] o.a.s.c.c.ZkStateReader Updated live nodes from ZooKeeper... (4) -> (3)
   [junit4]   2> 2017543 INFO  (zkCallback-5332-thread-1) [    ] o.a.s.c.c.ZkStateReader Updated live nodes from ZooKeeper... (4) -> (3)
   [junit4]   2> 2017543 INFO  (zkCallback-5319-thread-1) [    ] o.a.s.c.c.ZkStateReader Updated live nodes from ZooKeeper... (4) -> (3)
   [junit4]   2> 2017543 INFO  (zkCallback-5307-thread-1) [    ] o.a.s.c.c.ZkStateReader Updated live nodes from ZooKeeper... (4) -> (3)
   [junit4]   2> 2017543 INFO  (zkCallback-5343-thread-1) [    ] o.a.s.c.c.ZkStateReader Updated live nodes from ZooKeeper... (4) -> (3)
   [junit4]   2> 2017543 INFO  (zkCallback-5352-thread-1) [    ] o.a.s.c.c.ZkStateReader Updated live nodes from ZooKeeper... (4) -> (3)
   [junit4]   2> 2017545 INFO  (SUITE-LeaderVoteWaitTimeoutTest-seed#[1D0D818F380CCB95]-worker) [    ] o.a.s.m.SolrMetricManager Closing metric reporters for registry=solr.cluster, tag=null
   [junit4]   2> 2017555 INFO  (zkCallback-5305-thread-1) [    ] o.a.s.c.c.ZkStateReader Updated live nodes from ZooKeeper... (4) -> (3)
   [junit4]   2> 2017564 INFO  (SUITE-LeaderVoteWaitTimeoutTest-seed#[1D0D818F380CCB95]-worker) [    ] o.e.j.s.h.ContextHandler Stopped o.e.j.s.ServletContextHandler@1f3acde{/solr,null,UNAVAILABLE}
   [junit4]   2> 2017566 INFO  (SUITE-LeaderVoteWaitTimeoutTest-seed#[1D0D818F380CCB95]-worker) [    ] o.e.j.s.session node0 Stopped scavenging
   [junit4]   2> 2017567 INFO  (SUITE-LeaderVoteWaitTimeoutTest-seed#[1D0D818F380CCB95]-worker) [    ] o.e.j.s.Server jetty-9.4.11.v20180605; built: 2018-06-05T18:24:03.829Z; git: d5fc0523cfa96bfebfbda19606cad384d772f04c; jvm 9+181
   [junit4]   2> 2017568 INFO  (SUITE-LeaderVoteWaitTimeoutTest-seed#[1D0D818F380CCB95]-worker) [    ] o.e.j.s.session DefaultSessionIdManager workerName=node0
   [junit4]   2> 2017568 INFO  (SUITE-LeaderVoteWaitTimeoutTest-seed#[1D0D818F380CCB95]-worker) [    ] o.e.j.s.session No SessionScavenger set, using defaults
   [junit4]   2> 2017568 INFO  (SUITE-LeaderVoteWaitTimeoutTest-seed#[1D0D818F380CCB95]-worker) [    ] o.e.j.s.session node0 Scavenging every 660000ms
   [junit4]   2> 2017569 INFO  (SUITE-LeaderVoteWaitTimeoutTest-seed#[1D0D818F380CCB95]-worker) [    ] o.e.j.s.h.ContextHandler Started o.e.j.s.ServletContextHandler@338b440d{/solr,null,AVAILABLE}
   [junit4]   2> 2017569 INFO  (SUITE-LeaderVoteWaitTimeoutTest-seed#[1D0D818F380CCB95]-worker) [    ] o.e.j.s.AbstractConnector Started ServerConnector@a1cf580{HTTP/1.1,[http/1.1]}{127.0.0.1:53549}
   [junit4]   2> 2017569 INFO  (SUITE-LeaderVoteWaitTimeoutTest-seed#[1D0D818F380CCB95]-worker) [    ] o.e.j.s.Server Started @2017638ms
   [junit4]   2> 2017569 INFO  (SUITE-LeaderVoteWaitTimeoutTest-seed#[1D0D818F380CCB95]-worker) [    ] o.a.s.c.s.e.JettySolrRunner Jetty properties: {hostContext=/solr, hostPort=53548}
   [junit4]   2> 2017570 ERROR (SUITE-LeaderVoteWaitTimeoutTest-seed#[1D0D818F380CCB95]-worker) [    ] o.a.s.u.StartupLoggingUtils Missing Java Option solr.log.dir. Logging may be missing or incomplete.
   [junit4]   2> 2017570 INFO  (SUITE-LeaderVoteWaitTimeoutTest-seed#[1D0D818F380CCB95]-worker) [    ] o.a.s.s.SolrDispatchFilter Using logger factory org.apache.logging.slf4j.Log4jLoggerFactory
   [junit4]   2> 2017570 INFO  (SUITE-LeaderVoteWaitTimeoutTest-seed#[1D0D818F380CCB95]-worker) [    ] o.a.s.s.SolrDispatchFilter  ___      _       Welcome to Apache Solr™ version 8.0.0
   [junit4]   2> 2017570 INFO  (SUITE-LeaderVoteWaitTimeoutTest-seed#[1D0D818F380CCB95]-worker) [    ] o.a.s.s.SolrDispatchFilter / __| ___| |_ _   Starting in cloud mode on port null
   [junit4]   2> 2017570 INFO  (SUITE-LeaderVoteWaitTimeoutTest-seed#[1D0D818F380CCB95]-worker) [    ] o.a.s.s.SolrDispatchFilter \__ \/ _ \ | '_|  Install dir: null
   [junit4]   2> 2017570 INFO  (SUITE-LeaderVoteWaitTimeoutTest-seed#[1D0D818F380CCB95]-worker) [    ] o.a.s.s.SolrDispatchFilter |___/\___/_|_|    Start time: 2018-09-03T00:49:43.862449Z
   [junit4]   2> 2017572 INFO  (zkConnectionManagerCallback-5355-thread-1) [    ] o.a.s.c.c.ConnectionManager zkClient has connected
   [junit4]   2> 2017573 INFO  (SUITE-LeaderVoteWaitTimeoutTest-seed#[1D0D818F380CCB95]-worker) [    ] o.a.s.s.SolrDispatchFilter solr.xml found in ZooKeeper. Loading...
   [junit4]   2> 2017664 INFO  (SUITE-LeaderVoteWaitTimeoutTest-seed#[1D0D818F380CCB95]-worker) [    ] o.a.s.c.ZkContainer Zookeeper client=127.0.0.1:53524/solr
   [junit4]   2> 2017666 INFO  (zkConnectionManagerCallback-5359-thread-1) [    ] o.a.s.c.c.ConnectionManager zkClient has connected
   [junit4]   2> 2017670 INFO  (zkConnectionManagerCallback-5361-thread-1) [    ] o.a.s.c.c.ConnectionManager zkClient has connected
   [junit4]   2> 2017684 INFO  (SUITE-LeaderVoteWaitTimeoutTest-seed#[1D0D818F380CCB95]-worker) [n:127.0.0.1:53548_solr    ] o.a.s.c.c.ZkStateReader Updated live nodes from ZooKeeper... (0) -> (3)
   [junit4]   2> 2017699 INFO  (SUITE-LeaderVoteWaitTimeoutTest-seed#[1D0D818F380CCB95]-worker) [n:127.0.0.1:53548_solr    ] o.a.s.c.TransientSolrCoreCacheDefault Allocating transient cache for 2147483647 transient cores
   [junit4]   2> 2017699 INFO  (SUITE-LeaderVoteWaitTimeoutTest-seed#[1D0D818F380CCB95]-worker) [n:127.0.0.1:53548_solr    ] o.a.s.c.ZkController Register node as live in ZooKeeper:/live_nodes/127.0.0.1:53548_solr
   [junit4]   2> 2017702 INFO  (zkCallback-5337-thread-1) [    ] o.a.s.c.c.ZkStateReader Updated live nodes from ZooKeeper... (3) -> (4)
   [junit4]   2> 2017703 INFO  (zkCallback-5305-thread-1) [    ] o.a.s.c.c.ZkStateReader Updated live nodes from ZooKeeper... (3) -> (4)
   [junit4]   2> 2017703 INFO  (zkCallback-5332-thread-1) [    ] o.a.s.c.c.ZkStateReader Updated live nodes from ZooKeeper... (3) -> (4)
   [junit4]   2> 2017703 INFO  (zkCallback-5326-thread-1) [    ] o.a.s.c.c.ZkStateReader Updated live nodes from ZooKeeper... (3) -> (4)
   [junit4]   2> 2017703 INFO  (zkCallback-5307-thread-1) [    ] o.a.s.c.c.ZkStateReader Updated live nodes from ZooKeeper... (3) -> (4)
   [junit4]   2> 2017703 INFO  (zkCallback-5303-thread-1) [    ] o.a.s.c.c.ZkStateReader Updated live nodes from ZooKeeper... (3) -> (4)
   [junit4]   2> 2017703 INFO  (zkCallback-5352-thread-1) [    ] o.a.s.c.c.ZkStateReader Updated live nodes from ZooKeeper... (3) -> (4)
   [junit4]   2> 2017703 INFO  (zkCallback-5360-thread-1) [    ] o.a.s.c.c.ZkStateReader Updated live nodes from ZooKeeper... (3) -> (4)
   [junit4]   2> 2017754 INFO  (zkConnectionManagerCallback-5368-thread-1) [    ] o.a.s.c.c.ConnectionManager zkClient has connected
   [junit4]   2> 2017764 INFO  (SUITE-LeaderVoteWaitTimeoutTest-seed#[1D0D818F380CCB95]-worker) [n:127.0.0.1:53548_solr    ] o.a.s.c.c.ZkStateReader Updated live nodes from ZooKeeper... (0) -> (4)
   [junit4]   2> 2017767 INFO  (SUITE-LeaderVoteWaitTimeoutTest-seed#[1D0D818F380CCB95]-worker) [n:127.0.0.1:53548_solr    ] o.a.s.c.s.i.ZkClientClusterStateProvider Cluster at 127.0.0.1:53524/solr ready
   [junit4]   2> 2017767 INFO  (SUITE-LeaderVoteWaitTimeoutTest-seed#[1D0D818F380CCB95]-worker) [n:127.0.0.1:53548_solr    ] o.a.s.h.a.MetricsHistoryHandler No .system collection, keeping metrics history in memory.
   [junit4]   2> 2017828 INFO  (SUITE-LeaderVoteWaitTimeoutTest-seed#[1D0D818F380CCB95]-worker) [n:127.0.0.1:53548_solr    ] o.a.s.m.r.SolrJmxReporter JMX monitoring for 'solr_53548.solr.node' (registry 'solr.node') enabled at server: com.sun.jmx.mbeanserver.JmxMBeanServer@36115f2
   [junit4]   2> 2017877 INFO  (SUITE-LeaderVoteWaitTimeoutTest-seed#[1D0D818F380CCB95]-worker) [n:127.0.0.1:53548_solr    ] o.a.s.m.r.SolrJmxReporter JMX monitoring for 'solr_53548.solr.jvm' (registry 'solr.jvm') enabled at server: com.sun.jmx.mbeanserver.JmxMBeanServer@36115f2
   [junit4]   2> 2017878 INFO  (SUITE-LeaderVoteWaitTimeoutTest-seed#[1D0D818F380CCB95]-worker) [n:127.0.0.1:53548_solr    ] o.a.s.m.r.SolrJmxReporter JMX monitoring for 'solr_53548.solr.jetty' (registry 'solr.jetty') enabled at server: com.sun.jmx.mbeanserver.JmxMBeanServer@36115f2
   [junit4]   2> 2017888 INFO  (SUITE-LeaderVoteWaitTimeoutTest-seed#[1D0D818F380CCB95]-worker) [n:127.0.0.1:53548_solr    ] o.a.s.c.CorePropertiesLocator Found 0 core definitions underneath /Users/jenkins/workspace/Lucene-Solr-master-MacOSX/solr/build/solr-core/test/J0/temp/solr.cloud.LeaderVoteWaitTimeoutTest_1D0D818F380CCB95-001/tempDir-001/node3/.
   [junit4]   2> 2017986 INFO  (SUITE-LeaderVoteWaitTimeoutTest-seed#[1D0D818F380CCB95]-worker) [    ] o.a.s.c.LeaderVoteWaitTimeoutTest Adding proxy for URL: http://127.0.0.1:53549/solr. Proxy: http://127.0.0.1:53548/solr
   [junit4]   2> 2017991 INFO  (SUITE-LeaderVoteWaitTimeoutTest-seed#[1D0D818F380CCB95]-worker) [    ] o.e.j.s.AbstractConnector Stopped ServerConnector@4ff55c87{HTTP/1.1,[http/1.1]}{127.0.0.1:0}
   [junit4]   2> 2017999 INFO  (SUITE-LeaderVoteWaitTimeoutTest-seed#[1D0D818F380CCB95]-worker) [    ] o.a.s.c.CoreContainer Shutting down CoreContainer instance=152756921
   [junit4]   2> 2017999 INFO  (SUITE-LeaderVoteWaitTimeoutTest-seed#[1D0D818F380CCB95]-worker) [    ] o.a.s.m.SolrMetricManager Closing metric reporters for registry=solr.node, tag=null
   [junit4]   2> 2017999 INFO  (SUITE-LeaderVoteWaitTimeoutTest-seed#[1D0D818F380CCB95]-worker) [    ] o.a.s.m.r.SolrJmxReporter Closing reporter [org.apache.solr.metrics.reporters.SolrJmxReporter@23c7122e: rootName = solr_53527, domain = solr.node, service url = null, agent id = null] for registry solr.node / com.codahale.metrics.MetricRegistry@66bfd6a6
   [junit4]   2> 2018012 INFO  (SUITE-LeaderVoteWaitTimeoutTest-seed#[1D0D818F380CCB95]-worker) [    ] o.a.s.m.SolrMetricManager Closing metric reporters for registry=solr.jvm, tag=null
   [junit4]   2> 2018013 INFO  (SUITE-LeaderVoteWaitTimeoutTest-seed#[1D0D818F380CCB95]-worker) [    ] o.a.s.m.r.SolrJmxReporter Closing reporter [org.apache.solr.metrics.reporters.SolrJmxReporter@551e704f: rootName = solr_53527, domain = solr.jvm, service url = null, agent id = null] for registry solr.jvm / com.codahale.metrics.MetricRegistry@77bca6c7
   [junit4]   2> 2018020 INFO  (SUITE-LeaderVoteWaitTimeoutTest-seed#[1D0D818F380CCB95]-worker) [    ] o.a.s.m.SolrMetricManager Closing metric reporters for registry=solr.jetty, tag=null
   [junit4]   2> 2018020 INFO  (SUITE-LeaderVoteWaitTimeoutTest-seed#[1D0D818F380CCB95]-worker) [    ] o.a.s.m.r.SolrJmxReporter Closing reporter [org.apache.solr.metrics.reporters.SolrJmxReporter@f6fe615: rootName = solr_53527, domain = solr.jetty, service url = null, agent id = null] for registry solr.jetty / com.codahale.metrics.MetricRegistry@25a40bd4
   [junit4]   2> 2018023 INFO  (SUITE-LeaderVoteWaitTimeoutTest-seed#[1D0D818F380CCB95]-worker) [    ] o.a.s.c.ZkController Remove node as live in ZooKeeper:/live_nodes/127.0.0.1:53527_solr
   [junit4]   2> 2018031 INFO  (SUITE-LeaderVoteWaitTimeoutTest-seed#[1D0D818F380CCB95]-worker) [    ] o.a.s.m.SolrMetricManager Closing metric reporters for registry=solr.cluster, tag=null
   [junit4]   2> 2018034 INFO  (zkCallback-5332-thread-1) [    ] o.a.s.c.c.ZkStateReader Updated live nodes from ZooKeeper... (4) -> (3)
   [junit4]   2> 2018034 INFO  (SUITE-LeaderVoteWaitTimeoutTest-seed#[1D0D818F380CCB95]-worker) [    ] o.a.s.c.Overseer Overseer (id=72269760404389897-127.0.0.1:53527_solr-n_0000000000) closing
   [junit4]   2> 2018034 INFO  (OverseerStateUpdate-72269760404389897-127.0.0.1:53527_solr-n_0000000000) [n:127.0.0.1:53527_solr    ] o.a.s.c.Overseer Overseer Loop exiting : 127.0.0.1:53527_solr
   [junit4]   2> 2018034 WARN  (OverseerAutoScalingTriggerThread-72269760404389897-127.0.0.1:53527_solr-n_0000000000) [    ] o.a.s.c.a.OverseerTriggerThread OverseerTriggerThread woken up but we are closed, exiting.
   [junit4]   2> 2018036 INFO  (zkCallback-5326-thread-1) [    ] o.a.s.c.c.ZkStateReader Updated live nodes from ZooKeeper... (4) -> (3)
   [junit4]   2> 2018036 INFO  (zkCallback-5305-thread-1) [    ] o.a.s.c.c.ZkStateReader Updated live nodes from ZooKeeper... (4) -> (3)
   [junit4]   2> 2018036 INFO  (zkCallback-5367-thread-1) [    ] o.a.s.c.c.ZkStateReader Updated live nodes from ZooKeeper... (4) -> (3)
   [junit4]   2> 2018036 INFO  (zkCallback-5307-thread-1) [    ] o.a.s.c.c.ZkStateReader Updated live nodes from ZooKeeper... (4) -> (3)
   [junit4]   2> 2018036 INFO  (zkCallback-5352-thread-1) [    ] o.a.s.c.c.ZkStateReader Updated live nodes from ZooKeeper... (4) -> (3)
   [junit4]   2> 2018036 INFO  (zkCallback-5360-thread-1) [    ] o.a.s.c.c.ZkStateReader Updated live nodes from ZooKeeper... (4) -> (3)
   [junit4]   2> 2018036 INFO  (zkCallback-5303-thread-1) [    ] o.a.s.c.c.ZkStateReader Updated live nodes from ZooKeeper... (4) -> (3)
   [junit4]   2> 2018037 INFO  (zkCallback-5337-thread-1) [    ] o.a.s.c.c.ZkStateReader Updated live nodes from ZooKeeper... (4) -> (3)
   [junit4]   2> 2018049 INFO  (zkCallback-5303-thread-1) [    ] o.a.s.c.OverseerElectionContext I am going to be the leader 127.0.0.1:53529_solr
   [junit4]   2> 2018049 INFO  (SUITE-LeaderVoteWaitTimeoutTest-seed#[1D0D818F380CCB95]-worker) [    ] o.e.j.s.h.ContextHandler Stopped o.e.j.s.ServletContextHandler@7851c196{/solr,null,UNAVAILABLE}
   [junit4]   2> 2018049 INFO  (SUITE-LeaderVoteWaitTimeoutTest-seed#[1D0D818F380CCB95]-worker) [    ] o.e.j.s.session node0 Stopped scavenging
   [junit4]   2> 2018052 INFO  (SUITE-LeaderVoteWaitTimeoutTest-seed#[1D0D818F380CCB95]-worker) [    ] o.e.j.s.Server jetty-9.4.11.v20180605; built: 2018-06-05T18:24:03.829Z; git: d5fc0523cfa96bfebfbda19606cad384d772f04c; jvm 9+181
   [junit4]   2> 2018056 INFO  (zkCallback-5303-thread-1) [n:127.0.0.1:53529_solr    ] o.a.s.c.Overseer Overseer (id=72269760404389896-127.0.0.1:53529_solr-n_0000000001) starting
   [junit4]   2> 2018057 INFO  (SUITE-LeaderVoteWaitTimeoutTest-seed#[1D0D818F380CCB95]-worker) [    ] o.e.j.s.session DefaultSessionIdManager workerName=node0
   [junit4]   2> 2018057 INFO  (SUITE-LeaderVoteWaitTimeoutTest-seed#[1D0D818F380CCB95]-worker) [    ] o.e.j.s.session No SessionScavenger set, using defaults
   [junit4]   2> 2018058 INFO  (SUITE-LeaderVoteWaitTimeoutTest-seed#[1D0D818F380CCB95]-worker) [    ] o.e.j.s.session node0 Scavenging every 660000ms
   [junit4]   2> 2018059 INFO  (SUITE-LeaderVoteWaitTimeoutTest-seed#[1D0D818F380CCB95]-worker) [    ] o.e.j.s.h.ContextHandler Started o.e.j.s.ServletContextHandler@826bfd4{/solr,null,AVAILABLE}
   [junit4]   2> 2018059 INFO  (SUITE-LeaderVoteWaitTimeoutTest-seed#[1D0D818F380CCB95]-worker) [    ] o.e.j.s.AbstractConnector Started ServerConnector@79a2fa0c{HTTP/1.1,[http/1.1]}{127.0.0.1:53555}
   [junit4]   2> 2018059 INFO  (SUITE-LeaderVoteWaitTimeoutTest-seed#[1D0D818F380CCB95]-worker) [    ] o.e.j.s.Server Started @2018128ms
   [junit4]   2> 2018060 INFO  (SUITE-LeaderVoteWaitTimeoutTest-seed#[1D0D818F380CCB95]-worker) [    ] o.a.s.c.s.e.JettySolrRunner Jetty properties: {hostContext=/solr, hostPort=53554}
   [junit4]   2> 2018060 ERROR (SUITE-LeaderVoteWaitTimeoutTest-seed#[1D0D818F380CCB95]-worker) [    ] o.a.s.u.StartupLoggingUtils Missing Java Option solr.log.dir. Logging may be missing or incomplete.
   [junit4]   2> 2018060 INFO  (SUITE-LeaderVoteWaitTimeoutTest-seed#[1D0D818F380CCB95]-worker) [    ] o.a.s.s.SolrDispatchFilter Using logger factory org.apache.logging.slf4j.Log4jLoggerFactory
   [junit4]   2> 2018060 INFO  (SUITE-LeaderVoteWaitTimeoutTest-seed#[1D0D818F380CCB95]-worker) [    ] o.a.s.s.SolrDispatchFilter  ___      _       Welcome to Apache Solr™ version 8.0.0
   [junit4]   2> 2018060 INFO  (SUITE-LeaderVoteWaitTimeoutTest-seed#[1D0D818F380CCB95]-worker) [    ] o.a.s.s.SolrDispatchFilter / __| ___| |_ _   Starting in cloud mode on port null
   [junit4]   2> 2018060 INFO  (SUITE-LeaderVoteWaitTimeoutTest-seed#[1D0D818F380CCB95]-worker) [    ] o.a.s.s.SolrDispatchFilter \__ \/ _ \ | '_|  Install dir: null
   [junit4]   2> 2018060 INFO  (SUITE-LeaderVoteWaitTimeoutTest-seed#[1D0D818F380CCB95]-worker) [    ] o.a.s.s.SolrDispatchFilter |___/\___/_|_|    Start time: 2018-09-03T00:49:44.352964Z
   [junit4]   2> 2018067 INFO  (zkConnectionManagerCallback-5371-thread-1) [    ] o.a.s.c.c.ConnectionManager zkClient has connected
   [junit4]   2> 2018067 INFO  (SUITE-LeaderVoteWaitTimeoutTest-seed#[1D0D818F380CCB95]-worker) [    ] o.a.s.s.SolrDispatchFilter solr.xml found in ZooKeeper. Loading...
   [junit4]   2> 2018071 INFO  (OverseerStateUpdate-72269760404389896-127.0.0.1:53529_solr-n_0000000001) [n:127.0.0.1:53529_solr    ] o.a.s.c.Overseer Starting to work on the main queue : 127.0.0.1:53529_solr
   [junit4]   2> 2018216 INFO  (SUITE-LeaderVoteWaitTimeoutTest-seed#[1D0D818F380CCB95]-worker) [    ] o.a.s.c.ZkContainer Zookeeper client=127.0.0.1:53524/solr
   [junit4]   2> 2018218 INFO  (zkConnectionManagerCallback-5375-thread-1) [    ] o.a.s.c.c.ConnectionManager zkClient has connected
   [junit4]   2> 2018223 INFO  (zkConnectionManagerCallback-5377-thread-1) [    ] o.a.s.c.c.ConnectionManager zkClient has connected
   [junit4]   2> 2018257 INFO  (SUITE-LeaderVoteWaitTimeoutTest-seed#[1D0D818F380CCB95]-worker) [    ] o.a.s.c.c.ZkStateReader Updated live nodes from ZooKeeper... (0) -> (3)
   [junit4]   2> 2018275 INFO  (SUITE-LeaderVoteWaitTimeoutTest-seed#[1D0D818F380CCB95]-worker) [    ] o.a.s.c.TransientSolrCoreCacheDefault Allocating transient cache for 2147483647 transient cores
   [junit4]   2> 2018275 INFO  (SUITE-LeaderVoteWaitTimeoutTest-seed#[1D0D818F380CCB95]-worker) [    ] o.a.s.c.ZkController Register node as live in ZooKeeper:/live_nodes/127.0.0.1:53554_solr
   [junit4]   2> 2018283 INFO  (zkCallback-5352-thread-1) [    ] o.a.s.c.c.ZkStateReader Updated live nodes from ZooKeeper... (3) -> (4)
   [junit4]   2> 2018283 INFO  (zkCallback-5337-thread-1) [    ] o.a.s.c.c.ZkStateReader Updated live nodes from ZooKeeper... (3) -> (4)
   [junit4]   2> 2018284 INFO  (zkCallback-5307-thread-1) [    ] o.a.s.c.c.ZkStateReader Updated live nodes from ZooKeeper... (3) -> (4)
   [junit4]   2> 2018284 INFO  (zkCallback-5360-thread-1) [    ] o.a.s.c.c.ZkStateReader Updated live nodes from ZooKeeper... (3) -> (4)
   [junit4]   2> 2018284 INFO  (zkCallback-5376-thread-1) [    ] o.a.s.c.c.ZkStateReader Updated live nodes from ZooKeeper... (3) -> (4)
   [junit4]   2> 2018284 INFO  (zkCallback-5326-thread-1) [    ] o.a.s.c.c.ZkStateReader Updated live nodes from ZooKeeper... (3) -> (4)
   [junit4]   2> 2018284 INFO  (zkCallback-5367-thread-1) [    ] o.a.s.c.c.ZkStateReader Updated live nodes from ZooKeeper... (3) -> (4)
   [junit4]   2> 2018284 INFO  (zkCallback-5303-thread-1) [    ] o.a.s.c.c.ZkStateReader Updated live nodes from ZooKeeper... (3) -> (4)
   [junit4]   2> 2018312 INFO  (zkConnectionManagerCallback-5384-thread-1) [    ] o.a.s.c.c.ConnectionManager zkClient has connected
   [junit4]   2> 2018315 INFO  (SUITE-LeaderVoteWaitTimeoutTest-seed#[1D0D818F380CCB95]-worker) [    ] o.a.s.c.c.ZkStateReader Updated live nodes from ZooKeeper... (0) -> (4)
   [junit4]   2> 2018316 INFO  (SUITE-LeaderVoteWaitTimeoutTest-seed#[1D0D818F380CCB95]-worker) [    ] o.a.s.c.s.i.ZkClientClusterStateProvider Cluster at 127.0.0.1:53524/solr ready
   [junit4]   2> 2018317 INFO  (SUITE-LeaderVoteWaitTimeoutTest-seed#[1D0D818F380CCB95]-worker) [    ] o.a.s.h.a.MetricsHistoryHandler No .system collection, keeping metrics history in memory.
   [junit4]   2> 2018344 INFO  (SUITE-LeaderVoteWaitTimeoutTest-seed#[1D0D818F380CCB95]-worker) [    ] o.a.s.m.r.SolrJmxReporter JMX monitoring for 'solr_53554.solr.node' (registry 'solr.node') enabled at server: com.sun.jmx.mbeanserver.JmxMBeanServer@36115f2
   [junit4]   2> 2018398 INFO  (SUITE-LeaderVoteWaitTimeoutTest-seed#[1D0D818F380CCB95]-worker) [    ] o.a.s.m.r.SolrJmxReporter JMX monitoring for 'solr_53554.solr.jvm' (registry 'solr.jvm') enabled at server: com.sun.jmx.mbeanserver.JmxMBeanServer@36115f2
   [junit4]   2> 2018398 INFO  (SUITE-LeaderVoteWaitTimeoutTest-seed#[1D0D818F380CCB95]-worker) [    ] o.a.s.m.r.SolrJmxReporter JMX monitoring for 'solr_53554.solr.jetty' (registry 'solr.jetty') enabled at server: com.sun.jmx.mbeanserver.JmxMBeanServer@36115f2
   [junit4]   2> 2018419 INFO  (SUITE-LeaderVoteWaitTimeoutTest-seed#[1D0D818F380CCB95]-worker) [    ] o.a.s.c.CorePropertiesLocator Found 0 core definitions underneath /Users/jenkins/workspace/Lucene-Solr-master-MacOSX/solr/build/solr-core/test/J0/temp/solr.cloud.LeaderVoteWaitTimeoutTest_1D0D818F380CCB95-001/tempDir-001/node1/.
   [junit4]   2> 2018503 INFO  (SUITE-LeaderVoteWaitTimeoutTest-seed#[1D0D818F380CCB95]-worker) [    ] o.a.s.c.LeaderVoteWaitTimeoutTest Adding proxy for URL: http://127.0.0.1:53555/solr. Proxy: http://127.0.0.1:53554/solr
   [junit4]   2> 2018504 INFO  (SUITE-LeaderVoteWaitTimeoutTest-seed#[1D0D818F380CCB95]-worker) [    ] o.e.j.s.AbstractConnector Stopped ServerConnector@7e69e6bd{HTTP/1.1,[http/1.1]}{127.0.0.1:0}
   [junit4]   2> 2018505 INFO  (SUITE-LeaderVoteWaitTimeoutTest-seed#[1D0D818F380CCB95]-worker) [    ] o.a.s.c.CoreContainer Shutting down CoreContainer instance=1882194529
   [junit4]   2> 2018506 INFO  (SUITE-LeaderVoteWaitTimeoutTest-seed#[1D0D818F380CCB95]-worker) [    ] o.a.s.m.SolrMetricManager Closing metric reporters for registry=solr.node, tag=null
   [junit4]   2> 2018506 INFO  (SUITE-LeaderVoteWaitTimeoutTest-seed#[1D0D818F380CCB95]-worker) [    ] o.a.s.m.r.SolrJmxReporter Closing reporter [org.apache.solr.metrics.reporters.SolrJmxReporter@46731c85: rootName = solr_53529, domain = solr.node, service url = null, agent id = null] for registry solr.node / com.codahale.metrics.MetricRegistry@5dbce01c
   [junit4]   2> 2018517 INFO  (SUITE-LeaderVoteWaitTimeoutTest-seed#[1D0D818F380CCB95]-worker) [    ] o.a.s.m.SolrMetricManager Closing metric reporters for registry=solr.jvm, tag=null
   [junit4]   2> 2018517 INFO  (SUITE-LeaderVoteWaitTimeoutTest-seed#[1D0D818F380CCB95]-worker) [    ] o.a.s.m.r.SolrJmxReporter Closing reporter [org.apache.solr.metrics.reporters.SolrJmxReporter@a8a8361: rootName = solr_53529, domain = solr.jvm, service url = null, agent id = null] for registry solr.jvm / com.codahale.metrics.MetricRegistry@77bca6c7
   [junit4]   2> 2018525 INFO  (SUITE-LeaderVoteWaitTimeoutTest-seed#[1D0D818F380CCB95]-worker) [    ] o.a.s.m.SolrMetricManager Closing metric reporters for registry=solr.jetty, tag=null
   [junit4]   2> 2018525 INFO  (SUITE-LeaderVoteWaitTimeoutTest-seed#[1D0D818F380CCB95]-worker) [    ] o.a.s.m.r.SolrJmxReporter Closing reporter [org.apache.solr.metrics.reporters.SolrJmxReporter@415dfbcd: rootName = solr_53529, domain = solr.jetty, service url = null, agent id = null] for registry solr.jetty / com.codahale.metrics.MetricRegistry@25a40bd4
   [junit4]   2> 2018530 INFO  (SUITE-LeaderVoteWaitTimeoutTest-seed#[1D0D818F380CCB95]-worker) [    ] o.a.s.c.ZkController Remove node as live in ZooKeeper:/live_nodes/127.0.0.1:53529_solr
   [junit4]   2> 2018534 INFO  (zkCallback-5367-thread-1) [    ] o.a.s.c.c.ZkStateReader Updated live nodes from ZooKeeper... (4) -> (3)
   [junit4]   2> 2018534 INFO  (zkCallback-5307-thread-1) [    ] o.a.s.c.c.ZkStateReader Updated live nodes from ZooKeeper... (4) -> (3)
   [junit4]   2> 2018534 INFO  (zkCallback-5360-thread-1) [    ] o.a.s.c.c.ZkStateReader Updated live nodes from ZooKeeper... (4) -> (3)
   [junit4]   2> 2018535 INFO  (zkCallback-5383-thread-1) [    ] o.a.s.c.c.ZkStateReader Updated live nodes from ZooKeeper... (4) -> (3)
   [junit4]   2> 2018535 INFO  (zkCallback-5303-thread-1) [    ] o.a.s.c.c.ZkStateReader Updated live nodes from ZooKeeper... (4) -> (3)
   [junit4]   2> 2018535 INFO  (zkCallback-5337-thread-1) [    ] o.a.s.c.c.ZkStateReader Updated live nodes from ZooKeeper... (4) -> (3)
   [junit4]   2> 2018535 INFO  (zkCallback-5326-thread-1) [    ] o.a.s.c.c.ZkStateReader Updated live nodes from ZooKeeper... (4) -> (3)
   [junit4]   2> 2018535 INFO  (zkCallback-5352-thread-1) [    ] o.a.s.c.c.ZkStateReader Updated live nodes from ZooKeeper... (4) -> (3)
   [junit4]   2> 2018536 INFO  (zkCallback-5376-thread-1) [    ] o.a.s.c.c.ZkStateReader Updated live nodes from ZooKeeper... (4) -> (3)
   [junit4]   2> 2018538 INFO  (SUITE-LeaderVoteWaitTimeoutTest-seed#[1D0D818F380CCB95]-worker) [    ] o.a.s.m.SolrMetricManager Closing metric reporters for registry=solr.cluster, tag=null
   [junit4]   2> 2018540 INFO  (SUITE-LeaderVoteWaitTimeoutTest-seed#[1D0D818F380CCB95]-worker) [    ] o.a.s.c.TransientSolrCoreCacheDefault Allocating transient cache for 2147483647 transient cores
   [junit4]   2> 2018542 INFO  (SUITE-LeaderVoteWaitTimeoutTest-seed#[1D0D818F380CCB95]-worker) [    ] o.a.s.c.Overseer Overseer (id=72269760404389896-127.0.0.1:53529_solr-n_0000000001) closing
   [junit4]   2> 2018543 INFO  (OverseerStateUpdate-72269760404389896-127.0.0.1:53529_solr-n_0000000001) [n:127.0.0.1:53529_solr    ] o.a.s.c.Overseer Overseer Loop exiting : 127.0.0.1:53529_solr
   [junit4]   2> 2018544 WARN  (OverseerAutoScalingTriggerThread-72269760404389896-127.0.0.1:53529_solr-n_0000000001) [    ] o.a.s.c.a.OverseerTriggerThread OverseerTriggerThread woken up but we are closed, exiting.
   [junit4]   2> 2018571 INFO  (zkCallback-5307-thread-1) [    ] o.a.s.c.OverseerElectionContext I am going to be the leader 127.0.0.1:53526_solr
   [junit4]   2> 2018572 INFO  (SUITE-LeaderVoteWaitTimeoutTest-seed#[1D0D818F380CCB95]-worker) [    ] o.e.j.s.h.ContextHandler Stopped o.e.j.s.ServletContextHandler@e105a60{/solr,null,UNAVAILABLE}
   [junit4]   2> 2018572 INFO  (SUITE-LeaderVoteWaitTimeoutTest-seed#[1D0D818F380CCB95]-worker) [    ] o.e.j.s.session node0 Stopped scavenging
   [junit4]   2> 2018573 INFO  (zkCallback-5307-thread-1) [n:127.0.0.1:53526_solr    ] o.a.s.c.Overseer Overseer (id=72269760404389898-127.0.0.1:53526_solr-n_0000000002) starting
   [junit4]   2> 2018576 INFO  (SUITE-LeaderVoteWaitTimeoutTest-seed#[1D0D818F380CCB95]-worker) [    ] o.e.j.s.Server jetty-9.4.11.v20180605; built: 2018-06-05T18:24:03.829Z; git: d5fc0523cfa96bfebfbda19606cad384d772f04c; jvm 9+181
   [junit4]   2> 2018577 INFO  (SUITE-LeaderVoteWaitTimeoutTest-seed#[1D0D818F380CCB95]-worker) [    ] o.e.j.s.session DefaultSessionIdManager workerName=node0
   [junit4]   2> 2018577 INFO  (SUITE-LeaderVoteWaitTimeoutTest-seed#[1D0D818F380CCB95]-worker) [    ] o.e.j.s.session No SessionScavenger set, using defaults
   [junit4]   2> 2018577 INFO  (SUITE-LeaderVoteWaitTimeoutTest-seed#[1D0D818F380CCB95]-worker) [    ] o.e.j.s.session node0 Scavenging every 600000ms
   [junit4]   2> 2018578 INFO  (SUITE-LeaderVoteWaitTimeoutTest-seed#[1D0D818F380CCB95]-worker) [    ] o.e.j.s.h.ContextHandler Started o.e.j.s.ServletContextHandler@66193c26{/solr,null,AVAILABLE}
   [junit4]   2> 2018578 INFO  (SUITE-LeaderVoteWaitTimeoutTest-seed#[1D0D818F380CCB95]-worker) [    ] o.e.j.s.AbstractConnector Started ServerConnector@1f5df682{HTTP/1.1,[http/1.1]}{127.0.0.1:53561}
   [junit4]   2> 2018578 INFO  (SUITE-LeaderVoteWaitTimeoutTest-seed#[1D0D818F380CCB95]-worker) [    ] o.e.j.s.Server Started @2018647ms
   [junit4]   2> 2018578 INFO  (SUITE-LeaderVoteWaitTimeoutTest-seed#[1D0D818F380CCB95]-worker) [    ] o.a.s.c.s.e.JettySolrRunner Jetty properties: {hostContext=/solr, hostPort=53560}
   [junit4]   2> 2018578 ERROR (SUITE-LeaderVoteWaitTimeoutTest-seed#[1D0D818F380CCB95]-worker) [    ] o.a.s.u.StartupLoggingUtils Missing Java Option solr.log.dir. Logging may be missing or incomplete.
   [junit4]   2> 2018578 INFO  (SUITE-LeaderVoteWaitTimeoutTest-seed#[1D0D818F380CCB95]-worker) [    ] o.a.s.s.SolrDispatchFilter Using logger factory org.apache.logging.slf4j.Log4jLoggerFactory
   [junit4]   2> 2018579 INFO  (SUITE-LeaderVoteWaitTimeoutTest-seed#[1D0D818F380CCB95]-worker) [    ] o.a.s.s.SolrDispatchFilter  ___      _       Welcome to Apache Solr™ version 8.0.0
   [junit4]   2> 2018579 INFO  (SUITE-LeaderVoteWaitTimeoutTest-seed#[1D0D818F380CCB95]-worker) [    ] o.a.s.s.SolrDispatchFilter / __| ___| |_ _   Starting in cloud mode on port null
   [junit4]   2> 2018579 INFO  (SUITE-LeaderVoteWaitTimeoutTest-seed#[1D0D818F380CCB95]-worker) [    ] o.a.s.s.SolrDispatchFilter \__ \/ _ \ | '_|  Install dir: null
   [junit4]   2> 2018580 INFO  (SUITE-LeaderVoteWaitTimeoutTest-seed#[1D0D818F380CCB95]-worker) [    ] o.a.s.s.SolrDispatchFilter |___/\___/_|_|    Start time: 2018-09-03T00:49:44.871988Z
   [junit4]   2> 2018581 INFO  (zkConnectionManagerCallback-5387-thread-1) [    ] o.a.s.c.c.ConnectionManager zkClient has connected
   [junit4]   2> 2018585 INFO  (OverseerStateUpdate-72269760404389898-127.0.0.1:53526_solr-n_0000000002) [n:127.0.0.1:53526_solr    ] o.a.s.c.Overseer Starting to work on the main queue : 127.0.0.1:53526_solr
   [junit4]   2> 2018595 INFO  (SUITE-LeaderVoteWaitTimeoutTest-seed#[1D0D818F380CCB95]-worker) [    ] o.a.s.s.SolrDispatchFilter solr.xml found in ZooKeeper. Loading...
   [junit4]   2> 2018840 INFO  (SUITE-LeaderVoteWaitTimeoutTest-seed#[1D0D818F380CCB95]-worker) [    ] o.a.s.c.ZkContainer Zookeeper client=127.0.0.1:53524/solr
   [junit4]   2> 2018842 INFO  (zkConnectionManagerCallback-5391-thread-1) [    ] o.a.s.c.c.ConnectionManager zkClient has connected
   [junit4]   2> 2018850 INFO  (zkConnectionManagerCallback-5393-thread-1) [    ] o.a.s.c.c.ConnectionManager zkClient has connected
   [junit4]   2> 2018864 INFO  (SUITE-LeaderVoteWaitTimeoutTest-seed#[1D0D818F380CCB95]-worker) [    ] o.a.s.c.c.ZkStateReader Updated live nodes from ZooKeeper... (0) -> (3)
   [junit4]   2> 2018872 INFO  (SUITE-LeaderVoteWaitTimeoutTest-seed#[1D0D818F380CCB95]-worker) [    ] o.a.s.c.TransientSolrCoreCacheDefault Allocating transient cache for 2147483647 transient cores
   [junit4]   2> 2018872 INFO  (SUITE-LeaderVoteWaitTimeoutTest-seed#[1D0D818F380CCB95]-worker) [    ] o.a.s.c.ZkController Register node as live in ZooKeeper:/live_nodes/127.0.0.1:53560_solr
   [junit4]   2> 2018883 INFO  (zkCallback-5383-thread-1) [    ] o.a.s.c.c.ZkStateReader Updated live nodes from ZooKeeper... (3) -> (4)
   [junit4]   2> 2018883 INFO  (zkCallback-5337-thread-1) [    ] o.a.s.c.c.ZkStateReader Updated live nodes from ZooKeeper... (3) -> (4)
   [junit4]   2> 2018883 INFO  (zkCallback-5360-thread-1) [    ] o.a.s.c.c.ZkStateReader Updated live nodes from ZooKeeper... (3) -> (4)
   [junit4]   2> 2018883 INFO  (zkCallback-5376-thread-1) [    ] o.a.s.c.c.ZkStateReader Updated live nodes from ZooKeeper... (3) -> (4)
   [junit4]   2> 2018883 INFO  (zkCallback-5352-thread-1) [    ] o.a.s.c.c.ZkStateReader Updated live nodes from ZooKeeper... (3) -> (4)
   [junit4]   2> 2018883 INFO  (zkCallback-5307-thread-1) [    ] o.a.s.c.c.ZkStateReader Updated live nodes from ZooKeeper... (3) -> (4)
   [junit4]   2> 2018884 INFO  (zkCallback-5367-thread-1) [    ] o.a.s.c.c.ZkStateReader Updated live nodes from ZooKeeper... (3) -> (4)
   [junit4]   2> 2018884 INFO  (zkCallback-5392-thread-1) [    ] o.a.s.c.c.ZkStateReader Updated live nodes from ZooKeeper... (3) -> (4)
   [junit4]   2> 2018914 INFO  (zkConnectionManagerCallback-5400-thread-1) [    ] o.a.s.c.c.ConnectionManager zkClient has connected
   [junit4]   2> 2018917 INFO  (SUITE-LeaderVoteWaitTimeoutTest-seed#[1D0D818F380CCB95]-worker) [    ] o.a.s.c.c.ZkStateReader Updated live nodes from ZooKeeper... (0) -> (4)
   [junit4]   2> 2018927 INFO  (SUITE-LeaderVoteWaitTimeoutTest-seed#[1D0D818F380CCB95]-worker) [    ] o.a.s.c.s.i.ZkClientClusterStateProvider Cluster at 127.0.0.1:53524/solr ready
   [junit4]   2> 2018928 INFO  (SUITE-LeaderVoteWaitTimeoutTest-seed#[1D0D818F380CCB95]-worker) [    ] o.a.s.h.a.MetricsHistoryHandler No .system collection, keeping metrics history in memory.
   [junit4]   2> 2018960 INFO  (SUITE-LeaderVoteWaitTimeoutTest-seed#[1D0D818F380CCB95]-worker) [    ] o.a.s.m.r.SolrJmxReporter JMX monitoring for 'solr_53560.solr.node' (registry 'solr.node') enabled at server: com.sun.jmx.mbeanserver.JmxMBeanServer@36115f2
   [junit4]   2> 2018980 INFO  (SUITE-LeaderVoteWaitTimeoutTest-seed#[1D0D818F380CCB95]-worker) [    ] o.a.s.m.r.SolrJmxReporter JMX monitoring for 'solr_53560.solr.jvm' (registry 'solr.jvm') enabled at server: com.sun.jmx.mbeanserver.JmxMBeanServer@36115f2
   [junit4]   2> 2018980 INFO  (SUITE-LeaderVoteWaitTimeoutTest-seed#[1D0D818F380CCB95]-worker) [    ] o.a.s.m.r.SolrJmxReporter JMX monitoring for 'solr_53560.solr.jetty' (registry 'solr.jetty') enabled at server: com.sun.jmx.mbeanserver.JmxMBeanServer@36115f2
   [junit4]   2> 2018982 INFO  (SUITE-LeaderVoteWaitTimeoutTest-seed#[1D0D818F380CCB95]-worker) [    ] o.a.s.c.CorePropertiesLocator Found 0 core definitions underneath /Users/jenkins/workspace/Lucene-Solr-master-MacOSX/solr/build/solr-core/test/J0/temp/solr.cloud.LeaderVoteWaitTimeoutTest_1D0D818F380CCB95-001/tempDir-001/node4/.
   [junit4]   2> 2019052 INFO  (SUITE-LeaderVoteWaitTimeoutTest-seed#[1D0D818F380CCB95]-worker) [    ] o.a.s.c.LeaderVoteWaitTimeoutTest Adding proxy for URL: http://127.0.0.1:53561/solr. Proxy: http://127.0.0.1:53560/solr
   [junit4]   2> 2019053 INFO  (SUITE-LeaderVoteWaitTimeoutTest-seed#[1D0D818F380CCB95]-worker) [    ] o.e.j.s.AbstractConnector Stopped ServerConnector@28266acc{HTTP/1.1,[http/1.1]}{127.0.0.1:0}
   [junit4]   2> 2019059 INFO  (SUITE-LeaderVoteWaitTimeoutTest-seed#[1D0D818F380CCB95]-worker) [    ] o.a.s.c.CoreContainer Shutting down CoreContainer instance=433060152
   [junit4]   2> 2019060 INFO  (SUITE-LeaderVoteWaitTimeoutTest-seed#[1D0D818F380CCB95]-worker) [    ] o.a.s.m.SolrMetricManager Closing metric reporters for registry=solr.node, tag=null
   [junit4]   2> 2019060 INFO  (SUITE-LeaderVoteWaitTimeoutTest-seed#[1D0D818F380CCB95]-worker) [    ] o.a.s.m.r.SolrJmxReporter Closing reporter [org.apache.solr.metrics.reporters.SolrJmxReporter@2f67e38c: rootName = solr_53526, domain = solr.node, service url = null, agent id = null] for registry solr.node / com.codahale.metrics.MetricRegistry@40922429
   [junit4]   2> 2019083 INFO  (SUITE-LeaderVoteWaitTimeoutTest-seed#[1D0D818F380CCB95]-worker) [    ] o.a.s.m.SolrMetricManager Closing metric reporters for registry=solr.jvm, tag=null
   [junit4]   2> 2019083 INFO  (SUITE-LeaderVoteWaitTimeoutTest-seed#[1D0D818F380CCB95]-worker) [    ] o.a.s.m.r.SolrJmxReporter Closing reporter [org.apache.solr.metrics.reporters.SolrJmxReporter@7af9c22c: rootName = solr_53526, domain = solr.jvm, service url = null, agent id = null] for registry solr.jvm / com.codahale.metrics.MetricRegistry@77bca6c7
   [junit4]   2> 2019090 INFO  (SUITE-LeaderVoteWaitTimeoutTest-seed#[1D0D818F380CCB95]-worker) [    ] o.a.s.m.SolrMetricManager Closing metric reporters for registry=solr.jetty, tag=null
   [junit4]   2> 2019090 INFO  (SUITE-LeaderVoteWaitTimeoutTest-seed#[1D0D818F380CCB95]-worker) [    ] o.a.s.m.r.SolrJmxReporter Closing reporter [org.apache.solr.metrics.reporters.SolrJmxReporter@1972a617: rootName = solr_53526, domain = solr.jetty, service url = null, agent id = null] for registry solr.jetty / com.codahale.metrics.MetricRegistry@25a40bd4
   [junit4]   2> 2019094 INFO  (SUITE-LeaderVoteWaitTimeoutTest-seed#[1D0D818F380CCB95]-worker) [    ] o.a.s.c.ZkController Remove node as live in ZooKeeper:/live_nodes/127.0.0.1:53526_solr
   [junit4]   2> 2019098 INFO  (zkCallback-5376-thread-1) [    ] o.a.s.c.c.ZkStateReader Updated live nodes from ZooKeeper... (4) -> (3)
   [junit4]   2> 2019098 INFO  (zkCallback-5367-thread-1) [    ] o.a.s.c.c.ZkStateReader Updated live nodes from ZooKeeper... (4) -> (3)
   [junit4]   2> 2019098 INFO  (zkCallback-5307-thread-1) [    ] o.a.s.c.c.ZkStateReader Updated live nodes from ZooKeeper... (4) -> (3)
   [junit4]   2> 2019098 INFO  (zkCallback-5392-thread-1) [    ] o.a.s.c.c.ZkStateReader Updated live nodes from ZooKeeper... (4) -> (3)
   [junit4]   2> 2019098 INFO  (zkCallback-5337-thread-1) [    ] o.a.s.c.c.ZkStateReader Updated live nodes from ZooKeeper... (4) -> (3)
   [junit4]   2> 2019098 INFO  (zkCallback-5360-thread-1) [    ] o.a.s.c.c.ZkStateReader Updated live nodes from ZooKeeper... (4) -> (3)
   [junit4]   2> 2019098 INFO  (zkCallback-5352-thread-1) [    ] o.a.s.c.c.ZkStateReader Updated live nodes from ZooKeeper... (4) -> (3)
   [junit4]   2> 2019098 INFO  (zkCallback-5383-thread-1) [    ] o.a.s.c.c.ZkStateReader Updated live nodes from ZooKeeper... (4) -> (3)
   [junit4]   2> 2019098 INFO  (zkCallback-5399-thread-1) [    ] o.a.s.c.c.ZkStateReader Updated live nodes from ZooKeeper... (4) -> (3)
   [junit4]   2> 2019099 INFO  (SUITE-LeaderVoteWaitTimeoutTest-seed#[1D0D818F380CCB95]-worker) [    ] o.a.s.m.SolrMetricManager Closing metric reporters for registry=solr.cluster, tag=null
   [junit4]   2> 2019101 INFO  (SUITE-LeaderVoteWaitTimeoutTest-seed#[1D0D818F380CCB95]-worker) [    ] o.a.s.c.TransientSolrCoreCacheDefault Allocating transient cache for 2147483647 transient cores
   [junit4]   2> 2019103 INFO  (SUITE-LeaderVoteWaitTimeoutTest-seed#[1D0D818F380CCB95]-worker) [    ] o.a.s.c.Overseer Overseer (id=72269760404389898-127.0.0.1:53526_solr-n_0000000002) closing
   [junit4]   2> 2019103 INFO  (OverseerStateUpdate-72269760404389898-127.0.0.1:53526_solr-n_0000000002) [n:127.0.0.1:53526_solr    ] o.a.s.c.Overseer Overseer Loop exiting : 127.0.0.1:53526_solr
   [junit4]   2> 2019105 WARN  (OverseerAutoScalingTriggerThread-72269760404389898-127.0.0.1:53526_solr-n_0000000002) [    ] o.a.s.c.a.OverseerTriggerThread OverseerTriggerThread woken up but we are closed, exiting.
   [junit4]   2> 2019120 INFO  (zkCallback-5360-thread-1) [    ] o.a.s.c.OverseerElectionContext I am going to be the leader 127.0.0.1:53548_solr
   [junit4]   2> 2019121 INFO  (SUITE-LeaderVoteWaitTimeoutTest-seed#[1D0D818F380CCB95]-worker) [    ] o.e.j.s.h.ContextHandler Stopped o.e.j.s.ServletContextHandler@3107d462{/solr,null,UNAVAILABLE}
   [junit4]   2> 2019121 INFO  (SUITE-LeaderVoteWaitTimeoutTest-seed#[1D0D818F380CCB95]-worker) [    ] o.e.j.s.session node0 Stopped scavenging
   [junit4]   2> 2019122 INFO  (zkCallback-5360-thread-1) [n:127.0.0.1:53548_solr    ] o.a.s.c.Overseer Overseer (id=72269760404389909-127.0.0.1:53548_solr-n_0000000004) starting
   [junit4]   2> 2019133 INFO  (OverseerStateUpdate-72269760404389909-127.0.0.1:53548_solr-n_0000000004) [n:127.0.0.1:53548_solr    ] o.a.s.c.Overseer Starting to work on the main queue : 127.0.0.1:53548_solr
   [junit4]   2> 2019164 INFO  (SUITE-LeaderVoteWaitTimeoutTest-seed#[1D0D818F380CCB95]-worker) [    ] o.e.j.s.Server jetty-9.4.11.v20180605; built: 2018-06-05T18:24:03.829Z; git: d5fc0523cfa96bfebfbda19606cad384d772f04c; jvm 9+181
   [junit4]   2> 2019165 INFO  (SUITE-LeaderVoteWaitTimeoutTest-seed#[1D0D818F380CCB95]-worker) [    ] o.e.j.s.session DefaultSessionIdManager workerName=node0
   [junit4]   2> 2019165 INFO  (SUITE-LeaderVoteWaitTimeoutTest-seed#[1D0D818F380CCB95]-worker) [    ] o.e.j.s.session No SessionScavenger set, using defaults
   [junit4]   2> 2019165 INFO  (SUITE-LeaderVoteWaitTimeoutTest-seed#[1D0D818F380CCB95]-worker) [    ] o.e.j.s.session node0 Scavenging every 600000ms
   [junit4]   2> 2019166 INFO  (SUITE-LeaderVoteWaitTimeoutTest-seed#[1D0D818F380CCB95]-worker) [    ] o.e.j.s.h.ContextHandler Started o.e.j.s.ServletContextHandler@2c50de45{/solr,null,AVAILABLE}
   [junit4]   2> 2019177 INFO  (SUITE-LeaderVoteWaitTimeoutTest-seed#[1D0D818F380CCB95]-worker) [    ] o.e.j.s.AbstractConnector Started ServerConnector@5594e48d{HTTP/1.1,[http/1.1]}{127.0.0.1:53567}
   [junit4]   2> 2019177 INFO  (SUITE-LeaderVoteWaitTimeoutTest-seed#[1D0D818F380CCB95]-worker) [    ] o.e.j.s.Server Started @2019246ms
   [junit4]   2> 2019177 INFO  (SUITE-LeaderVoteWaitTimeoutTest-seed#[1D0D818F380CCB95]-worker) [    ] o.a.s.c.s.e.JettySolrRunner Jetty properties: {hostContext=/solr, hostPort=53566}
   [junit4]   2> 2019178 ERROR (SUITE-LeaderVoteWaitTimeoutTest-seed#[1D0D818F380CCB95]-worker) [    ] o.a.s.u.StartupLoggingUtils Missing Java Option solr.log.dir. Logging may be missing or incomplete.
   [junit4]   2> 2019178 INFO  (SUITE-LeaderVoteWaitTimeoutTest-seed#[1D0D818F380CCB95]-worker) [    ] o.a.s.s.SolrDispatchFilter Using logger factory org.apache.logging.slf4j.Log4jLoggerFactory
   [junit4]   2> 2019178 INFO  (SUITE-LeaderVoteWaitTimeoutTest-seed#[1D0D818F380CCB95]-worker) [    ] o.a.s.s.SolrDispatchFilter  ___      _       Welcome to Apache Solr™ version 8.0.0
   [junit4]   2> 2019178 INFO  (SUITE-LeaderVoteWaitTimeoutTest-seed#[1D0D818F380CCB95]-worker) [    ] o.a.s.s.SolrDispatchFilter / __| ___| |_ _   Starting in cloud mode on port null
   [junit4]   2> 2019178 INFO  (SUITE-LeaderVoteWaitTimeoutTest-seed#[1D0D818F380CCB95]-worker) [    ] o.a.s.s.SolrDispatchFilter \__ \/ _ \ | '_|  Install dir: null
   [junit4]   2> 2019184 INFO  (SUITE-LeaderVoteWaitTimeoutTest-seed#[1D0D818F380CCB95]-worker) [    ] o.a.s.s.SolrDispatchFilter |___/\___/_|_|    Start time: 2018-09-03T00:49:45.470629Z
   [junit4]   2> 2019187 INFO  (zkConnectionManagerCallback-5403-thread-1) [    ] o.a.s.c.c.ConnectionManager zkClient has connected
   [junit4]   2> 2019188 INFO  (SUITE-LeaderVoteWaitTimeoutTest-seed#[1D0D818F380CCB95]-worker) [    ] o.a.s.s.SolrDispatchFilter solr.xml found in ZooKeeper. Loading...
   [junit4]   2> 2019283 INFO  (SUITE-LeaderVoteWaitTimeoutTest-seed#[1D0D818F380CCB95]-worker) [    ] o.a.s.c.ZkContainer Zookeeper client=127.0.0.1:53524/solr
   [junit4]   2> 2019285 INFO  (zkConnectionManagerCallback-5407-thread-1) [    ] o.a.s.c.c.ConnectionManager zkClient has connected
   [junit4]   2> 2019290 INFO  (zkConnectionManagerCallback-5409-thread-1) [    ] o.a.s.c.c.ConnectionManager zkClient has connected
   [junit4]   2> 2019308 INFO  (SUITE-LeaderVoteWaitTimeoutTest-seed#[1D0D818F380CCB95]-worker) [    ] o.a.s.c.c.ZkStateReader Updated live nodes from ZooKeeper... (0) -> (3)
   [junit4]   2> 2019316 INFO  (SUITE-LeaderVoteWaitTimeoutTest-seed#[1D0D818F380CCB95]-worker) [    ] o.a.s.c.TransientSolrCoreCacheDefault Allocating transient cache for 2147483647 transient cores
   [junit4]   2> 2019316 INFO  (SUITE-LeaderVoteWaitTimeoutTest-seed#[1D0D818F380CCB95]-worker) [    ] o.a.s.c.ZkController Register node as live in ZooKeeper:/live_nodes/127.0.0.1:53566_solr
   [junit4]   2> 2019320 INFO  (zkCallback-5376-thread-1) [    ] o.a.s.c.c.ZkStateReader Updated live nodes from ZooKeeper... (3) -> (4)
   [junit4]   2> 2019320 INFO  (zkCallback-5360-thread-1) [    ] o.a.s.c.c.ZkStateReader Updated live nodes from ZooKeeper... (3) -> (4)
   [junit4]   2> 2019320 INFO  (zkCallback-5352-thread-1) [    ] o.a.s.c.c.ZkStateReader Updated live nodes from ZooKeeper... (3) -> (4)
   [junit4]   2> 2019320 INFO  (zkCallback-5367-thread-1) [    ] o.a.s.c.c.ZkStateReader Updated live nodes from ZooKeeper... (3) -> (4)
   [junit4]   2> 2019320 INFO  (zkCallback-5383-thread-1) [    ] o.a.s.c.c.ZkStateReader Updated live nodes from ZooKeeper... (3) -> (4)
   [junit4]   2> 2019320 INFO  (zkCallback-5392-thread-1) [    ] o.a.s.c.c.ZkStateReader Updated live nodes from ZooKeeper... (3) -> (4)
   [junit4]   2> 2019321 INFO  (zkCallback-5399-thread-1) [    ] o.a.s.c.c.ZkStateReader Updated live nodes from ZooKeeper... (3) -> (4)
   [junit4]   2> 2019321 INFO  (zkCallback-5408-thread-1) [    ] o.a.s.c.c.ZkStateReader Updated live nodes from ZooKeeper... (3) -> (4)
   [junit4]   2> 2019354 INFO  (zkConnectionManagerCallback-5416-thread-1) [    ] o.a.s.c.c.ConnectionManager zkClient has connected
   [junit4]   2> 2019357 INFO  (SUITE-LeaderVoteWaitTimeoutTest-seed#[1D0D818F380CCB95]-worker) [    ] o.a.s.c.c.ZkStateReader Updated live nodes from ZooKeeper... (0) -> (4)
   [junit4]   2> 2019364 INFO  (SUITE-LeaderVoteWaitTimeoutTest-seed#[1D0D818F380CCB95]-worker) [    ] o.a.s.c.s.i.ZkClientClusterStateProvider Cluster at 127.0.0.1:53524/solr ready
   [junit4]   2> 2019369 INFO  (SUITE-LeaderVoteWaitTimeoutTest-seed#[1D0D818F380CCB95]-worker) [    ] o.a.s.h.a.MetricsHistoryHandler No .system collection, keeping metrics history in memory.
   [junit4]   2> 2019398 INFO  (SUITE-LeaderVoteWaitTimeoutTest-seed#[1D0D818F380CCB95]-worker) [    ] o.a.s.m.r.SolrJmxReporter JMX monitoring for 'solr_53566.solr.node' (registry 'solr.node') enabled at server: com.sun.jmx.mbeanserver.JmxMBeanServer@36115f2
   [junit4]   2> 2019413 INFO  (SUITE-LeaderVoteWaitTimeoutTest-seed#[1D0D818F380CCB95]-worker) [    ] o.a.s.m.r.SolrJmxReporter JMX monitoring for 'solr_53566.solr.jvm' (registry 'solr.jvm') enabled at server: com.sun.jmx.mbeanserver.JmxMBeanServer@36115f2
   [junit4]   2> 2019413 INFO  (SUITE-LeaderVoteWaitTimeoutTest-seed#[1D0D818F380CCB95]-worker) [    ] o.a.s.m.r.SolrJmxReporter JMX monitoring for 'solr_53566.solr.jetty' (registry 'solr.jetty') enabled at server: com.sun.jmx.mbeanserver.JmxMBeanServer@36115f2
   [junit4]   2> 2019416 INFO  (SUITE-LeaderVoteWaitTimeoutTest-seed#[1D0D818F380CCB95]-worker) [    ] o.a.s.c.CorePropertiesLocator Found 0 core definitions underneath /Users/jenkins/workspace/Lucene-Solr-master-MacOSX/solr/build/solr-core/test/J0/temp/solr.cloud.LeaderVoteWaitTimeoutTest_1D0D818F380CCB95-001/tempDir-001/node2/.
   [junit4]   2> 2019492 INFO  (SUITE-LeaderVoteWaitTimeoutTest-seed#[1D0D818F380CCB95]-worker) [    ] o.a.s.c.LeaderVoteWaitTimeoutTest Adding proxy for URL: http://127.0.0.1:53567/solr. Proxy: http://127.0.0.1:53566/solr
   [junit4]   2> 2019553 INFO  (TEST-LeaderVoteWaitTimeoutTest.testMostInSyncReplicasCanWinElection-seed#[1D0D818F380CCB95]) [    ] o.a.s.SolrTestCaseJ4 ###Starting testMostInSyncReplicasCanWinElection
   [junit4]   2> 2019555 INFO  (zkConnectionManagerCallback-5419-thread-1) [    ] o.a.s.c.c.ConnectionManager zkClient has connected
   [junit4]   2> 2019560 INFO  (TEST-LeaderVoteWaitTimeoutTest.testMostInSyncReplicasCanWinElection-seed#[1D0D818F380CCB95]) [    ] o.a.s.c.c.ZkStateReader Updated live nodes from ZooKeeper... (0) -> (4)
   [junit4]   2> 2019572 INFO  (SocketProxy-Acceptor-53548) [    ] o.a.s.c.SocketProxy accepted Socket[addr=/127.0.0.1,port=53573,localport=53548], receiveBufferSize:408300
   [junit4]   2> 2019573 INFO  (SocketProxy-Acceptor-53548) [    ] o.a.s.c.SocketProxy proxy connection Socket[addr=/127.0.0.1,port=53549,localport=53574], receiveBufferSize=408300
   [junit4]   2> 2019576 INFO  (qtp10576137-17755) [n:127.0.0.1:53548_solr    ] o.a.s.h.a.CollectionsHandler Invoked Collection Action :create with params pullReplicas=0&name=collection1&nrtReplicas=3&action=CREATE&numShards=1&tlogReplicas=0&createNodeSet=&wt=javabin&version=2 and sendToOCPQueue=true
   [junit4]   2> 2019583 INFO  (OverseerThreadFactory-6041-thread-1-processing-n:127.0.0.1:53548_solr) [n:127.0.0.1:53548_solr    ] o.a.s.c.a.c.CreateCollectionCmd Create collection collection1
   [junit4]   2> 2019584 INFO  (OverseerThreadFactory-6041-thread-1-processing-n:127.0.0.1:53548_solr) [n:127.0.0.1:53548_solr    ] o.a.s.c.c.ZkConfigManager Copying zk node /configs/_default/managed-schema to /configs/collection1.AUTOCREATED/managed-schema
   [junit4]   2> 2019588 INFO  (OverseerThreadFactory-6041-thread-1-processing-n:127.0.0.1:53548_solr) [n:127.0.0.1:53548_solr    ] o.a.s.c.c.ZkConfigManager Copying zk node /configs/_default/protwords.txt to /configs/collection1.AUTOCREATED/protwords.txt
   [junit4]   2> 2019598 INFO  (OverseerThreadFactory-6041-thread-1-processing-n:127.0.0.1:53548_solr) [n:127.0.0.1:53548_solr    ] o.a.s.c.c.ZkConfigManager Copying zk node /configs/_default/solrconfig.xml to /configs/collection1.AUTOCREATED/solrconfig.xml
   [junit4]   2> 2019601 INFO  (O

[...truncated too long message...]

t4]   2> 	at org.apache.solr.core.SolrCore.openNewSearcher(SolrCore.java:2128)
   [junit4]   2> 	at org.apache.solr.update.DirectUpdateHandler2.commit(DirectUpdateHandler2.java:710)
   [junit4]   2> 	at org.apache.solr.update.CommitTracker.run(CommitTracker.java:270)
   [junit4]   2> 	at java.base/java.util.concurrent.Executors$RunnableAdapter.call(Executors.java:514)
   [junit4]   2> 	at java.base/java.util.concurrent.FutureTask.run(FutureTask.java:264)
   [junit4]   2> 	at java.base/java.util.concurrent.ScheduledThreadPoolExecutor$ScheduledFutureTask.run(ScheduledThreadPoolExecutor.java:299)
   [junit4]   2> 	at java.base/java.util.concurrent.ThreadPoolExecutor.runWorker(ThreadPoolExecutor.java:1167)
   [junit4]   2> 	at java.base/java.util.concurrent.ThreadPoolExecutor$Worker.run(ThreadPoolExecutor.java:641)
   [junit4]   2> 	at java.base/java.lang.Thread.run(Thread.java:844)
   [junit4]   2> Caused by: org.apache.solr.common.SolrException: openNewSearcher called on closed core
   [junit4]   2> 	at org.apache.solr.core.SolrCore.openNewSearcher(SolrCore.java:2115)
   [junit4]   2> 	... 8 more
   [junit4]   2> 
   [junit4]   2> 2317192 INFO  (coreCloseExecutor-7012-thread-1) [    x:collection1] o.a.s.u.SolrIndexWriter Calling setCommitData with IW:org.apache.solr.update.SolrIndexWriter@3a466655 commitCommandVersion:0
   [junit4]   2> NOTE: reproduce with: ant test  -Dtestcase=MaxSizeAutoCommitTest -Dtests.method=testAdds -Dtests.seed=1D0D818F380CCB95 -Dtests.slow=true -Dtests.locale=es-IC -Dtests.timezone=America/Nassau -Dtests.asserts=true -Dtests.file.encoding=UTF-8
   [junit4] FAILURE 3.55s J0 | MaxSizeAutoCommitTest.testAdds <<<
   [junit4]    > Throwable #1: java.lang.AssertionError: Current tlog size is larger than the max bound
   [junit4]    > 	at __randomizedtesting.SeedInfo.seed([1D0D818F380CCB95:B457A60D2F8C6C69]:0)
   [junit4]    > 	at org.apache.solr.update.MaxSizeAutoCommitTest.testAdds(MaxSizeAutoCommitTest.java:98)
   [junit4]    > 	at java.base/jdk.internal.reflect.NativeMethodAccessorImpl.invoke0(Native Method)
   [junit4]    > 	at java.base/jdk.internal.reflect.NativeMethodAccessorImpl.invoke(NativeMethodAccessorImpl.java:62)
   [junit4]    > 	at java.base/jdk.internal.reflect.DelegatingMethodAccessorImpl.invoke(DelegatingMethodAccessorImpl.java:43)
   [junit4]    > 	at java.base/java.lang.reflect.Method.invoke(Method.java:564)
   [junit4]    > 	at java.base/java.lang.Thread.run(Thread.java:844)
   [junit4]   2> NOTE: leaving temporary files on disk at: /Users/jenkins/workspace/Lucene-Solr-master-MacOSX/solr/build/solr-core/test/J0/temp/solr.update.MaxSizeAutoCommitTest_1D0D818F380CCB95-001
   [junit4]   2> NOTE: test params are: codec=Asserting(Lucene80): {multiDefault=PostingsFormat(name=LuceneVarGapDocFreqInterval), id=PostingsFormat(name=Asserting)}, docValues:{range_facet_l_dv=DocValuesFormat(name=Lucene70), _version_=DocValuesFormat(name=Direct), intDefault=DocValuesFormat(name=Direct), id_i1=DocValuesFormat(name=Lucene70), range_facet_i_dv=DocValuesFormat(name=Direct), intDvoDefault=DocValuesFormat(name=Asserting), range_facet_l=DocValuesFormat(name=Direct), timestamp=DocValuesFormat(name=Direct)}, maxPointsInLeafNode=75, maxMBSortInHeap=7.387553449759176, sim=Asserting(org.apache.lucene.search.similarities.AssertingSimilarity@1aea161e), locale=es-IC, timezone=America/Nassau
   [junit4]   2> NOTE: Mac OS X 10.11.6 x86_64/Oracle Corporation 9 (64-bit)/cpus=3,threads=1,free=147343288,total=518979584
   [junit4]   2> NOTE: All tests run in this JVM: [TestStressLucene, CdcrOpsAndBoundariesTest, TestSolrCoreSnapshots, PKIAuthenticationIntegrationTest, SolrCloudReportersTest, TestZkChroot, TriggerCooldownIntegrationTest, TestFastLRUCache, MetricsHistoryIntegrationTest, MultiTermTest, TaggingAttributeTest, TestHdfsUpdateLog, TestCoreBackup, TestComplexPhraseQParserPlugin, SuggesterWFSTTest, DistanceUnitsTest, TestWriterPerf, PluginInfoTest, ChaosMonkeySafeLeaderTest, UpdateRequestProcessorFactoryTest, TestLegacyFieldCache, OverseerStatusTest, HdfsCollectionsAPIDistributedZkTest, AtomicUpdatesTest, OverriddenZkACLAndCredentialsProvidersTest, NodeLostTriggerTest, DistributedFacetExistsSmallTest, TestZkAclsWithHadoopAuth, SuggestComponentContextFilterQueryTest, CoreAdminRequestStatusTest, InfixSuggestersTest, TestCollectionsAPIViaSolrCloudCluster, TestNumericRangeQuery64, TestCryptoKeys, IndexSizeTriggerTest, ConnectionManagerTest, TestStressVersions, TestSubQueryTransformerCrossCore, TestUtilizeNode, AutoAddReplicasPlanActionTest, DocValuesNotIndexedTest, SchemaVersionSpecificBehaviorTest, TestManagedSynonymFilterFactory, TestExportWriter, TestCodecSupport, TestExpandComponent, TestMaxTokenLenTokenizer, TestRecovery, LIROnShardRestartTest, TestSimDistribStateManager, BasicAuthIntegrationTest, AnalysisAfterCoreReloadTest, TestAnalyzedSuggestions, TestJsonRequest, SearchHandlerTest, TestBackupRepositoryFactory, NumericFieldsTest, TestXmlQParser, TestFileDictionaryLookup, ConcurrentDeleteAndCreateCollectionTest, TestNonDefinedSimilarityFactory, LukeRequestHandlerTest, TestPullReplica, ConcurrentCreateRoutedAliasTest, SpellingQueryConverterTest, TestReloadAndDeleteDocs, TestCloudPivotFacet, NumberUtilsTest, FullSolrCloudDistribCmdsTest, SolrRrdBackendFactoryTest, DisMaxRequestHandlerTest, MetricsConfigTest, SpellCheckComponentTest, SuggesterTSTTest, CdcrBidirectionalTest, ClusterStateUpdateTest, SolrMetricsIntegrationTest, FieldAnalysisRequestHandlerTest, PreAnalyzedFieldTest, ConvertedLegacyTest, TestBinaryField, RestoreTriggerStateTest, RemoteQueryErrorTest, TestCloudDeleteByQuery, TestReqParamsAPI, MoreLikeThisHandlerTest, TestReplicationHandler, SimpleCollectionCreateDeleteTest, OverseerTest, TestJsonFacets, TestClusterStateMutator, TestLockTree, TestCSVLoader, TestFieldResource, TestRandomFlRTGCloud, TestSolrQueryResponse, BasicDistributedZkTest, TestSearchPerf, HdfsRecoveryZkTest, TestSolr4Spatial, UUIDUpdateProcessorFallbackTest, CurrencyRangeFacetCloudTest, TestInitQParser, DeleteLastCustomShardedReplicaTest, ChaosMonkeyNothingIsSafeTest, ZkControllerTest, TestConfigSetProperties, TestFoldingMultitermQuery, AddBlockUpdateTest, TestMultiWordSynonyms, TestRangeQuery, DateFieldTest, TestSystemCollAutoCreate, TestDownShardTolerantSearch, TestDFRSimilarityFactory, AliasIntegrationTest, BlockJoinFacetDistribTest, TestFieldCacheSort, TestRawTransformer, TestFieldCache, TestCorePropertiesReload, TestLeaderElectionZkExpiry, TestUniqueKeyFieldResource, TestRTimerTree, TestGeoJSONResponseWriter, TestDistribDocBasedVersion, TestPhraseSuggestions, TransactionLogTest, DistributedSpellCheckComponentTest, TestFieldTypeResource, TestHashQParserPlugin, TestReRankQParserPlugin, ZkStateWriterTest, TestCollapseQParserPlugin, HLLSerializationTest, StatsReloadRaceTest, TestMacros, RecoveryAfterSoftCommitTest, TestSolrIndexConfig, HdfsSyncSliceTest, SolrIndexSplitterTest, TermVectorComponentDistributedTest, TestEmbeddedSolrServerConstructors, TestWordDelimiterFilterFactory, DirectUpdateHandlerTest, WordBreakSolrSpellCheckerTest, TestQuerySenderListener, RuleEngineTest, TestPayloadScoreQParserPlugin, HdfsTlogReplayBufferedWhileIndexingTest, SystemLogListenerTest, TestQueryTypes, TestStressLiveNodes, PreAnalyzedUpdateProcessorTest, TestSolrCoreParser, TestManagedResource, TestNumericTerms64, RankQueryTest, TestLRUCache, LeaderVoteWaitTimeoutTest, AddSchemaFieldsUpdateProcessorFactoryTest, TestCloudManagedSchema, SolrCLIZkUtilsTest, SegmentsInfoRequestHandlerTest, BlockDirectoryTest, TestIntervalFaceting, TestDocTermOrds, FieldMutatingUpdateProcessorTest, TestDirectoryFactory, TestDocBasedVersionConstraints, TestSimTriggerIntegration, TestCloudJSONFacetJoinDomain, TestLocalFSCloudBackupRestore, TestSha256AuthenticationProvider, TestStressReorder, TestUseDocValuesAsStored2, TestOnReconnectListenerSupport, TestRequestStatusCollectionAPI, AutoscalingHistoryHandlerTest, HdfsBasicDistributedZk2Test, ZookeeperStatusHandlerTest, TestStreamBody, TestRebalanceLeaders, TestJettySolrRunner, SSLMigrationTest, MaxSizeAutoCommitTest]
   [junit4] Completed [411/832 (2!)] on J0 in 7.22s, 3 tests, 1 failure <<< FAILURES!

[...truncated 43621 lines...]
[repro] Jenkins log URL: https://jenkins.thetaphi.de/job/Lucene-Solr-master-MacOSX/4810/consoleText

[repro] Revision: d93c46ea94dec612aa53e37d119fe34b5e8a828e

[repro] Ant options: "-Dargs=-XX:-UseCompressedOops -XX:+UseSerialGC"
[repro] Repro line:  ant test  -Dtestcase=LeaderVoteWaitTimeoutTest -Dtests.method=testMostInSyncReplicasCanWinElection -Dtests.seed=1D0D818F380CCB95 -Dtests.slow=true -Dtests.locale=shi -Dtests.timezone=America/Matamoros -Dtests.asserts=true -Dtests.file.encoding=UTF-8

[repro] Repro line:  ant test  -Dtestcase=LeaderVoteWaitTimeoutTest -Dtests.method=basicTest -Dtests.seed=1D0D818F380CCB95 -Dtests.slow=true -Dtests.locale=shi -Dtests.timezone=America/Matamoros -Dtests.asserts=true -Dtests.file.encoding=UTF-8

[repro] Repro line:  ant test  -Dtestcase=MaxSizeAutoCommitTest -Dtests.method=testAdds -Dtests.seed=1D0D818F380CCB95 -Dtests.slow=true -Dtests.locale=es-IC -Dtests.timezone=America/Nassau -Dtests.asserts=true -Dtests.file.encoding=UTF-8

[repro] ant clean

[...truncated 6 lines...]
[repro] Test suites by module:
[repro]    solr/core
[repro]       LeaderVoteWaitTimeoutTest
[repro]       MaxSizeAutoCommitTest
[repro] ant compile-test

[...truncated 3445 lines...]
[repro] ant test-nocompile -Dtests.dups=5 -Dtests.maxfailures=10 -Dtests.class="*.LeaderVoteWaitTimeoutTest|*.MaxSizeAutoCommitTest" -Dtests.showOutput=onerror "-Dargs=-XX:-UseCompressedOops -XX:+UseSerialGC" -Dtests.seed=1D0D818F380CCB95 -Dtests.slow=true -Dtests.locale=shi -Dtests.timezone=America/Matamoros -Dtests.asserts=true -Dtests.file.encoding=UTF-8

[...truncated 109 lines...]
[repro] Failures:
[repro]   0/5 failed: org.apache.solr.cloud.LeaderVoteWaitTimeoutTest
[repro]   0/5 failed: org.apache.solr.update.MaxSizeAutoCommitTest
[repro] Exiting with code 0

[...truncated 70 lines...]

Mime
View raw message