lucene-dev mailing list archives

Site index · List index
Message view « Date » · « Thread »
Top « Date » · « Thread »
From Policeman Jenkins Server <jenk...@thetaphi.de>
Subject [JENKINS] Lucene-Solr-master-Linux (64bit/jdk-10) - Build # 22781 - Still Unstable!
Date Sat, 01 Sep 2018 07:06:55 GMT
Build: https://jenkins.thetaphi.de/job/Lucene-Solr-master-Linux/22781/
Java: 64bit/jdk-10 -XX:+UseCompressedOops -XX:+UseSerialGC

5 tests failed.
FAILED:  org.apache.solr.cloud.MoveReplicaHDFSTest.testFailedMove

Error Message:
No live SolrServers available to handle this request:[http://127.0.0.1:34081/solr/MoveReplicaHDFSTest_failed_coll_true, http://127.0.0.1:37301/solr/MoveReplicaHDFSTest_failed_coll_true]

Stack Trace:
org.apache.solr.client.solrj.SolrServerException: No live SolrServers available to handle this request:[http://127.0.0.1:34081/solr/MoveReplicaHDFSTest_failed_coll_true, http://127.0.0.1:37301/solr/MoveReplicaHDFSTest_failed_coll_true]
	at __randomizedtesting.SeedInfo.seed([CAA7DEB88B0DD212:606A0D4A3CDE07C2]:0)
	at org.apache.solr.client.solrj.impl.LBHttpSolrClient.request(LBHttpSolrClient.java:462)
	at org.apache.solr.client.solrj.impl.CloudSolrClient.sendRequest(CloudSolrClient.java:1109)
	at org.apache.solr.client.solrj.impl.CloudSolrClient.requestWithRetryOnStaleState(CloudSolrClient.java:886)
	at org.apache.solr.client.solrj.impl.CloudSolrClient.requestWithRetryOnStaleState(CloudSolrClient.java:996)
	at org.apache.solr.client.solrj.impl.CloudSolrClient.request(CloudSolrClient.java:819)
	at org.apache.solr.client.solrj.SolrRequest.process(SolrRequest.java:194)
	at org.apache.solr.client.solrj.SolrClient.query(SolrClient.java:942)
	at org.apache.solr.cloud.MoveReplicaTest.testFailedMove(MoveReplicaTest.java:291)
	at java.base/jdk.internal.reflect.NativeMethodAccessorImpl.invoke0(Native Method)
	at java.base/jdk.internal.reflect.NativeMethodAccessorImpl.invoke(NativeMethodAccessorImpl.java:62)
	at java.base/jdk.internal.reflect.DelegatingMethodAccessorImpl.invoke(DelegatingMethodAccessorImpl.java:43)
	at java.base/java.lang.reflect.Method.invoke(Method.java:564)
	at com.carrotsearch.randomizedtesting.RandomizedRunner.invoke(RandomizedRunner.java:1737)
	at com.carrotsearch.randomizedtesting.RandomizedRunner$8.evaluate(RandomizedRunner.java:934)
	at com.carrotsearch.randomizedtesting.RandomizedRunner$9.evaluate(RandomizedRunner.java:970)
	at com.carrotsearch.randomizedtesting.RandomizedRunner$10.evaluate(RandomizedRunner.java:984)
	at com.carrotsearch.randomizedtesting.rules.SystemPropertiesRestoreRule$1.evaluate(SystemPropertiesRestoreRule.java:57)
	at org.apache.lucene.util.TestRuleSetupTeardownChained$1.evaluate(TestRuleSetupTeardownChained.java:49)
	at org.apache.lucene.util.AbstractBeforeAfterRule$1.evaluate(AbstractBeforeAfterRule.java:45)
	at org.apache.lucene.util.TestRuleThreadAndTestName$1.evaluate(TestRuleThreadAndTestName.java:48)
	at org.apache.lucene.util.TestRuleIgnoreAfterMaxFailures$1.evaluate(TestRuleIgnoreAfterMaxFailures.java:64)
	at org.apache.lucene.util.TestRuleMarkFailure$1.evaluate(TestRuleMarkFailure.java:47)
	at com.carrotsearch.randomizedtesting.rules.StatementAdapter.evaluate(StatementAdapter.java:36)
	at com.carrotsearch.randomizedtesting.ThreadLeakControl$StatementRunner.run(ThreadLeakControl.java:368)
	at com.carrotsearch.randomizedtesting.ThreadLeakControl.forkTimeoutingTask(ThreadLeakControl.java:817)
	at com.carrotsearch.randomizedtesting.ThreadLeakControl$3.evaluate(ThreadLeakControl.java:468)
	at com.carrotsearch.randomizedtesting.RandomizedRunner.runSingleTest(RandomizedRunner.java:943)
	at com.carrotsearch.randomizedtesting.RandomizedRunner$5.evaluate(RandomizedRunner.java:829)
	at com.carrotsearch.randomizedtesting.RandomizedRunner$6.evaluate(RandomizedRunner.java:879)
	at com.carrotsearch.randomizedtesting.RandomizedRunner$7.evaluate(RandomizedRunner.java:890)
	at com.carrotsearch.randomizedtesting.rules.StatementAdapter.evaluate(StatementAdapter.java:36)
	at com.carrotsearch.randomizedtesting.rules.SystemPropertiesRestoreRule$1.evaluate(SystemPropertiesRestoreRule.java:57)
	at org.apache.lucene.util.AbstractBeforeAfterRule$1.evaluate(AbstractBeforeAfterRule.java:45)
	at com.carrotsearch.randomizedtesting.rules.StatementAdapter.evaluate(StatementAdapter.java:36)
	at org.apache.lucene.util.TestRuleStoreClassName$1.evaluate(TestRuleStoreClassName.java:41)
	at com.carrotsearch.randomizedtesting.rules.NoShadowingOrOverridesOnMethodsRule$1.evaluate(NoShadowingOrOverridesOnMethodsRule.java:40)
	at com.carrotsearch.randomizedtesting.rules.NoShadowingOrOverridesOnMethodsRule$1.evaluate(NoShadowingOrOverridesOnMethodsRule.java:40)
	at com.carrotsearch.randomizedtesting.rules.StatementAdapter.evaluate(StatementAdapter.java:36)
	at com.carrotsearch.randomizedtesting.rules.StatementAdapter.evaluate(StatementAdapter.java:36)
	at org.apache.lucene.util.TestRuleAssertionsRequired$1.evaluate(TestRuleAssertionsRequired.java:53)
	at org.apache.lucene.util.TestRuleMarkFailure$1.evaluate(TestRuleMarkFailure.java:47)
	at org.apache.lucene.util.TestRuleIgnoreAfterMaxFailures$1.evaluate(TestRuleIgnoreAfterMaxFailures.java:64)
	at org.apache.lucene.util.TestRuleIgnoreTestSuites$1.evaluate(TestRuleIgnoreTestSuites.java:54)
	at com.carrotsearch.randomizedtesting.rules.StatementAdapter.evaluate(StatementAdapter.java:36)
	at com.carrotsearch.randomizedtesting.ThreadLeakControl$StatementRunner.run(ThreadLeakControl.java:368)
	at java.base/java.lang.Thread.run(Thread.java:844)
Caused by: org.apache.solr.client.solrj.impl.HttpSolrClient$RemoteSolrException: Error from server at http://127.0.0.1:34081/solr/MoveReplicaHDFSTest_failed_coll_true: no servers hosting shard: shard2
	at org.apache.solr.client.solrj.impl.HttpSolrClient.executeMethod(HttpSolrClient.java:643)
	at org.apache.solr.client.solrj.impl.HttpSolrClient.request(HttpSolrClient.java:255)
	at org.apache.solr.client.solrj.impl.HttpSolrClient.request(HttpSolrClient.java:244)
	at org.apache.solr.client.solrj.impl.LBHttpSolrClient.doRequest(LBHttpSolrClient.java:483)
	at org.apache.solr.client.solrj.impl.LBHttpSolrClient.request(LBHttpSolrClient.java:436)
	... 45 more


FAILED:  org.apache.solr.cloud.MoveReplicaHDFSTest.testFailedMove

Error Message:
No live SolrServers available to handle this request:[http://127.0.0.1:32831/solr/MoveReplicaHDFSTest_failed_coll_true, http://127.0.0.1:46333/solr/MoveReplicaHDFSTest_failed_coll_true]

Stack Trace:
org.apache.solr.client.solrj.SolrServerException: No live SolrServers available to handle this request:[http://127.0.0.1:32831/solr/MoveReplicaHDFSTest_failed_coll_true, http://127.0.0.1:46333/solr/MoveReplicaHDFSTest_failed_coll_true]
	at __randomizedtesting.SeedInfo.seed([CAA7DEB88B0DD212:606A0D4A3CDE07C2]:0)
	at org.apache.solr.client.solrj.impl.LBHttpSolrClient.request(LBHttpSolrClient.java:462)
	at org.apache.solr.client.solrj.impl.CloudSolrClient.sendRequest(CloudSolrClient.java:1109)
	at org.apache.solr.client.solrj.impl.CloudSolrClient.requestWithRetryOnStaleState(CloudSolrClient.java:886)
	at org.apache.solr.client.solrj.impl.CloudSolrClient.requestWithRetryOnStaleState(CloudSolrClient.java:996)
	at org.apache.solr.client.solrj.impl.CloudSolrClient.request(CloudSolrClient.java:819)
	at org.apache.solr.client.solrj.SolrRequest.process(SolrRequest.java:194)
	at org.apache.solr.client.solrj.SolrClient.query(SolrClient.java:942)
	at org.apache.solr.cloud.MoveReplicaTest.testFailedMove(MoveReplicaTest.java:291)
	at java.base/jdk.internal.reflect.NativeMethodAccessorImpl.invoke0(Native Method)
	at java.base/jdk.internal.reflect.NativeMethodAccessorImpl.invoke(NativeMethodAccessorImpl.java:62)
	at java.base/jdk.internal.reflect.DelegatingMethodAccessorImpl.invoke(DelegatingMethodAccessorImpl.java:43)
	at java.base/java.lang.reflect.Method.invoke(Method.java:564)
	at com.carrotsearch.randomizedtesting.RandomizedRunner.invoke(RandomizedRunner.java:1737)
	at com.carrotsearch.randomizedtesting.RandomizedRunner$8.evaluate(RandomizedRunner.java:934)
	at com.carrotsearch.randomizedtesting.RandomizedRunner$9.evaluate(RandomizedRunner.java:970)
	at com.carrotsearch.randomizedtesting.RandomizedRunner$10.evaluate(RandomizedRunner.java:984)
	at com.carrotsearch.randomizedtesting.rules.SystemPropertiesRestoreRule$1.evaluate(SystemPropertiesRestoreRule.java:57)
	at org.apache.lucene.util.TestRuleSetupTeardownChained$1.evaluate(TestRuleSetupTeardownChained.java:49)
	at org.apache.lucene.util.AbstractBeforeAfterRule$1.evaluate(AbstractBeforeAfterRule.java:45)
	at org.apache.lucene.util.TestRuleThreadAndTestName$1.evaluate(TestRuleThreadAndTestName.java:48)
	at org.apache.lucene.util.TestRuleIgnoreAfterMaxFailures$1.evaluate(TestRuleIgnoreAfterMaxFailures.java:64)
	at org.apache.lucene.util.TestRuleMarkFailure$1.evaluate(TestRuleMarkFailure.java:47)
	at com.carrotsearch.randomizedtesting.rules.StatementAdapter.evaluate(StatementAdapter.java:36)
	at com.carrotsearch.randomizedtesting.ThreadLeakControl$StatementRunner.run(ThreadLeakControl.java:368)
	at com.carrotsearch.randomizedtesting.ThreadLeakControl.forkTimeoutingTask(ThreadLeakControl.java:817)
	at com.carrotsearch.randomizedtesting.ThreadLeakControl$3.evaluate(ThreadLeakControl.java:468)
	at com.carrotsearch.randomizedtesting.RandomizedRunner.runSingleTest(RandomizedRunner.java:943)
	at com.carrotsearch.randomizedtesting.RandomizedRunner$5.evaluate(RandomizedRunner.java:829)
	at com.carrotsearch.randomizedtesting.RandomizedRunner$6.evaluate(RandomizedRunner.java:879)
	at com.carrotsearch.randomizedtesting.RandomizedRunner$7.evaluate(RandomizedRunner.java:890)
	at com.carrotsearch.randomizedtesting.rules.StatementAdapter.evaluate(StatementAdapter.java:36)
	at com.carrotsearch.randomizedtesting.rules.SystemPropertiesRestoreRule$1.evaluate(SystemPropertiesRestoreRule.java:57)
	at org.apache.lucene.util.AbstractBeforeAfterRule$1.evaluate(AbstractBeforeAfterRule.java:45)
	at com.carrotsearch.randomizedtesting.rules.StatementAdapter.evaluate(StatementAdapter.java:36)
	at org.apache.lucene.util.TestRuleStoreClassName$1.evaluate(TestRuleStoreClassName.java:41)
	at com.carrotsearch.randomizedtesting.rules.NoShadowingOrOverridesOnMethodsRule$1.evaluate(NoShadowingOrOverridesOnMethodsRule.java:40)
	at com.carrotsearch.randomizedtesting.rules.NoShadowingOrOverridesOnMethodsRule$1.evaluate(NoShadowingOrOverridesOnMethodsRule.java:40)
	at com.carrotsearch.randomizedtesting.rules.StatementAdapter.evaluate(StatementAdapter.java:36)
	at com.carrotsearch.randomizedtesting.rules.StatementAdapter.evaluate(StatementAdapter.java:36)
	at org.apache.lucene.util.TestRuleAssertionsRequired$1.evaluate(TestRuleAssertionsRequired.java:53)
	at org.apache.lucene.util.TestRuleMarkFailure$1.evaluate(TestRuleMarkFailure.java:47)
	at org.apache.lucene.util.TestRuleIgnoreAfterMaxFailures$1.evaluate(TestRuleIgnoreAfterMaxFailures.java:64)
	at org.apache.lucene.util.TestRuleIgnoreTestSuites$1.evaluate(TestRuleIgnoreTestSuites.java:54)
	at com.carrotsearch.randomizedtesting.rules.StatementAdapter.evaluate(StatementAdapter.java:36)
	at com.carrotsearch.randomizedtesting.ThreadLeakControl$StatementRunner.run(ThreadLeakControl.java:368)
	at java.base/java.lang.Thread.run(Thread.java:844)
Caused by: org.apache.solr.client.solrj.impl.HttpSolrClient$RemoteSolrException: Error from server at http://127.0.0.1:46333/solr/MoveReplicaHDFSTest_failed_coll_true: no servers hosting shard: shard2
	at org.apache.solr.client.solrj.impl.HttpSolrClient.executeMethod(HttpSolrClient.java:643)
	at org.apache.solr.client.solrj.impl.HttpSolrClient.request(HttpSolrClient.java:255)
	at org.apache.solr.client.solrj.impl.HttpSolrClient.request(HttpSolrClient.java:244)
	at org.apache.solr.client.solrj.impl.LBHttpSolrClient.doRequest(LBHttpSolrClient.java:483)
	at org.apache.solr.client.solrj.impl.LBHttpSolrClient.request(LBHttpSolrClient.java:413)
	... 45 more


FAILED:  org.apache.solr.handler.RequestLoggingTest.testLogBeforeExecuteWithRequestLogger

Error Message:


Stack Trace:
java.lang.AssertionError
	at __randomizedtesting.SeedInfo.seed([CAA7DEB88B0DD212:7BCEFEB726FB6A5C]:0)
	at org.junit.Assert.fail(Assert.java:92)
	at org.junit.Assert.assertTrue(Assert.java:43)
	at org.junit.Assert.assertTrue(Assert.java:54)
	at org.apache.solr.handler.RequestLoggingTest.testLogBeforeExecute(RequestLoggingTest.java:88)
	at org.apache.solr.handler.RequestLoggingTest.testLogBeforeExecuteWithRequestLogger(RequestLoggingTest.java:71)
	at java.base/jdk.internal.reflect.NativeMethodAccessorImpl.invoke0(Native Method)
	at java.base/jdk.internal.reflect.NativeMethodAccessorImpl.invoke(NativeMethodAccessorImpl.java:62)
	at java.base/jdk.internal.reflect.DelegatingMethodAccessorImpl.invoke(DelegatingMethodAccessorImpl.java:43)
	at java.base/java.lang.reflect.Method.invoke(Method.java:564)
	at com.carrotsearch.randomizedtesting.RandomizedRunner.invoke(RandomizedRunner.java:1737)
	at com.carrotsearch.randomizedtesting.RandomizedRunner$8.evaluate(RandomizedRunner.java:934)
	at com.carrotsearch.randomizedtesting.RandomizedRunner$9.evaluate(RandomizedRunner.java:970)
	at com.carrotsearch.randomizedtesting.RandomizedRunner$10.evaluate(RandomizedRunner.java:984)
	at com.carrotsearch.randomizedtesting.rules.SystemPropertiesRestoreRule$1.evaluate(SystemPropertiesRestoreRule.java:57)
	at org.apache.lucene.util.TestRuleSetupTeardownChained$1.evaluate(TestRuleSetupTeardownChained.java:49)
	at org.apache.lucene.util.AbstractBeforeAfterRule$1.evaluate(AbstractBeforeAfterRule.java:45)
	at org.apache.lucene.util.TestRuleThreadAndTestName$1.evaluate(TestRuleThreadAndTestName.java:48)
	at org.apache.lucene.util.TestRuleIgnoreAfterMaxFailures$1.evaluate(TestRuleIgnoreAfterMaxFailures.java:64)
	at org.apache.lucene.util.TestRuleMarkFailure$1.evaluate(TestRuleMarkFailure.java:47)
	at com.carrotsearch.randomizedtesting.rules.StatementAdapter.evaluate(StatementAdapter.java:36)
	at com.carrotsearch.randomizedtesting.ThreadLeakControl$StatementRunner.run(ThreadLeakControl.java:368)
	at com.carrotsearch.randomizedtesting.ThreadLeakControl.forkTimeoutingTask(ThreadLeakControl.java:817)
	at com.carrotsearch.randomizedtesting.ThreadLeakControl$3.evaluate(ThreadLeakControl.java:468)
	at com.carrotsearch.randomizedtesting.RandomizedRunner.runSingleTest(RandomizedRunner.java:943)
	at com.carrotsearch.randomizedtesting.RandomizedRunner$5.evaluate(RandomizedRunner.java:829)
	at com.carrotsearch.randomizedtesting.RandomizedRunner$6.evaluate(RandomizedRunner.java:879)
	at com.carrotsearch.randomizedtesting.RandomizedRunner$7.evaluate(RandomizedRunner.java:890)
	at com.carrotsearch.randomizedtesting.rules.StatementAdapter.evaluate(StatementAdapter.java:36)
	at com.carrotsearch.randomizedtesting.rules.SystemPropertiesRestoreRule$1.evaluate(SystemPropertiesRestoreRule.java:57)
	at org.apache.lucene.util.AbstractBeforeAfterRule$1.evaluate(AbstractBeforeAfterRule.java:45)
	at com.carrotsearch.randomizedtesting.rules.StatementAdapter.evaluate(StatementAdapter.java:36)
	at org.apache.lucene.util.TestRuleStoreClassName$1.evaluate(TestRuleStoreClassName.java:41)
	at com.carrotsearch.randomizedtesting.rules.NoShadowingOrOverridesOnMethodsRule$1.evaluate(NoShadowingOrOverridesOnMethodsRule.java:40)
	at com.carrotsearch.randomizedtesting.rules.NoShadowingOrOverridesOnMethodsRule$1.evaluate(NoShadowingOrOverridesOnMethodsRule.java:40)
	at com.carrotsearch.randomizedtesting.rules.StatementAdapter.evaluate(StatementAdapter.java:36)
	at com.carrotsearch.randomizedtesting.rules.StatementAdapter.evaluate(StatementAdapter.java:36)
	at org.apache.lucene.util.TestRuleAssertionsRequired$1.evaluate(TestRuleAssertionsRequired.java:53)
	at org.apache.lucene.util.TestRuleMarkFailure$1.evaluate(TestRuleMarkFailure.java:47)
	at org.apache.lucene.util.TestRuleIgnoreAfterMaxFailures$1.evaluate(TestRuleIgnoreAfterMaxFailures.java:64)
	at org.apache.lucene.util.TestRuleIgnoreTestSuites$1.evaluate(TestRuleIgnoreTestSuites.java:54)
	at com.carrotsearch.randomizedtesting.rules.StatementAdapter.evaluate(StatementAdapter.java:36)
	at com.carrotsearch.randomizedtesting.ThreadLeakControl$StatementRunner.run(ThreadLeakControl.java:368)
	at java.base/java.lang.Thread.run(Thread.java:844)


FAILED:  org.apache.solr.handler.RequestLoggingTest.testLogBeforeExecuteWithRequestLogger

Error Message:


Stack Trace:
java.lang.AssertionError
	at __randomizedtesting.SeedInfo.seed([CAA7DEB88B0DD212:7BCEFEB726FB6A5C]:0)
	at org.junit.Assert.fail(Assert.java:92)
	at org.junit.Assert.assertTrue(Assert.java:43)
	at org.junit.Assert.assertTrue(Assert.java:54)
	at org.apache.solr.handler.RequestLoggingTest.testLogBeforeExecute(RequestLoggingTest.java:88)
	at org.apache.solr.handler.RequestLoggingTest.testLogBeforeExecuteWithRequestLogger(RequestLoggingTest.java:71)
	at java.base/jdk.internal.reflect.NativeMethodAccessorImpl.invoke0(Native Method)
	at java.base/jdk.internal.reflect.NativeMethodAccessorImpl.invoke(NativeMethodAccessorImpl.java:62)
	at java.base/jdk.internal.reflect.DelegatingMethodAccessorImpl.invoke(DelegatingMethodAccessorImpl.java:43)
	at java.base/java.lang.reflect.Method.invoke(Method.java:564)
	at com.carrotsearch.randomizedtesting.RandomizedRunner.invoke(RandomizedRunner.java:1737)
	at com.carrotsearch.randomizedtesting.RandomizedRunner$8.evaluate(RandomizedRunner.java:934)
	at com.carrotsearch.randomizedtesting.RandomizedRunner$9.evaluate(RandomizedRunner.java:970)
	at com.carrotsearch.randomizedtesting.RandomizedRunner$10.evaluate(RandomizedRunner.java:984)
	at com.carrotsearch.randomizedtesting.rules.SystemPropertiesRestoreRule$1.evaluate(SystemPropertiesRestoreRule.java:57)
	at org.apache.lucene.util.TestRuleSetupTeardownChained$1.evaluate(TestRuleSetupTeardownChained.java:49)
	at org.apache.lucene.util.AbstractBeforeAfterRule$1.evaluate(AbstractBeforeAfterRule.java:45)
	at org.apache.lucene.util.TestRuleThreadAndTestName$1.evaluate(TestRuleThreadAndTestName.java:48)
	at org.apache.lucene.util.TestRuleIgnoreAfterMaxFailures$1.evaluate(TestRuleIgnoreAfterMaxFailures.java:64)
	at org.apache.lucene.util.TestRuleMarkFailure$1.evaluate(TestRuleMarkFailure.java:47)
	at com.carrotsearch.randomizedtesting.rules.StatementAdapter.evaluate(StatementAdapter.java:36)
	at com.carrotsearch.randomizedtesting.ThreadLeakControl$StatementRunner.run(ThreadLeakControl.java:368)
	at com.carrotsearch.randomizedtesting.ThreadLeakControl.forkTimeoutingTask(ThreadLeakControl.java:817)
	at com.carrotsearch.randomizedtesting.ThreadLeakControl$3.evaluate(ThreadLeakControl.java:468)
	at com.carrotsearch.randomizedtesting.RandomizedRunner.runSingleTest(RandomizedRunner.java:943)
	at com.carrotsearch.randomizedtesting.RandomizedRunner$5.evaluate(RandomizedRunner.java:829)
	at com.carrotsearch.randomizedtesting.RandomizedRunner$6.evaluate(RandomizedRunner.java:879)
	at com.carrotsearch.randomizedtesting.RandomizedRunner$7.evaluate(RandomizedRunner.java:890)
	at com.carrotsearch.randomizedtesting.rules.StatementAdapter.evaluate(StatementAdapter.java:36)
	at com.carrotsearch.randomizedtesting.rules.SystemPropertiesRestoreRule$1.evaluate(SystemPropertiesRestoreRule.java:57)
	at org.apache.lucene.util.AbstractBeforeAfterRule$1.evaluate(AbstractBeforeAfterRule.java:45)
	at com.carrotsearch.randomizedtesting.rules.StatementAdapter.evaluate(StatementAdapter.java:36)
	at org.apache.lucene.util.TestRuleStoreClassName$1.evaluate(TestRuleStoreClassName.java:41)
	at com.carrotsearch.randomizedtesting.rules.NoShadowingOrOverridesOnMethodsRule$1.evaluate(NoShadowingOrOverridesOnMethodsRule.java:40)
	at com.carrotsearch.randomizedtesting.rules.NoShadowingOrOverridesOnMethodsRule$1.evaluate(NoShadowingOrOverridesOnMethodsRule.java:40)
	at com.carrotsearch.randomizedtesting.rules.StatementAdapter.evaluate(StatementAdapter.java:36)
	at com.carrotsearch.randomizedtesting.rules.StatementAdapter.evaluate(StatementAdapter.java:36)
	at org.apache.lucene.util.TestRuleAssertionsRequired$1.evaluate(TestRuleAssertionsRequired.java:53)
	at org.apache.lucene.util.TestRuleMarkFailure$1.evaluate(TestRuleMarkFailure.java:47)
	at org.apache.lucene.util.TestRuleIgnoreAfterMaxFailures$1.evaluate(TestRuleIgnoreAfterMaxFailures.java:64)
	at org.apache.lucene.util.TestRuleIgnoreTestSuites$1.evaluate(TestRuleIgnoreTestSuites.java:54)
	at com.carrotsearch.randomizedtesting.rules.StatementAdapter.evaluate(StatementAdapter.java:36)
	at com.carrotsearch.randomizedtesting.ThreadLeakControl$StatementRunner.run(ThreadLeakControl.java:368)
	at java.base/java.lang.Thread.run(Thread.java:844)


FAILED:  org.apache.solr.handler.RequestLoggingTest.testLogBeforeExecuteWithCoreLogger

Error Message:


Stack Trace:
java.lang.AssertionError
	at __randomizedtesting.SeedInfo.seed([CAA7DEB88B0DD212:621DE3675C4B984]:0)
	at org.junit.Assert.fail(Assert.java:92)
	at org.junit.Assert.assertTrue(Assert.java:43)
	at org.junit.Assert.assertTrue(Assert.java:54)
	at org.apache.solr.handler.RequestLoggingTest.testLogBeforeExecute(RequestLoggingTest.java:88)
	at org.apache.solr.handler.RequestLoggingTest.testLogBeforeExecuteWithCoreLogger(RequestLoggingTest.java:65)
	at java.base/jdk.internal.reflect.NativeMethodAccessorImpl.invoke0(Native Method)
	at java.base/jdk.internal.reflect.NativeMethodAccessorImpl.invoke(NativeMethodAccessorImpl.java:62)
	at java.base/jdk.internal.reflect.DelegatingMethodAccessorImpl.invoke(DelegatingMethodAccessorImpl.java:43)
	at java.base/java.lang.reflect.Method.invoke(Method.java:564)
	at com.carrotsearch.randomizedtesting.RandomizedRunner.invoke(RandomizedRunner.java:1737)
	at com.carrotsearch.randomizedtesting.RandomizedRunner$8.evaluate(RandomizedRunner.java:934)
	at com.carrotsearch.randomizedtesting.RandomizedRunner$9.evaluate(RandomizedRunner.java:970)
	at com.carrotsearch.randomizedtesting.RandomizedRunner$10.evaluate(RandomizedRunner.java:984)
	at com.carrotsearch.randomizedtesting.rules.SystemPropertiesRestoreRule$1.evaluate(SystemPropertiesRestoreRule.java:57)
	at org.apache.lucene.util.TestRuleSetupTeardownChained$1.evaluate(TestRuleSetupTeardownChained.java:49)
	at org.apache.lucene.util.AbstractBeforeAfterRule$1.evaluate(AbstractBeforeAfterRule.java:45)
	at org.apache.lucene.util.TestRuleThreadAndTestName$1.evaluate(TestRuleThreadAndTestName.java:48)
	at org.apache.lucene.util.TestRuleIgnoreAfterMaxFailures$1.evaluate(TestRuleIgnoreAfterMaxFailures.java:64)
	at org.apache.lucene.util.TestRuleMarkFailure$1.evaluate(TestRuleMarkFailure.java:47)
	at com.carrotsearch.randomizedtesting.rules.StatementAdapter.evaluate(StatementAdapter.java:36)
	at com.carrotsearch.randomizedtesting.ThreadLeakControl$StatementRunner.run(ThreadLeakControl.java:368)
	at com.carrotsearch.randomizedtesting.ThreadLeakControl.forkTimeoutingTask(ThreadLeakControl.java:817)
	at com.carrotsearch.randomizedtesting.ThreadLeakControl$3.evaluate(ThreadLeakControl.java:468)
	at com.carrotsearch.randomizedtesting.RandomizedRunner.runSingleTest(RandomizedRunner.java:943)
	at com.carrotsearch.randomizedtesting.RandomizedRunner$5.evaluate(RandomizedRunner.java:829)
	at com.carrotsearch.randomizedtesting.RandomizedRunner$6.evaluate(RandomizedRunner.java:879)
	at com.carrotsearch.randomizedtesting.RandomizedRunner$7.evaluate(RandomizedRunner.java:890)
	at com.carrotsearch.randomizedtesting.rules.StatementAdapter.evaluate(StatementAdapter.java:36)
	at com.carrotsearch.randomizedtesting.rules.SystemPropertiesRestoreRule$1.evaluate(SystemPropertiesRestoreRule.java:57)
	at org.apache.lucene.util.AbstractBeforeAfterRule$1.evaluate(AbstractBeforeAfterRule.java:45)
	at com.carrotsearch.randomizedtesting.rules.StatementAdapter.evaluate(StatementAdapter.java:36)
	at org.apache.lucene.util.TestRuleStoreClassName$1.evaluate(TestRuleStoreClassName.java:41)
	at com.carrotsearch.randomizedtesting.rules.NoShadowingOrOverridesOnMethodsRule$1.evaluate(NoShadowingOrOverridesOnMethodsRule.java:40)
	at com.carrotsearch.randomizedtesting.rules.NoShadowingOrOverridesOnMethodsRule$1.evaluate(NoShadowingOrOverridesOnMethodsRule.java:40)
	at com.carrotsearch.randomizedtesting.rules.StatementAdapter.evaluate(StatementAdapter.java:36)
	at com.carrotsearch.randomizedtesting.rules.StatementAdapter.evaluate(StatementAdapter.java:36)
	at org.apache.lucene.util.TestRuleAssertionsRequired$1.evaluate(TestRuleAssertionsRequired.java:53)
	at org.apache.lucene.util.TestRuleMarkFailure$1.evaluate(TestRuleMarkFailure.java:47)
	at org.apache.lucene.util.TestRuleIgnoreAfterMaxFailures$1.evaluate(TestRuleIgnoreAfterMaxFailures.java:64)
	at org.apache.lucene.util.TestRuleIgnoreTestSuites$1.evaluate(TestRuleIgnoreTestSuites.java:54)
	at com.carrotsearch.randomizedtesting.rules.StatementAdapter.evaluate(StatementAdapter.java:36)
	at com.carrotsearch.randomizedtesting.ThreadLeakControl$StatementRunner.run(ThreadLeakControl.java:368)
	at java.base/java.lang.Thread.run(Thread.java:844)




Build Log:
[...truncated 14052 lines...]
   [junit4] Suite: org.apache.solr.cloud.MoveReplicaHDFSTest
   [junit4]   2> 1352167 INFO  (SUITE-MoveReplicaHDFSTest-seed#[CAA7DEB88B0DD212]-worker) [    ] o.a.s.SolrTestCaseJ4 SecureRandom sanity checks: test.solr.allowed.securerandom=null & java.security.egd=file:/dev/./urandom
   [junit4]   2> Creating dataDir: /home/jenkins/workspace/Lucene-Solr-master-Linux/solr/build/solr-core/test/J2/temp/solr.cloud.MoveReplicaHDFSTest_CAA7DEB88B0DD212-001/init-core-data-001
   [junit4]   2> 1352168 WARN  (SUITE-MoveReplicaHDFSTest-seed#[CAA7DEB88B0DD212]-worker) [    ] o.a.s.SolrTestCaseJ4 startTrackingSearchers: numOpens=17 numCloses=17
   [junit4]   2> 1352168 INFO  (SUITE-MoveReplicaHDFSTest-seed#[CAA7DEB88B0DD212]-worker) [    ] o.a.s.SolrTestCaseJ4 Using TrieFields (NUMERIC_POINTS_SYSPROP=false) w/NUMERIC_DOCVALUES_SYSPROP=false
   [junit4]   2> 1352169 INFO  (SUITE-MoveReplicaHDFSTest-seed#[CAA7DEB88B0DD212]-worker) [    ] o.a.s.SolrTestCaseJ4 Randomized ssl (false) and clientAuth (false) via: @org.apache.solr.util.RandomizeSSL(reason="", value=0.0/0.0, ssl=0.0/0.0, clientAuth=0.0/0.0)
   [junit4]   2> 1352169 INFO  (SUITE-MoveReplicaHDFSTest-seed#[CAA7DEB88B0DD212]-worker) [    ] o.a.s.c.MiniSolrCloudCluster Starting cluster of 4 servers in /home/jenkins/workspace/Lucene-Solr-master-Linux/solr/build/solr-core/test/J2/temp/solr.cloud.MoveReplicaHDFSTest_CAA7DEB88B0DD212-001/tempDir-001
   [junit4]   2> 1352169 INFO  (SUITE-MoveReplicaHDFSTest-seed#[CAA7DEB88B0DD212]-worker) [    ] o.a.s.c.ZkTestServer STARTING ZK TEST SERVER
   [junit4]   2> 1352170 INFO  (Thread-4049) [    ] o.a.s.c.ZkTestServer client port:0.0.0.0/0.0.0.0:0
   [junit4]   2> 1352170 INFO  (Thread-4049) [    ] o.a.s.c.ZkTestServer Starting server
   [junit4]   2> 1352171 ERROR (Thread-4049) [    ] o.a.z.s.ZooKeeperServer ZKShutdownHandler is not registered, so ZooKeeper server won't take any action on ERROR or SHUTDOWN server state changes
   [junit4]   2> 1352270 INFO  (SUITE-MoveReplicaHDFSTest-seed#[CAA7DEB88B0DD212]-worker) [    ] o.a.s.c.ZkTestServer start zk server on port:45585
   [junit4]   2> 1352271 INFO  (zkConnectionManagerCallback-6874-thread-1) [    ] o.a.s.c.c.ConnectionManager zkClient has connected
   [junit4]   2> 1352273 INFO  (jetty-launcher-6871-thread-2) [    ] o.e.j.s.Server jetty-9.4.11.v20180605; built: 2018-06-05T18:24:03.829Z; git: d5fc0523cfa96bfebfbda19606cad384d772f04c; jvm 10+46
   [junit4]   2> 1352273 INFO  (jetty-launcher-6871-thread-1) [    ] o.e.j.s.Server jetty-9.4.11.v20180605; built: 2018-06-05T18:24:03.829Z; git: d5fc0523cfa96bfebfbda19606cad384d772f04c; jvm 10+46
   [junit4]   2> 1352273 INFO  (jetty-launcher-6871-thread-3) [    ] o.e.j.s.Server jetty-9.4.11.v20180605; built: 2018-06-05T18:24:03.829Z; git: d5fc0523cfa96bfebfbda19606cad384d772f04c; jvm 10+46
   [junit4]   2> 1352274 INFO  (jetty-launcher-6871-thread-4) [    ] o.e.j.s.Server jetty-9.4.11.v20180605; built: 2018-06-05T18:24:03.829Z; git: d5fc0523cfa96bfebfbda19606cad384d772f04c; jvm 10+46
   [junit4]   2> 1352275 INFO  (jetty-launcher-6871-thread-4) [    ] o.e.j.s.session DefaultSessionIdManager workerName=node0
   [junit4]   2> 1352275 INFO  (jetty-launcher-6871-thread-4) [    ] o.e.j.s.session No SessionScavenger set, using defaults
   [junit4]   2> 1352275 INFO  (jetty-launcher-6871-thread-4) [    ] o.e.j.s.session node0 Scavenging every 660000ms
   [junit4]   2> 1352275 INFO  (jetty-launcher-6871-thread-3) [    ] o.e.j.s.session DefaultSessionIdManager workerName=node0
   [junit4]   2> 1352275 INFO  (jetty-launcher-6871-thread-3) [    ] o.e.j.s.session No SessionScavenger set, using defaults
   [junit4]   2> 1352275 INFO  (jetty-launcher-6871-thread-4) [    ] o.e.j.s.h.ContextHandler Started o.e.j.s.ServletContextHandler@481ff478{/solr,null,AVAILABLE}
   [junit4]   2> 1352275 INFO  (jetty-launcher-6871-thread-3) [    ] o.e.j.s.session node0 Scavenging every 660000ms
   [junit4]   2> 1352275 INFO  (jetty-launcher-6871-thread-1) [    ] o.e.j.s.session DefaultSessionIdManager workerName=node0
   [junit4]   2> 1352275 INFO  (jetty-launcher-6871-thread-1) [    ] o.e.j.s.session No SessionScavenger set, using defaults
   [junit4]   2> 1352275 INFO  (jetty-launcher-6871-thread-1) [    ] o.e.j.s.session node0 Scavenging every 660000ms
   [junit4]   2> 1352276 INFO  (jetty-launcher-6871-thread-1) [    ] o.e.j.s.h.ContextHandler Started o.e.j.s.ServletContextHandler@2092e81a{/solr,null,AVAILABLE}
   [junit4]   2> 1352276 INFO  (jetty-launcher-6871-thread-3) [    ] o.e.j.s.h.ContextHandler Started o.e.j.s.ServletContextHandler@4452e607{/solr,null,AVAILABLE}
   [junit4]   2> 1352276 INFO  (jetty-launcher-6871-thread-2) [    ] o.e.j.s.session DefaultSessionIdManager workerName=node0
   [junit4]   2> 1352276 INFO  (jetty-launcher-6871-thread-2) [    ] o.e.j.s.session No SessionScavenger set, using defaults
   [junit4]   2> 1352276 INFO  (jetty-launcher-6871-thread-2) [    ] o.e.j.s.session node0 Scavenging every 600000ms
   [junit4]   2> 1352276 INFO  (jetty-launcher-6871-thread-4) [    ] o.e.j.s.AbstractConnector Started ServerConnector@754bfc8a{HTTP/1.1,[http/1.1]}{127.0.0.1:33341}
   [junit4]   2> 1352276 INFO  (jetty-launcher-6871-thread-4) [    ] o.e.j.s.Server Started @1352315ms
   [junit4]   2> 1352276 INFO  (jetty-launcher-6871-thread-4) [    ] o.a.s.c.s.e.JettySolrRunner Jetty properties: {hostContext=/solr, hostPort=33341}
   [junit4]   2> 1352276 INFO  (jetty-launcher-6871-thread-2) [    ] o.e.j.s.h.ContextHandler Started o.e.j.s.ServletContextHandler@49932266{/solr,null,AVAILABLE}
   [junit4]   2> 1352276 ERROR (jetty-launcher-6871-thread-4) [    ] o.a.s.u.StartupLoggingUtils Missing Java Option solr.log.dir. Logging may be missing or incomplete.
   [junit4]   2> 1352276 INFO  (jetty-launcher-6871-thread-4) [    ] o.a.s.s.SolrDispatchFilter Using logger factory org.apache.logging.slf4j.Log4jLoggerFactory
   [junit4]   2> 1352276 INFO  (jetty-launcher-6871-thread-4) [    ] o.a.s.s.SolrDispatchFilter  ___      _       Welcome to Apache Solr™ version 8.0.0
   [junit4]   2> 1352276 INFO  (jetty-launcher-6871-thread-4) [    ] o.a.s.s.SolrDispatchFilter / __| ___| |_ _   Starting in cloud mode on port null
   [junit4]   2> 1352276 INFO  (jetty-launcher-6871-thread-4) [    ] o.a.s.s.SolrDispatchFilter \__ \/ _ \ | '_|  Install dir: null
   [junit4]   2> 1352276 INFO  (jetty-launcher-6871-thread-4) [    ] o.a.s.s.SolrDispatchFilter |___/\___/_|_|    Start time: 2018-09-01T06:18:42.077971Z
   [junit4]   2> 1352277 INFO  (jetty-launcher-6871-thread-2) [    ] o.e.j.s.AbstractConnector Started ServerConnector@2d0d6d94{HTTP/1.1,[http/1.1]}{127.0.0.1:35641}
   [junit4]   2> 1352277 INFO  (jetty-launcher-6871-thread-2) [    ] o.e.j.s.Server Started @1352315ms
   [junit4]   2> 1352277 INFO  (jetty-launcher-6871-thread-2) [    ] o.a.s.c.s.e.JettySolrRunner Jetty properties: {hostContext=/solr, hostPort=35641}
   [junit4]   2> 1352277 ERROR (jetty-launcher-6871-thread-2) [    ] o.a.s.u.StartupLoggingUtils Missing Java Option solr.log.dir. Logging may be missing or incomplete.
   [junit4]   2> 1352277 INFO  (jetty-launcher-6871-thread-2) [    ] o.a.s.s.SolrDispatchFilter Using logger factory org.apache.logging.slf4j.Log4jLoggerFactory
   [junit4]   2> 1352277 INFO  (jetty-launcher-6871-thread-2) [    ] o.a.s.s.SolrDispatchFilter  ___      _       Welcome to Apache Solr™ version 8.0.0
   [junit4]   2> 1352277 INFO  (jetty-launcher-6871-thread-2) [    ] o.a.s.s.SolrDispatchFilter / __| ___| |_ _   Starting in cloud mode on port null
   [junit4]   2> 1352277 INFO  (jetty-launcher-6871-thread-3) [    ] o.e.j.s.AbstractConnector Started ServerConnector@22a6a870{HTTP/1.1,[http/1.1]}{127.0.0.1:32831}
   [junit4]   2> 1352277 INFO  (jetty-launcher-6871-thread-1) [    ] o.e.j.s.AbstractConnector Started ServerConnector@73b53765{HTTP/1.1,[http/1.1]}{127.0.0.1:46333}
   [junit4]   2> 1352277 INFO  (jetty-launcher-6871-thread-2) [    ] o.a.s.s.SolrDispatchFilter \__ \/ _ \ | '_|  Install dir: null
   [junit4]   2> 1352277 INFO  (jetty-launcher-6871-thread-2) [    ] o.a.s.s.SolrDispatchFilter |___/\___/_|_|    Start time: 2018-09-01T06:18:42.078436Z
   [junit4]   2> 1352277 INFO  (jetty-launcher-6871-thread-3) [    ] o.e.j.s.Server Started @1352316ms
   [junit4]   2> 1352277 INFO  (jetty-launcher-6871-thread-1) [    ] o.e.j.s.Server Started @1352316ms
   [junit4]   2> 1352277 INFO  (jetty-launcher-6871-thread-3) [    ] o.a.s.c.s.e.JettySolrRunner Jetty properties: {hostContext=/solr, hostPort=32831}
   [junit4]   2> 1352277 INFO  (jetty-launcher-6871-thread-1) [    ] o.a.s.c.s.e.JettySolrRunner Jetty properties: {hostContext=/solr, hostPort=46333}
   [junit4]   2> 1352277 ERROR (jetty-launcher-6871-thread-3) [    ] o.a.s.u.StartupLoggingUtils Missing Java Option solr.log.dir. Logging may be missing or incomplete.
   [junit4]   2> 1352277 INFO  (jetty-launcher-6871-thread-3) [    ] o.a.s.s.SolrDispatchFilter Using logger factory org.apache.logging.slf4j.Log4jLoggerFactory
   [junit4]   2> 1352277 INFO  (jetty-launcher-6871-thread-3) [    ] o.a.s.s.SolrDispatchFilter  ___      _       Welcome to Apache Solr™ version 8.0.0
   [junit4]   2> 1352277 INFO  (jetty-launcher-6871-thread-3) [    ] o.a.s.s.SolrDispatchFilter / __| ___| |_ _   Starting in cloud mode on port null
   [junit4]   2> 1352277 INFO  (jetty-launcher-6871-thread-3) [    ] o.a.s.s.SolrDispatchFilter \__ \/ _ \ | '_|  Install dir: null
   [junit4]   2> 1352277 INFO  (jetty-launcher-6871-thread-3) [    ] o.a.s.s.SolrDispatchFilter |___/\___/_|_|    Start time: 2018-09-01T06:18:42.078629Z
   [junit4]   2> 1352278 ERROR (jetty-launcher-6871-thread-1) [    ] o.a.s.u.StartupLoggingUtils Missing Java Option solr.log.dir. Logging may be missing or incomplete.
   [junit4]   2> 1352278 INFO  (jetty-launcher-6871-thread-1) [    ] o.a.s.s.SolrDispatchFilter Using logger factory org.apache.logging.slf4j.Log4jLoggerFactory
   [junit4]   2> 1352278 INFO  (jetty-launcher-6871-thread-1) [    ] o.a.s.s.SolrDispatchFilter  ___      _       Welcome to Apache Solr™ version 8.0.0
   [junit4]   2> 1352278 INFO  (jetty-launcher-6871-thread-1) [    ] o.a.s.s.SolrDispatchFilter / __| ___| |_ _   Starting in cloud mode on port null
   [junit4]   2> 1352278 INFO  (jetty-launcher-6871-thread-1) [    ] o.a.s.s.SolrDispatchFilter \__ \/ _ \ | '_|  Install dir: null
   [junit4]   2> 1352278 INFO  (jetty-launcher-6871-thread-1) [    ] o.a.s.s.SolrDispatchFilter |___/\___/_|_|    Start time: 2018-09-01T06:18:42.079214Z
   [junit4]   2> 1352278 INFO  (zkConnectionManagerCallback-6876-thread-1) [    ] o.a.s.c.c.ConnectionManager zkClient has connected
   [junit4]   2> 1352278 INFO  (zkConnectionManagerCallback-6878-thread-1) [    ] o.a.s.c.c.ConnectionManager zkClient has connected
   [junit4]   2> 1352278 INFO  (jetty-launcher-6871-thread-2) [    ] o.a.s.s.SolrDispatchFilter solr.xml found in ZooKeeper. Loading...
   [junit4]   2> 1352278 INFO  (jetty-launcher-6871-thread-4) [    ] o.a.s.s.SolrDispatchFilter solr.xml found in ZooKeeper. Loading...
   [junit4]   2> 1352278 INFO  (zkConnectionManagerCallback-6880-thread-1) [    ] o.a.s.c.c.ConnectionManager zkClient has connected
   [junit4]   2> 1352279 INFO  (jetty-launcher-6871-thread-3) [    ] o.a.s.s.SolrDispatchFilter solr.xml found in ZooKeeper. Loading...
   [junit4]   2> 1352293 INFO  (zkConnectionManagerCallback-6882-thread-1) [    ] o.a.s.c.c.ConnectionManager zkClient has connected
   [junit4]   2> 1352293 INFO  (jetty-launcher-6871-thread-1) [    ] o.a.s.s.SolrDispatchFilter solr.xml found in ZooKeeper. Loading...
   [junit4]   2> 1352295 WARN  (NIOServerCxn.Factory:0.0.0.0/0.0.0.0:0) [    ] o.a.z.s.NIOServerCnxn Unable to read additional data from client sessionid 0x1005228b5700001, likely client has closed socket
   [junit4]   2> 1352347 INFO  (jetty-launcher-6871-thread-2) [    ] o.a.s.c.ZkContainer Zookeeper client=127.0.0.1:45585/solr
   [junit4]   2> 1352347 INFO  (zkConnectionManagerCallback-6886-thread-1) [    ] o.a.s.c.c.ConnectionManager zkClient has connected
   [junit4]   2> 1352348 DEBUG (jetty-launcher-6871-thread-2) [n:127.0.0.1:35641_solr    ] o.a.s.c.ZkController Added new OnReconnect listener org.apache.solr.cloud.ZkController$$Lambda$390/1509026845@71169bca
   [junit4]   2> 1352349 INFO  (zkConnectionManagerCallback-6888-thread-1) [    ] o.a.s.c.c.ConnectionManager zkClient has connected
   [junit4]   2> 1352363 INFO  (jetty-launcher-6871-thread-4) [    ] o.a.s.c.ZkContainer Zookeeper client=127.0.0.1:45585/solr
   [junit4]   2> 1352382 INFO  (zkConnectionManagerCallback-6894-thread-1) [    ] o.a.s.c.c.ConnectionManager zkClient has connected
   [junit4]   2> 1352383 DEBUG (jetty-launcher-6871-thread-4) [n:127.0.0.1:33341_solr    ] o.a.s.c.ZkController Added new OnReconnect listener org.apache.solr.cloud.ZkController$$Lambda$390/1509026845@57009237
   [junit4]   2> 1352390 DEBUG (SyncThread:0) [    ] o.a.s.c.ZkTestServer Watch added: create/delete: /solr/clusterprops.json
   [junit4]   2> 1352390 DEBUG (SyncThread:0) [    ] o.a.s.c.ZkTestServer Watch added: children: /solr/live_nodes
   [junit4]   2> 1352390 DEBUG (SyncThread:0) [    ] o.a.s.c.ZkTestServer Watch added: data: /solr/clusterstate.json
   [junit4]   2> 1352390 DEBUG (SyncThread:0) [    ] o.a.s.c.ZkTestServer Watch added: children: /solr/collections
   [junit4]   2> 1352390 DEBUG (SyncThread:0) [    ] o.a.s.c.ZkTestServer Watch added: create/delete: /solr/aliases.json
   [junit4]   2> 1352391 DEBUG (SyncThread:0) [    ] o.a.s.c.ZkTestServer Watch added: create/delete: /solr/security.json
   [junit4]   2> 1352392 DEBUG (jetty-launcher-6871-thread-2) [n:127.0.0.1:35641_solr    ] o.a.s.c.LeaderElector Joined leadership election with path: /overseer_elect/election/72147928834113542-127.0.0.1:35641_solr-n_0000000000
   [junit4]   2> 1352392 INFO  (zkConnectionManagerCallback-6896-thread-1) [    ] o.a.s.c.c.ConnectionManager zkClient has connected
   [junit4]   2> 1352392 INFO  (jetty-launcher-6871-thread-2) [n:127.0.0.1:35641_solr    ] o.a.s.c.OverseerElectionContext I am going to be the leader 127.0.0.1:35641_solr
   [junit4]   2> 1352392 INFO  (jetty-launcher-6871-thread-2) [n:127.0.0.1:35641_solr    ] o.a.s.c.Overseer Overseer (id=72147928834113542-127.0.0.1:35641_solr-n_0000000000) starting
   [junit4]   2> 1352393 INFO  (jetty-launcher-6871-thread-3) [    ] o.a.s.c.ZkContainer Zookeeper client=127.0.0.1:45585/solr
   [junit4]   2> 1352395 DEBUG (SyncThread:0) [    ] o.a.s.c.ZkTestServer Watch added: create/delete: /solr/clusterprops.json
   [junit4]   2> 1352395 DEBUG (SyncThread:0) [    ] o.a.s.c.ZkTestServer Watch added: children: /solr/live_nodes
   [junit4]   2> 1352395 DEBUG (SyncThread:0) [    ] o.a.s.c.ZkTestServer Watch added: data: /solr/clusterstate.json
   [junit4]   2> 1352396 DEBUG (SyncThread:0) [    ] o.a.s.c.ZkTestServer Watch added: children: /solr/collections
   [junit4]   2> 1352396 INFO  (zkConnectionManagerCallback-6900-thread-1) [    ] o.a.s.c.c.ConnectionManager zkClient has connected
   [junit4]   2> 1352396 DEBUG (SyncThread:0) [    ] o.a.s.c.ZkTestServer Watch added: create/delete: /solr/aliases.json
   [junit4]   2> 1352396 DEBUG (SyncThread:0) [    ] o.a.s.c.ZkTestServer Watch added: create/delete: /solr/security.json
   [junit4]   2> 1352396 DEBUG (jetty-launcher-6871-thread-3) [n:127.0.0.1:32831_solr    ] o.a.s.c.ZkController Added new OnReconnect listener org.apache.solr.cloud.ZkController$$Lambda$390/1509026845@37a5ffef
   [junit4]   2> 1352396 WARN  (NIOServerCxn.Factory:0.0.0.0/0.0.0.0:0) [    ] o.a.z.s.NIOServerCnxn Unable to read additional data from client sessionid 0x1005228b5700009, likely client has closed socket
   [junit4]   2> 1352397 DEBUG (jetty-launcher-6871-thread-4) [n:127.0.0.1:33341_solr    ] o.a.s.c.LeaderElector Joined leadership election with path: /overseer_elect/election/72147928834113544-127.0.0.1:33341_solr-n_0000000001
   [junit4]   2> 1352397 DEBUG (SyncThread:0) [    ] o.a.s.c.ZkTestServer Watch added: data: /solr/overseer_elect/election/72147928834113542-127.0.0.1:35641_solr-n_0000000000
   [junit4]   2> 1352397 INFO  (zkConnectionManagerCallback-6910-thread-1) [    ] o.a.s.c.c.ConnectionManager zkClient has connected
   [junit4]   2> 1352397 DEBUG (jetty-launcher-6871-thread-4) [n:127.0.0.1:33341_solr    ] o.a.s.c.LeaderElector Watching path /overseer_elect/election/72147928834113542-127.0.0.1:35641_solr-n_0000000000 to know if I could be the leader
   [junit4]   2> 1352397 INFO  (jetty-launcher-6871-thread-4) [n:127.0.0.1:33341_solr    ] o.a.s.c.ZkController Register node as live in ZooKeeper:/live_nodes/127.0.0.1:33341_solr
   [junit4]   2> 1352397 INFO  (jetty-launcher-6871-thread-1) [    ] o.a.s.c.ZkContainer Zookeeper client=127.0.0.1:45585/solr
   [junit4]   2> 1352397 DEBUG (SyncThread:0) [    ] o.a.s.c.ZkTestServer Watch fired: children: /solr/live_nodes
   [junit4]   2> 1352397 DEBUG (SyncThread:0) [    ] o.a.s.c.ZkTestServer Watch fired: children: /solr/live_nodes
   [junit4]   2> 1352398 DEBUG (SyncThread:0) [    ] o.a.s.c.ZkTestServer Watch added: children: /solr/live_nodes
   [junit4]   2> 1352398 DEBUG (SyncThread:0) [    ] o.a.s.c.ZkTestServer Watch added: children: /solr/live_nodes
   [junit4]   2> 1352398 INFO  (zkCallback-6895-thread-1) [    ] o.a.s.c.c.ZkStateReader Updated live nodes from ZooKeeper... (0) -> (1)
   [junit4]   2> 1352398 INFO  (zkConnectionManagerCallback-6908-thread-1) [    ] o.a.s.c.c.ConnectionManager zkClient has connected
   [junit4]   2> 1352398 INFO  (zkCallback-6887-thread-1) [    ] o.a.s.c.c.ZkStateReader Updated live nodes from ZooKeeper... (0) -> (1)
   [junit4]   2> 1352398 INFO  (zkConnectionManagerCallback-6913-thread-1) [    ] o.a.s.c.c.ConnectionManager zkClient has connected
   [junit4]   2> 1352399 DEBUG (jetty-launcher-6871-thread-1) [n:127.0.0.1:46333_solr    ] o.a.s.c.ZkController Added new OnReconnect listener org.apache.solr.cloud.ZkController$$Lambda$390/1509026845@7d33d2a
   [junit4]   2> 1352399 DEBUG (SyncThread:0) [    ] o.a.s.c.ZkTestServer Watch added: create/delete: /solr/clusterprops.json
   [junit4]   2> 1352399 DEBUG (SyncThread:0) [    ] o.a.s.c.ZkTestServer Watch added: children: /solr/live_nodes
   [junit4]   2> 1352399 INFO  (jetty-launcher-6871-thread-2) [n:127.0.0.1:35641_solr    ] o.a.s.c.c.ZkStateReader Updated live nodes from ZooKeeper... (0) -> (1)
   [junit4]   2> 1352399 DEBUG (SyncThread:0) [    ] o.a.s.c.ZkTestServer Watch added: data: /solr/clusterstate.json
   [junit4]   2> 1352399 DEBUG (SyncThread:0) [    ] o.a.s.c.ZkTestServer Watch added: children: /solr/collections
   [junit4]   2> 1352399 INFO  (zkConnectionManagerCallback-6915-thread-1) [    ] o.a.s.c.c.ConnectionManager zkClient has connected
   [junit4]   2> 1352399 DEBUG (SyncThread:0) [    ] o.a.s.c.ZkTestServer Watch added: create/delete: /solr/aliases.json
   [junit4]   2> 1352399 INFO  (jetty-launcher-6871-thread-2) [n:127.0.0.1:35641_solr    ] o.a.s.c.s.i.ZkClientClusterStateProvider Cluster at 127.0.0.1:45585/solr ready
   [junit4]   2> 1352400 DEBUG (OverseerCollectionConfigSetProcessor-72147928834113542-127.0.0.1:35641_solr-n_0000000000) [n:127.0.0.1:35641_solr    ] o.a.s.c.OverseerTaskProcessor Process current queue of overseer operations
   [junit4]   2> 1352400 INFO  (OverseerStateUpdate-72147928834113542-127.0.0.1:35641_solr-n_0000000000) [n:127.0.0.1:35641_solr    ] o.a.s.c.Overseer Starting to work on the main queue : 127.0.0.1:35641_solr
   [junit4]   2> 1352400 DEBUG (OverseerAutoScalingTriggerThread-72147928834113542-127.0.0.1:35641_solr-n_0000000000) [    ] o.a.s.c.a.OverseerTriggerThread Adding .auto_add_replicas and .scheduled_maintenance triggers
   [junit4]   2> 1352400 DEBUG (jetty-launcher-6871-thread-2) [n:127.0.0.1:35641_solr    ] o.a.s.c.ZkController Publish node=127.0.0.1:35641_solr as DOWN
   [junit4]   2> 1352400 DEBUG (SyncThread:0) [    ] o.a.s.c.ZkTestServer Watch added: data: /solr/autoscaling.json
   [junit4]   2> 1352401 DEBUG (OverseerAutoScalingTriggerThread-72147928834113542-127.0.0.1:35641_solr-n_0000000000) [    ] o.a.s.c.a.OverseerTriggerThread Refreshing /autoscaling.json with znode version 1
   [junit4]   2> 1352401 DEBUG (OverseerCollectionConfigSetProcessor-72147928834113542-127.0.0.1:35641_solr-n_0000000000) [n:127.0.0.1:35641_solr    ] o.a.s.c.OverseerTaskProcessor Cleaning up work-queue. #Running tasks: 0
   [junit4]   2> 1352401 DEBUG (OverseerCollectionConfigSetProcessor-72147928834113542-127.0.0.1:35641_solr-n_0000000000) [n:127.0.0.1:35641_solr    ] o.a.s.c.OverseerTaskProcessor RunningTasks: []
   [junit4]   2> 1352401 DEBUG (OverseerCollectionConfigSetProcessor-72147928834113542-127.0.0.1:35641_solr-n_0000000000) [n:127.0.0.1:35641_solr    ] o.a.s.c.OverseerTaskProcessor BlockedTasks: []
   [junit4]   2> 1352401 DEBUG (OverseerCollectionConfigSetProcessor-72147928834113542-127.0.0.1:35641_solr-n_0000000000) [n:127.0.0.1:35641_solr    ] o.a.s.c.OverseerTaskProcessor CompletedTasks: []
   [junit4]   2> 1352401 DEBUG (OverseerCollectionConfigSetProcessor-72147928834113542-127.0.0.1:35641_solr-n_0000000000) [n:127.0.0.1:35641_solr    ] o.a.s.c.OverseerTaskProcessor RunningZKTasks: []
   [junit4]   2> 1352401 DEBUG (OverseerAutoScalingTriggerThread-72147928834113542-127.0.0.1:35641_solr-n_0000000000) [    ] o.a.s.c.a.OverseerTriggerThread Current znodeVersion 1, lastZnodeVersion -1
   [junit4]   2> 1352401 DEBUG (OverseerAutoScalingTriggerThread-72147928834113542-127.0.0.1:35641_solr-n_0000000000) [    ] o.a.s.c.a.OverseerTriggerThread Processed trigger updates upto znodeVersion 1
   [junit4]   2> 1352401 DEBUG (OverseerCollectionConfigSetProcessor-72147928834113542-127.0.0.1:35641_solr-n_0000000000) [n:127.0.0.1:35641_solr    ] o.a.s.c.OverseerTaskQueue Peeking for top 100 elements. ExcludeSet: []
   [junit4]   2> 1352401 INFO  (jetty-launcher-6871-thread-2) [n:127.0.0.1:35641_solr    ] o.a.s.c.TransientSolrCoreCacheDefault Allocating transient cache for 2147483647 transient cores
   [junit4]   2> 1352401 INFO  (jetty-launcher-6871-thread-2) [n:127.0.0.1:35641_solr    ] o.a.s.c.ZkController Register node as live in ZooKeeper:/live_nodes/127.0.0.1:35641_solr
   [junit4]   2> 1352401 DEBUG (SyncThread:0) [    ] o.a.s.c.ZkTestServer Watch added: children: /solr/overseer/collection-queue-work
   [junit4]   2> 1352401 DEBUG (SyncThread:0) [    ] o.a.s.c.ZkTestServer Watch added: children: /solr/overseer/queue-work
   [junit4]   2> 1352401 DEBUG (SyncThread:0) [    ] o.a.s.c.ZkTestServer Watch added: children: /solr/overseer/queue
   [junit4]   2> 1352401 DEBUG (SyncThread:0) [    ] o.a.s.c.ZkTestServer Watch fired: children: /solr/live_nodes
   [junit4]   2> 1352401 DEBUG (SyncThread:0) [    ] o.a.s.c.ZkTestServer Watch fired: children: /solr/live_nodes
   [junit4]   2> 1352401 DEBUG (SyncThread:0) [    ] o.a.s.c.ZkTestServer Watch fired: children: /solr/live_nodes
   [junit4]   2> 1352402 DEBUG (SyncThread:0) [    ] o.a.s.c.ZkTestServer Watch added: children: /solr/live_nodes
   [junit4]   2> 1352402 DEBUG (SyncThread:0) [    ] o.a.s.c.ZkTestServer Watch added: children: /solr/live_nodes
   [junit4]   2> 1352402 INFO  (zkCallback-6895-thread-1) [    ] o.a.s.c.c.ZkStateReader Updated live nodes from ZooKeeper... (1) -> (2)
   [junit4]   2> 1352402 INFO  (zkCallback-6907-thread-1) [    ] o.a.s.c.c.ZkStateReader Updated live nodes from ZooKeeper... (1) -> (2)
   [junit4]   2> 1352406 DEBUG (SyncThread:0) [    ] o.a.s.c.ZkTestServer Watch added: create/delete: /solr/clusterprops.json
   [junit4]   2> 1352407 DEBUG (SyncThread:0) [    ] o.a.s.c.ZkTestServer Watch added: children: /solr/live_nodes
   [junit4]   2> 1352407 INFO  (jetty-launcher-6871-thread-3) [n:127.0.0.1:32831_solr    ] o.a.s.c.c.ZkStateReader Updated live nodes from ZooKeeper... (0) -> (2)
   [junit4]   2> 1352407 DEBUG (SyncThread:0) [    ] o.a.s.c.ZkTestServer Watch added: data: /solr/clusterstate.json
   [junit4]   2> 1352407 DEBUG (SyncThread:0) [    ] o.a.s.c.ZkTestServer Watch added: children: /solr/collections
   [junit4]   2> 1352407 DEBUG (SyncThread:0) [    ] o.a.s.c.ZkTestServer Watch added: create/delete: /solr/aliases.json
   [junit4]   2> 1352407 DEBUG (SyncThread:0) [    ] o.a.s.c.ZkTestServer Watch added: create/delete: /solr/security.json
   [junit4]   2> 1352408 DEBUG (jetty-launcher-6871-thread-3) [n:127.0.0.1:32831_solr    ] o.a.s.c.LeaderElector Joined leadership election with path: /overseer_elect/election/72147928834113547-127.0.0.1:32831_solr-n_0000000002
   [junit4]   2> 1352409 DEBUG (SyncThread:0) [    ] o.a.s.c.ZkTestServer Watch added: data: /solr/overseer_elect/election/72147928834113544-127.0.0.1:33341_solr-n_0000000001
   [junit4]   2> 1352409 DEBUG (jetty-launcher-6871-thread-3) [n:127.0.0.1:32831_solr    ] o.a.s.c.LeaderElector Watching path /overseer_elect/election/72147928834113544-127.0.0.1:33341_solr-n_0000000001 to know if I could be the leader
   [junit4]   2> 1352409 DEBUG (jetty-launcher-6871-thread-3) [n:127.0.0.1:32831_solr    ] o.a.s.c.ZkController Publish node=127.0.0.1:32831_solr as DOWN
   [junit4]   2> 1352409 DEBUG (SyncThread:0) [    ] o.a.s.c.ZkTestServer Watch fired: children: /solr/overseer/queue
   [junit4]   2> 1352409 INFO  (zkConnectionManagerCallback-6922-thread-1) [    ] o.a.s.c.c.ConnectionManager zkClient has connected
   [junit4]   2> 1352409 INFO  (jetty-launcher-6871-thread-3) [n:127.0.0.1:32831_solr    ] o.a.s.c.TransientSolrCoreCacheDefault Allocating transient cache for 2147483647 transient cores
   [junit4]   2> 1352409 INFO  (jetty-launcher-6871-thread-3) [n:127.0.0.1:32831_solr    ] o.a.s.c.ZkController Register node as live in ZooKeeper:/live_nodes/127.0.0.1:32831_solr
   [junit4]   2> 1352410 DEBUG (SyncThread:0) [    ] o.a.s.c.ZkTestServer Watch fired: children: /solr/live_nodes
   [junit4]   2> 1352410 DEBUG (SyncThread:0) [    ] o.a.s.c.ZkTestServer Watch fired: children: /solr/live_nodes
   [junit4]   2> 1352410 DEBUG (SyncThread:0) [    ] o.a.s.c.ZkTestServer Watch fired: children: /solr/live_nodes
   [junit4]   2> 1352414 INFO  (jetty-launcher-6871-thread-2) [n:127.0.0.1:35641_solr    ] o.a.s.h.a.MetricsHistoryHandler No .system collection, keeping metrics history in memory.
   [junit4]   2> 1352418 DEBUG (SyncThread:0) [    ] o.a.s.c.ZkTestServer Watch added: children: /solr/live_nodes
   [junit4]   2> 1352418 DEBUG (SyncThread:0) [    ] o.a.s.c.ZkTestServer Watch added: children: /solr/live_nodes
   [junit4]   2> 1352418 INFO  (zkCallback-6895-thread-1) [    ] o.a.s.c.c.ZkStateReader Updated live nodes from ZooKeeper... (2) -> (3)
   [junit4]   2> 1352418 DEBUG (SyncThread:0) [    ] o.a.s.c.ZkTestServer Watch added: children: /solr/live_nodes
   [junit4]   2> 1352418 INFO  (zkCallback-6907-thread-1) [    ] o.a.s.c.c.ZkStateReader Updated live nodes from ZooKeeper... (2) -> (3)
   [junit4]   2> 1352418 DEBUG (SyncThread:0) [    ] o.a.s.c.ZkTestServer Watch added: children: /solr/overseer/queue
   [junit4]   2> 1352418 DEBUG (SyncThread:0) [    ] o.a.s.c.ZkTestServer Watch added: create/delete: /solr/clusterprops.json
   [junit4]   2> 1352418 INFO  (zkCallback-6887-thread-1) [    ] o.a.s.c.c.ZkStateReader Updated live nodes from ZooKeeper... (1) -> (3)
   [junit4]   2> 1352419 DEBUG (SyncThread:0) [    ] o.a.s.c.ZkTestServer Watch added: children: /solr/live_nodes
   [junit4]   2> 1352419 INFO  (jetty-launcher-6871-thread-4) [n:127.0.0.1:33341_solr    ] o.a.s.c.c.ZkStateReader Updated live nodes from ZooKeeper... (0) -> (3)
   [junit4]   2> 1352419 DEBUG (SyncThread:0) [    ] o.a.s.c.ZkTestServer Watch added: data: /solr/clusterstate.json
   [junit4]   2> 1352433 DEBUG (SyncThread:0) [    ] o.a.s.c.ZkTestServer Watch added: children: /solr/collections
   [junit4]   2> 1352433 DEBUG (SyncThread:0) [    ] o.a.s.c.ZkTestServer Watch added: create/delete: /solr/aliases.json
   [junit4]   2> 1352433 INFO  (jetty-launcher-6871-thread-4) [n:127.0.0.1:33341_solr    ] o.a.s.c.s.i.ZkClientClusterStateProvider Cluster at 127.0.0.1:45585/solr ready
   [junit4]   2> 1352434 DEBUG (SyncThread:0) [    ] o.a.s.c.ZkTestServer Watch added: children: /solr/live_nodes
   [junit4]   2> 1352434 INFO  (zkCallback-6909-thread-1) [    ] o.a.s.c.c.ZkStateReader Updated live nodes from ZooKeeper... (2) -> (3)
   [junit4]   2> 1352435 DEBUG (SyncThread:0) [    ] o.a.s.c.ZkTestServer Watch added: children: /solr/autoscaling/events/.scheduled_maintenance
   [junit4]   2> 1352436 DEBUG (OverseerAutoScalingTriggerThread-72147928834113542-127.0.0.1:35641_solr-n_0000000000) [    ] o.a.s.c.a.NodeLostTrigger NodeLostTrigger .auto_add_replicas - Initial livenodes: [127.0.0.1:32831_solr, 127.0.0.1:33341_solr, 127.0.0.1:35641_solr]
   [junit4]   2> 1352437 DEBUG (SyncThread:0) [    ] o.a.s.c.ZkTestServer Watch added: create/delete: /solr/clusterprops.json
   [junit4]   2> 1352437 DEBUG (SyncThread:0) [    ] o.a.s.c.ZkTestServer Watch added: children: /solr/live_nodes
   [junit4]   2> 1352437 INFO  (jetty-launcher-6871-thread-1) [n:127.0.0.1:46333_solr    ] o.a.s.c.c.ZkStateReader Updated live nodes from ZooKeeper... (0) -> (3)
   [junit4]   2> 1352437 DEBUG (SyncThread:0) [    ] o.a.s.c.ZkTestServer Watch added: data: /solr/clusterstate.json
   [junit4]   2> 1352437 DEBUG (SyncThread:0) [    ] o.a.s.c.ZkTestServer Watch added: children: /solr/collections
   [junit4]   2> 1352437 DEBUG (SyncThread:0) [    ] o.a.s.c.ZkTestServer Watch added: create/delete: /solr/aliases.json
   [junit4]   2> 1352438 DEBUG (SyncThread:0) [    ] o.a.s.c.ZkTestServer Watch added: create/delete: /solr/security.json
   [junit4]   2> 1352438 DEBUG (jetty-launcher-6871-thread-1) [n:127.0.0.1:46333_solr    ] o.a.s.c.LeaderElector Joined leadership election with path: /overseer_elect/election/72147928834113549-127.0.0.1:46333_solr-n_0000000003
   [junit4]   2> 1352438 DEBUG (SyncThread:0) [    ] o.a.s.c.ZkTestServer Watch added: data: /solr/overseer_elect/election/72147928834113547-127.0.0.1:32831_solr-n_0000000002
   [junit4]   2> 1352439 DEBUG (jetty-launcher-6871-thread-1) [n:127.0.0.1:46333_solr    ] o.a.s.c.LeaderElector Watching path /overseer_elect/election/72147928834113547-127.0.0.1:32831_solr-n_0000000002 to know if I could be the leader
   [junit4]   2> 1352439 DEBUG (jetty-launcher-6871-thread-1) [n:127.0.0.1:46333_solr    ] o.a.s.c.ZkController Publish node=127.0.0.1:46333_solr as DOWN
   [junit4]   2> 1352439 DEBUG (SyncThread:0) [    ] o.a.s.c.ZkTestServer Watch fired: children: /solr/overseer/queue
   [junit4]   2> 1352439 DEBUG (SyncThread:0) [    ] o.a.s.c.ZkTestServer Watch added: children: /solr/overseer/queue
   [junit4]   2> 1352439 INFO  (jetty-launcher-6871-thread-1) [n:127.0.0.1:46333_solr    ] o.a.s.c.TransientSolrCoreCacheDefault Allocating transient cache for 2147483647 transient cores
   [junit4]   2> 1352439 INFO  (jetty-launcher-6871-thread-1) [n:127.0.0.1:46333_solr    ] o.a.s.c.ZkController Register node as live in ZooKeeper:/live_nodes/127.0.0.1:46333_solr
   [junit4]   2> 1352440 DEBUG (SyncThread:0) [    ] o.a.s.c.ZkTestServer Watch fired: children: /solr/live_nodes
   [junit4]   2> 1352440 DEBUG (SyncThread:0) [    ] o.a.s.c.ZkTestServer Watch fired: children: /solr/live_nodes
   [junit4]   2> 1352440 DEBUG (SyncThread:0) [    ] o.a.s.c.ZkTestServer Watch fired: children: /solr/live_nodes
   [junit4]   2> 1352440 DEBUG (SyncThread:0) [    ] o.a.s.c.ZkTestServer Watch fired: children: /solr/live_nodes
   [junit4]   2> 1352440 DEBUG (SyncThread:0) [    ] o.a.s.c.ZkTestServer Watch fired: children: /solr/live_nodes
   [junit4]   2> 1352440 DEBUG (SyncThread:0) [    ] o.a.s.c.ZkTestServer Watch fired: children: /solr/live_nodes
   [junit4]   2> 1352440 DEBUG (SyncThread:0) [    ] o.a.s.c.ZkTestServer Watch added: children: /solr/live_nodes
   [junit4]   2> 1352440 INFO  (zkCallback-6887-thread-1) [    ] o.a.s.c.c.ZkStateReader Updated live nodes from ZooKeeper... (3) -> (4)
   [junit4]   2> 1352440 DEBUG (SyncThread:0) [    ] o.a.s.c.ZkTestServer Watch added: children: /solr/live_nodes
   [junit4]   2> 1352440 INFO  (zkCallback-6895-thread-1) [    ] o.a.s.c.c.ZkStateReader Updated live nodes from ZooKeeper... (3) -> (4)
   [junit4]   2> 1352440 DEBUG (SyncThread:0) [    ] o.a.s.c.ZkTestServer Watch added: children: /solr/live_nodes
   [junit4]   2> 1352440 DEBUG (SyncThread:0) [    ] o.a.s.c.ZkTestServer Watch added: children: /solr/live_nodes
   [junit4]   2> 1352440 INFO  (zkCallback-6907-thread-1) [    ] o.a.s.c.c.ZkStateReader Updated live nodes from ZooKeeper... (3) -> (4)
   [junit4]   2> 1352442 INFO  (jetty-launcher-6871-thread-2) [n:127.0.0.1:35641_solr    ] o.a.s.m.r.SolrJmxReporter JMX monitoring for 'solr_35641.solr.node' (registry 'solr.node') enabled at server: com.sun.jmx.mbeanserver.JmxMBeanServer@1906fe93
   [junit4]   2> 1352446 INFO  (zkCallback-6909-thread-1) [    ] o.a.s.c.c.ZkStateReader Updated live nodes from ZooKeeper... (3) -> (4)
   [junit4]   2> 1352447 INFO  (jetty-launcher-6871-thread-2) [n:127.0.0.1:35641_solr    ] o.a.s.m.r.SolrJmxReporter JMX monitoring for 'solr_35641.solr.jvm' (registry 'solr.jvm') enabled at server: com.sun.jmx.mbeanserver.JmxMBeanServer@1906fe93
   [junit4]   2> 1352448 INFO  (jetty-launcher-6871-thread-2) [n:127.0.0.1:35641_solr    ] o.a.s.m.r.SolrJmxReporter JMX monitoring for 'solr_35641.solr.jetty' (registry 'solr.jetty') enabled at server: com.sun.jmx.mbeanserver.JmxMBeanServer@1906fe93
   [junit4]   2> 1352448 INFO  (jetty-launcher-6871-thread-2) [n:127.0.0.1:35641_solr    ] o.a.s.c.CorePropertiesLocator Found 0 core definitions underneath /home/jenkins/workspace/Lucene-Solr-master-Linux/solr/build/solr-core/test/J2/temp/solr.cloud.MoveReplicaHDFSTest_CAA7DEB88B0DD212-001/tempDir-001/node2/.
   [junit4]   2> 1352450 INFO  (jetty-launcher-6871-thread-4) [n:127.0.0.1:33341_solr    ] o.a.s.h.a.MetricsHistoryHandler No .system collection, keeping metrics history in memory.
   [junit4]   2> 1352456 DEBUG (SyncThread:0) [    ] o.a.s.c.ZkTestServer Watch added: children: /solr/live_nodes
   [junit4]   2> 1352456 INFO  (zkCallback-6921-thread-1) [    ] o.a.s.c.c.ZkStateReader Updated live nodes from ZooKeeper... (3) -> (4)
   [junit4]   2> 1352458 DEBUG (OverseerAutoScalingTriggerThread-72147928834113542-127.0.0.1:35641_solr-n_0000000000) [    ] o.a.s.c.a.OverseerTriggerThread -- clean old nodeAdded markers
   [junit4]   2> 1352458 DEBUG (SyncThread:0) [    ] o.a.s.c.ZkTestServer Watch added: children: /solr/live_nodes
   [junit4]   2> 1352458 INFO  (zkCallback-6914-thread-1) [    ] o.a.s.c.c.ZkStateReader Updated live nodes from ZooKeeper... (3) -> (4)
   [junit4]   2> 1352459 DEBUG (OverseerAutoScalingTriggerThread-72147928834113542-127.0.0.1:35641_solr-n_0000000000) [    ] o.a.s.c.a.OverseerTriggerThread Current znodeVersion 1, lastZnodeVersion 1
   [junit4]   2> 1352459 DEBUG (SyncThread:0) [    ] o.a.s.c.ZkTestServer Watch added: children: /solr/autoscaling/events/.auto_add_replicas
   [junit4]   2> 1352459 DEBUG (ScheduledTrigger-6959-thread-3) [    ] o.a.s.c.a.NodeLostTrigger Running NodeLostTrigger: .auto_add_replicas with currently live nodes: 4
   [junit4]   2> 1352459 INFO  (jetty-launcher-6871-thread-4) [n:127.0.0.1:33341_solr    ] o.a.s.m.r.SolrJmxReporter JMX monitoring for 'solr_33341.solr.node' (registry 'solr.node') enabled at server: com.sun.jmx.mbeanserver.JmxMBeanServer@1906fe93
   [junit4]   2> 1352464 INFO  (jetty-launcher-6871-thread-4) [n:127.0.0.1:33341_solr    ] o.a.s.m.r.SolrJmxReporter JMX monitoring for 'solr_33341.solr.jvm' (registry 'solr.jvm') enabled at server: com.sun.jmx.mbeanserver.JmxMBeanServer@1906fe93
   [junit4]   2> 1352464 INFO  (jetty-launcher-6871-thread-4) [n:127.0.0.1:33341_solr    ] o.a.s.m.r.SolrJmxReporter JMX monitoring for 'solr_33341.solr.jetty' (registry 'solr.jetty') enabled at server: com.sun.jmx.mbeanserver.JmxMBeanServer@1906fe93
   [junit4]   2> 1352465 INFO  (jetty-launcher-6871-thread-4) [n:127.0.0.1:33341_solr    ] o.a.s.c.CorePropertiesLocator Found 0 core definitions underneath /home/jenkins/workspace/Lucene-Solr-master-Linux/solr/build/solr-core/test/J2/temp/solr.cloud.MoveReplicaHDFSTest_CAA7DEB88B0DD212-001/tempDir-001/node4/.
   [junit4]   2> 1352471 INFO  (zkConnectionManagerCallback-6931-thread-1) [    ] o.a.s.c.c.ConnectionManager zkClient has connected
   [junit4]   2> 1352472 INFO  (zkConnectionManagerCallback-6936-thread-1) [    ] o.a.s.c.c.ConnectionManager zkClient has connected
   [junit4]   2> 1352472 DEBUG (SyncThread:0) [    ] o.a.s.c.ZkTestServer Watch added: create/delete: /solr/clusterprops.json
   [junit4]   2> 1352472 DEBUG (SyncThread:0) [    ] o.a.s.c.ZkTestServer Watch added: children: /solr/live_nodes
   [junit4]   2> 1352472 INFO  (jetty-launcher-6871-thread-3) [n:127.0.0.1:32831_solr    ] o.a.s.c.c.ZkStateReader Updated live nodes from ZooKeeper... (0) -> (4)
   [junit4]   2> 1352472 DEBUG (SyncThread:0) [    ] o.a.s.c.ZkTestServer Watch added: data: /solr/clusterstate.json
   [junit4]   2> 1352472 DEBUG (SyncThread:0) [    ] o.a.s.c.ZkTestServer Watch added: create/delete: /solr/clusterprops.json
   [junit4]   2> 1352472 DEBUG (SyncThread:0) [    ] o.a.s.c.ZkTestServer Watch added: children: /solr/collections
   [junit4]   2> 1352473 DEBUG (SyncThread:0) [    ] o.a.s.c.ZkTestServer Watch added: children: /solr/live_nodes
   [junit4]   2> 1352473 INFO  (jetty-launcher-6871-thread-1) [n:127.0.0.1:46333_solr    ] o.a.s.c.c.ZkStateReader Updated live nodes from ZooKeeper... (0) -> (4)
   [junit4]   2> 1352473 DEBUG (SyncThread:0) [    ] o.a.s.c.ZkTestServer Watch added: create/delete: /solr/aliases.json
   [junit4]   2> 1352473 DEBUG (SyncThread:0) [    ] o.a.s.c.ZkTestServer Watch added: data: /solr/clusterstate.json
   [junit4]   2> 1352473 DEBUG (SyncThread:0) [    ] o.a.s.c.ZkTestServer Watch added: children: /solr/collections
   [junit4]   2> 1352473 INFO  (jetty-launcher-6871-thread-3) [n:127.0.0.1:32831_solr    ] o.a.s.c.s.i.ZkClientClusterStateProvider Cluster at 127.0.0.1:45585/solr ready
   [junit4]   2> 1352473 DEBUG (SyncThread:0) [    ] o.a.s.c.ZkTestServer Watch added: create/delete: /solr/aliases.json
   [junit4]   2> 1352473 INFO  (jetty-launcher-6871-thread-1) [n:127.0.0.1:46333_solr    ] o.a.s.c.s.i.ZkClientClusterStateProvider Cluster at 127.0.0.1:45585/solr ready
   [junit4]   2> 1352474 INFO  (jetty-launcher-6871-thread-3) [n:127.0.0.1:32831_solr    ] o.a.s.h.a.MetricsHistoryHandler No .system collection, keeping metrics history in memory.
   [junit4]   2> 1352474 INFO  (jetty-launcher-6871-thread-1) [n:127.0.0.1:46333_solr    ] o.a.s.h.a.MetricsHistoryHandler No .system collection, keeping metrics history in memory.
   [junit4]   2> 1352486 INFO  (jetty-launcher-6871-thread-1) [n:127.0.0.1:46333_solr    ] o.a.s.m.r.SolrJmxReporter JMX monitoring for 'solr_46333.solr.node' (registry 'solr.node') enabled at server: com.sun.jmx.mbeanserver.JmxMBeanServer@1906fe93
   [junit4]   2> 1352489 INFO  (jetty-launcher-6871-thread-3) [n:127.0.0.1:32831_solr    ] o.a.s.m.r.SolrJmxReporter JMX monitoring for 'solr_32831.solr.node' (registry 'solr.node') enabled at server: com.sun.jmx.mbeanserver.JmxMBeanServer@1906fe93
   [junit4]   2> 1352494 INFO  (jetty-launcher-6871-thread-1) [n:127.0.0.1:46333_solr    ] o.a.s.m.r.SolrJmxReporter JMX monitoring for 'solr_46333.solr.jvm' (registry 'solr.jvm') enabled at server: com.sun.jmx.mbeanserver.JmxMBeanServer@1906fe93
   [junit4]   2> 1352494 INFO  (jetty-launcher-6871-thread-1) [n:127.0.0.1:46333_solr    ] o.a.s.m.r.SolrJmxReporter JMX monitoring for 'solr_46333.solr.jetty' (registry 'solr.jetty') enabled at server: com.sun.jmx.mbeanserver.JmxMBeanServer@1906fe93
   [junit4]   2> 1352495 INFO  (jetty-launcher-6871-thread-1) [n:127.0.0.1:46333_solr    ] o.a.s.c.CorePropertiesLocator Found 0 core definitions underneath /home/jenkins/workspace/Lucene-Solr-master-Linux/solr/build/solr-core/test/J2/temp/solr.cloud.MoveReplicaHDFSTest_CAA7DEB88B0DD212-001/tempDir-001/node1/.
   [junit4]   2> 1352498 INFO  (jetty-launcher-6871-thread-3) [n:127.0.0.1:32831_solr    ] o.a.s.m.r.SolrJmxReporter JMX monitoring for 'solr_32831.solr.jvm' (registry 'solr.jvm') enabled at server: com.sun.jmx.mbeanserver.JmxMBeanServer@1906fe93
   [junit4]   2> 1352498 INFO  (jetty-launcher-6871-thread-3) [n:127.0.0.1:32831_solr    ] o.a.s.m.r.SolrJmxReporter JMX monitoring for 'solr_32831.solr.jetty' (registry 'solr.jetty') enabled at server: com.sun.jmx.mbeanserver.JmxMBeanServer@1906fe93
   [junit4]   2> 1352499 INFO  (jetty-launcher-6871-thread-3) [n:127.0.0.1:32831_solr    ] o.a.s.c.CorePropertiesLocator Found 0 core definitions underneath /home/jenkins/workspace/Lucene-Solr-master-Linux/solr/build/solr-core/test/J2/temp/solr.cloud.MoveReplicaHDFSTest_CAA7DEB88B0DD212-001/tempDir-001/node3/.
   [junit4]   2> 1352540 DEBUG (SyncThread:0) [    ] o.a.s.c.ZkTestServer Watch fired: children: /solr/overseer/queue
   [junit4]   2> 1352540 DEBUG (SyncThread:0) [    ] o.a.s.c.ZkTestServer Watch added: children: /solr/overseer/queue
   [junit4]   2> 1352547 INFO  (zkConnectionManagerCallback-6940-thread-1) [    ] o.a.s.c.c.ConnectionManager zkClient has connected
   [junit4]   2> 1352550 INFO  (zkConnectionManagerCallback-6945-thread-1) [    ] o.a.s.c.c.ConnectionManager zkClient has connected
   [junit4]   2> 1352550 DEBUG (SyncThread:0) [    ] o.a.s.c.ZkTestServer Watch added: create/delete: /solr/clusterprops.json
   [junit4]   2> 1352550 DEBUG (SyncThread:0) [    ] o.a.s.c.ZkTestServer Watch added: children: /solr/live_nodes
   [junit4]   2> 1352550 INFO  (SUITE-MoveReplicaHDFSTest-seed#[CAA7DEB88B0DD212]-worker) [    ] o.a.s.c.c.ZkStateReader Updated live nodes from ZooKeeper... (0) -> (4)
   [junit4]   2> 1352550 DEBUG (SyncThread:0) [    ] o.a.s.c.ZkTestServer Watch added: data: /solr/clusterstate.json
   [junit4]   2> 1352550 DEBUG (SyncThread:0) [    ] o.a.s.c.ZkTestServer Watch added: children: /solr/collections
   [junit4]   2> 1352550 DEBUG (SyncThread:0) [    ] o.a.s.c.ZkTestServer Watch added: create/delete: /solr/aliases.json
   [junit4]   2> 1352551 INFO  (SUITE-MoveReplicaHDFSTest-seed#[CAA7DEB88B0DD212]-worker) [    ] o.a.s.c.s.i.ZkClientClusterStateProvider Cluster at 127.0.0.1:45585/solr ready
   [junit4]   2> 1352554 INFO  (qtp506360940-19422) [n:127.0.0.1:35641_solr    ] o.a.s.h.a.CollectionsHandler Invoked Collection Action :overseerstatus with params action=OVERSEERSTATUS&wt=javabin&version=2 and sendToOCPQueue=true
   [junit4]   2> 1352554 DEBUG (SyncThread:0) [    ] o.a.s.c.ZkTestServer Watch fired: children: /solr/overseer/collection-queue-work
   [junit4]   2> 1352554 DEBUG (SyncThread:0) [    ] o.a.s.c.ZkTestServer Watch added: create/delete: /solr/overseer/collection-queue-work/qnr-0000000000
   [junit4]   2> 1352554 DEBUG (SyncThread:0) [    ] o.a.s.c.ZkTestServer Watch added: children: /solr/overseer/collection-queue-work
   [junit4]   2> 1352554 DEBUG (OverseerCollectionConfigSetProcessor-72147928834113542-127.0.0.1:35641_solr-n_0000000000) [n:127.0.0.1:35641_solr    ] o.a.s.c.ZkDistributedQueue Found child node with improper name: qnr-0000000000
   [junit4]   2> 1352554 DEBUG (SyncThread:0) [    ] o.a.s.c.ZkTestServer Watch fired: children: /solr/overseer/collection-queue-work
   [junit4]   2> 1352554 DEBUG (SyncThread:0) [    ] o.a.s.c.ZkTestServer Watch added: children: /solr/overseer/collection-queue-work
   [junit4]   2> 1352554 DEBUG (OverseerCollectionConfigSetProcessor-72147928834113542-127.0.0.1:35641_solr-n_0000000000) [n:127.0.0.1:35641_solr    ] o.a.s.c.ZkDistributedQueue Found child node with improper name: qnr-0000000000
   [junit4]   2> 1352554 DEBUG (OverseerCollectionConfigSetProcessor-72147928834113542-127.0.0.1:35641_solr-n_0000000000) [n:127.0.0.1:35641_solr    ] o.a.s.c.OverseerTaskQueue Returning topN elements: [/overseer/collection-queue-work/qn-0000000000, ]
   [junit4]   2> 1352554 DEBUG (OverseerCollectionConfigSetProcessor-72147928834113542-127.0.0.1:35641_solr-n_0000000000) [n:127.0.0.1:35641_solr    ] o.a.s.c.OverseerTaskProcessor Got 1 tasks from work-queue : [[org.apache.solr.cloud.OverseerTaskQueue$QueueEvent@2e684ecf]]
   [junit4]   2> 1352554 DEBUG (OverseerCollectionConfigSetProcessor-72147928834113542-127.0.0.1:35641_solr-n_0000000000) [n:127.0.0.1:35641_solr    ] o.a.s.c.OverseerTaskProcessor Marked task [/overseer/collection-queue-work/qn-0000000000] as running
   [junit4]   2> 1352554 DEBUG (OverseerCollectionConfigSetProcessor-72147928834113542-127.0.0.1:35641_solr-n_0000000000) [n:127.0.0.1:35641_solr    ] o.a.s.c.OverseerTaskProcessor Overseer Collection Message Handler: Get the message id:/overseer/collection-queue-work/qn-0000000000 message:{"operation":"overseerstatus"}
   [junit4]   2> 1352555 DEBUG (OverseerThreadFactory-6961-thread-1-processing-n:127.0.0.1:35641_solr) [n:127.0.0.1:35641_solr    ] o.a.s.c.OverseerTaskProcessor Runner processing /overseer/collection-queue-work/qn-0000000000
   [junit4]   2> 1352555 DEBUG (OverseerThreadFactory-6961-thread-1-processing-n:127.0.0.1:35641_solr) [n:127.0.0.1:35641_solr    ] o.a.s.c.a.c.OverseerCollectionMessageHandler OverseerCollectionMessageHandler.processMessage : overseerstatus , {"operation":"overseerstatus"}
   [junit4]   2> 1352555 DEBUG (OverseerCollectionConfigSetProcessor-72147928834113542-127.0.0.1:35641_solr-n_0000000000) [n:127.0.0.1:35641_solr    ] o.a.s.c.OverseerTaskProcessor Cleaning up work-queue. #Running tasks: 1
   [junit4]   2> 1352555 DEBUG (OverseerCollectionConfigSetProcessor-72147928834113542-127.0.0.1:35641_solr-n_0000000000) [n:127.0.0.1:35641_solr    ] o.a.s.c.OverseerTaskProcessor RunningTasks: [/overseer/collection-queue-work/qn-0000000000]
   [junit4]   2> 1352555 DEBUG (OverseerCollectionConfigSetProcessor-72147928834113542-127.0.0.1:35641_solr-n_0000000000) [n:127.0.0.1:35641_solr    ] o.a.s.c.OverseerTaskProcessor BlockedTasks: []
   [junit4]   2> 1352555 DEBUG (OverseerCollectionConfigSetProcessor-72147928834113542-127.0.0.1:35641_solr-n_0000000000) [n:127.0.0.1:35641_solr    ] o.a.s.c.OverseerTaskProcessor CompletedTasks: []
   [junit4]   2> 1352555 DEBUG (OverseerCollectionConfigSetProcessor-72147928834113542-127.0.0.1:35641_solr-n_0000000000) [n:127.0.0.1:35641_solr    ] o.a.s.c.OverseerTaskProcessor RunningZKTasks: [/overseer/collection-queue-work/qn-0000000000]
   [junit4]   2> 1352555 DEBUG (OverseerCollectionConfigSetProcessor-72147928834113542-127.0.0.1:35641_solr-n_0000000000) [n:127.0.0.1:35641_solr    ] o.a.s.c.OverseerTaskQueue Peeking for top 99 elements. ExcludeSet: [/overseer/collection-queue-work/qn-0000000000],[]
   [junit4]   2> 1352555 DEBUG (OverseerThreadFactory-6961-thread-1-processing-n:127.0.0.1:35641_solr) [n:127.0.0.1:35641_solr    ] o.a.s.c.OverseerTaskProcessor Completed task:[/overseer/collection-queue-work/qn-0000000000]
   [junit4]   2> 1352555 DEBUG (SyncThread:0) [    ] o.a.s.c.ZkTestServer Watch fired: data: /solr/overseer/collection-queue-work/qnr-0000000000
   [junit4]   2> 1352556 DEBUG (zkCallback-6887-thread-1) [    ] o.a.s.c.OverseerTaskQueue NodeDataChanged fired on path /overseer/collection-queue-work/qnr-0000000000 state SyncConnected latchEventType null
   [junit4]   2> 1352556 DEBUG (SyncThread:0) [    ] o.a.s.c.ZkTestServer Watch fired: children: /solr/overseer/collection-queue-work
   [junit4]   2> 1352556 DEBUG (OverseerThreadFactory-6961-thread-1-processing-n:127.0.0.1:35641_solr) [n:127.0.0.1:35641_solr    ] o.a.s.c.OverseerTaskProcessor Marked task [/overseer/collection-queue-work/qn-0000000000] as completed.
   [junit4]   2> 1352556 DEBUG (OverseerThreadFactory-6961-thread-1-processing-n:127.0.0.1:35641_solr) [n:127.0.0.1:35641_solr    ] o.a.s.c.OverseerTaskProcessor RunningTasks: []
   [junit4]   2> 1352556 DEBUG (OverseerThreadFactory-6961-thread-1-processing-n:127.0.0.1:35641_solr) [n:127.0.0.1:35641_solr    ] o.a.s.c.OverseerTaskProcessor BlockedTasks: []
   [junit4]   2> 1352556 DEBUG (OverseerThreadFactory-6961-thread-1-processing-n:127.0.0.1:35641_solr) [n:127.0.0.1:35641_solr    ] o.a.s.c.OverseerTaskProcessor CompletedTasks: [/overseer/collection-queue-work/qn-0000000000]
   [junit4]   2> 1352556 DEBUG (OverseerThreadFactory-6961-thread-1-processing-n:127.0.0.1:35641_solr) [n:127.0.0.1:35641_solr    ] o.a.s.c.OverseerTaskProcessor RunningZKTasks: [/overseer/collection-queue-work/qn-0000000000]
   [junit4]   2> 1352556 DEBUG (OverseerThreadFactory-6961-thread-1-processing-n:127.0.0.1:35641_solr) [n:127.0.0.1:35641_solr    ] o.a.s.c.OverseerTaskProcessor Overseer Collection Message Handler: Message id:/overseer/collection-queue-work/qn-0000000000 complete, response:{leader=127.0.0.1:35641_solr,overseer_queue_size=0,overseer_work_queue_size=0,overseer_collection_queue_size=2,overseer_operations={am_i_leader={requests=3,errors=0,avgRequestsPerSecond=19.300680874622707,5minRateRequestsPerSecond=0.0,15minRateRequestsPerSecond=0.0,avgTimePerRequest=0.2230853333333333,medianRequestTime=0.252734,75thPcRequestTime=0.296165,95thPcRequestTime=0.296165,99thPcRequestTime=0.296165,999thPcRequestTime=0.296165},downnode={requests=3,errors=0,avgRequestsPerSecond=20.70923096574544,5minRateRequestsPerSecond=0.0,15minRateRequestsPerSecond=0.0,avgTimePerRequest=0.006776666666666666,medianRequestTime=0.007042,75thPcRequestTime=0.007332,95thPcRequestTime=0.007332,99thPcRequestTime=0.007332,999thPcRequestTime=0.007332}},collection_operations={am_i_leader={requests=3,errors=0,avgRequestsPerSecond=19.314377456474954,5minRateRequestsPerSecond=0.0,15minRateRequestsPerSecond=0.0,avgTimePerRequest=0.20678133333333332,medianRequestTime=0.155823,75thPcRequestTime=0.345844,95thPcRequestTime=0.345844,99thPcRequestTime=0.345844,999thPcRequestTime=0.345844},overseerstatus={requests=0,errors=0,avgRequestsPerSecond=0.0,5minRateRequestsPerSecond=0.0,15minRateRequestsPerSecond=0.0,avgTimePerRequest=0.0,medianRequestTime=0.0,75thPcRequestTime=0.0,95thPcRequestTime=0.0,99thPcRequestTime=0.0,999thPcRequestTime=0.0}},overseer_queue={},overseer_internal_queue={peek={avgRequestsPerSecond=6.488589533052482,5minRateRequestsPerSecond=0.0,15minRateRequestsPerSecond=0.0,avgTimePerRequest=0.090932,medianRequestTime=0.090932,75thPcRequestTime=0.090932,95thPcRequestTime=0.090932,99thPcRequestTime=0.090932,999thPcRequestTime=0.090932}},collection_queue={peektopn_wait2000={avgRequestsPerSecond=6.481614414591929,5minRateRequestsPerSecond=0.0,15minRateRequestsPerSecond=0.0,avgTimePerRequest=153.574198,medianRequestTime=153.574198,75thPcRequestTime=153.574198,95thPcRequestTime=153.574198,99thPcRequestTime=153.574198,999thPcRequestTime=153.574198}}}
   [junit4]   2> 1352556 DEBUG (SyncThread:0) [    ] o.a.s.c.ZkTestServer Watch added: children: /solr/overseer/collection-queue-work
   [junit4]   2> 1352556 DEBUG (SyncThread:0) [    ] o.a.s.c.ZkTestServer Watch fired: children: /solr/overseer/collection-queue-work
   [junit4]   2> 1352556 DEBUG (OverseerCollectionConfigSetProcessor-72147928834113542-127.0.0.1:35641_solr-n_0000000000) [n:127.0.0.1:35641_solr    ] o.a.s.c.ZkDistributedQueue Found child node with improper name: qnr-0000000000
   [junit4]   2> 1352556 DEBUG (SyncThread:0) [    ] o.a.s.c.ZkTestServer Watch added: children: /solr/overseer/collection-queue-work
   [junit4]   2> 1352556 INFO  (qtp506360940-19422) [n:127.0.0.1:35641_solr    ] o.a.s.s.HttpSolrCall [admin] webapp=null path=/admin/collections params={action=OVERSEERSTATUS&wt=javabin&version=2} status=0 QTime=2
   [junit4]   1> Formatting using clusterid: testClusterID
   [junit4]   2> 1352666 WARN  (SUITE-MoveReplicaHDFSTest-seed#[CAA7DEB88B0DD212]-worker) [    ] o.a.h.m.i.MetricsConfig Cannot locate configuration: tried hadoop-metrics2-namenode.properties,hadoop-metrics2.properties
   [junit4]   2> 1352672 WARN  (SUITE-MoveReplicaHDFSTest-seed#[CAA7DEB88B0DD212]-worker) [    ] o.a.h.h.HttpRequestLog Jetty request log can only be enabled using Log4j
   [junit4]   2> 1352674 INFO  (SUITE-MoveReplicaHDFSTest-seed#[CAA7DEB88B0DD212]-worker) [    ] o.m.log jetty-6.1.26
   [junit4]   2> 1352677 INFO  (SUITE-MoveReplicaHDFSTest-seed#[CAA7DEB88B0DD212]-worker) [    ] o.m.log Extract jar:file:/home/jenkins/.ivy2/cache/org.apache.hadoop/hadoop-hdfs/tests/hadoop-hdfs-2.7.4-tests.jar!/webapps/hdfs to ./temp/Jetty_localhost_localdomain_42099_hdfs____.yrc1ec/webapp
   [junit4]   2> 1352742 INFO  (SUITE-MoveReplicaHDFSTest-seed#[CAA7DEB88B0DD212]-worker) [    ] o.m.log Started HttpServer2$SelectChannelConnectorWithSafeStartup@localhost.localdomain:42099
   [junit4]   2> 1352802 WARN  (SUITE-MoveReplicaHDFSTest-seed#[CAA7DEB88B0DD212]-worker) [    ] o.a.h.h.HttpRequestLog Jetty request log can only be enabled using Log4j
   [junit4]   2> 1352803 INFO  (SUITE-MoveReplicaHDFSTest-seed#[CAA7DEB88B0DD212]-worker) [    ] o.m.log jetty-6.1.26
   [junit4]   2> 1352806 INFO  (SUITE-MoveReplicaHDFSTest-seed#[CAA7DEB88B0DD212]-worker) [    ] o.m.log Extract jar:file:/home/jenkins/.ivy2/cache/org.apache.hadoop/hadoop-hdfs/tests/hadoop-hdfs-2.7.4-tests.jar!/webapps/datanode to ./temp/Jetty_localhost_38971_datanode____d6vgad/webapp
   [junit4]   2> 1352878 INFO  (SUITE-MoveReplicaHDFSTest-seed#[CAA7DEB88B0DD212]-worker) [    ] o.m.log Started HttpServer2$SelectChannelConnectorWithSafeStartup@localhost:38971
   [junit4]   2> 1352904 WARN  (SUITE-MoveReplicaHDFSTest-seed#[CAA7DEB88B0DD212]-worker) [    ] o.a.h.h.HttpRequestLog Jetty request log can only be enabled using Log4j
   [junit4]   2> 1352905 INFO  (SUITE-MoveReplicaHDFSTest-seed#[CAA7DEB88B0DD212]-worker) [    ] o.m.log jetty-6.1.26
   [junit4]   2> 1352908 INFO  (SUITE-MoveReplicaHDFSTest-seed#[CAA7DEB88B0DD212]-worker) [    ] o.m.log Extract jar:file:/home/jenkins/.ivy2/cache/org.apache.hadoop/hadoop-hdfs/tests/hadoop-hdfs-2.7.4-tests.jar!/webapps/datanode to ./temp/Jetty_localhost_37323_datanode____.otsabt/webapp
   [junit4]   2> 1352999 INFO  (SUITE-MoveReplicaHDFSTest-seed#[CAA7DEB88B0DD212]-worker) [    ] o.m.log Started HttpServer2$SelectChannelConnectorWithSafeStartup@localhost:37323
   [junit4]   2> 1353011 ERROR (DataNode: [[[DISK]file:/home/jenkins/workspace/Lucene-Solr-master-Linux/solr/build/solr-core/test/J2/temp/solr.cloud.MoveReplicaHDFSTest_CAA7DEB88B0DD212-001/tempDir-002/hdfsBaseDir/data/data1/, [DISK]file:/home/jenkins/workspace/Lucene-Solr-master-Linux/solr/build/solr-core/test/J2/temp/solr.cloud.MoveReplicaHDFSTest_CAA7DEB88B0DD212-001/tempDir-002/hdfsBaseDir/data/data2/]]  heartbeating to localhost.localdomain/127.0.0.1:38435) [    ] o.a.h.h.s.d.DirectoryScanner dfs.datanode.directoryscan.throttle.limit.ms.per.sec set to value below 1 ms/sec. Assuming default value of 1000
   [junit4]   2> 1353016 INFO  (Block report processor) [    ] BlockStateChange BLOCK* processReport 0x4e5a5dce05ddb: from storage DS-0ee08e53-8a70-4b3a-af5c-52f619626807 node DatanodeRegistration(127.0.0.1:39491, datanodeUuid=db3920ae-15fb-4751-b5ee-70437b2b359e, infoPort=40377, infoSecurePort=0, ipcPort=34527, storageInfo=lv=-56;cid=testClusterID;nsid=1592444176;c=0), blocks: 0, hasStaleStorage: true, processing time: 0 msecs
   [junit4]   2> 1353016 INFO  (Block report processor) [    ] BlockStateChange BLOCK* processReport 0x4e5a5dce05ddb: from storage DS-a0cbc8c7-31ba-401d-9b69-401cfedb698a node DatanodeRegistration(127.0.0.1:39491, datanodeUuid=db3920ae-15fb-4751-b5ee-70437b2b359e, infoPort=40377, infoSecurePort=0, ipcPort=34527, storageInfo=lv=-56;cid=testClusterID;nsid=1592444176;c=0), blocks: 0, hasStaleStorage: false, processing time: 0 msecs
   [junit4]   2> 1353131 ERROR (DataNode: [[[DISK]file:/home/jenkins/workspace/Lucene-Solr-master-Linux/solr/build/solr-core/test/J2/temp/solr.cloud.MoveReplicaHDFSTest_CAA7DEB88B0DD212-001/tempDir-002/hdfsBaseDir/data/data3/, [DISK]file:/home/jenkins/workspace/Lucene-Solr-master-Linux/solr/build/solr-core/test/J2/temp/solr.cloud.MoveReplicaHDFSTest_CAA7DEB88B0DD212-001/tempDir-002/hdfsBaseDir/data/data4/]]  heartbeating to localhost.localdomain/127.0.0.1:38435) [    ] o.a.h.h.s.d.DirectoryScanner dfs.datanode.directoryscan.throttle.limit.ms.per.sec set to value below 1 ms/sec. Assuming default value of 1000
   [junit4]   2> 1353135 INFO  (Block report processor) [    ] BlockStateChange BLOCK* processReport 0x4e5a5e40458ea: from storage DS-f22afea0-c35d-4816-b297-689eee04e9db node DatanodeRegistration(127.0.0.1:38539, datanodeUuid=d999ea65-930b-46e7-a373-d4773df09c9c, infoPort=43903, infoSecurePort=0, ipcPort=35921, storageInfo=lv=-56;cid=testClusterID;nsid=1592444176;c=0), blocks: 0, hasStaleStorage: true, processing time: 0 msecs
   [junit4]   2> 1353135 INFO  (Block report processor) [    ] BlockStateChange BLOCK* processReport 0x4e5a5e40458ea: from storage DS-5699902e-3280-4e86-8c19-63a071efafac node DatanodeRegistration(127.0.0.1:38539, datanodeUuid=d999ea65-930b-46e7-a373-d4773df09c9c, infoPort=43903, infoSecurePort=0, ipcPort=35921, storageInfo=lv=-56;cid=testClusterID;nsid=1592444176;c=0), blocks: 0, hasStaleStorage: false, processing time: 0 msecs
   [junit4]   2> 1353239 INFO  (TEST-MoveReplicaHDFSTest.testFailedMove-seed#[CAA7DEB88B0DD212]) [    ] o.a.s.SolrTestCaseJ4 ###Starting testFailedMove
   [junit4]   2> 1353239 DEBUG (SyncThread:0) [    ] o.a.s.c.ZkTestServer Watch added: create/delete: /solr/clusterprops.json
   [junit4]   2> 1353240 DEBUG (SyncThread:0) [    ] o.a.s.c.ZkTestServer Watch added: children: /solr/live_nodes
   [junit4]   2> 1353240 INFO  (TEST-MoveReplicaHDFSTest.testFailedMove-seed#[CAA7DEB88B0DD212]) [    ] o.a.s.c.c.ZkStateReader Updated live nodes from ZooKeeper... (0) -> (4)
   [junit4]   2> 1353240 DEBUG (SyncThread:0) [    ] o.a.s.c.ZkTestServer Watch added: data: /solr/clusterstate.json
   [junit4]   2> 1353240 DEBUG (SyncThread:0) [    ] o.a.s.c.ZkTestServer Watch added: children: /solr/collections
   [junit4]   2> 1353240 DEBUG (SyncThread:0) [    ] o.a.s.c.ZkTestServer Watch added: create/delete: /solr/aliases.json
   [junit4]   2> 1353240 DEBUG (SyncThread:0) [    ] o.a.s.c.ZkTestServer Watch fired: data: /solr/aliases.json
   [junit4]   2> 1353240 DEBUG (SyncThread:0) [    ] o.a.s.c.ZkTestServer Watch fired: data: /solr/aliases.json
   [junit4]   2> 1353240 DEBUG (SyncThread:0) [    ] o.a.s.c.ZkTestServer Watch fired: data: /solr/aliases.json
   [junit4]   2> 1353240 DEBUG (SyncThread:0) [    ] o.a.s.c.ZkTestServer Watch fired: data: /solr/aliases.json
   [junit4]   2> 1353240 DEBUG (SyncThread:0) [    ] o.a.s.c.ZkTestServer Watch fired: data: /solr/aliases.json
   [junit4]   2> 1353240 DEBUG (SyncThread:0) [    ] o.a.s.c.ZkTestServer Watch fired: data: /solr/aliases.json
   [junit4]   2> 1353240 DEBUG (SyncThread:0) [    ] o.a.s.c.ZkTestServer Watch fired: data: /solr/aliases.json
   [junit4]   2> 1353240 DEBUG (SyncThread:0) [    ] o.a.s.c.ZkTestServer Watch fired: data: /solr/aliases.json
   [junit4]   2> 1353240 DEBUG (SyncThread:0) [    ] o.a.s.c.ZkTestServer Watch fired: data: /solr/aliases.json
   [junit4]   2> 1353241 DEBUG (SyncThread:0) [    ] o.a.s.c.ZkTestServer Watch added: data: /solr/aliases.json
   [junit4]   2> 1353241 DEBUG (SyncThread:0) [    ] o.a.s.c.ZkTestServer Watch added: data: /solr/aliases.json
   [junit4]   2> 1353241 DEBUG (SyncThread:0) [    ] o.a.s.c.ZkTestServer Watch added: data: /solr/aliases.json
   [junit4]   2> 1353241 DEBUG (SyncThread:0) [    ] o.a.s.c.ZkTestServer Watch added: data: /solr/aliases.json
   [junit4]   2> 1353241 DEBUG (SyncThread:0) [    ] o.a.s.c.ZkTestServer Watch added: data: /solr/aliases.json
   [junit4]   2> 1353241 INFO  (TEST-MoveReplicaHDFSTest.testFailedMove-seed#[CAA7DEB88B0DD212]) [    ] o.e.j.s.Server jetty-9.4.11.v20180605; built: 2018-06-05T18:24:03.829Z; git: d5fc0523cfa96bfebfbda19606cad384d772f04c; jvm 10+46
   [junit4]   2> 1353246 DEBUG (SyncThread:0) [    ] o.a.s.c.ZkTestServer Watch added: data: /solr/aliases.json
   [junit4]   2> 1353247 DEBUG (SyncThread:0) [    ] o.a.s.c.ZkTestServer Watch added: data: /solr/aliases.json
   [junit4]   2> 1353247 DEBUG (SyncThread:0) [    ] o.a.s.c.ZkTestServer Watch added: data: /solr/aliases.json
   [junit4]   2> 1353247 DEBUG (SyncThread:0) [    ] o.a.s.c.ZkTestServer Watch added: data: /solr/aliases.json
   [junit4]   2> 1353247 DEBUG (SyncThread:0) [    ] o.a.s.c.ZkTestServer Watch added: data: /solr/aliases.json
   [junit4]   2> 1353247 INFO  (TEST-MoveReplicaHDFSTest.testFailedMove-seed#[CAA7DEB88B0DD212]) [    ] o.e.j.s.session DefaultSessionIdManager workerName=node0
   [junit4]   2> 1353247 INFO  (TEST-MoveReplicaHDFSTest.testFailedMove-seed#[CAA7DEB88B0DD212]) [    ] o.e.j.s.session No SessionScavenger set, using defaults
   [junit4]   2> 1353247 INFO  (TEST-MoveReplicaHDFSTest.testFailedMove-seed#[CAA7DEB88B0DD212]) [    ] o.e.j.s.session node0 Scavenging every 660000ms
   [junit4]   2> 1353247 INFO  (TEST-MoveReplicaHDFSTest.testFailedMove-seed#[CAA7DEB88B0DD212]) [    ] o.e.j.s.h.ContextHandler Started o.e.j.s.ServletContextHandler@16cbeb10{/solr,null,AVAILABLE}
   [junit4]   2> 1353248 INFO  (TEST-MoveReplicaHDFSTest.testFailedMove-seed#[CAA7DEB88B0DD212]) [    ] o.e.j.s.AbstractConnector Started ServerConnector@4ba321f4{HTTP/1.1,[http/1.1]}{127.0.0.1:41593}
   [junit4]   2> 1353248 INFO  (TEST-MoveReplicaHDFSTest.testFailedMove-seed#[CAA7DEB88B0DD212]) [    ] o.e.j.s.Server Started @1353286ms
   [junit4]   2> 1353248 INFO  (TEST-MoveReplicaHDFSTest.testFailedMove-seed#[CAA7DEB88B0DD212]) [    ] o.a.s.c.s.e.JettySolrRunner Jetty properties: {hostContext=/solr, hostPort=41593}
   [junit4]   2> 1353248 ERROR (TEST-MoveReplicaHDFSTest.testFailedMove-seed#[CAA7DEB88B0DD212]) [    ] o.a.s.u.StartupLoggingUtils Missing Java Option solr.log.dir. Logging may be missing or incomplete.
   [junit4]   2> 1353248 INFO  (TEST-MoveReplicaHDFSTest.testFailedMove-seed#[CAA7DEB88B0DD212]) [    ] o.a.s.s.SolrDispatchFilter Using logger factory org.apache.logging.slf4j.Log4jLoggerFactory
   [junit4]   2> 1353248 INFO  (TEST-MoveReplicaHDFSTest.testFailedMove-seed#[CAA7DEB88B0DD212]) [    ] o.a.s.s.SolrDispatchFilter  ___      _       Welcome to Apache Solr™ version 8.0.0
   [junit4]   2> 1353248 INFO  (TEST-MoveReplicaHDFSTest.testFailedMove-seed#[CAA7DEB88B0DD212]) [    ] o.a.s.s.SolrDispatchFilter / __| ___| |_ _   Starting in cloud mode on port null
   [junit4]   2> 1353248 INFO  (TEST-MoveReplicaHDFSTest.testFailedMove-seed#[CAA7DEB88B0DD212]) [    ] o.a.s.s.SolrDispatchFilter \__ \/ _ \ | '_|  Install dir: null
   [junit4]   2> 1353248 INFO  (TEST-MoveReplicaHDFSTest.testFailedMove-seed#[CAA7DEB88B0DD212]) [    ] o.a.s.s.SolrDispatchFilter |___/\___/_|_|    Start time: 2018-09-01T06:18:43.049464Z
   [junit4]   2> 1353249 INFO  (zkConnectionManagerCallback-6949-thread-1) [    ] o.a.s.c.c.ConnectionManager zkClient has connected
   [junit4]   2> 1353249 INFO  (TEST-MoveReplicaHDFSTest.testFailedMove-seed#[CAA7DEB88B0DD212]) [    ] o.a.s.s.SolrDispatchFilter solr.xml found in ZooKeeper. Loading...
   [junit4]   2> 1353431 INFO  (TEST-MoveReplicaHDFSTest.testFailedMove-seed#[CAA7DEB88B0DD212]) [    ] o.a.s.c.ZkContainer Zookeeper client=127.0.0.1:45585/solr
   [junit4]   2> 1353432 INFO  (zkConnectionManagerCallback-6953-thread-1) [    ] o.a.s.c.c.ConnectionManager zkClient has connected
   [junit4]   2> 1353433 WARN  (NIOServerCxn.Factory:0.0.0.0/0.0.0.0:0) [    ] o.a.z.s.NIOServerCnxn Unable to read additional data from client sessionid 0x1005228b5700014, likely client has closed socket
   [junit4]   2> 1353433 DEBUG (TEST-MoveReplicaHDFSTest.testFailedMove-seed#[CAA7DEB88B0DD212]) [n:127.0.0.1:41593_solr    ] o.a.s.c.ZkController Added new OnReconnect listener org.apache.solr.cloud.ZkController$$Lambda$390/1509026845@7f24cab0
   [junit4]   2> 1353434 INFO  (zkConnectionManagerCallback-6955-thread-1) [    ] o.a.s.c.c.ConnectionManager zkClient has connected
   [junit4]   2> 1353437 DEBUG (SyncThread:0) [    ] o.a.s.c.ZkTestServer Watch added: create/delete: /solr/clusterprops.json
   [junit4]   2> 1353437 DEBUG (SyncThread:0) [    ] o.a.s.c.ZkTestServer Watch added: children: /solr/live_nodes
   [junit4]   2> 1353437 INFO  (TEST-MoveReplicaHDFSTest.testFailedMove-seed#[CAA7DEB88B0DD212]) [n:127.0.0.1:41593_solr    ] o.a.s.c.c.ZkStateReader Updated live nodes from ZooKeeper... (0) -> (4)
   [junit4]   2> 1353437 DEBUG (SyncThread:0) [    ] o.a.s.c.ZkTestServer Watch added: data: /solr/clusterstate.json
   [junit4]   2> 1353437 DEBUG (SyncThread:0) [    ] o.a.s.c.ZkTestServer Watch added: children: /solr/collections
   [junit4]   2> 1353437 DEBUG (SyncThread:0) [    ] o.a.s.c.ZkTestServer Watch added: create/delete: /solr/aliases.json
   [junit4]   2> 1353437 DEBUG (SyncThread:0) [    ] o.a.s.c.ZkTestServer Watch added: create/delete: /solr/security.json
   [junit4]   2> 1353438 DEBUG (TEST-MoveReplicaHDFSTest.testFailedMove-seed#[CAA7DEB88B0DD212]) [n:127.0.0.1:41593_solr    ] o.a.s.c.LeaderElector Joined leadership election with path: /overseer_elect/election/72147928834113557-127.0.0.1:41593_solr-n_0000000004
   [junit4]   2> 1353438 DEBUG (SyncThread:0) [    ] o.a.s.c.ZkTestServer Watch added: data: /solr/overseer_elect/election/72147928834113549-127.0.0.1:46333_solr-n_0000000003
   [junit4]   2> 1353438 DEBUG (TEST-MoveReplicaHDFSTest.testFailedMove-seed#[CAA7DEB88B0DD212]) [n:127.0.0.1:41593_solr    ] o.a.s.c.LeaderElector Watching path /overseer_elect/election/72147928834113549-127.0.0.1:46333_solr-n_0000000003 to know if I could be the leader
   [junit4]   2> 1353438 DEBUG (TEST-MoveReplicaHDFSTest.testFailedMove-seed#[CAA7DEB88B0DD212]) [n:127.0.0.1:41593_solr    ]

[...truncated too long message...]

ng
   [junit4]   2> 84210 INFO  (jetty-closer-8-thread-5) [    ] o.e.j.s.h.ContextHandler Stopped o.e.j.s.ServletContextHandler@6f923419{/solr,null,UNAVAILABLE}
   [junit4]   2> 84211 INFO  (jetty-closer-8-thread-5) [    ] o.e.j.s.session node0 Stopped scavenging
   [junit4]   2> 84211 ERROR (SUITE-MoveReplicaHDFSTest-seed#[CAA7DEB88B0DD212]-worker) [    ] o.a.z.s.ZooKeeperServer ZKShutdownHandler is not registered, so ZooKeeper server won't take any action on ERROR or SHUTDOWN server state changes
   [junit4]   2> 84212 INFO  (SUITE-MoveReplicaHDFSTest-seed#[CAA7DEB88B0DD212]-worker) [    ] o.a.s.c.ZkTestServer connecting to 127.0.0.1:36753 36753
   [junit4]   2> 84316 INFO  (Thread-3) [    ] o.a.s.c.ZkTestServer connecting to 127.0.0.1:36753 36753
   [junit4]   2> 84317 WARN  (Thread-3) [    ] o.a.s.c.ZkTestServer Watch limit violations: 
   [junit4]   2> Maximum concurrent create/delete watches above limit:
   [junit4]   2> 
   [junit4]   2> 	31	/solr/collections/MoveReplicaHDFSTest_coll_false/terms/shard1
   [junit4]   2> 	23	/solr/collections/MoveReplicaHDFSTest_coll_true/terms/shard2
   [junit4]   2> 	19	/solr/aliases.json
   [junit4]   2> 	19	/solr/clusterprops.json
   [junit4]   2> 	18	/solr/configs/conf1
   [junit4]   2> 	10	/solr/collections/MoveReplicaHDFSTest_failed_coll_true/terms/shard1
   [junit4]   2> 	10	/solr/collections/MoveReplicaHDFSTest_coll_true/terms/shard1
   [junit4]   2> 	9	/solr/collections/MoveReplicaHDFSTest_failed_coll_true/terms/shard2
   [junit4]   2> 	9	/solr/collections/MoveReplicaHDFSTest_failed_coll_false/terms/shard1
   [junit4]   2> 	8	/solr/collections/MoveReplicaHDFSTest_failed_coll_false/terms/shard2
   [junit4]   2> 	8	/solr/collections/MoveReplicaHDFSTest_coll_false/terms/shard2
   [junit4]   2> 	7	/solr/security.json
   [junit4]   2> 
   [junit4]   2> Maximum concurrent data watches above limit:
   [junit4]   2> 
   [junit4]   2> 	19	/solr/clusterstate.json
   [junit4]   2> 	10	/solr/aliases.json
   [junit4]   2> 	7	/solr/collections/MoveReplicaHDFSTest_coll_true/state.json
   [junit4]   2> 	7	/solr/collections/MoveReplicaHDFSTest_coll_false/state.json
   [junit4]   2> 	4	/solr/collections/MoveReplicaHDFSTest_failed_coll_false/state.json
   [junit4]   2> 	4	/solr/collections/MoveReplicaHDFSTest_failed_coll_true/state.json
   [junit4]   2> 	3	/solr/collections/MoveReplicaHDFSTest_coll_false/leader_elect/shard1/election/72148085248622618-core_node5-n_0000000000
   [junit4]   2> 	3	/solr/collections/MoveReplicaHDFSTest_coll_true/leader_elect/shard2/election/72148085248622623-core_node8-n_0000000000
   [junit4]   2> 	2	/solr/overseer_elect/election/72148085248622613-127.0.0.1:37301_solr-n_0000000004
   [junit4]   2> 	2	/solr/overseer_elect/election/72148085248622600-127.0.0.1:43739_solr-n_0000000002
   [junit4]   2> 	2	/solr/overseer_elect/election/72148085248622601-127.0.0.1:34081_solr-n_0000000001
   [junit4]   2> 	2	/solr/autoscaling.json
   [junit4]   2> 
   [junit4]   2> Maximum concurrent children watches above limit:
   [junit4]   2> 
   [junit4]   2> 	40	/solr/collections
   [junit4]   2> 	28	/solr/live_nodes
   [junit4]   2> 	2	/solr/overseer/queue
   [junit4]   2> 	2	/solr/autoscaling/events/.scheduled_maintenance
   [junit4]   2> 	2	/solr/autoscaling/events/.auto_add_replicas
   [junit4]   2> 	2	/solr/overseer/queue-work
   [junit4]   2> 	2	/solr/overseer/collection-queue-work
   [junit4]   2> 
   [junit4]   2> 84318 WARN  (SUITE-MoveReplicaHDFSTest-seed#[CAA7DEB88B0DD212]-worker) [    ] o.a.h.h.s.d.DirectoryScanner DirectoryScanner: shutdown has been called
   [junit4]   2> 84328 INFO  (SUITE-MoveReplicaHDFSTest-seed#[CAA7DEB88B0DD212]-worker) [    ] o.m.log Stopped HttpServer2$SelectChannelConnectorWithSafeStartup@localhost:0
   [junit4]   2> 84429 WARN  (DataNode: [[[DISK]file:/home/jenkins/workspace/Lucene-Solr-master-Linux/solr/build/solr-core/test/J2/temp/solr.cloud.MoveReplicaHDFSTest_CAA7DEB88B0DD212-001/tempDir-002/hdfsBaseDir/data/data3/, [DISK]file:/home/jenkins/workspace/Lucene-Solr-master-Linux/solr/build/solr-core/test/J2/temp/solr.cloud.MoveReplicaHDFSTest_CAA7DEB88B0DD212-001/tempDir-002/hdfsBaseDir/data/data4/]]  heartbeating to localhost.localdomain/127.0.0.1:38455) [    ] o.a.h.h.s.d.IncrementalBlockReportManager IncrementalBlockReportManager interrupted
   [junit4]   2> 84429 WARN  (DataNode: [[[DISK]file:/home/jenkins/workspace/Lucene-Solr-master-Linux/solr/build/solr-core/test/J2/temp/solr.cloud.MoveReplicaHDFSTest_CAA7DEB88B0DD212-001/tempDir-002/hdfsBaseDir/data/data3/, [DISK]file:/home/jenkins/workspace/Lucene-Solr-master-Linux/solr/build/solr-core/test/J2/temp/solr.cloud.MoveReplicaHDFSTest_CAA7DEB88B0DD212-001/tempDir-002/hdfsBaseDir/data/data4/]]  heartbeating to localhost.localdomain/127.0.0.1:38455) [    ] o.a.h.h.s.d.DataNode Ending block pool service for: Block pool BP-863397921-88.99.242.108-1535785110942 (Datanode Uuid bd2a3cc3-8028-4533-ab7f-ae17b32a542e) service to localhost.localdomain/127.0.0.1:38455
   [junit4]   2> 84431 WARN  (SUITE-MoveReplicaHDFSTest-seed#[CAA7DEB88B0DD212]-worker) [    ] o.a.h.h.s.d.DirectoryScanner DirectoryScanner: shutdown has been called
   [junit4]   2> 84437 INFO  (SUITE-MoveReplicaHDFSTest-seed#[CAA7DEB88B0DD212]-worker) [    ] o.m.log Stopped HttpServer2$SelectChannelConnectorWithSafeStartup@localhost:0
   [junit4]   2> 84538 WARN  (DataNode: [[[DISK]file:/home/jenkins/workspace/Lucene-Solr-master-Linux/solr/build/solr-core/test/J2/temp/solr.cloud.MoveReplicaHDFSTest_CAA7DEB88B0DD212-001/tempDir-002/hdfsBaseDir/data/data1/, [DISK]file:/home/jenkins/workspace/Lucene-Solr-master-Linux/solr/build/solr-core/test/J2/temp/solr.cloud.MoveReplicaHDFSTest_CAA7DEB88B0DD212-001/tempDir-002/hdfsBaseDir/data/data2/]]  heartbeating to localhost.localdomain/127.0.0.1:38455) [    ] o.a.h.h.s.d.IncrementalBlockReportManager IncrementalBlockReportManager interrupted
   [junit4]   2> 84538 WARN  (DataNode: [[[DISK]file:/home/jenkins/workspace/Lucene-Solr-master-Linux/solr/build/solr-core/test/J2/temp/solr.cloud.MoveReplicaHDFSTest_CAA7DEB88B0DD212-001/tempDir-002/hdfsBaseDir/data/data1/, [DISK]file:/home/jenkins/workspace/Lucene-Solr-master-Linux/solr/build/solr-core/test/J2/temp/solr.cloud.MoveReplicaHDFSTest_CAA7DEB88B0DD212-001/tempDir-002/hdfsBaseDir/data/data2/]]  heartbeating to localhost.localdomain/127.0.0.1:38455) [    ] o.a.h.h.s.d.DataNode Ending block pool service for: Block pool BP-863397921-88.99.242.108-1535785110942 (Datanode Uuid 7659987a-1838-477e-9065-81c4c243095a) service to localhost.localdomain/127.0.0.1:38455
   [junit4]   2> 84547 INFO  (SUITE-MoveReplicaHDFSTest-seed#[CAA7DEB88B0DD212]-worker) [    ] o.m.log Stopped HttpServer2$SelectChannelConnectorWithSafeStartup@localhost.localdomain:0
   [junit4]   2> 84660 INFO  (SUITE-MoveReplicaHDFSTest-seed#[CAA7DEB88B0DD212]-worker) [    ] o.a.s.c.ZkTestServer connecting to 127.0.0.1:36753 36753
   [junit4]   2> NOTE: leaving temporary files on disk at: /home/jenkins/workspace/Lucene-Solr-master-Linux/solr/build/solr-core/test/J2/temp/solr.cloud.MoveReplicaHDFSTest_CAA7DEB88B0DD212-001
   [junit4]   2> Sep 01, 2018 6:59:42 AM com.carrotsearch.randomizedtesting.ThreadLeakControl checkThreadLeaks
   [junit4]   2> WARNING: Will linger awaiting termination of 67 leaked thread(s).
   [junit4]   2> NOTE: test params are: codec=Asserting(Lucene80): {_version_=PostingsFormat(name=Asserting), id=Lucene50(blocksize=128)}, docValues:{}, maxPointsInLeafNode=1366, maxMBSortInHeap=7.341958996158132, sim=Asserting(org.apache.lucene.search.similarities.AssertingSimilarity@1869e5f6), locale=kkj-CM, timezone=Australia/Canberra
   [junit4]   2> NOTE: Linux 4.15.0-32-generic amd64/Oracle Corporation 10 (64-bit)/cpus=8,threads=6,free=267465976,total=518979584
   [junit4]   2> NOTE: All tests run in this JVM: [RequestLoggingTest, RequestLoggingTest, RequestLoggingTest, MoveReplicaHDFSTest]
   [junit4] Completed [5/10 (2!)] on J2 in 83.54s, 4 tests, 1 error <<< FAILURES!

[...truncated 44 lines...]
BUILD FAILED
/home/jenkins/workspace/Lucene-Solr-master-Linux/lucene/common-build.xml:1568: The following error occurred while executing this line:
/home/jenkins/workspace/Lucene-Solr-master-Linux/lucene/common-build.xml:1092: There were test failures: 10 suites, 30 tests, 1 error, 1 failure [seed: CAA7DEB88B0DD212]

Total time: 3 minutes 12 seconds

[repro] Setting last failure code to 256

[repro] Failures:
[repro]   1/5 failed: org.apache.solr.cloud.MoveReplicaHDFSTest
[repro]   1/5 failed: org.apache.solr.handler.RequestLoggingTest
[repro] Exiting with code 256
+ mv lucene/build lucene/build.repro
+ mv solr/build solr/build.repro
+ mv lucene/build.orig lucene/build
+ mv solr/build.orig solr/build
Archiving artifacts
Setting ANT_1_8_2_HOME=/var/lib/jenkins/tools/hudson.tasks.Ant_AntInstallation/ANT_1.8.2
[WARNINGS] Parsing warnings in console log with parser Java Compiler (javac)
Setting ANT_1_8_2_HOME=/var/lib/jenkins/tools/hudson.tasks.Ant_AntInstallation/ANT_1.8.2
Setting ANT_1_8_2_HOME=/var/lib/jenkins/tools/hudson.tasks.Ant_AntInstallation/ANT_1.8.2
<Git Blamer> Using GitBlamer to create author and commit information for all warnings.
<Git Blamer> GIT_COMMIT=e7b449534344baf09f4824ad322f9a1e53300620, workspace=/var/lib/jenkins/workspace/Lucene-Solr-master-Linux
[WARNINGS] Computing warning deltas based on reference build #22780
Recording test results
Setting ANT_1_8_2_HOME=/var/lib/jenkins/tools/hudson.tasks.Ant_AntInstallation/ANT_1.8.2
Build step 'Publish JUnit test result report' changed build result to UNSTABLE
Email was triggered for: Unstable (Test Failures)
Sending email for trigger: Unstable (Test Failures)
Setting ANT_1_8_2_HOME=/var/lib/jenkins/tools/hudson.tasks.Ant_AntInstallation/ANT_1.8.2
Setting ANT_1_8_2_HOME=/var/lib/jenkins/tools/hudson.tasks.Ant_AntInstallation/ANT_1.8.2
Setting ANT_1_8_2_HOME=/var/lib/jenkins/tools/hudson.tasks.Ant_AntInstallation/ANT_1.8.2
Setting ANT_1_8_2_HOME=/var/lib/jenkins/tools/hudson.tasks.Ant_AntInstallation/ANT_1.8.2

Mime
View raw message