lucene-dev mailing list archives

Site index · List index
Message view « Date » · « Thread »
Top « Date » · « Thread »
From Policeman Jenkins Server <jenk...@thetaphi.de>
Subject [JENKINS-EA] Lucene-Solr-7.x-Linux (64bit/jdk-11-ea+28) - Build # 2739 - Unstable!
Date Fri, 14 Sep 2018 00:20:23 GMT
Build: https://jenkins.thetaphi.de/job/Lucene-Solr-7.x-Linux/2739/
Java: 64bit/jdk-11-ea+28 -XX:-UseCompressedOops -XX:+UseG1GC

12 tests failed.
FAILED:  junit.framework.TestSuite.org.apache.solr.cloud.TestCloudRecovery

Error Message:
Could not find collection:collection1

Stack Trace:
java.lang.AssertionError: Could not find collection:collection1
	at __randomizedtesting.SeedInfo.seed([30DE7798017005F6]:0)
	at org.junit.Assert.fail(Assert.java:93)
	at org.junit.Assert.assertTrue(Assert.java:43)
	at org.junit.Assert.assertNotNull(Assert.java:526)
	at org.apache.solr.cloud.AbstractDistribZkTestBase.waitForRecoveriesToFinish(AbstractDistribZkTestBase.java:155)
	at org.apache.solr.cloud.TestCloudRecovery.setupCluster(TestCloudRecovery.java:70)
	at java.base/jdk.internal.reflect.NativeMethodAccessorImpl.invoke0(Native Method)
	at java.base/jdk.internal.reflect.NativeMethodAccessorImpl.invoke(NativeMethodAccessorImpl.java:62)
	at java.base/jdk.internal.reflect.DelegatingMethodAccessorImpl.invoke(DelegatingMethodAccessorImpl.java:43)
	at java.base/java.lang.reflect.Method.invoke(Method.java:566)
	at com.carrotsearch.randomizedtesting.RandomizedRunner.invoke(RandomizedRunner.java:1742)
	at com.carrotsearch.randomizedtesting.RandomizedRunner$6.evaluate(RandomizedRunner.java:875)
	at com.carrotsearch.randomizedtesting.RandomizedRunner$7.evaluate(RandomizedRunner.java:891)
	at com.carrotsearch.randomizedtesting.rules.StatementAdapter.evaluate(StatementAdapter.java:36)
	at com.carrotsearch.randomizedtesting.rules.SystemPropertiesRestoreRule$1.evaluate(SystemPropertiesRestoreRule.java:57)
	at org.apache.lucene.util.AbstractBeforeAfterRule$1.evaluate(AbstractBeforeAfterRule.java:45)
	at com.carrotsearch.randomizedtesting.rules.StatementAdapter.evaluate(StatementAdapter.java:36)
	at org.apache.lucene.util.TestRuleStoreClassName$1.evaluate(TestRuleStoreClassName.java:41)
	at com.carrotsearch.randomizedtesting.rules.NoShadowingOrOverridesOnMethodsRule$1.evaluate(NoShadowingOrOverridesOnMethodsRule.java:40)
	at com.carrotsearch.randomizedtesting.rules.NoShadowingOrOverridesOnMethodsRule$1.evaluate(NoShadowingOrOverridesOnMethodsRule.java:40)
	at com.carrotsearch.randomizedtesting.rules.StatementAdapter.evaluate(StatementAdapter.java:36)
	at com.carrotsearch.randomizedtesting.rules.StatementAdapter.evaluate(StatementAdapter.java:36)
	at org.apache.lucene.util.TestRuleAssertionsRequired$1.evaluate(TestRuleAssertionsRequired.java:53)
	at org.apache.lucene.util.TestRuleMarkFailure$1.evaluate(TestRuleMarkFailure.java:47)
	at org.apache.lucene.util.TestRuleIgnoreAfterMaxFailures$1.evaluate(TestRuleIgnoreAfterMaxFailures.java:64)
	at org.apache.lucene.util.TestRuleIgnoreTestSuites$1.evaluate(TestRuleIgnoreTestSuites.java:54)
	at com.carrotsearch.randomizedtesting.rules.StatementAdapter.evaluate(StatementAdapter.java:36)
	at com.carrotsearch.randomizedtesting.ThreadLeakControl$StatementRunner.run(ThreadLeakControl.java:368)
	at java.base/java.lang.Thread.run(Thread.java:834)


FAILED:  junit.framework.TestSuite.org.apache.solr.cloud.TestCloudRecovery

Error Message:
Could not find collection:collection1

Stack Trace:
java.lang.AssertionError: Could not find collection:collection1
	at __randomizedtesting.SeedInfo.seed([30DE7798017005F6]:0)
	at org.junit.Assert.fail(Assert.java:93)
	at org.junit.Assert.assertTrue(Assert.java:43)
	at org.junit.Assert.assertNotNull(Assert.java:526)
	at org.apache.solr.cloud.AbstractDistribZkTestBase.waitForRecoveriesToFinish(AbstractDistribZkTestBase.java:155)
	at org.apache.solr.cloud.TestCloudRecovery.setupCluster(TestCloudRecovery.java:70)
	at java.base/jdk.internal.reflect.NativeMethodAccessorImpl.invoke0(Native Method)
	at java.base/jdk.internal.reflect.NativeMethodAccessorImpl.invoke(NativeMethodAccessorImpl.java:62)
	at java.base/jdk.internal.reflect.DelegatingMethodAccessorImpl.invoke(DelegatingMethodAccessorImpl.java:43)
	at java.base/java.lang.reflect.Method.invoke(Method.java:566)
	at com.carrotsearch.randomizedtesting.RandomizedRunner.invoke(RandomizedRunner.java:1742)
	at com.carrotsearch.randomizedtesting.RandomizedRunner$6.evaluate(RandomizedRunner.java:875)
	at com.carrotsearch.randomizedtesting.RandomizedRunner$7.evaluate(RandomizedRunner.java:891)
	at com.carrotsearch.randomizedtesting.rules.StatementAdapter.evaluate(StatementAdapter.java:36)
	at com.carrotsearch.randomizedtesting.rules.SystemPropertiesRestoreRule$1.evaluate(SystemPropertiesRestoreRule.java:57)
	at org.apache.lucene.util.AbstractBeforeAfterRule$1.evaluate(AbstractBeforeAfterRule.java:45)
	at com.carrotsearch.randomizedtesting.rules.StatementAdapter.evaluate(StatementAdapter.java:36)
	at org.apache.lucene.util.TestRuleStoreClassName$1.evaluate(TestRuleStoreClassName.java:41)
	at com.carrotsearch.randomizedtesting.rules.NoShadowingOrOverridesOnMethodsRule$1.evaluate(NoShadowingOrOverridesOnMethodsRule.java:40)
	at com.carrotsearch.randomizedtesting.rules.NoShadowingOrOverridesOnMethodsRule$1.evaluate(NoShadowingOrOverridesOnMethodsRule.java:40)
	at com.carrotsearch.randomizedtesting.rules.StatementAdapter.evaluate(StatementAdapter.java:36)
	at com.carrotsearch.randomizedtesting.rules.StatementAdapter.evaluate(StatementAdapter.java:36)
	at org.apache.lucene.util.TestRuleAssertionsRequired$1.evaluate(TestRuleAssertionsRequired.java:53)
	at org.apache.lucene.util.TestRuleMarkFailure$1.evaluate(TestRuleMarkFailure.java:47)
	at org.apache.lucene.util.TestRuleIgnoreAfterMaxFailures$1.evaluate(TestRuleIgnoreAfterMaxFailures.java:64)
	at org.apache.lucene.util.TestRuleIgnoreTestSuites$1.evaluate(TestRuleIgnoreTestSuites.java:54)
	at com.carrotsearch.randomizedtesting.rules.StatementAdapter.evaluate(StatementAdapter.java:36)
	at com.carrotsearch.randomizedtesting.ThreadLeakControl$StatementRunner.run(ThreadLeakControl.java:368)
	at java.base/java.lang.Thread.run(Thread.java:834)


FAILED:  org.apache.solr.cloud.TestCloudRecovery.leaderRecoverFromLogOnStartupTest

Error Message:


Stack Trace:
java.lang.NullPointerException
	at __randomizedtesting.SeedInfo.seed([30DE7798017005F6:442E96DD45544279]:0)
	at org.apache.solr.cloud.TestCloudRecovery.leaderRecoverFromLogOnStartupTest(TestCloudRecovery.java:135)
	at java.base/jdk.internal.reflect.NativeMethodAccessorImpl.invoke0(Native Method)
	at java.base/jdk.internal.reflect.NativeMethodAccessorImpl.invoke(NativeMethodAccessorImpl.java:62)
	at java.base/jdk.internal.reflect.DelegatingMethodAccessorImpl.invoke(DelegatingMethodAccessorImpl.java:43)
	at java.base/java.lang.reflect.Method.invoke(Method.java:566)
	at com.carrotsearch.randomizedtesting.RandomizedRunner.invoke(RandomizedRunner.java:1742)
	at com.carrotsearch.randomizedtesting.RandomizedRunner$8.evaluate(RandomizedRunner.java:935)
	at com.carrotsearch.randomizedtesting.RandomizedRunner$9.evaluate(RandomizedRunner.java:971)
	at com.carrotsearch.randomizedtesting.RandomizedRunner$10.evaluate(RandomizedRunner.java:985)
	at com.carrotsearch.randomizedtesting.rules.SystemPropertiesRestoreRule$1.evaluate(SystemPropertiesRestoreRule.java:57)
	at org.apache.lucene.util.TestRuleSetupTeardownChained$1.evaluate(TestRuleSetupTeardownChained.java:49)
	at org.apache.lucene.util.AbstractBeforeAfterRule$1.evaluate(AbstractBeforeAfterRule.java:45)
	at org.apache.lucene.util.TestRuleThreadAndTestName$1.evaluate(TestRuleThreadAndTestName.java:48)
	at org.apache.lucene.util.TestRuleIgnoreAfterMaxFailures$1.evaluate(TestRuleIgnoreAfterMaxFailures.java:64)
	at org.apache.lucene.util.TestRuleMarkFailure$1.evaluate(TestRuleMarkFailure.java:47)
	at com.carrotsearch.randomizedtesting.rules.StatementAdapter.evaluate(StatementAdapter.java:36)
	at com.carrotsearch.randomizedtesting.ThreadLeakControl$StatementRunner.run(ThreadLeakControl.java:368)
	at com.carrotsearch.randomizedtesting.ThreadLeakControl.forkTimeoutingTask(ThreadLeakControl.java:817)
	at com.carrotsearch.randomizedtesting.ThreadLeakControl$3.evaluate(ThreadLeakControl.java:468)
	at com.carrotsearch.randomizedtesting.RandomizedRunner.runSingleTest(RandomizedRunner.java:944)
	at com.carrotsearch.randomizedtesting.RandomizedRunner$5.evaluate(RandomizedRunner.java:830)
	at com.carrotsearch.randomizedtesting.RandomizedRunner$6.evaluate(RandomizedRunner.java:880)
	at com.carrotsearch.randomizedtesting.RandomizedRunner$7.evaluate(RandomizedRunner.java:891)
	at com.carrotsearch.randomizedtesting.rules.StatementAdapter.evaluate(StatementAdapter.java:36)
	at com.carrotsearch.randomizedtesting.rules.SystemPropertiesRestoreRule$1.evaluate(SystemPropertiesRestoreRule.java:57)
	at org.apache.lucene.util.AbstractBeforeAfterRule$1.evaluate(AbstractBeforeAfterRule.java:45)
	at com.carrotsearch.randomizedtesting.rules.StatementAdapter.evaluate(StatementAdapter.java:36)
	at org.apache.lucene.util.TestRuleStoreClassName$1.evaluate(TestRuleStoreClassName.java:41)
	at com.carrotsearch.randomizedtesting.rules.NoShadowingOrOverridesOnMethodsRule$1.evaluate(NoShadowingOrOverridesOnMethodsRule.java:40)
	at com.carrotsearch.randomizedtesting.rules.NoShadowingOrOverridesOnMethodsRule$1.evaluate(NoShadowingOrOverridesOnMethodsRule.java:40)
	at com.carrotsearch.randomizedtesting.rules.StatementAdapter.evaluate(StatementAdapter.java:36)
	at com.carrotsearch.randomizedtesting.rules.StatementAdapter.evaluate(StatementAdapter.java:36)
	at org.apache.lucene.util.TestRuleAssertionsRequired$1.evaluate(TestRuleAssertionsRequired.java:53)
	at org.apache.lucene.util.TestRuleMarkFailure$1.evaluate(TestRuleMarkFailure.java:47)
	at org.apache.lucene.util.TestRuleIgnoreAfterMaxFailures$1.evaluate(TestRuleIgnoreAfterMaxFailures.java:64)
	at org.apache.lucene.util.TestRuleIgnoreTestSuites$1.evaluate(TestRuleIgnoreTestSuites.java:54)
	at com.carrotsearch.randomizedtesting.rules.StatementAdapter.evaluate(StatementAdapter.java:36)
	at com.carrotsearch.randomizedtesting.ThreadLeakControl$StatementRunner.run(ThreadLeakControl.java:368)
	at java.base/java.lang.Thread.run(Thread.java:834)


FAILED:  org.apache.solr.cloud.autoscaling.IndexSizeTriggerTest.testSplitIntegration

Error Message:
last state: DocCollection(testSplitIntegration_collection//collections/testSplitIntegration_collection/state.json/32)={   "pullReplicas":"0",   "replicationFactor":"2",   "shards":{     "shard1":{       "range":"80000000-ffffffff",       "state":"active",       "replicas":{         "core_node3":{           "core":"testSplitIntegration_collection_shard1_replica_n1",           "base_url":"https://127.0.0.1:44945/solr",           "node_name":"127.0.0.1:44945_solr",           "state":"active",           "type":"NRT",           "force_set_state":"false"},         "core_node5":{           "core":"testSplitIntegration_collection_shard1_replica_n2",           "base_url":"https://127.0.0.1:33007/solr",           "node_name":"127.0.0.1:33007_solr",           "state":"active",           "type":"NRT",           "force_set_state":"false",           "leader":"true"}}},     "shard2":{       "range":"0-7fffffff",       "state":"inactive",       "replicas":{         "core_node7":{           "core":"testSplitIntegration_collection_shard2_replica_n4",           "base_url":"https://127.0.0.1:44945/solr",           "node_name":"127.0.0.1:44945_solr",           "state":"active",           "type":"NRT",           "force_set_state":"false",           "leader":"true"},         "core_node8":{           "core":"testSplitIntegration_collection_shard2_replica_n6",           "base_url":"https://127.0.0.1:33007/solr",           "node_name":"127.0.0.1:33007_solr",           "state":"active",           "type":"NRT",           "force_set_state":"false"}},       "stateTimestamp":"1536883675903137220"},     "shard2_0":{       "range":"0-3fffffff",       "state":"active",       "replicas":{         "core_node11":{           "core":"testSplitIntegration_collection_shard2_0_replica_n9",           "base_url":"https://127.0.0.1:44945/solr",           "node_name":"127.0.0.1:44945_solr",           "state":"active",           "type":"NRT",           "force_set_state":"false",           "leader":"true"},         "core_node13":{           "core":"testSplitIntegration_collection_shard2_0_replica_n0",           "base_url":"https://127.0.0.1:44945/solr",           "node_name":"127.0.0.1:44945_solr",           "state":"active",           "type":"NRT",           "force_set_state":"false"}},       "stateTimestamp":"1536883675903202969"},     "shard2_1":{       "range":"40000000-7fffffff",       "state":"active",       "replicas":{         "core_node12":{           "core":"testSplitIntegration_collection_shard2_1_replica_n10",           "base_url":"https://127.0.0.1:44945/solr",           "node_name":"127.0.0.1:44945_solr",           "state":"active",           "type":"NRT",           "force_set_state":"false",           "leader":"true"},         "core_node14":{           "core":"testSplitIntegration_collection_shard2_1_replica_n0",           "base_url":"https://127.0.0.1:33007/solr",           "node_name":"127.0.0.1:33007_solr",           "state":"active",           "type":"NRT",           "force_set_state":"false"}},       "stateTimestamp":"1536883675903170550"},     "shard1_0":{       "parent":"shard1",       "shard_parent_node":"127.0.0.1:33007_solr",       "range":"80000000-bfffffff",       "state":"recovery",       "shard_parent_zk_session":"72220079634513927",       "replicas":{         "core_node17":{           "core":"testSplitIntegration_collection_shard1_0_replica_n15",           "base_url":"https://127.0.0.1:33007/solr",           "node_name":"127.0.0.1:33007_solr",           "state":"active",           "type":"NRT",           "force_set_state":"false",           "leader":"true"},         "core_node19":{           "core":"testSplitIntegration_collection_shard1_0_replica_n0",           "base_url":"https://127.0.0.1:44945/solr",           "node_name":"127.0.0.1:44945_solr",           "state":"active",           "type":"NRT",           "force_set_state":"false"}},       "stateTimestamp":"1536883693150323768"},     "shard1_1":{       "parent":"shard1",       "shard_parent_node":"127.0.0.1:33007_solr",       "range":"c0000000-ffffffff",       "state":"recovery",       "shard_parent_zk_session":"72220079634513927",       "replicas":{         "core_node18":{           "core":"testSplitIntegration_collection_shard1_1_replica_n16",           "base_url":"https://127.0.0.1:33007/solr",           "node_name":"127.0.0.1:33007_solr",           "state":"active",           "type":"NRT",           "force_set_state":"false",           "leader":"true"},         "core_node20":{           "core":"testSplitIntegration_collection_shard1_1_replica_n0",           "base_url":"https://127.0.0.1:33007/solr",           "node_name":"127.0.0.1:33007_solr",           "state":"recovering",           "type":"NRT",           "force_set_state":"false"}},       "stateTimestamp":"1536883693150293171"}},   "router":{"name":"compositeId"},   "maxShardsPerNode":"2",   "autoAddReplicas":"false",   "nrtReplicas":"2",   "tlogReplicas":"0"}

Stack Trace:
java.util.concurrent.TimeoutException: last state: DocCollection(testSplitIntegration_collection//collections/testSplitIntegration_collection/state.json/32)={
  "pullReplicas":"0",
  "replicationFactor":"2",
  "shards":{
    "shard1":{
      "range":"80000000-ffffffff",
      "state":"active",
      "replicas":{
        "core_node3":{
          "core":"testSplitIntegration_collection_shard1_replica_n1",
          "base_url":"https://127.0.0.1:44945/solr",
          "node_name":"127.0.0.1:44945_solr",
          "state":"active",
          "type":"NRT",
          "force_set_state":"false"},
        "core_node5":{
          "core":"testSplitIntegration_collection_shard1_replica_n2",
          "base_url":"https://127.0.0.1:33007/solr",
          "node_name":"127.0.0.1:33007_solr",
          "state":"active",
          "type":"NRT",
          "force_set_state":"false",
          "leader":"true"}}},
    "shard2":{
      "range":"0-7fffffff",
      "state":"inactive",
      "replicas":{
        "core_node7":{
          "core":"testSplitIntegration_collection_shard2_replica_n4",
          "base_url":"https://127.0.0.1:44945/solr",
          "node_name":"127.0.0.1:44945_solr",
          "state":"active",
          "type":"NRT",
          "force_set_state":"false",
          "leader":"true"},
        "core_node8":{
          "core":"testSplitIntegration_collection_shard2_replica_n6",
          "base_url":"https://127.0.0.1:33007/solr",
          "node_name":"127.0.0.1:33007_solr",
          "state":"active",
          "type":"NRT",
          "force_set_state":"false"}},
      "stateTimestamp":"1536883675903137220"},
    "shard2_0":{
      "range":"0-3fffffff",
      "state":"active",
      "replicas":{
        "core_node11":{
          "core":"testSplitIntegration_collection_shard2_0_replica_n9",
          "base_url":"https://127.0.0.1:44945/solr",
          "node_name":"127.0.0.1:44945_solr",
          "state":"active",
          "type":"NRT",
          "force_set_state":"false",
          "leader":"true"},
        "core_node13":{
          "core":"testSplitIntegration_collection_shard2_0_replica_n0",
          "base_url":"https://127.0.0.1:44945/solr",
          "node_name":"127.0.0.1:44945_solr",
          "state":"active",
          "type":"NRT",
          "force_set_state":"false"}},
      "stateTimestamp":"1536883675903202969"},
    "shard2_1":{
      "range":"40000000-7fffffff",
      "state":"active",
      "replicas":{
        "core_node12":{
          "core":"testSplitIntegration_collection_shard2_1_replica_n10",
          "base_url":"https://127.0.0.1:44945/solr",
          "node_name":"127.0.0.1:44945_solr",
          "state":"active",
          "type":"NRT",
          "force_set_state":"false",
          "leader":"true"},
        "core_node14":{
          "core":"testSplitIntegration_collection_shard2_1_replica_n0",
          "base_url":"https://127.0.0.1:33007/solr",
          "node_name":"127.0.0.1:33007_solr",
          "state":"active",
          "type":"NRT",
          "force_set_state":"false"}},
      "stateTimestamp":"1536883675903170550"},
    "shard1_0":{
      "parent":"shard1",
      "shard_parent_node":"127.0.0.1:33007_solr",
      "range":"80000000-bfffffff",
      "state":"recovery",
      "shard_parent_zk_session":"72220079634513927",
      "replicas":{
        "core_node17":{
          "core":"testSplitIntegration_collection_shard1_0_replica_n15",
          "base_url":"https://127.0.0.1:33007/solr",
          "node_name":"127.0.0.1:33007_solr",
          "state":"active",
          "type":"NRT",
          "force_set_state":"false",
          "leader":"true"},
        "core_node19":{
          "core":"testSplitIntegration_collection_shard1_0_replica_n0",
          "base_url":"https://127.0.0.1:44945/solr",
          "node_name":"127.0.0.1:44945_solr",
          "state":"active",
          "type":"NRT",
          "force_set_state":"false"}},
      "stateTimestamp":"1536883693150323768"},
    "shard1_1":{
      "parent":"shard1",
      "shard_parent_node":"127.0.0.1:33007_solr",
      "range":"c0000000-ffffffff",
      "state":"recovery",
      "shard_parent_zk_session":"72220079634513927",
      "replicas":{
        "core_node18":{
          "core":"testSplitIntegration_collection_shard1_1_replica_n16",
          "base_url":"https://127.0.0.1:33007/solr",
          "node_name":"127.0.0.1:33007_solr",
          "state":"active",
          "type":"NRT",
          "force_set_state":"false",
          "leader":"true"},
        "core_node20":{
          "core":"testSplitIntegration_collection_shard1_1_replica_n0",
          "base_url":"https://127.0.0.1:33007/solr",
          "node_name":"127.0.0.1:33007_solr",
          "state":"recovering",
          "type":"NRT",
          "force_set_state":"false"}},
      "stateTimestamp":"1536883693150293171"}},
  "router":{"name":"compositeId"},
  "maxShardsPerNode":"2",
  "autoAddReplicas":"false",
  "nrtReplicas":"2",
  "tlogReplicas":"0"}
	at __randomizedtesting.SeedInfo.seed([30DE7798017005F6:950CED82E8FCC08]:0)
	at org.apache.solr.cloud.CloudTestUtils.waitForState(CloudTestUtils.java:112)
	at org.apache.solr.cloud.autoscaling.IndexSizeTriggerTest.testSplitIntegration(IndexSizeTriggerTest.java:317)
	at java.base/jdk.internal.reflect.NativeMethodAccessorImpl.invoke0(Native Method)
	at java.base/jdk.internal.reflect.NativeMethodAccessorImpl.invoke(NativeMethodAccessorImpl.java:62)
	at java.base/jdk.internal.reflect.DelegatingMethodAccessorImpl.invoke(DelegatingMethodAccessorImpl.java:43)
	at java.base/java.lang.reflect.Method.invoke(Method.java:566)
	at com.carrotsearch.randomizedtesting.RandomizedRunner.invoke(RandomizedRunner.java:1742)
	at com.carrotsearch.randomizedtesting.RandomizedRunner$8.evaluate(RandomizedRunner.java:935)
	at com.carrotsearch.randomizedtesting.RandomizedRunner$9.evaluate(RandomizedRunner.java:971)
	at com.carrotsearch.randomizedtesting.RandomizedRunner$10.evaluate(RandomizedRunner.java:985)
	at com.carrotsearch.randomizedtesting.rules.SystemPropertiesRestoreRule$1.evaluate(SystemPropertiesRestoreRule.java:57)
	at org.apache.lucene.util.TestRuleSetupTeardownChained$1.evaluate(TestRuleSetupTeardownChained.java:49)
	at org.apache.lucene.util.AbstractBeforeAfterRule$1.evaluate(AbstractBeforeAfterRule.java:45)
	at org.apache.lucene.util.TestRuleThreadAndTestName$1.evaluate(TestRuleThreadAndTestName.java:48)
	at org.apache.lucene.util.TestRuleIgnoreAfterMaxFailures$1.evaluate(TestRuleIgnoreAfterMaxFailures.java:64)
	at org.apache.lucene.util.TestRuleMarkFailure$1.evaluate(TestRuleMarkFailure.java:47)
	at com.carrotsearch.randomizedtesting.rules.StatementAdapter.evaluate(StatementAdapter.java:36)
	at com.carrotsearch.randomizedtesting.ThreadLeakControl$StatementRunner.run(ThreadLeakControl.java:368)
	at com.carrotsearch.randomizedtesting.ThreadLeakControl.forkTimeoutingTask(ThreadLeakControl.java:817)
	at com.carrotsearch.randomizedtesting.ThreadLeakControl$3.evaluate(ThreadLeakControl.java:468)
	at com.carrotsearch.randomizedtesting.RandomizedRunner.runSingleTest(RandomizedRunner.java:944)
	at com.carrotsearch.randomizedtesting.RandomizedRunner$5.evaluate(RandomizedRunner.java:830)
	at com.carrotsearch.randomizedtesting.RandomizedRunner$6.evaluate(RandomizedRunner.java:880)
	at com.carrotsearch.randomizedtesting.RandomizedRunner$7.evaluate(RandomizedRunner.java:891)
	at com.carrotsearch.randomizedtesting.rules.StatementAdapter.evaluate(StatementAdapter.java:36)
	at com.carrotsearch.randomizedtesting.rules.SystemPropertiesRestoreRule$1.evaluate(SystemPropertiesRestoreRule.java:57)
	at org.apache.lucene.util.AbstractBeforeAfterRule$1.evaluate(AbstractBeforeAfterRule.java:45)
	at com.carrotsearch.randomizedtesting.rules.StatementAdapter.evaluate(StatementAdapter.java:36)
	at org.apache.lucene.util.TestRuleStoreClassName$1.evaluate(TestRuleStoreClassName.java:41)
	at com.carrotsearch.randomizedtesting.rules.NoShadowingOrOverridesOnMethodsRule$1.evaluate(NoShadowingOrOverridesOnMethodsRule.java:40)
	at com.carrotsearch.randomizedtesting.rules.NoShadowingOrOverridesOnMethodsRule$1.evaluate(NoShadowingOrOverridesOnMethodsRule.java:40)
	at com.carrotsearch.randomizedtesting.rules.StatementAdapter.evaluate(StatementAdapter.java:36)
	at com.carrotsearch.randomizedtesting.rules.StatementAdapter.evaluate(StatementAdapter.java:36)
	at org.apache.lucene.util.TestRuleAssertionsRequired$1.evaluate(TestRuleAssertionsRequired.java:53)
	at org.apache.lucene.util.TestRuleMarkFailure$1.evaluate(TestRuleMarkFailure.java:47)
	at org.apache.lucene.util.TestRuleIgnoreAfterMaxFailures$1.evaluate(TestRuleIgnoreAfterMaxFailures.java:64)
	at org.apache.lucene.util.TestRuleIgnoreTestSuites$1.evaluate(TestRuleIgnoreTestSuites.java:54)
	at com.carrotsearch.randomizedtesting.rules.StatementAdapter.evaluate(StatementAdapter.java:36)
	at com.carrotsearch.randomizedtesting.ThreadLeakControl$StatementRunner.run(ThreadLeakControl.java:368)
	at java.base/java.lang.Thread.run(Thread.java:834)


FAILED:  org.apache.solr.cloud.autoscaling.IndexSizeTriggerTest.testSplitIntegration

Error Message:
failed to create testSplitIntegration_collection Live Nodes: null Last available state: null

Stack Trace:
java.lang.AssertionError: failed to create testSplitIntegration_collection
Live Nodes: null
Last available state: null
	at __randomizedtesting.SeedInfo.seed([30DE7798017005F6:950CED82E8FCC08]:0)
	at org.apache.solr.cloud.CloudTestUtils.waitForState(CloudTestUtils.java:70)
	at org.apache.solr.cloud.autoscaling.IndexSizeTriggerTest.testSplitIntegration(IndexSizeTriggerTest.java:248)
	at java.base/jdk.internal.reflect.NativeMethodAccessorImpl.invoke0(Native Method)
	at java.base/jdk.internal.reflect.NativeMethodAccessorImpl.invoke(NativeMethodAccessorImpl.java:62)
	at java.base/jdk.internal.reflect.DelegatingMethodAccessorImpl.invoke(DelegatingMethodAccessorImpl.java:43)
	at java.base/java.lang.reflect.Method.invoke(Method.java:566)
	at com.carrotsearch.randomizedtesting.RandomizedRunner.invoke(RandomizedRunner.java:1742)
	at com.carrotsearch.randomizedtesting.RandomizedRunner$8.evaluate(RandomizedRunner.java:935)
	at com.carrotsearch.randomizedtesting.RandomizedRunner$9.evaluate(RandomizedRunner.java:971)
	at com.carrotsearch.randomizedtesting.RandomizedRunner$10.evaluate(RandomizedRunner.java:985)
	at com.carrotsearch.randomizedtesting.rules.SystemPropertiesRestoreRule$1.evaluate(SystemPropertiesRestoreRule.java:57)
	at org.apache.lucene.util.TestRuleSetupTeardownChained$1.evaluate(TestRuleSetupTeardownChained.java:49)
	at org.apache.lucene.util.AbstractBeforeAfterRule$1.evaluate(AbstractBeforeAfterRule.java:45)
	at org.apache.lucene.util.TestRuleThreadAndTestName$1.evaluate(TestRuleThreadAndTestName.java:48)
	at org.apache.lucene.util.TestRuleIgnoreAfterMaxFailures$1.evaluate(TestRuleIgnoreAfterMaxFailures.java:64)
	at org.apache.lucene.util.TestRuleMarkFailure$1.evaluate(TestRuleMarkFailure.java:47)
	at com.carrotsearch.randomizedtesting.rules.StatementAdapter.evaluate(StatementAdapter.java:36)
	at com.carrotsearch.randomizedtesting.ThreadLeakControl$StatementRunner.run(ThreadLeakControl.java:368)
	at com.carrotsearch.randomizedtesting.ThreadLeakControl.forkTimeoutingTask(ThreadLeakControl.java:817)
	at com.carrotsearch.randomizedtesting.ThreadLeakControl$3.evaluate(ThreadLeakControl.java:468)
	at com.carrotsearch.randomizedtesting.RandomizedRunner.runSingleTest(RandomizedRunner.java:944)
	at com.carrotsearch.randomizedtesting.RandomizedRunner$5.evaluate(RandomizedRunner.java:830)
	at com.carrotsearch.randomizedtesting.RandomizedRunner$6.evaluate(RandomizedRunner.java:880)
	at com.carrotsearch.randomizedtesting.RandomizedRunner$7.evaluate(RandomizedRunner.java:891)
	at com.carrotsearch.randomizedtesting.rules.StatementAdapter.evaluate(StatementAdapter.java:36)
	at com.carrotsearch.randomizedtesting.rules.SystemPropertiesRestoreRule$1.evaluate(SystemPropertiesRestoreRule.java:57)
	at org.apache.lucene.util.AbstractBeforeAfterRule$1.evaluate(AbstractBeforeAfterRule.java:45)
	at com.carrotsearch.randomizedtesting.rules.StatementAdapter.evaluate(StatementAdapter.java:36)
	at org.apache.lucene.util.TestRuleStoreClassName$1.evaluate(TestRuleStoreClassName.java:41)
	at com.carrotsearch.randomizedtesting.rules.NoShadowingOrOverridesOnMethodsRule$1.evaluate(NoShadowingOrOverridesOnMethodsRule.java:40)
	at com.carrotsearch.randomizedtesting.rules.NoShadowingOrOverridesOnMethodsRule$1.evaluate(NoShadowingOrOverridesOnMethodsRule.java:40)
	at com.carrotsearch.randomizedtesting.rules.StatementAdapter.evaluate(StatementAdapter.java:36)
	at com.carrotsearch.randomizedtesting.rules.StatementAdapter.evaluate(StatementAdapter.java:36)
	at org.apache.lucene.util.TestRuleAssertionsRequired$1.evaluate(TestRuleAssertionsRequired.java:53)
	at org.apache.lucene.util.TestRuleMarkFailure$1.evaluate(TestRuleMarkFailure.java:47)
	at org.apache.lucene.util.TestRuleIgnoreAfterMaxFailures$1.evaluate(TestRuleIgnoreAfterMaxFailures.java:64)
	at org.apache.lucene.util.TestRuleIgnoreTestSuites$1.evaluate(TestRuleIgnoreTestSuites.java:54)
	at com.carrotsearch.randomizedtesting.rules.StatementAdapter.evaluate(StatementAdapter.java:36)
	at com.carrotsearch.randomizedtesting.ThreadLeakControl$StatementRunner.run(ThreadLeakControl.java:368)
	at java.base/java.lang.Thread.run(Thread.java:834)
Caused by: java.util.concurrent.TimeoutException: last state: null
	at org.apache.solr.cloud.CloudTestUtils.waitForState(CloudTestUtils.java:112)
	at org.apache.solr.cloud.CloudTestUtils.waitForState(CloudTestUtils.java:64)
	... 39 more


FAILED:  org.apache.solr.cloud.autoscaling.IndexSizeTriggerTest.testSplitIntegration

Error Message:
failed to create testSplitIntegration_collection Live Nodes: null Last available state: null

Stack Trace:
java.lang.AssertionError: failed to create testSplitIntegration_collection
Live Nodes: null
Last available state: null
	at __randomizedtesting.SeedInfo.seed([30DE7798017005F6:950CED82E8FCC08]:0)
	at org.apache.solr.cloud.CloudTestUtils.waitForState(CloudTestUtils.java:70)
	at org.apache.solr.cloud.autoscaling.IndexSizeTriggerTest.testSplitIntegration(IndexSizeTriggerTest.java:248)
	at java.base/jdk.internal.reflect.NativeMethodAccessorImpl.invoke0(Native Method)
	at java.base/jdk.internal.reflect.NativeMethodAccessorImpl.invoke(NativeMethodAccessorImpl.java:62)
	at java.base/jdk.internal.reflect.DelegatingMethodAccessorImpl.invoke(DelegatingMethodAccessorImpl.java:43)
	at java.base/java.lang.reflect.Method.invoke(Method.java:566)
	at com.carrotsearch.randomizedtesting.RandomizedRunner.invoke(RandomizedRunner.java:1742)
	at com.carrotsearch.randomizedtesting.RandomizedRunner$8.evaluate(RandomizedRunner.java:935)
	at com.carrotsearch.randomizedtesting.RandomizedRunner$9.evaluate(RandomizedRunner.java:971)
	at com.carrotsearch.randomizedtesting.RandomizedRunner$10.evaluate(RandomizedRunner.java:985)
	at com.carrotsearch.randomizedtesting.rules.SystemPropertiesRestoreRule$1.evaluate(SystemPropertiesRestoreRule.java:57)
	at org.apache.lucene.util.TestRuleSetupTeardownChained$1.evaluate(TestRuleSetupTeardownChained.java:49)
	at org.apache.lucene.util.AbstractBeforeAfterRule$1.evaluate(AbstractBeforeAfterRule.java:45)
	at org.apache.lucene.util.TestRuleThreadAndTestName$1.evaluate(TestRuleThreadAndTestName.java:48)
	at org.apache.lucene.util.TestRuleIgnoreAfterMaxFailures$1.evaluate(TestRuleIgnoreAfterMaxFailures.java:64)
	at org.apache.lucene.util.TestRuleMarkFailure$1.evaluate(TestRuleMarkFailure.java:47)
	at com.carrotsearch.randomizedtesting.rules.StatementAdapter.evaluate(StatementAdapter.java:36)
	at com.carrotsearch.randomizedtesting.ThreadLeakControl$StatementRunner.run(ThreadLeakControl.java:368)
	at com.carrotsearch.randomizedtesting.ThreadLeakControl.forkTimeoutingTask(ThreadLeakControl.java:817)
	at com.carrotsearch.randomizedtesting.ThreadLeakControl$3.evaluate(ThreadLeakControl.java:468)
	at com.carrotsearch.randomizedtesting.RandomizedRunner.runSingleTest(RandomizedRunner.java:944)
	at com.carrotsearch.randomizedtesting.RandomizedRunner$5.evaluate(RandomizedRunner.java:830)
	at com.carrotsearch.randomizedtesting.RandomizedRunner$6.evaluate(RandomizedRunner.java:880)
	at com.carrotsearch.randomizedtesting.RandomizedRunner$7.evaluate(RandomizedRunner.java:891)
	at com.carrotsearch.randomizedtesting.rules.StatementAdapter.evaluate(StatementAdapter.java:36)
	at com.carrotsearch.randomizedtesting.rules.SystemPropertiesRestoreRule$1.evaluate(SystemPropertiesRestoreRule.java:57)
	at org.apache.lucene.util.AbstractBeforeAfterRule$1.evaluate(AbstractBeforeAfterRule.java:45)
	at com.carrotsearch.randomizedtesting.rules.StatementAdapter.evaluate(StatementAdapter.java:36)
	at org.apache.lucene.util.TestRuleStoreClassName$1.evaluate(TestRuleStoreClassName.java:41)
	at com.carrotsearch.randomizedtesting.rules.NoShadowingOrOverridesOnMethodsRule$1.evaluate(NoShadowingOrOverridesOnMethodsRule.java:40)
	at com.carrotsearch.randomizedtesting.rules.NoShadowingOrOverridesOnMethodsRule$1.evaluate(NoShadowingOrOverridesOnMethodsRule.java:40)
	at com.carrotsearch.randomizedtesting.rules.StatementAdapter.evaluate(StatementAdapter.java:36)
	at com.carrotsearch.randomizedtesting.rules.StatementAdapter.evaluate(StatementAdapter.java:36)
	at org.apache.lucene.util.TestRuleAssertionsRequired$1.evaluate(TestRuleAssertionsRequired.java:53)
	at org.apache.lucene.util.TestRuleMarkFailure$1.evaluate(TestRuleMarkFailure.java:47)
	at org.apache.lucene.util.TestRuleIgnoreAfterMaxFailures$1.evaluate(TestRuleIgnoreAfterMaxFailures.java:64)
	at org.apache.lucene.util.TestRuleIgnoreTestSuites$1.evaluate(TestRuleIgnoreTestSuites.java:54)
	at com.carrotsearch.randomizedtesting.rules.StatementAdapter.evaluate(StatementAdapter.java:36)
	at com.carrotsearch.randomizedtesting.ThreadLeakControl$StatementRunner.run(ThreadLeakControl.java:368)
	at java.base/java.lang.Thread.run(Thread.java:834)
Caused by: java.util.concurrent.TimeoutException: last state: null
	at org.apache.solr.cloud.CloudTestUtils.waitForState(CloudTestUtils.java:112)
	at org.apache.solr.cloud.CloudTestUtils.waitForState(CloudTestUtils.java:64)
	... 39 more


FAILED:  org.apache.solr.cloud.autoscaling.IndexSizeTriggerTest.testSplitIntegration

Error Message:
failed to create testSplitIntegration_collection Live Nodes: null Last available state: null

Stack Trace:
java.lang.AssertionError: failed to create testSplitIntegration_collection
Live Nodes: null
Last available state: null
	at __randomizedtesting.SeedInfo.seed([30DE7798017005F6:950CED82E8FCC08]:0)
	at org.apache.solr.cloud.CloudTestUtils.waitForState(CloudTestUtils.java:70)
	at org.apache.solr.cloud.autoscaling.IndexSizeTriggerTest.testSplitIntegration(IndexSizeTriggerTest.java:248)
	at java.base/jdk.internal.reflect.NativeMethodAccessorImpl.invoke0(Native Method)
	at java.base/jdk.internal.reflect.NativeMethodAccessorImpl.invoke(NativeMethodAccessorImpl.java:62)
	at java.base/jdk.internal.reflect.DelegatingMethodAccessorImpl.invoke(DelegatingMethodAccessorImpl.java:43)
	at java.base/java.lang.reflect.Method.invoke(Method.java:566)
	at com.carrotsearch.randomizedtesting.RandomizedRunner.invoke(RandomizedRunner.java:1742)
	at com.carrotsearch.randomizedtesting.RandomizedRunner$8.evaluate(RandomizedRunner.java:935)
	at com.carrotsearch.randomizedtesting.RandomizedRunner$9.evaluate(RandomizedRunner.java:971)
	at com.carrotsearch.randomizedtesting.RandomizedRunner$10.evaluate(RandomizedRunner.java:985)
	at com.carrotsearch.randomizedtesting.rules.SystemPropertiesRestoreRule$1.evaluate(SystemPropertiesRestoreRule.java:57)
	at org.apache.lucene.util.TestRuleSetupTeardownChained$1.evaluate(TestRuleSetupTeardownChained.java:49)
	at org.apache.lucene.util.AbstractBeforeAfterRule$1.evaluate(AbstractBeforeAfterRule.java:45)
	at org.apache.lucene.util.TestRuleThreadAndTestName$1.evaluate(TestRuleThreadAndTestName.java:48)
	at org.apache.lucene.util.TestRuleIgnoreAfterMaxFailures$1.evaluate(TestRuleIgnoreAfterMaxFailures.java:64)
	at org.apache.lucene.util.TestRuleMarkFailure$1.evaluate(TestRuleMarkFailure.java:47)
	at com.carrotsearch.randomizedtesting.rules.StatementAdapter.evaluate(StatementAdapter.java:36)
	at com.carrotsearch.randomizedtesting.ThreadLeakControl$StatementRunner.run(ThreadLeakControl.java:368)
	at com.carrotsearch.randomizedtesting.ThreadLeakControl.forkTimeoutingTask(ThreadLeakControl.java:817)
	at com.carrotsearch.randomizedtesting.ThreadLeakControl$3.evaluate(ThreadLeakControl.java:468)
	at com.carrotsearch.randomizedtesting.RandomizedRunner.runSingleTest(RandomizedRunner.java:944)
	at com.carrotsearch.randomizedtesting.RandomizedRunner$5.evaluate(RandomizedRunner.java:830)
	at com.carrotsearch.randomizedtesting.RandomizedRunner$6.evaluate(RandomizedRunner.java:880)
	at com.carrotsearch.randomizedtesting.RandomizedRunner$7.evaluate(RandomizedRunner.java:891)
	at com.carrotsearch.randomizedtesting.rules.StatementAdapter.evaluate(StatementAdapter.java:36)
	at com.carrotsearch.randomizedtesting.rules.SystemPropertiesRestoreRule$1.evaluate(SystemPropertiesRestoreRule.java:57)
	at org.apache.lucene.util.AbstractBeforeAfterRule$1.evaluate(AbstractBeforeAfterRule.java:45)
	at com.carrotsearch.randomizedtesting.rules.StatementAdapter.evaluate(StatementAdapter.java:36)
	at org.apache.lucene.util.TestRuleStoreClassName$1.evaluate(TestRuleStoreClassName.java:41)
	at com.carrotsearch.randomizedtesting.rules.NoShadowingOrOverridesOnMethodsRule$1.evaluate(NoShadowingOrOverridesOnMethodsRule.java:40)
	at com.carrotsearch.randomizedtesting.rules.NoShadowingOrOverridesOnMethodsRule$1.evaluate(NoShadowingOrOverridesOnMethodsRule.java:40)
	at com.carrotsearch.randomizedtesting.rules.StatementAdapter.evaluate(StatementAdapter.java:36)
	at com.carrotsearch.randomizedtesting.rules.StatementAdapter.evaluate(StatementAdapter.java:36)
	at org.apache.lucene.util.TestRuleAssertionsRequired$1.evaluate(TestRuleAssertionsRequired.java:53)
	at org.apache.lucene.util.TestRuleMarkFailure$1.evaluate(TestRuleMarkFailure.java:47)
	at org.apache.lucene.util.TestRuleIgnoreAfterMaxFailures$1.evaluate(TestRuleIgnoreAfterMaxFailures.java:64)
	at org.apache.lucene.util.TestRuleIgnoreTestSuites$1.evaluate(TestRuleIgnoreTestSuites.java:54)
	at com.carrotsearch.randomizedtesting.rules.StatementAdapter.evaluate(StatementAdapter.java:36)
	at com.carrotsearch.randomizedtesting.ThreadLeakControl$StatementRunner.run(ThreadLeakControl.java:368)
	at java.base/java.lang.Thread.run(Thread.java:834)
Caused by: java.util.concurrent.TimeoutException: last state: null
	at org.apache.solr.cloud.CloudTestUtils.waitForState(CloudTestUtils.java:112)
	at org.apache.solr.cloud.CloudTestUtils.waitForState(CloudTestUtils.java:64)
	... 39 more


FAILED:  org.apache.solr.cloud.cdcr.CdcrBidirectionalTest.testBiDir

Error Message:
Collection not found: cdcr-cluster1

Stack Trace:
org.apache.solr.common.SolrException: Collection not found: cdcr-cluster1
	at __randomizedtesting.SeedInfo.seed([30DE7798017005F6:7505877A195E49B4]:0)
	at org.apache.solr.client.solrj.impl.CloudSolrClient.requestWithRetryOnStaleState(CloudSolrClient.java:851)
	at org.apache.solr.client.solrj.impl.CloudSolrClient.request(CloudSolrClient.java:817)
	at org.apache.solr.client.solrj.SolrRequest.process(SolrRequest.java:194)
	at org.apache.solr.client.solrj.SolrClient.query(SolrClient.java:942)
	at org.apache.solr.client.solrj.SolrClient.query(SolrClient.java:957)
	at org.apache.solr.cloud.cdcr.CdcrTestsUtil.invokeCdcrAction(CdcrTestsUtil.java:83)
	at org.apache.solr.cloud.cdcr.CdcrTestsUtil.cdcrStart(CdcrTestsUtil.java:60)
	at org.apache.solr.cloud.cdcr.CdcrBidirectionalTest.testBiDir(CdcrBidirectionalTest.java:78)
	at java.base/jdk.internal.reflect.NativeMethodAccessorImpl.invoke0(Native Method)
	at java.base/jdk.internal.reflect.NativeMethodAccessorImpl.invoke(NativeMethodAccessorImpl.java:62)
	at java.base/jdk.internal.reflect.DelegatingMethodAccessorImpl.invoke(DelegatingMethodAccessorImpl.java:43)
	at java.base/java.lang.reflect.Method.invoke(Method.java:566)
	at com.carrotsearch.randomizedtesting.RandomizedRunner.invoke(RandomizedRunner.java:1742)
	at com.carrotsearch.randomizedtesting.RandomizedRunner$8.evaluate(RandomizedRunner.java:935)
	at com.carrotsearch.randomizedtesting.RandomizedRunner$9.evaluate(RandomizedRunner.java:971)
	at com.carrotsearch.randomizedtesting.RandomizedRunner$10.evaluate(RandomizedRunner.java:985)
	at com.carrotsearch.randomizedtesting.rules.SystemPropertiesRestoreRule$1.evaluate(SystemPropertiesRestoreRule.java:57)
	at org.apache.lucene.util.TestRuleSetupTeardownChained$1.evaluate(TestRuleSetupTeardownChained.java:49)
	at org.apache.lucene.util.AbstractBeforeAfterRule$1.evaluate(AbstractBeforeAfterRule.java:45)
	at org.apache.lucene.util.TestRuleThreadAndTestName$1.evaluate(TestRuleThreadAndTestName.java:48)
	at org.apache.lucene.util.TestRuleIgnoreAfterMaxFailures$1.evaluate(TestRuleIgnoreAfterMaxFailures.java:64)
	at org.apache.lucene.util.TestRuleMarkFailure$1.evaluate(TestRuleMarkFailure.java:47)
	at com.carrotsearch.randomizedtesting.rules.StatementAdapter.evaluate(StatementAdapter.java:36)
	at com.carrotsearch.randomizedtesting.ThreadLeakControl$StatementRunner.run(ThreadLeakControl.java:368)
	at com.carrotsearch.randomizedtesting.ThreadLeakControl.forkTimeoutingTask(ThreadLeakControl.java:817)
	at com.carrotsearch.randomizedtesting.ThreadLeakControl$3.evaluate(ThreadLeakControl.java:468)
	at com.carrotsearch.randomizedtesting.RandomizedRunner.runSingleTest(RandomizedRunner.java:944)
	at com.carrotsearch.randomizedtesting.RandomizedRunner$5.evaluate(RandomizedRunner.java:830)
	at com.carrotsearch.randomizedtesting.RandomizedRunner$6.evaluate(RandomizedRunner.java:880)
	at com.carrotsearch.randomizedtesting.RandomizedRunner$7.evaluate(RandomizedRunner.java:891)
	at com.carrotsearch.randomizedtesting.rules.StatementAdapter.evaluate(StatementAdapter.java:36)
	at com.carrotsearch.randomizedtesting.rules.SystemPropertiesRestoreRule$1.evaluate(SystemPropertiesRestoreRule.java:57)
	at org.apache.lucene.util.AbstractBeforeAfterRule$1.evaluate(AbstractBeforeAfterRule.java:45)
	at com.carrotsearch.randomizedtesting.rules.StatementAdapter.evaluate(StatementAdapter.java:36)
	at org.apache.lucene.util.TestRuleStoreClassName$1.evaluate(TestRuleStoreClassName.java:41)
	at com.carrotsearch.randomizedtesting.rules.NoShadowingOrOverridesOnMethodsRule$1.evaluate(NoShadowingOrOverridesOnMethodsRule.java:40)
	at com.carrotsearch.randomizedtesting.rules.NoShadowingOrOverridesOnMethodsRule$1.evaluate(NoShadowingOrOverridesOnMethodsRule.java:40)
	at com.carrotsearch.randomizedtesting.rules.StatementAdapter.evaluate(StatementAdapter.java:36)
	at com.carrotsearch.randomizedtesting.rules.StatementAdapter.evaluate(StatementAdapter.java:36)
	at org.apache.lucene.util.TestRuleAssertionsRequired$1.evaluate(TestRuleAssertionsRequired.java:53)
	at org.apache.lucene.util.TestRuleMarkFailure$1.evaluate(TestRuleMarkFailure.java:47)
	at org.apache.lucene.util.TestRuleIgnoreAfterMaxFailures$1.evaluate(TestRuleIgnoreAfterMaxFailures.java:64)
	at org.apache.lucene.util.TestRuleIgnoreTestSuites$1.evaluate(TestRuleIgnoreTestSuites.java:54)
	at com.carrotsearch.randomizedtesting.rules.StatementAdapter.evaluate(StatementAdapter.java:36)
	at com.carrotsearch.randomizedtesting.ThreadLeakControl$StatementRunner.run(ThreadLeakControl.java:368)
	at java.base/java.lang.Thread.run(Thread.java:834)


FAILED:  org.apache.solr.cloud.cdcr.CdcrBidirectionalTest.testBiDir

Error Message:
Collection not found: cdcr-cluster1

Stack Trace:
org.apache.solr.common.SolrException: Collection not found: cdcr-cluster1
	at __randomizedtesting.SeedInfo.seed([30DE7798017005F6:7505877A195E49B4]:0)
	at org.apache.solr.client.solrj.impl.CloudSolrClient.requestWithRetryOnStaleState(CloudSolrClient.java:851)
	at org.apache.solr.client.solrj.impl.CloudSolrClient.request(CloudSolrClient.java:817)
	at org.apache.solr.client.solrj.SolrRequest.process(SolrRequest.java:194)
	at org.apache.solr.client.solrj.SolrClient.query(SolrClient.java:942)
	at org.apache.solr.client.solrj.SolrClient.query(SolrClient.java:957)
	at org.apache.solr.cloud.cdcr.CdcrTestsUtil.invokeCdcrAction(CdcrTestsUtil.java:83)
	at org.apache.solr.cloud.cdcr.CdcrTestsUtil.cdcrStart(CdcrTestsUtil.java:60)
	at org.apache.solr.cloud.cdcr.CdcrBidirectionalTest.testBiDir(CdcrBidirectionalTest.java:78)
	at java.base/jdk.internal.reflect.NativeMethodAccessorImpl.invoke0(Native Method)
	at java.base/jdk.internal.reflect.NativeMethodAccessorImpl.invoke(NativeMethodAccessorImpl.java:62)
	at java.base/jdk.internal.reflect.DelegatingMethodAccessorImpl.invoke(DelegatingMethodAccessorImpl.java:43)
	at java.base/java.lang.reflect.Method.invoke(Method.java:566)
	at com.carrotsearch.randomizedtesting.RandomizedRunner.invoke(RandomizedRunner.java:1742)
	at com.carrotsearch.randomizedtesting.RandomizedRunner$8.evaluate(RandomizedRunner.java:935)
	at com.carrotsearch.randomizedtesting.RandomizedRunner$9.evaluate(RandomizedRunner.java:971)
	at com.carrotsearch.randomizedtesting.RandomizedRunner$10.evaluate(RandomizedRunner.java:985)
	at com.carrotsearch.randomizedtesting.rules.SystemPropertiesRestoreRule$1.evaluate(SystemPropertiesRestoreRule.java:57)
	at org.apache.lucene.util.TestRuleSetupTeardownChained$1.evaluate(TestRuleSetupTeardownChained.java:49)
	at org.apache.lucene.util.AbstractBeforeAfterRule$1.evaluate(AbstractBeforeAfterRule.java:45)
	at org.apache.lucene.util.TestRuleThreadAndTestName$1.evaluate(TestRuleThreadAndTestName.java:48)
	at org.apache.lucene.util.TestRuleIgnoreAfterMaxFailures$1.evaluate(TestRuleIgnoreAfterMaxFailures.java:64)
	at org.apache.lucene.util.TestRuleMarkFailure$1.evaluate(TestRuleMarkFailure.java:47)
	at com.carrotsearch.randomizedtesting.rules.StatementAdapter.evaluate(StatementAdapter.java:36)
	at com.carrotsearch.randomizedtesting.ThreadLeakControl$StatementRunner.run(ThreadLeakControl.java:368)
	at com.carrotsearch.randomizedtesting.ThreadLeakControl.forkTimeoutingTask(ThreadLeakControl.java:817)
	at com.carrotsearch.randomizedtesting.ThreadLeakControl$3.evaluate(ThreadLeakControl.java:468)
	at com.carrotsearch.randomizedtesting.RandomizedRunner.runSingleTest(RandomizedRunner.java:944)
	at com.carrotsearch.randomizedtesting.RandomizedRunner$5.evaluate(RandomizedRunner.java:830)
	at com.carrotsearch.randomizedtesting.RandomizedRunner$6.evaluate(RandomizedRunner.java:880)
	at com.carrotsearch.randomizedtesting.RandomizedRunner$7.evaluate(RandomizedRunner.java:891)
	at com.carrotsearch.randomizedtesting.rules.StatementAdapter.evaluate(StatementAdapter.java:36)
	at com.carrotsearch.randomizedtesting.rules.SystemPropertiesRestoreRule$1.evaluate(SystemPropertiesRestoreRule.java:57)
	at org.apache.lucene.util.AbstractBeforeAfterRule$1.evaluate(AbstractBeforeAfterRule.java:45)
	at com.carrotsearch.randomizedtesting.rules.StatementAdapter.evaluate(StatementAdapter.java:36)
	at org.apache.lucene.util.TestRuleStoreClassName$1.evaluate(TestRuleStoreClassName.java:41)
	at com.carrotsearch.randomizedtesting.rules.NoShadowingOrOverridesOnMethodsRule$1.evaluate(NoShadowingOrOverridesOnMethodsRule.java:40)
	at com.carrotsearch.randomizedtesting.rules.NoShadowingOrOverridesOnMethodsRule$1.evaluate(NoShadowingOrOverridesOnMethodsRule.java:40)
	at com.carrotsearch.randomizedtesting.rules.StatementAdapter.evaluate(StatementAdapter.java:36)
	at com.carrotsearch.randomizedtesting.rules.StatementAdapter.evaluate(StatementAdapter.java:36)
	at org.apache.lucene.util.TestRuleAssertionsRequired$1.evaluate(TestRuleAssertionsRequired.java:53)
	at org.apache.lucene.util.TestRuleMarkFailure$1.evaluate(TestRuleMarkFailure.java:47)
	at org.apache.lucene.util.TestRuleIgnoreAfterMaxFailures$1.evaluate(TestRuleIgnoreAfterMaxFailures.java:64)
	at org.apache.lucene.util.TestRuleIgnoreTestSuites$1.evaluate(TestRuleIgnoreTestSuites.java:54)
	at com.carrotsearch.randomizedtesting.rules.StatementAdapter.evaluate(StatementAdapter.java:36)
	at com.carrotsearch.randomizedtesting.ThreadLeakControl$StatementRunner.run(ThreadLeakControl.java:368)
	at java.base/java.lang.Thread.run(Thread.java:834)


FAILED:  org.apache.solr.cloud.cdcr.CdcrBidirectionalTest.testBiDir

Error Message:
Collection not found: cdcr-cluster1

Stack Trace:
org.apache.solr.common.SolrException: Collection not found: cdcr-cluster1
	at __randomizedtesting.SeedInfo.seed([30DE7798017005F6:7505877A195E49B4]:0)
	at org.apache.solr.client.solrj.impl.CloudSolrClient.requestWithRetryOnStaleState(CloudSolrClient.java:851)
	at org.apache.solr.client.solrj.impl.CloudSolrClient.request(CloudSolrClient.java:817)
	at org.apache.solr.client.solrj.SolrRequest.process(SolrRequest.java:194)
	at org.apache.solr.client.solrj.SolrClient.query(SolrClient.java:942)
	at org.apache.solr.client.solrj.SolrClient.query(SolrClient.java:957)
	at org.apache.solr.cloud.cdcr.CdcrTestsUtil.invokeCdcrAction(CdcrTestsUtil.java:83)
	at org.apache.solr.cloud.cdcr.CdcrTestsUtil.cdcrStart(CdcrTestsUtil.java:60)
	at org.apache.solr.cloud.cdcr.CdcrBidirectionalTest.testBiDir(CdcrBidirectionalTest.java:78)
	at java.base/jdk.internal.reflect.NativeMethodAccessorImpl.invoke0(Native Method)
	at java.base/jdk.internal.reflect.NativeMethodAccessorImpl.invoke(NativeMethodAccessorImpl.java:62)
	at java.base/jdk.internal.reflect.DelegatingMethodAccessorImpl.invoke(DelegatingMethodAccessorImpl.java:43)
	at java.base/java.lang.reflect.Method.invoke(Method.java:566)
	at com.carrotsearch.randomizedtesting.RandomizedRunner.invoke(RandomizedRunner.java:1742)
	at com.carrotsearch.randomizedtesting.RandomizedRunner$8.evaluate(RandomizedRunner.java:935)
	at com.carrotsearch.randomizedtesting.RandomizedRunner$9.evaluate(RandomizedRunner.java:971)
	at com.carrotsearch.randomizedtesting.RandomizedRunner$10.evaluate(RandomizedRunner.java:985)
	at com.carrotsearch.randomizedtesting.rules.SystemPropertiesRestoreRule$1.evaluate(SystemPropertiesRestoreRule.java:57)
	at org.apache.lucene.util.TestRuleSetupTeardownChained$1.evaluate(TestRuleSetupTeardownChained.java:49)
	at org.apache.lucene.util.AbstractBeforeAfterRule$1.evaluate(AbstractBeforeAfterRule.java:45)
	at org.apache.lucene.util.TestRuleThreadAndTestName$1.evaluate(TestRuleThreadAndTestName.java:48)
	at org.apache.lucene.util.TestRuleIgnoreAfterMaxFailures$1.evaluate(TestRuleIgnoreAfterMaxFailures.java:64)
	at org.apache.lucene.util.TestRuleMarkFailure$1.evaluate(TestRuleMarkFailure.java:47)
	at com.carrotsearch.randomizedtesting.rules.StatementAdapter.evaluate(StatementAdapter.java:36)
	at com.carrotsearch.randomizedtesting.ThreadLeakControl$StatementRunner.run(ThreadLeakControl.java:368)
	at com.carrotsearch.randomizedtesting.ThreadLeakControl.forkTimeoutingTask(ThreadLeakControl.java:817)
	at com.carrotsearch.randomizedtesting.ThreadLeakControl$3.evaluate(ThreadLeakControl.java:468)
	at com.carrotsearch.randomizedtesting.RandomizedRunner.runSingleTest(RandomizedRunner.java:944)
	at com.carrotsearch.randomizedtesting.RandomizedRunner$5.evaluate(RandomizedRunner.java:830)
	at com.carrotsearch.randomizedtesting.RandomizedRunner$6.evaluate(RandomizedRunner.java:880)
	at com.carrotsearch.randomizedtesting.RandomizedRunner$7.evaluate(RandomizedRunner.java:891)
	at com.carrotsearch.randomizedtesting.rules.StatementAdapter.evaluate(StatementAdapter.java:36)
	at com.carrotsearch.randomizedtesting.rules.SystemPropertiesRestoreRule$1.evaluate(SystemPropertiesRestoreRule.java:57)
	at org.apache.lucene.util.AbstractBeforeAfterRule$1.evaluate(AbstractBeforeAfterRule.java:45)
	at com.carrotsearch.randomizedtesting.rules.StatementAdapter.evaluate(StatementAdapter.java:36)
	at org.apache.lucene.util.TestRuleStoreClassName$1.evaluate(TestRuleStoreClassName.java:41)
	at com.carrotsearch.randomizedtesting.rules.NoShadowingOrOverridesOnMethodsRule$1.evaluate(NoShadowingOrOverridesOnMethodsRule.java:40)
	at com.carrotsearch.randomizedtesting.rules.NoShadowingOrOverridesOnMethodsRule$1.evaluate(NoShadowingOrOverridesOnMethodsRule.java:40)
	at com.carrotsearch.randomizedtesting.rules.StatementAdapter.evaluate(StatementAdapter.java:36)
	at com.carrotsearch.randomizedtesting.rules.StatementAdapter.evaluate(StatementAdapter.java:36)
	at org.apache.lucene.util.TestRuleAssertionsRequired$1.evaluate(TestRuleAssertionsRequired.java:53)
	at org.apache.lucene.util.TestRuleMarkFailure$1.evaluate(TestRuleMarkFailure.java:47)
	at org.apache.lucene.util.TestRuleIgnoreAfterMaxFailures$1.evaluate(TestRuleIgnoreAfterMaxFailures.java:64)
	at org.apache.lucene.util.TestRuleIgnoreTestSuites$1.evaluate(TestRuleIgnoreTestSuites.java:54)
	at com.carrotsearch.randomizedtesting.rules.StatementAdapter.evaluate(StatementAdapter.java:36)
	at com.carrotsearch.randomizedtesting.ThreadLeakControl$StatementRunner.run(ThreadLeakControl.java:368)
	at java.base/java.lang.Thread.run(Thread.java:834)


FAILED:  org.apache.solr.cloud.cdcr.CdcrBidirectionalTest.testBiDir

Error Message:
Collection not found: cdcr-cluster1

Stack Trace:
org.apache.solr.common.SolrException: Collection not found: cdcr-cluster1
	at __randomizedtesting.SeedInfo.seed([30DE7798017005F6:7505877A195E49B4]:0)
	at org.apache.solr.client.solrj.impl.CloudSolrClient.requestWithRetryOnStaleState(CloudSolrClient.java:851)
	at org.apache.solr.client.solrj.impl.CloudSolrClient.request(CloudSolrClient.java:817)
	at org.apache.solr.client.solrj.SolrRequest.process(SolrRequest.java:194)
	at org.apache.solr.client.solrj.SolrClient.query(SolrClient.java:942)
	at org.apache.solr.client.solrj.SolrClient.query(SolrClient.java:957)
	at org.apache.solr.cloud.cdcr.CdcrTestsUtil.invokeCdcrAction(CdcrTestsUtil.java:83)
	at org.apache.solr.cloud.cdcr.CdcrTestsUtil.cdcrStart(CdcrTestsUtil.java:60)
	at org.apache.solr.cloud.cdcr.CdcrBidirectionalTest.testBiDir(CdcrBidirectionalTest.java:78)
	at java.base/jdk.internal.reflect.NativeMethodAccessorImpl.invoke0(Native Method)
	at java.base/jdk.internal.reflect.NativeMethodAccessorImpl.invoke(NativeMethodAccessorImpl.java:62)
	at java.base/jdk.internal.reflect.DelegatingMethodAccessorImpl.invoke(DelegatingMethodAccessorImpl.java:43)
	at java.base/java.lang.reflect.Method.invoke(Method.java:566)
	at com.carrotsearch.randomizedtesting.RandomizedRunner.invoke(RandomizedRunner.java:1742)
	at com.carrotsearch.randomizedtesting.RandomizedRunner$8.evaluate(RandomizedRunner.java:935)
	at com.carrotsearch.randomizedtesting.RandomizedRunner$9.evaluate(RandomizedRunner.java:971)
	at com.carrotsearch.randomizedtesting.RandomizedRunner$10.evaluate(RandomizedRunner.java:985)
	at com.carrotsearch.randomizedtesting.rules.SystemPropertiesRestoreRule$1.evaluate(SystemPropertiesRestoreRule.java:57)
	at org.apache.lucene.util.TestRuleSetupTeardownChained$1.evaluate(TestRuleSetupTeardownChained.java:49)
	at org.apache.lucene.util.AbstractBeforeAfterRule$1.evaluate(AbstractBeforeAfterRule.java:45)
	at org.apache.lucene.util.TestRuleThreadAndTestName$1.evaluate(TestRuleThreadAndTestName.java:48)
	at org.apache.lucene.util.TestRuleIgnoreAfterMaxFailures$1.evaluate(TestRuleIgnoreAfterMaxFailures.java:64)
	at org.apache.lucene.util.TestRuleMarkFailure$1.evaluate(TestRuleMarkFailure.java:47)
	at com.carrotsearch.randomizedtesting.rules.StatementAdapter.evaluate(StatementAdapter.java:36)
	at com.carrotsearch.randomizedtesting.ThreadLeakControl$StatementRunner.run(ThreadLeakControl.java:368)
	at com.carrotsearch.randomizedtesting.ThreadLeakControl.forkTimeoutingTask(ThreadLeakControl.java:817)
	at com.carrotsearch.randomizedtesting.ThreadLeakControl$3.evaluate(ThreadLeakControl.java:468)
	at com.carrotsearch.randomizedtesting.RandomizedRunner.runSingleTest(RandomizedRunner.java:944)
	at com.carrotsearch.randomizedtesting.RandomizedRunner$5.evaluate(RandomizedRunner.java:830)
	at com.carrotsearch.randomizedtesting.RandomizedRunner$6.evaluate(RandomizedRunner.java:880)
	at com.carrotsearch.randomizedtesting.RandomizedRunner$7.evaluate(RandomizedRunner.java:891)
	at com.carrotsearch.randomizedtesting.rules.StatementAdapter.evaluate(StatementAdapter.java:36)
	at com.carrotsearch.randomizedtesting.rules.SystemPropertiesRestoreRule$1.evaluate(SystemPropertiesRestoreRule.java:57)
	at org.apache.lucene.util.AbstractBeforeAfterRule$1.evaluate(AbstractBeforeAfterRule.java:45)
	at com.carrotsearch.randomizedtesting.rules.StatementAdapter.evaluate(StatementAdapter.java:36)
	at org.apache.lucene.util.TestRuleStoreClassName$1.evaluate(TestRuleStoreClassName.java:41)
	at com.carrotsearch.randomizedtesting.rules.NoShadowingOrOverridesOnMethodsRule$1.evaluate(NoShadowingOrOverridesOnMethodsRule.java:40)
	at com.carrotsearch.randomizedtesting.rules.NoShadowingOrOverridesOnMethodsRule$1.evaluate(NoShadowingOrOverridesOnMethodsRule.java:40)
	at com.carrotsearch.randomizedtesting.rules.StatementAdapter.evaluate(StatementAdapter.java:36)
	at com.carrotsearch.randomizedtesting.rules.StatementAdapter.evaluate(StatementAdapter.java:36)
	at org.apache.lucene.util.TestRuleAssertionsRequired$1.evaluate(TestRuleAssertionsRequired.java:53)
	at org.apache.lucene.util.TestRuleMarkFailure$1.evaluate(TestRuleMarkFailure.java:47)
	at org.apache.lucene.util.TestRuleIgnoreAfterMaxFailures$1.evaluate(TestRuleIgnoreAfterMaxFailures.java:64)
	at org.apache.lucene.util.TestRuleIgnoreTestSuites$1.evaluate(TestRuleIgnoreTestSuites.java:54)
	at com.carrotsearch.randomizedtesting.rules.StatementAdapter.evaluate(StatementAdapter.java:36)
	at com.carrotsearch.randomizedtesting.ThreadLeakControl$StatementRunner.run(ThreadLeakControl.java:368)
	at java.base/java.lang.Thread.run(Thread.java:834)


FAILED:  org.apache.solr.cloud.cdcr.CdcrBidirectionalTest.testBiDir

Error Message:
Collection not found: cdcr-cluster1

Stack Trace:
org.apache.solr.common.SolrException: Collection not found: cdcr-cluster1
	at __randomizedtesting.SeedInfo.seed([30DE7798017005F6:7505877A195E49B4]:0)
	at org.apache.solr.client.solrj.impl.CloudSolrClient.requestWithRetryOnStaleState(CloudSolrClient.java:851)
	at org.apache.solr.client.solrj.impl.CloudSolrClient.request(CloudSolrClient.java:817)
	at org.apache.solr.client.solrj.SolrRequest.process(SolrRequest.java:194)
	at org.apache.solr.client.solrj.SolrClient.query(SolrClient.java:942)
	at org.apache.solr.client.solrj.SolrClient.query(SolrClient.java:957)
	at org.apache.solr.cloud.cdcr.CdcrTestsUtil.invokeCdcrAction(CdcrTestsUtil.java:83)
	at org.apache.solr.cloud.cdcr.CdcrTestsUtil.cdcrStart(CdcrTestsUtil.java:60)
	at org.apache.solr.cloud.cdcr.CdcrBidirectionalTest.testBiDir(CdcrBidirectionalTest.java:78)
	at java.base/jdk.internal.reflect.NativeMethodAccessorImpl.invoke0(Native Method)
	at java.base/jdk.internal.reflect.NativeMethodAccessorImpl.invoke(NativeMethodAccessorImpl.java:62)
	at java.base/jdk.internal.reflect.DelegatingMethodAccessorImpl.invoke(DelegatingMethodAccessorImpl.java:43)
	at java.base/java.lang.reflect.Method.invoke(Method.java:566)
	at com.carrotsearch.randomizedtesting.RandomizedRunner.invoke(RandomizedRunner.java:1742)
	at com.carrotsearch.randomizedtesting.RandomizedRunner$8.evaluate(RandomizedRunner.java:935)
	at com.carrotsearch.randomizedtesting.RandomizedRunner$9.evaluate(RandomizedRunner.java:971)
	at com.carrotsearch.randomizedtesting.RandomizedRunner$10.evaluate(RandomizedRunner.java:985)
	at com.carrotsearch.randomizedtesting.rules.SystemPropertiesRestoreRule$1.evaluate(SystemPropertiesRestoreRule.java:57)
	at org.apache.lucene.util.TestRuleSetupTeardownChained$1.evaluate(TestRuleSetupTeardownChained.java:49)
	at org.apache.lucene.util.AbstractBeforeAfterRule$1.evaluate(AbstractBeforeAfterRule.java:45)
	at org.apache.lucene.util.TestRuleThreadAndTestName$1.evaluate(TestRuleThreadAndTestName.java:48)
	at org.apache.lucene.util.TestRuleIgnoreAfterMaxFailures$1.evaluate(TestRuleIgnoreAfterMaxFailures.java:64)
	at org.apache.lucene.util.TestRuleMarkFailure$1.evaluate(TestRuleMarkFailure.java:47)
	at com.carrotsearch.randomizedtesting.rules.StatementAdapter.evaluate(StatementAdapter.java:36)
	at com.carrotsearch.randomizedtesting.ThreadLeakControl$StatementRunner.run(ThreadLeakControl.java:368)
	at com.carrotsearch.randomizedtesting.ThreadLeakControl.forkTimeoutingTask(ThreadLeakControl.java:817)
	at com.carrotsearch.randomizedtesting.ThreadLeakControl$3.evaluate(ThreadLeakControl.java:468)
	at com.carrotsearch.randomizedtesting.RandomizedRunner.runSingleTest(RandomizedRunner.java:944)
	at com.carrotsearch.randomizedtesting.RandomizedRunner$5.evaluate(RandomizedRunner.java:830)
	at com.carrotsearch.randomizedtesting.RandomizedRunner$6.evaluate(RandomizedRunner.java:880)
	at com.carrotsearch.randomizedtesting.RandomizedRunner$7.evaluate(RandomizedRunner.java:891)
	at com.carrotsearch.randomizedtesting.rules.StatementAdapter.evaluate(StatementAdapter.java:36)
	at com.carrotsearch.randomizedtesting.rules.SystemPropertiesRestoreRule$1.evaluate(SystemPropertiesRestoreRule.java:57)
	at org.apache.lucene.util.AbstractBeforeAfterRule$1.evaluate(AbstractBeforeAfterRule.java:45)
	at com.carrotsearch.randomizedtesting.rules.StatementAdapter.evaluate(StatementAdapter.java:36)
	at org.apache.lucene.util.TestRuleStoreClassName$1.evaluate(TestRuleStoreClassName.java:41)
	at com.carrotsearch.randomizedtesting.rules.NoShadowingOrOverridesOnMethodsRule$1.evaluate(NoShadowingOrOverridesOnMethodsRule.java:40)
	at com.carrotsearch.randomizedtesting.rules.NoShadowingOrOverridesOnMethodsRule$1.evaluate(NoShadowingOrOverridesOnMethodsRule.java:40)
	at com.carrotsearch.randomizedtesting.rules.StatementAdapter.evaluate(StatementAdapter.java:36)
	at com.carrotsearch.randomizedtesting.rules.StatementAdapter.evaluate(StatementAdapter.java:36)
	at org.apache.lucene.util.TestRuleAssertionsRequired$1.evaluate(TestRuleAssertionsRequired.java:53)
	at org.apache.lucene.util.TestRuleMarkFailure$1.evaluate(TestRuleMarkFailure.java:47)
	at org.apache.lucene.util.TestRuleIgnoreAfterMaxFailures$1.evaluate(TestRuleIgnoreAfterMaxFailures.java:64)
	at org.apache.lucene.util.TestRuleIgnoreTestSuites$1.evaluate(TestRuleIgnoreTestSuites.java:54)
	at com.carrotsearch.randomizedtesting.rules.StatementAdapter.evaluate(StatementAdapter.java:36)
	at com.carrotsearch.randomizedtesting.ThreadLeakControl$StatementRunner.run(ThreadLeakControl.java:368)
	at java.base/java.lang.Thread.run(Thread.java:834)




Build Log:
[...truncated 12751 lines...]
   [junit4] Suite: org.apache.solr.cloud.TestCloudRecovery
   [junit4]   2> 289311 INFO  (SUITE-TestCloudRecovery-seed#[30DE7798017005F6]-worker) [    ] o.a.s.SolrTestCaseJ4 SecureRandom sanity checks: test.solr.allowed.securerandom=null & java.security.egd=file:/dev/./urandom
   [junit4]   2> Creating dataDir: /home/jenkins/workspace/Lucene-Solr-7.x-Linux/solr/build/solr-core/test/J1/temp/solr.cloud.TestCloudRecovery_30DE7798017005F6-001/init-core-data-001
   [junit4]   2> 289311 WARN  (SUITE-TestCloudRecovery-seed#[30DE7798017005F6]-worker) [    ] o.a.s.SolrTestCaseJ4 startTrackingSearchers: numOpens=28 numCloses=28
   [junit4]   2> 289311 INFO  (SUITE-TestCloudRecovery-seed#[30DE7798017005F6]-worker) [    ] o.a.s.SolrTestCaseJ4 Using PointFields (NUMERIC_POINTS_SYSPROP=true) w/NUMERIC_DOCVALUES_SYSPROP=true
   [junit4]   2> 289312 INFO  (SUITE-TestCloudRecovery-seed#[30DE7798017005F6]-worker) [    ] o.a.s.SolrTestCaseJ4 Randomized ssl (true) and clientAuth (false) via: @org.apache.solr.util.RandomizeSSL(reason="", ssl=0.0/0.0, value=0.0/0.0, clientAuth=0.0/0.0)
   [junit4]   2> 289312 INFO  (SUITE-TestCloudRecovery-seed#[30DE7798017005F6]-worker) [    ] o.a.s.c.MiniSolrCloudCluster Starting cluster of 2 servers in /home/jenkins/workspace/Lucene-Solr-7.x-Linux/solr/build/solr-core/test/J1/temp/solr.cloud.TestCloudRecovery_30DE7798017005F6-001/tempDir-001
   [junit4]   2> 289312 INFO  (SUITE-TestCloudRecovery-seed#[30DE7798017005F6]-worker) [    ] o.a.s.c.ZkTestServer STARTING ZK TEST SERVER
   [junit4]   2> 289312 INFO  (Thread-469) [    ] o.a.s.c.ZkTestServer client port:0.0.0.0/0.0.0.0:0
   [junit4]   2> 289312 INFO  (Thread-469) [    ] o.a.s.c.ZkTestServer Starting server
   [junit4]   2> 289315 ERROR (Thread-469) [    ] o.a.z.s.ZooKeeperServer ZKShutdownHandler is not registered, so ZooKeeper server won't take any action on ERROR or SHUTDOWN server state changes
   [junit4]   2> 289412 INFO  (SUITE-TestCloudRecovery-seed#[30DE7798017005F6]-worker) [    ] o.a.s.c.ZkTestServer start zk server on port:42759
   [junit4]   2> 289414 INFO  (zkConnectionManagerCallback-827-thread-1) [    ] o.a.s.c.c.ConnectionManager zkClient has connected
   [junit4]   2> 289433 INFO  (jetty-launcher-824-thread-2) [    ] o.e.j.s.Server jetty-9.4.11.v20180605; built: 2018-06-05T18:24:03.829Z; git: d5fc0523cfa96bfebfbda19606cad384d772f04c; jvm 11+28
   [junit4]   2> 289433 INFO  (jetty-launcher-824-thread-1) [    ] o.e.j.s.Server jetty-9.4.11.v20180605; built: 2018-06-05T18:24:03.829Z; git: d5fc0523cfa96bfebfbda19606cad384d772f04c; jvm 11+28
   [junit4]   2> 289434 INFO  (jetty-launcher-824-thread-1) [    ] o.e.j.s.session DefaultSessionIdManager workerName=node0
   [junit4]   2> 289434 INFO  (jetty-launcher-824-thread-1) [    ] o.e.j.s.session No SessionScavenger set, using defaults
   [junit4]   2> 289434 INFO  (jetty-launcher-824-thread-1) [    ] o.e.j.s.session node0 Scavenging every 660000ms
   [junit4]   2> 289434 INFO  (jetty-launcher-824-thread-2) [    ] o.e.j.s.session DefaultSessionIdManager workerName=node0
   [junit4]   2> 289434 INFO  (jetty-launcher-824-thread-2) [    ] o.e.j.s.session No SessionScavenger set, using defaults
   [junit4]   2> 289434 INFO  (jetty-launcher-824-thread-2) [    ] o.e.j.s.session node0 Scavenging every 660000ms
   [junit4]   2> 289435 INFO  (jetty-launcher-824-thread-1) [    ] o.e.j.s.h.ContextHandler Started o.e.j.s.ServletContextHandler@1e088386{/solr,null,AVAILABLE}
   [junit4]   2> 289435 INFO  (jetty-launcher-824-thread-2) [    ] o.e.j.s.h.ContextHandler Started o.e.j.s.ServletContextHandler@afeccd0{/solr,null,AVAILABLE}
   [junit4]   2> 289436 INFO  (jetty-launcher-824-thread-1) [    ] o.e.j.s.AbstractConnector Started ServerConnector@3681d6a2{SSL,[ssl, http/1.1]}{127.0.0.1:39119}
   [junit4]   2> 289436 INFO  (jetty-launcher-824-thread-2) [    ] o.e.j.s.AbstractConnector Started ServerConnector@65d10672{SSL,[ssl, http/1.1]}{127.0.0.1:39769}
   [junit4]   2> 289436 INFO  (jetty-launcher-824-thread-1) [    ] o.e.j.s.Server Started @289460ms
   [junit4]   2> 289436 INFO  (jetty-launcher-824-thread-2) [    ] o.e.j.s.Server Started @289460ms
   [junit4]   2> 289436 INFO  (jetty-launcher-824-thread-2) [    ] o.a.s.c.s.e.JettySolrRunner Jetty properties: {hostContext=/solr, hostPort=39769}
   [junit4]   2> 289436 INFO  (jetty-launcher-824-thread-1) [    ] o.a.s.c.s.e.JettySolrRunner Jetty properties: {hostContext=/solr, hostPort=39119}
   [junit4]   2> 289436 ERROR (jetty-launcher-824-thread-1) [    ] o.a.s.u.StartupLoggingUtils Missing Java Option solr.log.dir. Logging may be missing or incomplete.
   [junit4]   2> 289436 ERROR (jetty-launcher-824-thread-2) [    ] o.a.s.u.StartupLoggingUtils Missing Java Option solr.log.dir. Logging may be missing or incomplete.
   [junit4]   2> 289436 INFO  (jetty-launcher-824-thread-1) [    ] o.a.s.s.SolrDispatchFilter Using logger factory org.apache.logging.slf4j.Log4jLoggerFactory
   [junit4]   2> 289436 INFO  (jetty-launcher-824-thread-2) [    ] o.a.s.s.SolrDispatchFilter Using logger factory org.apache.logging.slf4j.Log4jLoggerFactory
   [junit4]   2> 289436 INFO  (jetty-launcher-824-thread-2) [    ] o.a.s.s.SolrDispatchFilter  ___      _       Welcome to Apache Solr™ version 7.6.0
   [junit4]   2> 289436 INFO  (jetty-launcher-824-thread-1) [    ] o.a.s.s.SolrDispatchFilter  ___      _       Welcome to Apache Solr™ version 7.6.0
   [junit4]   2> 289436 INFO  (jetty-launcher-824-thread-2) [    ] o.a.s.s.SolrDispatchFilter / __| ___| |_ _   Starting in cloud mode on port null
   [junit4]   2> 289436 INFO  (jetty-launcher-824-thread-1) [    ] o.a.s.s.SolrDispatchFilter / __| ___| |_ _   Starting in cloud mode on port null
   [junit4]   2> 289436 INFO  (jetty-launcher-824-thread-2) [    ] o.a.s.s.SolrDispatchFilter \__ \/ _ \ | '_|  Install dir: null
   [junit4]   2> 289436 INFO  (jetty-launcher-824-thread-1) [    ] o.a.s.s.SolrDispatchFilter \__ \/ _ \ | '_|  Install dir: null
   [junit4]   2> 289436 INFO  (jetty-launcher-824-thread-2) [    ] o.a.s.s.SolrDispatchFilter |___/\___/_|_|    Start time: 2018-09-13T23:03:49.520907Z
   [junit4]   2> 289436 INFO  (jetty-launcher-824-thread-1) [    ] o.a.s.s.SolrDispatchFilter |___/\___/_|_|    Start time: 2018-09-13T23:03:49.520916Z
   [junit4]   2> 289438 INFO  (zkConnectionManagerCallback-830-thread-1) [    ] o.a.s.c.c.ConnectionManager zkClient has connected
   [junit4]   2> 289438 INFO  (zkConnectionManagerCallback-831-thread-1) [    ] o.a.s.c.c.ConnectionManager zkClient has connected
   [junit4]   2> 289438 INFO  (jetty-launcher-824-thread-1) [    ] o.a.s.s.SolrDispatchFilter solr.xml found in ZooKeeper. Loading...
   [junit4]   2> 289438 INFO  (jetty-launcher-824-thread-2) [    ] o.a.s.s.SolrDispatchFilter solr.xml found in ZooKeeper. Loading...
   [junit4]   2> 289487 INFO  (jetty-launcher-824-thread-1) [    ] o.a.s.c.ZkContainer Zookeeper client=127.0.0.1:42759/solr
   [junit4]   2> 289488 INFO  (zkConnectionManagerCallback-835-thread-1) [    ] o.a.s.c.c.ConnectionManager zkClient has connected
   [junit4]   2> 289490 INFO  (zkConnectionManagerCallback-837-thread-1) [    ] o.a.s.c.c.ConnectionManager zkClient has connected
   [junit4]   2> 289520 INFO  (jetty-launcher-824-thread-2) [    ] o.a.s.c.ZkContainer Zookeeper client=127.0.0.1:42759/solr
   [junit4]   2> 289532 INFO  (zkConnectionManagerCallback-843-thread-1) [    ] o.a.s.c.c.ConnectionManager zkClient has connected
   [junit4]   2> 289540 INFO  (jetty-launcher-824-thread-1) [n:127.0.0.1:39119_solr    ] o.a.s.c.OverseerElectionContext I am going to be the leader 127.0.0.1:39119_solr
   [junit4]   2> 289540 INFO  (jetty-launcher-824-thread-1) [n:127.0.0.1:39119_solr    ] o.a.s.c.Overseer Overseer (id=72219828866383876-127.0.0.1:39119_solr-n_0000000000) starting
   [junit4]   2> 289552 INFO  (zkConnectionManagerCallback-845-thread-1) [    ] o.a.s.c.c.ConnectionManager zkClient has connected
   [junit4]   2> 289557 INFO  (jetty-launcher-824-thread-2) [n:127.0.0.1:39769_solr    ] o.a.s.c.ZkController Register node as live in ZooKeeper:/live_nodes/127.0.0.1:39769_solr
   [junit4]   2> 289559 INFO  (zkConnectionManagerCallback-850-thread-1) [    ] o.a.s.c.c.ConnectionManager zkClient has connected
   [junit4]   2> 289560 INFO  (jetty-launcher-824-thread-1) [n:127.0.0.1:39119_solr    ] o.a.s.c.c.ZkStateReader Updated live nodes from ZooKeeper... (0) -> (1)
   [junit4]   2> 289561 INFO  (jetty-launcher-824-thread-1) [n:127.0.0.1:39119_solr    ] o.a.s.c.s.i.ZkClientClusterStateProvider Cluster at 127.0.0.1:42759/solr ready
   [junit4]   2> 289566 INFO  (zkCallback-836-thread-1) [    ] o.a.s.c.c.ZkStateReader Updated live nodes from ZooKeeper... (0) -> (1)
   [junit4]   2> 289566 INFO  (OverseerStateUpdate-72219828866383876-127.0.0.1:39119_solr-n_0000000000) [n:127.0.0.1:39119_solr    ] o.a.s.c.Overseer Starting to work on the main queue : 127.0.0.1:39119_solr
   [junit4]   2> 289571 INFO  (jetty-launcher-824-thread-1) [n:127.0.0.1:39119_solr    ] o.a.s.c.TransientSolrCoreCacheDefault Allocating transient cache for 2147483647 transient cores
   [junit4]   2> 289571 INFO  (jetty-launcher-824-thread-1) [n:127.0.0.1:39119_solr    ] o.a.s.c.ZkController Register node as live in ZooKeeper:/live_nodes/127.0.0.1:39119_solr
   [junit4]   2> 289575 INFO  (zkCallback-836-thread-1) [    ] o.a.s.c.c.ZkStateReader Updated live nodes from ZooKeeper... (1) -> (2)
   [junit4]   2> 289584 INFO  (zkCallback-844-thread-1) [    ] o.a.s.c.c.ZkStateReader Updated live nodes from ZooKeeper... (0) -> (2)
   [junit4]   2> 289584 INFO  (jetty-launcher-824-thread-1) [n:127.0.0.1:39119_solr    ] o.a.s.h.a.MetricsHistoryHandler No .system collection, keeping metrics history in memory.
   [junit4]   2> 289584 INFO  (zkCallback-849-thread-1) [    ] o.a.s.c.c.ZkStateReader Updated live nodes from ZooKeeper... (1) -> (2)
   [junit4]   2> 289584 INFO  (zkConnectionManagerCallback-857-thread-1) [    ] o.a.s.c.c.ConnectionManager zkClient has connected
   [junit4]   2> 289585 INFO  (jetty-launcher-824-thread-2) [n:127.0.0.1:39769_solr    ] o.a.s.c.c.ZkStateReader Updated live nodes from ZooKeeper... (0) -> (2)
   [junit4]   2> 289585 INFO  (jetty-launcher-824-thread-2) [n:127.0.0.1:39769_solr    ] o.a.s.c.s.i.ZkClientClusterStateProvider Cluster at 127.0.0.1:42759/solr ready
   [junit4]   2> 289594 INFO  (jetty-launcher-824-thread-2) [n:127.0.0.1:39769_solr    ] o.a.s.h.a.MetricsHistoryHandler No .system collection, keeping metrics history in memory.
   [junit4]   2> 289596 INFO  (jetty-launcher-824-thread-1) [n:127.0.0.1:39119_solr    ] o.a.s.m.r.SolrJmxReporter JMX monitoring for 'solr_39119.solr.node' (registry 'solr.node') enabled at server: com.sun.jmx.mbeanserver.JmxMBeanServer@4d5221e8
   [junit4]   2> 289601 INFO  (jetty-launcher-824-thread-1) [n:127.0.0.1:39119_solr    ] o.a.s.m.r.SolrJmxReporter JMX monitoring for 'solr_39119.solr.jvm' (registry 'solr.jvm') enabled at server: com.sun.jmx.mbeanserver.JmxMBeanServer@4d5221e8
   [junit4]   2> 289602 INFO  (jetty-launcher-824-thread-1) [n:127.0.0.1:39119_solr    ] o.a.s.m.r.SolrJmxReporter JMX monitoring for 'solr_39119.solr.jetty' (registry 'solr.jetty') enabled at server: com.sun.jmx.mbeanserver.JmxMBeanServer@4d5221e8
   [junit4]   2> 289603 INFO  (jetty-launcher-824-thread-1) [n:127.0.0.1:39119_solr    ] o.a.s.c.CorePropertiesLocator Found 0 core definitions underneath /home/jenkins/workspace/Lucene-Solr-7.x-Linux/solr/build/solr-core/test/J1/temp/solr.cloud.TestCloudRecovery_30DE7798017005F6-001/tempDir-001/node1/.
   [junit4]   2> 289605 INFO  (jetty-launcher-824-thread-2) [n:127.0.0.1:39769_solr    ] o.a.s.m.r.SolrJmxReporter JMX monitoring for 'solr_39769.solr.node' (registry 'solr.node') enabled at server: com.sun.jmx.mbeanserver.JmxMBeanServer@4d5221e8
   [junit4]   2> 289610 INFO  (jetty-launcher-824-thread-2) [n:127.0.0.1:39769_solr    ] o.a.s.m.r.SolrJmxReporter JMX monitoring for 'solr_39769.solr.jvm' (registry 'solr.jvm') enabled at server: com.sun.jmx.mbeanserver.JmxMBeanServer@4d5221e8
   [junit4]   2> 289610 INFO  (jetty-launcher-824-thread-2) [n:127.0.0.1:39769_solr    ] o.a.s.m.r.SolrJmxReporter JMX monitoring for 'solr_39769.solr.jetty' (registry 'solr.jetty') enabled at server: com.sun.jmx.mbeanserver.JmxMBeanServer@4d5221e8
   [junit4]   2> 289610 INFO  (jetty-launcher-824-thread-2) [n:127.0.0.1:39769_solr    ] o.a.s.c.CorePropertiesLocator Found 0 core definitions underneath /home/jenkins/workspace/Lucene-Solr-7.x-Linux/solr/build/solr-core/test/J1/temp/solr.cloud.TestCloudRecovery_30DE7798017005F6-001/tempDir-001/node2/.
   [junit4]   2> 289635 INFO  (zkConnectionManagerCallback-861-thread-1) [    ] o.a.s.c.c.ConnectionManager zkClient has connected
   [junit4]   2> 289637 INFO  (zkConnectionManagerCallback-866-thread-1) [    ] o.a.s.c.c.ConnectionManager zkClient has connected
   [junit4]   2> 289638 INFO  (SUITE-TestCloudRecovery-seed#[30DE7798017005F6]-worker) [    ] o.a.s.c.c.ZkStateReader Updated live nodes from ZooKeeper... (0) -> (2)
   [junit4]   2> 289638 INFO  (SUITE-TestCloudRecovery-seed#[30DE7798017005F6]-worker) [    ] o.a.s.c.s.i.ZkClientClusterStateProvider Cluster at 127.0.0.1:42759/solr ready
   [junit4]   2> 289653 INFO  (qtp1921295838-2760) [n:127.0.0.1:39769_solr    ] o.a.s.h.a.CollectionsHandler Invoked Collection Action :create with params pullReplicas=0&collection.configName=config&maxShardsPerNode=2&name=collection1&nrtReplicas=0&action=CREATE&numShards=2&tlogReplicas=2&wt=javabin&version=2 and sendToOCPQueue=true
   [junit4]   2> 289654 INFO  (OverseerThreadFactory-1229-thread-1-processing-n:127.0.0.1:39119_solr) [n:127.0.0.1:39119_solr    ] o.a.s.c.a.c.CreateCollectionCmd Create collection collection1
   [junit4]   2> 289759 INFO  (OverseerStateUpdate-72219828866383876-127.0.0.1:39119_solr-n_0000000000) [n:127.0.0.1:39119_solr    ] o.a.s.c.o.SliceMutator createReplica() {
   [junit4]   2>   "operation":"ADDREPLICA",
   [junit4]   2>   "collection":"collection1",
   [junit4]   2>   "shard":"shard1",
   [junit4]   2>   "core":"collection1_shard1_replica_t1",
   [junit4]   2>   "state":"down",
   [junit4]   2>   "base_url":"https://127.0.0.1:39769/solr",
   [junit4]   2>   "type":"TLOG",
   [junit4]   2>   "waitForFinalState":"false"} 
   [junit4]   2> 289760 INFO  (OverseerStateUpdate-72219828866383876-127.0.0.1:39119_solr-n_0000000000) [n:127.0.0.1:39119_solr    ] o.a.s.c.o.SliceMutator createReplica() {
   [junit4]   2>   "operation":"ADDREPLICA",
   [junit4]   2>   "collection":"collection1",
   [junit4]   2>   "shard":"shard1",
   [junit4]   2>   "core":"collection1_shard1_replica_t2",
   [junit4]   2>   "state":"down",
   [junit4]   2>   "base_url":"https://127.0.0.1:39119/solr",
   [junit4]   2>   "type":"TLOG",
   [junit4]   2>   "waitForFinalState":"false"} 
   [junit4]   2> 289761 INFO  (OverseerStateUpdate-72219828866383876-127.0.0.1:39119_solr-n_0000000000) [n:127.0.0.1:39119_solr    ] o.a.s.c.o.SliceMutator createReplica() {
   [junit4]   2>   "operation":"ADDREPLICA",
   [junit4]   2>   "collection":"collection1",
   [junit4]   2>   "shard":"shard2",
   [junit4]   2>   "core":"collection1_shard2_replica_t4",
   [junit4]   2>   "state":"down",
   [junit4]   2>   "base_url":"https://127.0.0.1:39769/solr",
   [junit4]   2>   "type":"TLOG",
   [junit4]   2>   "waitForFinalState":"false"} 
   [junit4]   2> 289762 INFO  (OverseerStateUpdate-72219828866383876-127.0.0.1:39119_solr-n_0000000000) [n:127.0.0.1:39119_solr    ] o.a.s.c.o.SliceMutator createReplica() {
   [junit4]   2>   "operation":"ADDREPLICA",
   [junit4]   2>   "collection":"collection1",
   [junit4]   2>   "shard":"shard2",
   [junit4]   2>   "core":"collection1_shard2_replica_t6",
   [junit4]   2>   "state":"down",
   [junit4]   2>   "base_url":"https://127.0.0.1:39119/solr",
   [junit4]   2>   "type":"TLOG",
   [junit4]   2>   "waitForFinalState":"false"} 
   [junit4]   2> 289973 ERROR (OverseerThreadFactory-1229-thread-1-processing-n:127.0.0.1:39119_solr) [n:127.0.0.1:39119_solr    ] o.a.s.c.a.c.OverseerCollectionMessageHandler Error from shard: https://127.0.0.1:39769/solr
   [junit4]   2> org.apache.solr.client.solrj.SolrServerException: IOException occured when talking to server at: https://127.0.0.1:39769/solr
   [junit4]   2> 	at org.apache.solr.client.solrj.impl.HttpSolrClient.executeMethod(HttpSolrClient.java:657) ~[java/:?]
   [junit4]   2> 	at org.apache.solr.client.solrj.impl.HttpSolrClient.request(HttpSolrClient.java:255) ~[java/:?]
   [junit4]   2> 	at org.apache.solr.client.solrj.impl.HttpSolrClient.request(HttpSolrClient.java:244) ~[java/:?]
   [junit4]   2> 	at org.apache.solr.client.solrj.SolrClient.request(SolrClient.java:1219) ~[java/:?]
   [junit4]   2> 	at org.apache.solr.handler.component.HttpShardHandler.lambda$submit$0(HttpShardHandler.java:172) ~[java/:?]
   [junit4]   2> 	at java.util.concurrent.FutureTask.run(FutureTask.java:264) ~[?:?]
   [junit4]   2> 	at java.util.concurrent.Executors$RunnableAdapter.call(Executors.java:515) ~[?:?]
   [junit4]   2> 	at java.util.concurrent.FutureTask.run(FutureTask.java:264) ~[?:?]
   [junit4]   2> 	at com.codahale.metrics.InstrumentedExecutorService$InstrumentedRunnable.run(InstrumentedExecutorService.java:176) ~[metrics-core-3.2.6.jar:3.2.6]
   [junit4]   2> 	at org.apache.solr.common.util.ExecutorUtil$MDCAwareThreadPoolExecutor.lambda$execute$0(ExecutorUtil.java:209) [java/:?]
   [junit4]   2> 	at java.util.concurrent.ThreadPoolExecutor.runWorker(ThreadPoolExecutor.java:1128) [?:?]
   [junit4]   2> 	at java.util.concurrent.ThreadPoolExecutor$Worker.run(ThreadPoolExecutor.java:628) [?:?]
   [junit4]   2> 	at java.lang.Thread.run(Thread.java:834) [?:?]
   [junit4]   2> Caused by: javax.net.ssl.SSLException: Received fatal alert: internal_error
   [junit4]   2> 	at sun.security.ssl.Alert.createSSLException(Alert.java:129) ~[?:?]
   [junit4]   2> 	at sun.security.ssl.Alert.createSSLException(Alert.java:117) ~[?:?]
   [junit4]   2> 	at sun.security.ssl.TransportContext.fatal(TransportContext.java:308) ~[?:?]
   [junit4]   2> 	at sun.security.ssl.Alert$AlertConsumer.consume(Alert.java:279) ~[?:?]
   [junit4]   2> 	at sun.security.ssl.TransportContext.dispatch(TransportContext.java:181) ~[?:?]
   [junit4]   2> 	at sun.security.ssl.SSLTransport.decode(SSLTransport.java:164) ~[?:?]
   [junit4]   2> 	at sun.security.ssl.SSLSocketImpl.decode(SSLSocketImpl.java:1152) ~[?:?]
   [junit4]   2> 	at sun.security.ssl.SSLSocketImpl.readHandshakeRecord(SSLSocketImpl.java:1063) ~[?:?]
   [junit4]   2> 	at sun.security.ssl.SSLSocketImpl.startHandshake(SSLSocketImpl.java:402) ~[?:?]
   [junit4]   2> 	at org.apache.http.conn.ssl.SSLConnectionSocketFactory.createLayeredSocket(SSLConnectionSocketFactory.java:396) ~[httpclient-4.5.3.jar:4.5.3]
   [junit4]   2> 	at org.apache.http.conn.ssl.SSLConnectionSocketFactory.connectSocket(SSLConnectionSocketFactory.java:355) ~[httpclient-4.5.3.jar:4.5.3]
   [junit4]   2> 	at org.apache.http.impl.conn.DefaultHttpClientConnectionOperator.connect(DefaultHttpClientConnectionOperator.java:142) ~[httpclient-4.5.3.jar:4.5.3]
   [junit4]   2> 	at org.apache.http.impl.conn.PoolingHttpClientConnectionManager.connect(PoolingHttpClientConnectionManager.java:359) ~[httpclient-4.5.3.jar:4.5.3]
   [junit4]   2> 	at org.apache.http.impl.execchain.MainClientExec.establishRoute(MainClientExec.java:381) ~[httpclient-4.5.3.jar:4.5.3]
   [junit4]   2> 	at org.apache.http.impl.execchain.MainClientExec.execute(MainClientExec.java:237) ~[httpclient-4.5.3.jar:4.5.3]
   [junit4]   2> 	at org.apache.http.impl.execchain.ProtocolExec.execute(ProtocolExec.java:185) ~[httpclient-4.5.3.jar:4.5.3]
   [junit4]   2> 	at org.apache.http.impl.execchain.RetryExec.execute(RetryExec.java:89) ~[httpclient-4.5.3.jar:4.5.3]
   [junit4]   2> 	at org.apache.http.impl.execchain.RedirectExec.execute(RedirectExec.java:111) ~[httpclient-4.5.3.jar:4.5.3]
   [junit4]   2> 	at org.apache.http.impl.client.InternalHttpClient.doExecute(InternalHttpClient.java:185) ~[httpclient-4.5.3.jar:4.5.3]
   [junit4]   2> 	at org.apache.http.impl.client.CloseableHttpClient.execute(CloseableHttpClient.java:83) ~[httpclient-4.5.3.jar:4.5.3]
   [junit4]   2> 	at org.apache.http.impl.client.CloseableHttpClient.execute(CloseableHttpClient.java:56) ~[httpclient-4.5.3.jar:4.5.3]
   [junit4]   2> 	at org.apache.solr.client.solrj.impl.HttpSolrClient.executeMethod(HttpSolrClient.java:542) ~[java/:?]
   [junit4]   2> 	... 12 more
   [junit4]   2> 289984 INFO  (qtp1921295838-2748) [n:127.0.0.1:39769_solr    x:collection1_shard2_replica_t4] o.a.s.h.a.CoreAdminOperation core create command qt=/admin/cores&coreNodeName=core_node7&collection.configName=config&newCollection=true&name=collection1_shard2_replica_t4&action=CREATE&numShards=2&collection=collection1&shard=shard2&wt=javabin&version=2&replicaType=TLOG
   [junit4]   2> 289984 INFO  (qtp1921295838-2748) [n:127.0.0.1:39769_solr    x:collection1_shard2_replica_t4] o.a.s.c.TransientSolrCoreCacheDefault Allocating transient cache for 2147483647 transient cores
   [junit4]   2> 289985 INFO  (qtp1344316681-2757) [n:127.0.0.1:39119_solr    x:collection1_shard2_replica_t6] o.a.s.h.a.CoreAdminOperation core create command qt=/admin/cores&coreNodeName=core_node8&collection.configName=config&newCollection=true&name=collection1_shard2_replica_t6&action=CREATE&numShards=2&collection=collection1&shard=shard2&wt=javabin&version=2&replicaType=TLOG
   [junit4]   2> 289985 INFO  (qtp1344316681-2833) [n:127.0.0.1:39119_solr    x:collection1_shard1_replica_t2] o.a.s.h.a.CoreAdminOperation core create command qt=/admin/cores&coreNodeName=core_node5&collection.configName=config&newCollection=true&name=collection1_shard1_replica_t2&action=CREATE&numShards=2&collection=collection1&shard=shard1&wt=javabin&version=2&replicaType=TLOG
   [junit4]   2> 290992 INFO  (qtp1344316681-2757) [n:127.0.0.1:39119_solr c:collection1 s:shard2 r:core_node8 x:collection1_shard2_replica_t6] o.a.s.c.SolrConfig Using Lucene MatchVersion: 7.6.0
   [junit4]   2> 290993 INFO  (qtp1344316681-2833) [n:127.0.0.1:39119_solr c:collection1 s:shard1 r:core_node5 x:collection1_shard1_replica_t2] o.a.s.c.SolrConfig Using Lucene MatchVersion: 7.6.0
   [junit4]   2> 290993 INFO  (qtp1921295838-2748) [n:127.0.0.1:39769_solr c:collection1 s:shard2 r:core_node7 x:collection1_shard2_replica_t4] o.a.s.c.SolrConfig Using Lucene MatchVersion: 7.6.0
   [junit4]   2> 290999 INFO  (qtp1344316681-2757) [n:127.0.0.1:39119_solr c:collection1 s:shard2 r:core_node8 x:collection1_shard2_replica_t6] o.a.s.s.IndexSchema [collection1_shard2_replica_t6] Schema name=minimal
   [junit4]   2> 291000 INFO  (qtp1344316681-2833) [n:127.0.0.1:39119_solr c:collection1 s:shard1 r:core_node5 x:collection1_shard1_replica_t2] o.a.s.s.IndexSchema [collection1_shard1_replica_t2] Schema name=minimal
   [junit4]   2> 291000 INFO  (qtp1921295838-2748) [n:127.0.0.1:39769_solr c:collection1 s:shard2 r:core_node7 x:collection1_shard2_replica_t4] o.a.s.s.IndexSchema [collection1_shard2_replica_t4] Schema name=minimal
   [junit4]   2> 291000 INFO  (qtp1344316681-2757) [n:127.0.0.1:39119_solr c:collection1 s:shard2 r:core_node8 x:collection1_shard2_replica_t6] o.a.s.s.IndexSchema Loaded schema minimal/1.1 with uniqueid field id
   [junit4]   2> 291000 INFO  (qtp1344316681-2757) [n:127.0.0.1:39119_solr c:collection1 s:shard2 r:core_node8 x:collection1_shard2_replica_t6] o.a.s.c.CoreContainer Creating SolrCore 'collection1_shard2_replica_t6' using configuration from collection collection1, trusted=true
   [junit4]   2> 291001 INFO  (qtp1344316681-2757) [n:127.0.0.1:39119_solr c:collection1 s:shard2 r:core_node8 x:collection1_shard2_replica_t6] o.a.s.m.r.SolrJmxReporter JMX monitoring for 'solr_39119.solr.core.collection1.shard2.replica_t6' (registry 'solr.core.collection1.shard2.replica_t6') enabled at server: com.sun.jmx.mbeanserver.JmxMBeanServer@4d5221e8
   [junit4]   2> 291001 INFO  (qtp1921295838-2748) [n:127.0.0.1:39769_solr c:collection1 s:shard2 r:core_node7 x:collection1_shard2_replica_t4] o.a.s.s.IndexSchema Loaded schema minimal/1.1 with uniqueid field id
   [junit4]   2> 291001 INFO  (qtp1344316681-2833) [n:127.0.0.1:39119_solr c:collection1 s:shard1 r:core_node5 x:collection1_shard1_replica_t2] o.a.s.s.IndexSchema Loaded schema minimal/1.1 with uniqueid field id
   [junit4]   2> 291001 INFO  (qtp1344316681-2833) [n:127.0.0.1:39119_solr c:collection1 s:shard1 r:core_node5 x:collection1_shard1_replica_t2] o.a.s.c.CoreContainer Creating SolrCore 'collection1_shard1_replica_t2' using configuration from collection collection1, trusted=true
   [junit4]   2> 291001 INFO  (qtp1921295838-2748) [n:127.0.0.1:39769_solr c:collection1 s:shard2 r:core_node7 x:collection1_shard2_replica_t4] o.a.s.c.CoreContainer Creating SolrCore 'collection1_shard2_replica_t4' using configuration from collection collection1, trusted=true
   [junit4]   2> 291002 INFO  (qtp1921295838-2748) [n:127.0.0.1:39769_solr c:collection1 s:shard2 r:core_node7 x:collection1_shard2_replica_t4] o.a.s.m.r.SolrJmxReporter JMX monitoring for 'solr_39769.solr.core.collection1.shard2.replica_t4' (registry 'solr.core.collection1.shard2.replica_t4') enabled at server: com.sun.jmx.mbeanserver.JmxMBeanServer@4d5221e8
   [junit4]   2> 291002 INFO  (qtp1344316681-2833) [n:127.0.0.1:39119_solr c:collection1 s:shard1 r:core_node5 x:collection1_shard1_replica_t2] o.a.s.m.r.SolrJmxReporter JMX monitoring for 'solr_39119.solr.core.collection1.shard1.replica_t2' (registry 'solr.core.collection1.shard1.replica_t2') enabled at server: com.sun.jmx.mbeanserver.JmxMBeanServer@4d5221e8
   [junit4]   2> 291003 INFO  (qtp1344316681-2757) [n:127.0.0.1:39119_solr c:collection1 s:shard2 r:core_node8 x:collection1_shard2_replica_t6] o.a.s.c.SolrCore [[collection1_shard2_replica_t6] ] Opening new SolrCore at [/home/jenkins/workspace/Lucene-Solr-7.x-Linux/solr/build/solr-core/test/J1/temp/solr.cloud.TestCloudRecovery_30DE7798017005F6-001/tempDir-001/node1/collection1_shard2_replica_t6], dataDir=[/home/jenkins/workspace/Lucene-Solr-7.x-Linux/solr/build/solr-core/test/J1/temp/solr.cloud.TestCloudRecovery_30DE7798017005F6-001/tempDir-001/node1/./collection1_shard2_replica_t6/data/]
   [junit4]   2> 291004 INFO  (qtp1344316681-2833) [n:127.0.0.1:39119_solr c:collection1 s:shard1 r:core_node5 x:collection1_shard1_replica_t2] o.a.s.c.SolrCore [[collection1_shard1_replica_t2] ] Opening new SolrCore at [/home/jenkins/workspace/Lucene-Solr-7.x-Linux/solr/build/solr-core/test/J1/temp/solr.cloud.TestCloudRecovery_30DE7798017005F6-001/tempDir-001/node1/collection1_shard1_replica_t2], dataDir=[/home/jenkins/workspace/Lucene-Solr-7.x-Linux/solr/build/solr-core/test/J1/temp/solr.cloud.TestCloudRecovery_30DE7798017005F6-001/tempDir-001/node1/./collection1_shard1_replica_t2/data/]
   [junit4]   2> 291004 INFO  (qtp1921295838-2748) [n:127.0.0.1:39769_solr c:collection1 s:shard2 r:core_node7 x:collection1_shard2_replica_t4] o.a.s.c.SolrCore [[collection1_shard2_replica_t4] ] Opening new SolrCore at [/home/jenkins/workspace/Lucene-Solr-7.x-Linux/solr/build/solr-core/test/J1/temp/solr.cloud.TestCloudRecovery_30DE7798017005F6-001/tempDir-001/node2/collection1_shard2_replica_t4], dataDir=[/home/jenkins/workspace/Lucene-Solr-7.x-Linux/solr/build/solr-core/test/J1/temp/solr.cloud.TestCloudRecovery_30DE7798017005F6-001/tempDir-001/node2/./collection1_shard2_replica_t4/data/]
   [junit4]   2> 291100 INFO  (qtp1344316681-2757) [n:127.0.0.1:39119_solr c:collection1 s:shard2 r:core_node8 x:collection1_shard2_replica_t6] o.a.s.u.UpdateHandler Using UpdateLog implementation: org.apache.solr.update.UpdateLog
   [junit4]   2> 291100 INFO  (qtp1344316681-2757) [n:127.0.0.1:39119_solr c:collection1 s:shard2 r:core_node8 x:collection1_shard2_replica_t6] o.a.s.u.UpdateLog Initializing UpdateLog: dataDir=null defaultSyncLevel=FLUSH numRecordsToKeep=100 maxNumLogsToKeep=10 numVersionBuckets=65536
   [junit4]   2> 291102 INFO  (qtp1344316681-2757) [n:127.0.0.1:39119_solr c:collection1 s:shard2 r:core_node8 x:collection1_shard2_replica_t6] o.a.s.u.CommitTracker Hard AutoCommit: disabled
   [junit4]   2> 291102 INFO  (qtp1344316681-2757) [n:127.0.0.1:39119_solr c:collection1 s:shard2 r:core_node8 x:collection1_shard2_replica_t6] o.a.s.u.CommitTracker Soft AutoCommit: disabled
   [junit4]   2> 291104 INFO  (qtp1344316681-2757) [n:127.0.0.1:39119_solr c:collection1 s:shard2 r:core_node8 x:collection1_shard2_replica_t6] o.a.s.s.SolrIndexSearcher Opening [Searcher@3bb7f763[collection1_shard2_replica_t6] main]
   [junit4]   2> 291104 INFO  (qtp1921295838-2748) [n:127.0.0.1:39769_solr c:collection1 s:shard2 r:core_node7 x:collection1_shard2_replica_t4] o.a.s.u.UpdateHandler Using UpdateL

[...truncated too long message...]

557 INFO  (jetty-closer-326-thread-2) [    ] o.a.s.m.SolrMetricManager Closing metric reporters for registry=solr.jvm, tag=null
   [junit4]   2> 468557 INFO  (jetty-closer-326-thread-2) [    ] o.a.s.m.r.SolrJmxReporter Closing reporter [org.apache.solr.metrics.reporters.SolrJmxReporter@7088cef7: rootName = solr_44273, domain = solr.jvm, service url = null, agent id = null] for registry solr.jvm / com.codahale.metrics.MetricRegistry@3dcc073
   [junit4]   2> 468559 INFO  (jetty-closer-326-thread-1) [    ] o.a.s.m.SolrMetricManager Closing metric reporters for registry=solr.jetty, tag=null
   [junit4]   2> 468559 INFO  (jetty-closer-326-thread-1) [    ] o.a.s.m.r.SolrJmxReporter Closing reporter [org.apache.solr.metrics.reporters.SolrJmxReporter@16e0ce3b: rootName = solr_41519, domain = solr.jetty, service url = null, agent id = null] for registry solr.jetty / com.codahale.metrics.MetricRegistry@1539e853
   [junit4]   2> 468559 INFO  (jetty-closer-326-thread-2) [    ] o.a.s.m.SolrMetricManager Closing metric reporters for registry=solr.jetty, tag=null
   [junit4]   2> 468559 INFO  (jetty-closer-326-thread-2) [    ] o.a.s.m.r.SolrJmxReporter Closing reporter [org.apache.solr.metrics.reporters.SolrJmxReporter@31529406: rootName = solr_44273, domain = solr.jetty, service url = null, agent id = null] for registry solr.jetty / com.codahale.metrics.MetricRegistry@1539e853
   [junit4]   2> 468560 INFO  (jetty-closer-326-thread-1) [    ] o.a.s.c.ZkController Remove node as live in ZooKeeper:/live_nodes/127.0.0.1:41519_solr
   [junit4]   2> 468560 INFO  (jetty-closer-326-thread-2) [    ] o.a.s.c.ZkController Remove node as live in ZooKeeper:/live_nodes/127.0.0.1:44273_solr
   [junit4]   2> 468561 INFO  (jetty-closer-326-thread-1) [    ] o.a.s.m.SolrMetricManager Closing metric reporters for registry=solr.cluster, tag=null
   [junit4]   2> 468561 INFO  (jetty-closer-326-thread-2) [    ] o.a.s.m.SolrMetricManager Closing metric reporters for registry=solr.cluster, tag=null
   [junit4]   2> 468561 INFO  (zkCallback-337-thread-3) [    ] o.a.s.c.c.ZkStateReader Updated live nodes from ZooKeeper... (2) -> (0)
   [junit4]   2> 468561 INFO  (zkCallback-345-thread-4) [    ] o.a.s.c.c.ZkStateReader Updated live nodes from ZooKeeper... (2) -> (0)
   [junit4]   2> 468561 INFO  (zkCallback-358-thread-2) [    ] o.a.s.c.c.ZkStateReader Updated live nodes from ZooKeeper... (2) -> (0)
   [junit4]   2> 468561 INFO  (zkCallback-352-thread-3) [    ] o.a.s.c.c.ZkStateReader Updated live nodes from ZooKeeper... (2) -> (0)
   [junit4]   2> 468563 INFO  (jetty-closer-326-thread-1) [    ] o.a.s.c.Overseer Overseer (id=72220090906116102-127.0.0.1:41519_solr-n_0000000000) closing
   [junit4]   2> 468563 INFO  (OverseerStateUpdate-72220090906116102-127.0.0.1:41519_solr-n_0000000000) [n:127.0.0.1:41519_solr    ] o.a.s.c.Overseer Overseer Loop exiting : 127.0.0.1:41519_solr
   [junit4]   2> 468563 DEBUG (jetty-closer-326-thread-1) [    ] o.a.s.c.a.ScheduledTriggers Shutting down scheduled thread pool executor now
   [junit4]   2> 468563 WARN  (OverseerAutoScalingTriggerThread-72220090906116102-127.0.0.1:41519_solr-n_0000000000) [    ] o.a.s.c.a.OverseerTriggerThread OverseerTriggerThread woken up but we are closed, exiting.
   [junit4]   2> 468563 DEBUG (jetty-closer-326-thread-1) [    ] o.a.s.c.a.ScheduledTriggers Shutting down action executor now
   [junit4]   2> 468563 DEBUG (jetty-closer-326-thread-1) [    ] o.a.s.c.a.ScheduledTriggers Awaiting termination for action executor
   [junit4]   2> 468563 DEBUG (jetty-closer-326-thread-1) [    ] o.a.s.c.a.ScheduledTriggers Awaiting termination for scheduled thread pool executor
   [junit4]   2> 468563 DEBUG (jetty-closer-326-thread-1) [    ] o.a.s.c.a.ScheduledTriggers ScheduledTriggers closed completely
   [junit4]   2> 468563 DEBUG (jetty-closer-326-thread-1) [    ] o.a.s.c.a.OverseerTriggerThread OverseerTriggerThread has been closed explicitly
   [junit4]   2> 468563 WARN  (NIOServerCxn.Factory:0.0.0.0/0.0.0.0:0) [    ] o.a.z.s.NIOServerCnxn Unable to read additional data from client sessionid 0x10093ca401b0007, likely client has closed socket
   [junit4]   2> 468565 INFO  (jetty-closer-326-thread-1) [    ] o.e.j.s.h.ContextHandler Stopped o.e.j.s.ServletContextHandler@3f7554e4{/solr,null,UNAVAILABLE}
   [junit4]   2> 468565 INFO  (jetty-closer-326-thread-1) [    ] o.e.j.s.session node0 Stopped scavenging
   [junit4]   2> 470064 INFO  (jetty-closer-326-thread-2) [    ] o.e.j.s.h.ContextHandler Stopped o.e.j.s.ServletContextHandler@629e5bea{/solr,null,UNAVAILABLE}
   [junit4]   2> 470064 INFO  (jetty-closer-326-thread-2) [    ] o.e.j.s.session node0 Stopped scavenging
   [junit4]   2> 470065 ERROR (SUITE-IndexSizeTriggerTest-seed#[30DE7798017005F6]-worker) [    ] o.a.z.s.ZooKeeperServer ZKShutdownHandler is not registered, so ZooKeeper server won't take any action on ERROR or SHUTDOWN server state changes
   [junit4]   2> 470065 INFO  (SUITE-IndexSizeTriggerTest-seed#[30DE7798017005F6]-worker) [    ] o.a.s.c.ZkTestServer connecting to 127.0.0.1:35321 35321
   [junit4]   2> 470929 INFO  (Thread-214) [    ] o.a.s.c.ZkTestServer connecting to 127.0.0.1:35321 35321
   [junit4]   2> 470930 WARN  (Thread-214) [    ] o.a.s.c.ZkTestServer Watch limit violations: 
   [junit4]   2> Maximum concurrent create/delete watches above limit:
   [junit4]   2> 
   [junit4]   2> 	13	/solr/collections/testMixedBounds_collection/terms/shard1_0
   [junit4]   2> 	12	/solr/collections/testMixedBounds_collection/terms/shard2_0
   [junit4]   2> 	10	/solr/collections/testMergeIntegration_collection/terms/shard2
   [junit4]   2> 	10	/solr/collections/testMixedBounds_collection/terms/shard1
   [junit4]   2> 	10	/solr/collections/testMergeIntegration_collection/terms/shard1
   [junit4]   2> 	10	/solr/collections/testMixedBounds_collection/terms/shard2
   [junit4]   2> 	10	/solr/collections/testTrigger_collection/terms/shard1
   [junit4]   2> 	10	/solr/collections/testTrigger_collection/terms/shard2
   [junit4]   2> 	9	/solr/collections/testMixedBounds_collection/terms/shard2_1
   [junit4]   2> 	9	/solr/collections/testMixedBounds_collection/terms/shard1_1
   [junit4]   2> 	9	/solr/aliases.json
   [junit4]   2> 	8	/solr/configs/conf
   [junit4]   2> 	8	/solr/collections/testSplitIntegration_collection/terms/shard2
   [junit4]   2> 	3	/solr/collections/testSplitIntegration_collection/terms/shard1
   [junit4]   2> 	2	/solr/security.json
   [junit4]   2> 
   [junit4]   2> Maximum concurrent data watches above limit:
   [junit4]   2> 
   [junit4]   2> 	10	/solr/aliases.json
   [junit4]   2> 	9	/solr/clusterprops.json
   [junit4]   2> 	9	/solr/clusterstate.json
   [junit4]   2> 	5	/solr/collections/testTrigger_collection/state.json
   [junit4]   2> 	5	/solr/collections/testMixedBounds_collection/state.json
   [junit4]   2> 	4	/solr/collections/testSplitIntegration_collection/state.json
   [junit4]   2> 	4	/solr/collections/testMergeIntegration_collection/state.json
   [junit4]   2> 
   [junit4]   2> Maximum concurrent children watches above limit:
   [junit4]   2> 
   [junit4]   2> 	24	/solr/collections
   [junit4]   2> 	9	/solr/live_nodes
   [junit4]   2> 
   [junit4]   2> NOTE: leaving temporary files on disk at: /home/jenkins/workspace/Lucene-Solr-7.x-Linux/solr/build/solr-core/test/J2/temp/solr.cloud.autoscaling.IndexSizeTriggerTest_30DE7798017005F6-001
   [junit4]   2> NOTE: test params are: codec=Lucene70, sim=RandomSimilarity(queryNorm=true): {}, locale=es-DO, timezone=Etc/GMT-10
   [junit4]   2> NOTE: Linux 4.15.0-32-generic amd64/Oracle Corporation 11 (64-bit)/cpus=8,threads=1,free=68657792,total=536870912
   [junit4]   2> NOTE: All tests run in this JVM: [TestCloudRecovery, IndexSizeTriggerTest, TestCloudRecovery, TestCloudRecovery, IndexSizeTriggerTest]
   [junit4] Completed [15/15 (10!)] on J2 in 208.60s, 4 tests, 1 failure <<< FAILURES!

[...truncated 20 lines...]
BUILD FAILED
/home/jenkins/workspace/Lucene-Solr-7.x-Linux/lucene/common-build.xml:1567: The following error occurred while executing this line:
/home/jenkins/workspace/Lucene-Solr-7.x-Linux/lucene/common-build.xml:1092: There were test failures: 15 suites, 33 tests, 1 suite-level error, 7 errors, 2 failures [seed: 30DE7798017005F6]

Total time: 7 minutes 53 seconds

[repro] Setting last failure code to 256

[repro] Failures:
[repro]   2/5 failed: org.apache.solr.cloud.TestCloudRecovery
[repro]   3/5 failed: org.apache.solr.cloud.autoscaling.IndexSizeTriggerTest
[repro]   5/5 failed: org.apache.solr.cloud.cdcr.CdcrBidirectionalTest
[repro] Exiting with code 256
+ mv lucene/build lucene/build.repro
+ mv solr/build solr/build.repro
+ mv lucene/build.orig lucene/build
+ mv solr/build.orig solr/build
Archiving artifacts
Setting ANT_1_8_2_HOME=/var/lib/jenkins/tools/hudson.tasks.Ant_AntInstallation/ANT_1.8.2
[WARNINGS] Parsing warnings in console log with parser Java Compiler (javac)
Setting ANT_1_8_2_HOME=/var/lib/jenkins/tools/hudson.tasks.Ant_AntInstallation/ANT_1.8.2
Setting ANT_1_8_2_HOME=/var/lib/jenkins/tools/hudson.tasks.Ant_AntInstallation/ANT_1.8.2
<Git Blamer> Using GitBlamer to create author and commit information for all warnings.
<Git Blamer> GIT_COMMIT=9c8b4353a23598b40b9ac30a735b61f7172d6ba4, workspace=/var/lib/jenkins/workspace/Lucene-Solr-7.x-Linux
[WARNINGS] Computing warning deltas based on reference build #2738
Recording test results
Setting ANT_1_8_2_HOME=/var/lib/jenkins/tools/hudson.tasks.Ant_AntInstallation/ANT_1.8.2
Build step 'Publish JUnit test result report' changed build result to UNSTABLE
Email was triggered for: Unstable (Test Failures)
Sending email for trigger: Unstable (Test Failures)
Setting ANT_1_8_2_HOME=/var/lib/jenkins/tools/hudson.tasks.Ant_AntInstallation/ANT_1.8.2
Setting ANT_1_8_2_HOME=/var/lib/jenkins/tools/hudson.tasks.Ant_AntInstallation/ANT_1.8.2
Setting ANT_1_8_2_HOME=/var/lib/jenkins/tools/hudson.tasks.Ant_AntInstallation/ANT_1.8.2
Setting ANT_1_8_2_HOME=/var/lib/jenkins/tools/hudson.tasks.Ant_AntInstallation/ANT_1.8.2

Mime
View raw message