lucene-dev mailing list archives

Site index · List index
Message view « Date » · « Thread »
Top « Date » · « Thread »
From Policeman Jenkins Server <jenk...@thetaphi.de>
Subject [JENKINS] Lucene-Solr-BadApples-master-Linux (64bit/jdk-10) - Build # 86 - Unstable!
Date Sun, 02 Sep 2018 05:08:13 GMT
Build: https://jenkins.thetaphi.de/job/Lucene-Solr-BadApples-master-Linux/86/
Java: 64bit/jdk-10 -XX:-UseCompressedOops -XX:+UseParallelGC

2 tests failed.
FAILED:  org.apache.solr.cloud.SSLMigrationTest.test

Error Message:
Replica didn't have the proper urlScheme in the ClusterState

Stack Trace:
java.lang.AssertionError: Replica didn't have the proper urlScheme in the ClusterState
	at __randomizedtesting.SeedInfo.seed([242E8F1A3C07F4AE:AC7AB0C092FB9956]:0)
	at org.junit.Assert.fail(Assert.java:93)
	at org.junit.Assert.assertTrue(Assert.java:43)
	at org.apache.solr.cloud.SSLMigrationTest.assertReplicaInformation(SSLMigrationTest.java:104)
	at org.apache.solr.cloud.SSLMigrationTest.testMigrateSSL(SSLMigrationTest.java:97)
	at org.apache.solr.cloud.SSLMigrationTest.test(SSLMigrationTest.java:61)
	at java.base/jdk.internal.reflect.NativeMethodAccessorImpl.invoke0(Native Method)
	at java.base/jdk.internal.reflect.NativeMethodAccessorImpl.invoke(NativeMethodAccessorImpl.java:62)
	at java.base/jdk.internal.reflect.DelegatingMethodAccessorImpl.invoke(DelegatingMethodAccessorImpl.java:43)
	at java.base/java.lang.reflect.Method.invoke(Method.java:564)
	at com.carrotsearch.randomizedtesting.RandomizedRunner.invoke(RandomizedRunner.java:1737)
	at com.carrotsearch.randomizedtesting.RandomizedRunner$8.evaluate(RandomizedRunner.java:934)
	at com.carrotsearch.randomizedtesting.RandomizedRunner$9.evaluate(RandomizedRunner.java:970)
	at com.carrotsearch.randomizedtesting.RandomizedRunner$10.evaluate(RandomizedRunner.java:984)
	at org.apache.solr.BaseDistributedSearchTestCase$ShardsRepeatRule$ShardsFixedStatement.callStatement(BaseDistributedSearchTestCase.java:1008)
	at org.apache.solr.BaseDistributedSearchTestCase$ShardsRepeatRule$ShardsStatement.evaluate(BaseDistributedSearchTestCase.java:983)
	at com.carrotsearch.randomizedtesting.rules.SystemPropertiesRestoreRule$1.evaluate(SystemPropertiesRestoreRule.java:57)
	at org.apache.lucene.util.TestRuleSetupTeardownChained$1.evaluate(TestRuleSetupTeardownChained.java:49)
	at org.apache.lucene.util.AbstractBeforeAfterRule$1.evaluate(AbstractBeforeAfterRule.java:45)
	at org.apache.lucene.util.TestRuleThreadAndTestName$1.evaluate(TestRuleThreadAndTestName.java:48)
	at org.apache.lucene.util.TestRuleIgnoreAfterMaxFailures$1.evaluate(TestRuleIgnoreAfterMaxFailures.java:64)
	at org.apache.lucene.util.TestRuleMarkFailure$1.evaluate(TestRuleMarkFailure.java:47)
	at com.carrotsearch.randomizedtesting.rules.StatementAdapter.evaluate(StatementAdapter.java:36)
	at com.carrotsearch.randomizedtesting.ThreadLeakControl$StatementRunner.run(ThreadLeakControl.java:368)
	at com.carrotsearch.randomizedtesting.ThreadLeakControl.forkTimeoutingTask(ThreadLeakControl.java:817)
	at com.carrotsearch.randomizedtesting.ThreadLeakControl$3.evaluate(ThreadLeakControl.java:468)
	at com.carrotsearch.randomizedtesting.RandomizedRunner.runSingleTest(RandomizedRunner.java:943)
	at com.carrotsearch.randomizedtesting.RandomizedRunner$5.evaluate(RandomizedRunner.java:829)
	at com.carrotsearch.randomizedtesting.RandomizedRunner$6.evaluate(RandomizedRunner.java:879)
	at com.carrotsearch.randomizedtesting.RandomizedRunner$7.evaluate(RandomizedRunner.java:890)
	at com.carrotsearch.randomizedtesting.rules.StatementAdapter.evaluate(StatementAdapter.java:36)
	at com.carrotsearch.randomizedtesting.rules.SystemPropertiesRestoreRule$1.evaluate(SystemPropertiesRestoreRule.java:57)
	at org.apache.lucene.util.AbstractBeforeAfterRule$1.evaluate(AbstractBeforeAfterRule.java:45)
	at com.carrotsearch.randomizedtesting.rules.StatementAdapter.evaluate(StatementAdapter.java:36)
	at org.apache.lucene.util.TestRuleStoreClassName$1.evaluate(TestRuleStoreClassName.java:41)
	at com.carrotsearch.randomizedtesting.rules.NoShadowingOrOverridesOnMethodsRule$1.evaluate(NoShadowingOrOverridesOnMethodsRule.java:40)
	at com.carrotsearch.randomizedtesting.rules.NoShadowingOrOverridesOnMethodsRule$1.evaluate(NoShadowingOrOverridesOnMethodsRule.java:40)
	at com.carrotsearch.randomizedtesting.rules.StatementAdapter.evaluate(StatementAdapter.java:36)
	at com.carrotsearch.randomizedtesting.rules.StatementAdapter.evaluate(StatementAdapter.java:36)
	at org.apache.lucene.util.TestRuleAssertionsRequired$1.evaluate(TestRuleAssertionsRequired.java:53)
	at org.apache.lucene.util.TestRuleMarkFailure$1.evaluate(TestRuleMarkFailure.java:47)
	at org.apache.lucene.util.TestRuleIgnoreAfterMaxFailures$1.evaluate(TestRuleIgnoreAfterMaxFailures.java:64)
	at org.apache.lucene.util.TestRuleIgnoreTestSuites$1.evaluate(TestRuleIgnoreTestSuites.java:54)
	at com.carrotsearch.randomizedtesting.rules.StatementAdapter.evaluate(StatementAdapter.java:36)
	at com.carrotsearch.randomizedtesting.ThreadLeakControl$StatementRunner.run(ThreadLeakControl.java:368)
	at java.base/java.lang.Thread.run(Thread.java:844)


FAILED:  org.apache.solr.cloud.SSLMigrationTest.test

Error Message:
Replica didn't have the proper urlScheme in the ClusterState

Stack Trace:
java.lang.AssertionError: Replica didn't have the proper urlScheme in the ClusterState
	at __randomizedtesting.SeedInfo.seed([242E8F1A3C07F4AE:AC7AB0C092FB9956]:0)
	at org.junit.Assert.fail(Assert.java:93)
	at org.junit.Assert.assertTrue(Assert.java:43)
	at org.apache.solr.cloud.SSLMigrationTest.assertReplicaInformation(SSLMigrationTest.java:104)
	at org.apache.solr.cloud.SSLMigrationTest.testMigrateSSL(SSLMigrationTest.java:97)
	at org.apache.solr.cloud.SSLMigrationTest.test(SSLMigrationTest.java:61)
	at java.base/jdk.internal.reflect.NativeMethodAccessorImpl.invoke0(Native Method)
	at java.base/jdk.internal.reflect.NativeMethodAccessorImpl.invoke(NativeMethodAccessorImpl.java:62)
	at java.base/jdk.internal.reflect.DelegatingMethodAccessorImpl.invoke(DelegatingMethodAccessorImpl.java:43)
	at java.base/java.lang.reflect.Method.invoke(Method.java:564)
	at com.carrotsearch.randomizedtesting.RandomizedRunner.invoke(RandomizedRunner.java:1737)
	at com.carrotsearch.randomizedtesting.RandomizedRunner$8.evaluate(RandomizedRunner.java:934)
	at com.carrotsearch.randomizedtesting.RandomizedRunner$9.evaluate(RandomizedRunner.java:970)
	at com.carrotsearch.randomizedtesting.RandomizedRunner$10.evaluate(RandomizedRunner.java:984)
	at org.apache.solr.BaseDistributedSearchTestCase$ShardsRepeatRule$ShardsFixedStatement.callStatement(BaseDistributedSearchTestCase.java:1008)
	at org.apache.solr.BaseDistributedSearchTestCase$ShardsRepeatRule$ShardsStatement.evaluate(BaseDistributedSearchTestCase.java:983)
	at com.carrotsearch.randomizedtesting.rules.SystemPropertiesRestoreRule$1.evaluate(SystemPropertiesRestoreRule.java:57)
	at org.apache.lucene.util.TestRuleSetupTeardownChained$1.evaluate(TestRuleSetupTeardownChained.java:49)
	at org.apache.lucene.util.AbstractBeforeAfterRule$1.evaluate(AbstractBeforeAfterRule.java:45)
	at org.apache.lucene.util.TestRuleThreadAndTestName$1.evaluate(TestRuleThreadAndTestName.java:48)
	at org.apache.lucene.util.TestRuleIgnoreAfterMaxFailures$1.evaluate(TestRuleIgnoreAfterMaxFailures.java:64)
	at org.apache.lucene.util.TestRuleMarkFailure$1.evaluate(TestRuleMarkFailure.java:47)
	at com.carrotsearch.randomizedtesting.rules.StatementAdapter.evaluate(StatementAdapter.java:36)
	at com.carrotsearch.randomizedtesting.ThreadLeakControl$StatementRunner.run(ThreadLeakControl.java:368)
	at com.carrotsearch.randomizedtesting.ThreadLeakControl.forkTimeoutingTask(ThreadLeakControl.java:817)
	at com.carrotsearch.randomizedtesting.ThreadLeakControl$3.evaluate(ThreadLeakControl.java:468)
	at com.carrotsearch.randomizedtesting.RandomizedRunner.runSingleTest(RandomizedRunner.java:943)
	at com.carrotsearch.randomizedtesting.RandomizedRunner$5.evaluate(RandomizedRunner.java:829)
	at com.carrotsearch.randomizedtesting.RandomizedRunner$6.evaluate(RandomizedRunner.java:879)
	at com.carrotsearch.randomizedtesting.RandomizedRunner$7.evaluate(RandomizedRunner.java:890)
	at com.carrotsearch.randomizedtesting.rules.StatementAdapter.evaluate(StatementAdapter.java:36)
	at com.carrotsearch.randomizedtesting.rules.SystemPropertiesRestoreRule$1.evaluate(SystemPropertiesRestoreRule.java:57)
	at org.apache.lucene.util.AbstractBeforeAfterRule$1.evaluate(AbstractBeforeAfterRule.java:45)
	at com.carrotsearch.randomizedtesting.rules.StatementAdapter.evaluate(StatementAdapter.java:36)
	at org.apache.lucene.util.TestRuleStoreClassName$1.evaluate(TestRuleStoreClassName.java:41)
	at com.carrotsearch.randomizedtesting.rules.NoShadowingOrOverridesOnMethodsRule$1.evaluate(NoShadowingOrOverridesOnMethodsRule.java:40)
	at com.carrotsearch.randomizedtesting.rules.NoShadowingOrOverridesOnMethodsRule$1.evaluate(NoShadowingOrOverridesOnMethodsRule.java:40)
	at com.carrotsearch.randomizedtesting.rules.StatementAdapter.evaluate(StatementAdapter.java:36)
	at com.carrotsearch.randomizedtesting.rules.StatementAdapter.evaluate(StatementAdapter.java:36)
	at org.apache.lucene.util.TestRuleAssertionsRequired$1.evaluate(TestRuleAssertionsRequired.java:53)
	at org.apache.lucene.util.TestRuleMarkFailure$1.evaluate(TestRuleMarkFailure.java:47)
	at org.apache.lucene.util.TestRuleIgnoreAfterMaxFailures$1.evaluate(TestRuleIgnoreAfterMaxFailures.java:64)
	at org.apache.lucene.util.TestRuleIgnoreTestSuites$1.evaluate(TestRuleIgnoreTestSuites.java:54)
	at com.carrotsearch.randomizedtesting.rules.StatementAdapter.evaluate(StatementAdapter.java:36)
	at com.carrotsearch.randomizedtesting.ThreadLeakControl$StatementRunner.run(ThreadLeakControl.java:368)
	at java.base/java.lang.Thread.run(Thread.java:844)




Build Log:
[...truncated 13792 lines...]
   [junit4] Suite: org.apache.solr.cloud.SSLMigrationTest
   [junit4]   2> Creating dataDir: /home/jenkins/workspace/Lucene-Solr-BadApples-master-Linux/solr/build/solr-core/test/J0/temp/solr.cloud.SSLMigrationTest_242E8F1A3C07F4AE-001/init-core-data-001
   [junit4]   2> 2593782 WARN  (SUITE-SSLMigrationTest-seed#[242E8F1A3C07F4AE]-worker) [    ] o.a.s.SolrTestCaseJ4 startTrackingSearchers: numOpens=5 numCloses=5
   [junit4]   2> 2593782 INFO  (SUITE-SSLMigrationTest-seed#[242E8F1A3C07F4AE]-worker) [    ] o.a.s.SolrTestCaseJ4 Using PointFields (NUMERIC_POINTS_SYSPROP=true) w/NUMERIC_DOCVALUES_SYSPROP=false
   [junit4]   2> 2593782 INFO  (SUITE-SSLMigrationTest-seed#[242E8F1A3C07F4AE]-worker) [    ] o.a.s.SolrTestCaseJ4 Randomized ssl (false) and clientAuth (false) via: @org.apache.solr.SolrTestCaseJ4$SuppressSSL(bugUrl="None")
   [junit4]   2> 2593782 INFO  (SUITE-SSLMigrationTest-seed#[242E8F1A3C07F4AE]-worker) [    ] o.a.s.SolrTestCaseJ4 SecureRandom sanity checks: test.solr.allowed.securerandom=null & java.security.egd=file:/dev/./urandom
   [junit4]   2> 2593783 INFO  (SUITE-SSLMigrationTest-seed#[242E8F1A3C07F4AE]-worker) [    ] o.a.s.BaseDistributedSearchTestCase Setting hostContext system property: /ze/
   [junit4]   2> 2593784 INFO  (TEST-SSLMigrationTest.test-seed#[242E8F1A3C07F4AE]) [    ] o.a.s.c.ZkTestServer STARTING ZK TEST SERVER
   [junit4]   2> 2593790 INFO  (Thread-7317) [    ] o.a.s.c.ZkTestServer client port:0.0.0.0/0.0.0.0:0
   [junit4]   2> 2593790 INFO  (Thread-7317) [    ] o.a.s.c.ZkTestServer Starting server
   [junit4]   2> 2593801 ERROR (Thread-7317) [    ] o.a.z.s.ZooKeeperServer ZKShutdownHandler is not registered, so ZooKeeper server won't take any action on ERROR or SHUTDOWN server state changes
   [junit4]   2> 2593890 INFO  (TEST-SSLMigrationTest.test-seed#[242E8F1A3C07F4AE]) [    ] o.a.s.c.ZkTestServer start zk server on port:44113
   [junit4]   2> 2593898 INFO  (zkConnectionManagerCallback-5934-thread-1) [    ] o.a.s.c.c.ConnectionManager zkClient has connected
   [junit4]   2> 2593940 INFO  (zkConnectionManagerCallback-5936-thread-1) [    ] o.a.s.c.c.ConnectionManager zkClient has connected
   [junit4]   2> 2593947 INFO  (TEST-SSLMigrationTest.test-seed#[242E8F1A3C07F4AE]) [    ] o.a.s.c.AbstractZkTestCase put /home/jenkins/workspace/Lucene-Solr-BadApples-master-Linux/solr/core/src/test-files/solr/collection1/conf/solrconfig-tlog.xml to /configs/conf1/solrconfig.xml
   [junit4]   2> 2593948 INFO  (TEST-SSLMigrationTest.test-seed#[242E8F1A3C07F4AE]) [    ] o.a.s.c.AbstractZkTestCase put /home/jenkins/workspace/Lucene-Solr-BadApples-master-Linux/solr/core/src/test-files/solr/collection1/conf/schema.xml to /configs/conf1/schema.xml
   [junit4]   2> 2593949 INFO  (TEST-SSLMigrationTest.test-seed#[242E8F1A3C07F4AE]) [    ] o.a.s.c.AbstractZkTestCase put /home/jenkins/workspace/Lucene-Solr-BadApples-master-Linux/solr/core/src/test-files/solr/collection1/conf/solrconfig.snippet.randomindexconfig.xml to /configs/conf1/solrconfig.snippet.randomindexconfig.xml
   [junit4]   2> 2593950 INFO  (TEST-SSLMigrationTest.test-seed#[242E8F1A3C07F4AE]) [    ] o.a.s.c.AbstractZkTestCase put /home/jenkins/workspace/Lucene-Solr-BadApples-master-Linux/solr/core/src/test-files/solr/collection1/conf/stopwords.txt to /configs/conf1/stopwords.txt
   [junit4]   2> 2593950 INFO  (TEST-SSLMigrationTest.test-seed#[242E8F1A3C07F4AE]) [    ] o.a.s.c.AbstractZkTestCase put /home/jenkins/workspace/Lucene-Solr-BadApples-master-Linux/solr/core/src/test-files/solr/collection1/conf/protwords.txt to /configs/conf1/protwords.txt
   [junit4]   2> 2593951 INFO  (TEST-SSLMigrationTest.test-seed#[242E8F1A3C07F4AE]) [    ] o.a.s.c.AbstractZkTestCase put /home/jenkins/workspace/Lucene-Solr-BadApples-master-Linux/solr/core/src/test-files/solr/collection1/conf/currency.xml to /configs/conf1/currency.xml
   [junit4]   2> 2593952 INFO  (TEST-SSLMigrationTest.test-seed#[242E8F1A3C07F4AE]) [    ] o.a.s.c.AbstractZkTestCase put /home/jenkins/workspace/Lucene-Solr-BadApples-master-Linux/solr/core/src/test-files/solr/collection1/conf/enumsConfig.xml to /configs/conf1/enumsConfig.xml
   [junit4]   2> 2593953 INFO  (TEST-SSLMigrationTest.test-seed#[242E8F1A3C07F4AE]) [    ] o.a.s.c.AbstractZkTestCase put /home/jenkins/workspace/Lucene-Solr-BadApples-master-Linux/solr/core/src/test-files/solr/collection1/conf/open-exchange-rates.json to /configs/conf1/open-exchange-rates.json
   [junit4]   2> 2593954 INFO  (TEST-SSLMigrationTest.test-seed#[242E8F1A3C07F4AE]) [    ] o.a.s.c.AbstractZkTestCase put /home/jenkins/workspace/Lucene-Solr-BadApples-master-Linux/solr/core/src/test-files/solr/collection1/conf/mapping-ISOLatin1Accent.txt to /configs/conf1/mapping-ISOLatin1Accent.txt
   [junit4]   2> 2593955 INFO  (TEST-SSLMigrationTest.test-seed#[242E8F1A3C07F4AE]) [    ] o.a.s.c.AbstractZkTestCase put /home/jenkins/workspace/Lucene-Solr-BadApples-master-Linux/solr/core/src/test-files/solr/collection1/conf/old_synonyms.txt to /configs/conf1/old_synonyms.txt
   [junit4]   2> 2593956 INFO  (TEST-SSLMigrationTest.test-seed#[242E8F1A3C07F4AE]) [    ] o.a.s.c.AbstractZkTestCase put /home/jenkins/workspace/Lucene-Solr-BadApples-master-Linux/solr/core/src/test-files/solr/collection1/conf/synonyms.txt to /configs/conf1/synonyms.txt
   [junit4]   2> 2593957 INFO  (TEST-SSLMigrationTest.test-seed#[242E8F1A3C07F4AE]) [    ] o.a.s.c.AbstractFullDistribZkTestBase Will use NRT replicas unless explicitly asked otherwise
   [junit4]   2> 2594057 INFO  (TEST-SSLMigrationTest.test-seed#[242E8F1A3C07F4AE]) [    ] o.e.j.s.Server jetty-9.4.11.v20180605; built: 2018-06-05T18:24:03.829Z; git: d5fc0523cfa96bfebfbda19606cad384d772f04c; jvm 10+46
   [junit4]   2> 2594078 INFO  (TEST-SSLMigrationTest.test-seed#[242E8F1A3C07F4AE]) [    ] o.e.j.s.session DefaultSessionIdManager workerName=node0
   [junit4]   2> 2594078 INFO  (TEST-SSLMigrationTest.test-seed#[242E8F1A3C07F4AE]) [    ] o.e.j.s.session No SessionScavenger set, using defaults
   [junit4]   2> 2594078 INFO  (TEST-SSLMigrationTest.test-seed#[242E8F1A3C07F4AE]) [    ] o.e.j.s.session node0 Scavenging every 600000ms
   [junit4]   2> 2594081 INFO  (TEST-SSLMigrationTest.test-seed#[242E8F1A3C07F4AE]) [    ] o.e.j.s.h.ContextHandler Started o.e.j.s.ServletContextHandler@6709df8b{/ze,null,AVAILABLE}
   [junit4]   2> 2594082 INFO  (TEST-SSLMigrationTest.test-seed#[242E8F1A3C07F4AE]) [    ] o.e.j.s.AbstractConnector Started ServerConnector@6bab0cca{HTTP/1.1,[http/1.1]}{127.0.0.1:37903}
   [junit4]   2> 2594082 INFO  (TEST-SSLMigrationTest.test-seed#[242E8F1A3C07F4AE]) [    ] o.e.j.s.Server Started @2594108ms
   [junit4]   2> 2594082 INFO  (TEST-SSLMigrationTest.test-seed#[242E8F1A3C07F4AE]) [    ] o.a.s.c.s.e.JettySolrRunner Jetty properties: {hostContext=/ze, solr.data.dir=/home/jenkins/workspace/Lucene-Solr-BadApples-master-Linux/solr/build/solr-core/test/J0/temp/solr.cloud.SSLMigrationTest_242E8F1A3C07F4AE-001/tempDir-001/control/data, hostPort=37903, coreRootDirectory=/home/jenkins/workspace/Lucene-Solr-BadApples-master-Linux/solr/build/solr-core/test/J0/../../../../../../../../../home/jenkins/workspace/Lucene-Solr-BadApples-master-Linux/solr/build/solr-core/test/J0/temp/solr.cloud.SSLMigrationTest_242E8F1A3C07F4AE-001/control-001/cores}
   [junit4]   2> 2594083 ERROR (TEST-SSLMigrationTest.test-seed#[242E8F1A3C07F4AE]) [    ] o.a.s.u.StartupLoggingUtils Missing Java Option solr.log.dir. Logging may be missing or incomplete.
   [junit4]   2> 2594083 INFO  (TEST-SSLMigrationTest.test-seed#[242E8F1A3C07F4AE]) [    ] o.a.s.s.SolrDispatchFilter Using logger factory org.apache.logging.slf4j.Log4jLoggerFactory
   [junit4]   2> 2594083 INFO  (TEST-SSLMigrationTest.test-seed#[242E8F1A3C07F4AE]) [    ] o.a.s.s.SolrDispatchFilter  ___      _       Welcome to Apache Solr? version 8.0.0
   [junit4]   2> 2594083 INFO  (TEST-SSLMigrationTest.test-seed#[242E8F1A3C07F4AE]) [    ] o.a.s.s.SolrDispatchFilter / __| ___| |_ _   Starting in cloud mode on port null
   [junit4]   2> 2594083 INFO  (TEST-SSLMigrationTest.test-seed#[242E8F1A3C07F4AE]) [    ] o.a.s.s.SolrDispatchFilter \__ \/ _ \ | '_|  Install dir: null
   [junit4]   2> 2594083 INFO  (TEST-SSLMigrationTest.test-seed#[242E8F1A3C07F4AE]) [    ] o.a.s.s.SolrDispatchFilter |___/\___/_|_|    Start time: 2018-09-02T04:38:13.914324Z
   [junit4]   2> 2594100 INFO  (zkConnectionManagerCallback-5938-thread-1) [    ] o.a.s.c.c.ConnectionManager zkClient has connected
   [junit4]   2> 2594101 INFO  (TEST-SSLMigrationTest.test-seed#[242E8F1A3C07F4AE]) [    ] o.a.s.s.SolrDispatchFilter Loading solr.xml from SolrHome (not found in ZooKeeper)
   [junit4]   2> 2594101 INFO  (TEST-SSLMigrationTest.test-seed#[242E8F1A3C07F4AE]) [    ] o.a.s.c.SolrXmlConfig Loading container configuration from /home/jenkins/workspace/Lucene-Solr-BadApples-master-Linux/solr/build/solr-core/test/J0/temp/solr.cloud.SSLMigrationTest_242E8F1A3C07F4AE-001/control-001/solr.xml
   [junit4]   2> 2594103 INFO  (TEST-SSLMigrationTest.test-seed#[242E8F1A3C07F4AE]) [    ] o.a.s.c.SolrXmlConfig Configuration parameter autoReplicaFailoverWorkLoopDelay is ignored
   [junit4]   2> 2594103 INFO  (TEST-SSLMigrationTest.test-seed#[242E8F1A3C07F4AE]) [    ] o.a.s.c.SolrXmlConfig Configuration parameter autoReplicaFailoverBadNodeExpiration is ignored
   [junit4]   2> 2594104 INFO  (TEST-SSLMigrationTest.test-seed#[242E8F1A3C07F4AE]) [    ] o.a.s.c.SolrXmlConfig MBean server found: com.sun.jmx.mbeanserver.JmxMBeanServer@36c7b8d7, but no JMX reporters were configured - adding default JMX reporter.
   [junit4]   2> 2594263 INFO  (TEST-SSLMigrationTest.test-seed#[242E8F1A3C07F4AE]) [    ] o.a.s.c.ZkContainer Zookeeper client=127.0.0.1:44113/solr
   [junit4]   2> 2594264 INFO  (zkConnectionManagerCallback-5942-thread-1) [    ] o.a.s.c.c.ConnectionManager zkClient has connected
   [junit4]   2> 2594265 INFO  (zkConnectionManagerCallback-5944-thread-1) [    ] o.a.s.c.c.ConnectionManager zkClient has connected
   [junit4]   2> 2594298 INFO  (TEST-SSLMigrationTest.test-seed#[242E8F1A3C07F4AE]) [n:127.0.0.1:37903_ze    ] o.a.s.c.OverseerElectionContext I am going to be the leader 127.0.0.1:37903_ze
   [junit4]   2> 2594298 INFO  (TEST-SSLMigrationTest.test-seed#[242E8F1A3C07F4AE]) [n:127.0.0.1:37903_ze    ] o.a.s.c.Overseer Overseer (id=72153196070699012-127.0.0.1:37903_ze-n_0000000000) starting
   [junit4]   2> 2594301 INFO  (zkConnectionManagerCallback-5951-thread-1) [    ] o.a.s.c.c.ConnectionManager zkClient has connected
   [junit4]   2> 2594302 INFO  (TEST-SSLMigrationTest.test-seed#[242E8F1A3C07F4AE]) [n:127.0.0.1:37903_ze    ] o.a.s.c.s.i.ZkClientClusterStateProvider Cluster at 127.0.0.1:44113/solr ready
   [junit4]   2> 2594303 INFO  (OverseerStateUpdate-72153196070699012-127.0.0.1:37903_ze-n_0000000000) [n:127.0.0.1:37903_ze    ] o.a.s.c.Overseer Starting to work on the main queue : 127.0.0.1:37903_ze
   [junit4]   2> 2594303 INFO  (TEST-SSLMigrationTest.test-seed#[242E8F1A3C07F4AE]) [n:127.0.0.1:37903_ze    ] o.a.s.c.ZkController Register node as live in ZooKeeper:/live_nodes/127.0.0.1:37903_ze
   [junit4]   2> 2594304 INFO  (zkCallback-5950-thread-1) [    ] o.a.s.c.c.ZkStateReader Updated live nodes from ZooKeeper... (0) -> (1)
   [junit4]   2> 2594304 INFO  (zkCallback-5943-thread-1) [    ] o.a.s.c.c.ZkStateReader Updated live nodes from ZooKeeper... (0) -> (1)
   [junit4]   2> 2594316 INFO  (TEST-SSLMigrationTest.test-seed#[242E8F1A3C07F4AE]) [n:127.0.0.1:37903_ze    ] o.a.s.h.a.MetricsHistoryHandler No .system collection, keeping metrics history in memory.
   [junit4]   2> 2594330 INFO  (TEST-SSLMigrationTest.test-seed#[242E8F1A3C07F4AE]) [n:127.0.0.1:37903_ze    ] o.a.s.m.r.SolrJmxReporter JMX monitoring for 'solr.node' (registry 'solr.node') enabled at server: com.sun.jmx.mbeanserver.JmxMBeanServer@36c7b8d7
   [junit4]   2> 2594339 INFO  (TEST-SSLMigrationTest.test-seed#[242E8F1A3C07F4AE]) [n:127.0.0.1:37903_ze    ] o.a.s.m.r.SolrJmxReporter JMX monitoring for 'solr.jvm' (registry 'solr.jvm') enabled at server: com.sun.jmx.mbeanserver.JmxMBeanServer@36c7b8d7
   [junit4]   2> 2594339 INFO  (TEST-SSLMigrationTest.test-seed#[242E8F1A3C07F4AE]) [n:127.0.0.1:37903_ze    ] o.a.s.m.r.SolrJmxReporter JMX monitoring for 'solr.jetty' (registry 'solr.jetty') enabled at server: com.sun.jmx.mbeanserver.JmxMBeanServer@36c7b8d7
   [junit4]   2> 2594340 INFO  (TEST-SSLMigrationTest.test-seed#[242E8F1A3C07F4AE]) [n:127.0.0.1:37903_ze    ] o.a.s.c.CorePropertiesLocator Found 0 core definitions underneath /home/jenkins/workspace/Lucene-Solr-BadApples-master-Linux/solr/build/solr-core/test/J0/../../../../../../../../../home/jenkins/workspace/Lucene-Solr-BadApples-master-Linux/solr/build/solr-core/test/J0/temp/solr.cloud.SSLMigrationTest_242E8F1A3C07F4AE-001/control-001/cores
   [junit4]   2> 2594356 INFO  (zkConnectionManagerCallback-5957-thread-1) [    ] o.a.s.c.c.ConnectionManager zkClient has connected
   [junit4]   2> 2594356 INFO  (TEST-SSLMigrationTest.test-seed#[242E8F1A3C07F4AE]) [    ] o.a.s.c.c.ZkStateReader Updated live nodes from ZooKeeper... (0) -> (1)
   [junit4]   2> 2594357 INFO  (TEST-SSLMigrationTest.test-seed#[242E8F1A3C07F4AE]) [    ] o.a.s.c.s.i.ZkClientClusterStateProvider Cluster at 127.0.0.1:44113/solr ready
   [junit4]   2> 2594361 INFO  (qtp1466882133-27410) [n:127.0.0.1:37903_ze    ] o.a.s.h.a.CollectionsHandler Invoked Collection Action :create with params collection.configName=conf1&name=control_collection&nrtReplicas=1&action=CREATE&numShards=1&createNodeSet=127.0.0.1:37903_ze&wt=javabin&version=2 and sendToOCPQueue=true
   [junit4]   2> 2594364 INFO  (OverseerThreadFactory-9618-thread-1-processing-n:127.0.0.1:37903_ze) [n:127.0.0.1:37903_ze    ] o.a.s.c.a.c.CreateCollectionCmd Create collection control_collection
   [junit4]   2> 2594468 INFO  (qtp1466882133-27405) [n:127.0.0.1:37903_ze    x:control_collection_shard1_replica_n1] o.a.s.h.a.CoreAdminOperation core create command qt=/admin/cores&collection.configName=conf1&newCollection=true&name=control_collection_shard1_replica_n1&action=CREATE&numShards=1&collection=control_collection&shard=shard1&wt=javabin&version=2&replicaType=NRT
   [junit4]   2> 2594468 INFO  (qtp1466882133-27405) [n:127.0.0.1:37903_ze    x:control_collection_shard1_replica_n1] o.a.s.c.TransientSolrCoreCacheDefault Allocating transient cache for 4 transient cores
   [junit4]   2> 2595503 INFO  (qtp1466882133-27405) [n:127.0.0.1:37903_ze c:control_collection s:shard1  x:control_collection_shard1_replica_n1] o.a.s.c.SolrConfig Using Lucene MatchVersion: 8.0.0
   [junit4]   2> 2595513 INFO  (qtp1466882133-27405) [n:127.0.0.1:37903_ze c:control_collection s:shard1  x:control_collection_shard1_replica_n1] o.a.s.s.IndexSchema [control_collection_shard1_replica_n1] Schema name=test
   [junit4]   2> 2595573 INFO  (qtp1466882133-27405) [n:127.0.0.1:37903_ze c:control_collection s:shard1  x:control_collection_shard1_replica_n1] o.a.s.s.IndexSchema Loaded schema test/1.0 with uniqueid field id
   [junit4]   2> 2595580 INFO  (qtp1466882133-27405) [n:127.0.0.1:37903_ze c:control_collection s:shard1  x:control_collection_shard1_replica_n1] o.a.s.c.CoreContainer Creating SolrCore 'control_collection_shard1_replica_n1' using configuration from collection control_collection, trusted=true
   [junit4]   2> 2595580 INFO  (qtp1466882133-27405) [n:127.0.0.1:37903_ze c:control_collection s:shard1  x:control_collection_shard1_replica_n1] o.a.s.m.r.SolrJmxReporter JMX monitoring for 'solr.core.control_collection.shard1.replica_n1' (registry 'solr.core.control_collection.shard1.replica_n1') enabled at server: com.sun.jmx.mbeanserver.JmxMBeanServer@36c7b8d7
   [junit4]   2> 2595580 INFO  (qtp1466882133-27405) [n:127.0.0.1:37903_ze c:control_collection s:shard1  x:control_collection_shard1_replica_n1] o.a.s.c.SolrCore solr.RecoveryStrategy.Builder
   [junit4]   2> 2595580 INFO  (qtp1466882133-27405) [n:127.0.0.1:37903_ze c:control_collection s:shard1  x:control_collection_shard1_replica_n1] o.a.s.c.SolrCore [[control_collection_shard1_replica_n1] ] Opening new SolrCore at [/home/jenkins/workspace/Lucene-Solr-BadApples-master-Linux/solr/build/solr-core/test/J0/temp/solr.cloud.SSLMigrationTest_242E8F1A3C07F4AE-001/control-001/cores/control_collection_shard1_replica_n1], dataDir=[/home/jenkins/workspace/Lucene-Solr-BadApples-master-Linux/solr/build/solr-core/test/J0/../../../../../../../../../home/jenkins/workspace/Lucene-Solr-BadApples-master-Linux/solr/build/solr-core/test/J0/temp/solr.cloud.SSLMigrationTest_242E8F1A3C07F4AE-001/control-001/cores/control_collection_shard1_replica_n1/data/]
   [junit4]   2> 2595582 INFO  (qtp1466882133-27405) [n:127.0.0.1:37903_ze c:control_collection s:shard1  x:control_collection_shard1_replica_n1] o.a.s.u.RandomMergePolicy RandomMergePolicy wrapping class org.apache.lucene.index.TieredMergePolicy: [TieredMergePolicy: maxMergeAtOnce=25, maxMergeAtOnceExplicit=13, maxMergedSegmentMB=75.4072265625, floorSegmentMB=0.31640625, forceMergeDeletesPctAllowed=18.44192338657029, segmentsPerTier=38.0, maxCFSSegmentSizeMB=1.3662109375, noCFSRatio=0.0, deletesPctAllowed=42.232666875284465
   [junit4]   2> 2595585 WARN  (qtp1466882133-27405) [n:127.0.0.1:37903_ze c:control_collection s:shard1  x:control_collection_shard1_replica_n1] o.a.s.c.RequestHandlers INVALID paramSet a in requestHandler {type = requestHandler,name = /dump,class = DumpRequestHandler,attributes = {initParams=a, name=/dump, class=DumpRequestHandler},args = {defaults={a=A,b=B}}}
   [junit4]   2> 2595621 INFO  (qtp1466882133-27405) [n:127.0.0.1:37903_ze c:control_collection s:shard1  x:control_collection_shard1_replica_n1] o.a.s.u.UpdateHandler Using UpdateLog implementation: org.apache.solr.update.UpdateLog
   [junit4]   2> 2595621 INFO  (qtp1466882133-27405) [n:127.0.0.1:37903_ze c:control_collection s:shard1  x:control_collection_shard1_replica_n1] o.a.s.u.UpdateLog Initializing UpdateLog: dataDir= defaultSyncLevel=FLUSH numRecordsToKeep=100 maxNumLogsToKeep=10 numVersionBuckets=65536
   [junit4]   2> 2595622 INFO  (qtp1466882133-27405) [n:127.0.0.1:37903_ze c:control_collection s:shard1  x:control_collection_shard1_replica_n1] o.a.s.u.CommitTracker Hard AutoCommit: disabled
   [junit4]   2> 2595622 INFO  (qtp1466882133-27405) [n:127.0.0.1:37903_ze c:control_collection s:shard1  x:control_collection_shard1_replica_n1] o.a.s.u.CommitTracker Soft AutoCommit: disabled
   [junit4]   2> 2595623 INFO  (qtp1466882133-27405) [n:127.0.0.1:37903_ze c:control_collection s:shard1  x:control_collection_shard1_replica_n1] o.a.s.u.RandomMergePolicy RandomMergePolicy wrapping class org.apache.lucene.index.LogDocMergePolicy: [LogDocMergePolicy: minMergeSize=1000, mergeFactor=24, maxMergeSize=9223372036854775807, maxMergeSizeForForcedMerge=9223372036854775807, calibrateSizeByDeletes=false, maxMergeDocs=2147483647, maxCFSSegmentSizeMB=8.796093022207999E12, noCFSRatio=1.0]
   [junit4]   2> 2595623 INFO  (qtp1466882133-27405) [n:127.0.0.1:37903_ze c:control_collection s:shard1  x:control_collection_shard1_replica_n1] o.a.s.s.SolrIndexSearcher Opening [Searcher@47755bd0[control_collection_shard1_replica_n1] main]
   [junit4]   2> 2595624 INFO  (qtp1466882133-27405) [n:127.0.0.1:37903_ze c:control_collection s:shard1  x:control_collection_shard1_replica_n1] o.a.s.r.ManagedResourceStorage Configured ZooKeeperStorageIO with znodeBase: /configs/conf1
   [junit4]   2> 2595624 INFO  (qtp1466882133-27405) [n:127.0.0.1:37903_ze c:control_collection s:shard1  x:control_collection_shard1_replica_n1] o.a.s.r.ManagedResourceStorage Loaded null at path _rest_managed.json using ZooKeeperStorageIO:path=/configs/conf1
   [junit4]   2> 2595625 INFO  (qtp1466882133-27405) [n:127.0.0.1:37903_ze c:control_collection s:shard1  x:control_collection_shard1_replica_n1] o.a.s.h.ReplicationHandler Commits will be reserved for 10000ms.
   [junit4]   2> 2595625 INFO  (searcherExecutor-9623-thread-1-processing-n:127.0.0.1:37903_ze x:control_collection_shard1_replica_n1 c:control_collection s:shard1) [n:127.0.0.1:37903_ze c:control_collection s:shard1  x:control_collection_shard1_replica_n1] o.a.s.c.SolrCore [control_collection_shard1_replica_n1] Registered new searcher Searcher@47755bd0[control_collection_shard1_replica_n1] main{ExitableDirectoryReader(UninvertingDirectoryReader())}
   [junit4]   2> 2595625 INFO  (qtp1466882133-27405) [n:127.0.0.1:37903_ze c:control_collection s:shard1  x:control_collection_shard1_replica_n1] o.a.s.u.UpdateLog Could not find max version in index or recent updates, using new clock 1610469181180870656
   [junit4]   2> 2595628 INFO  (qtp1466882133-27405) [n:127.0.0.1:37903_ze c:control_collection s:shard1  x:control_collection_shard1_replica_n1] o.a.s.c.ZkShardTerms Successful update of terms at /collections/control_collection/terms/shard1 to Terms{values={core_node2=0}, version=0}
   [junit4]   2> 2595629 INFO  (qtp1466882133-27405) [n:127.0.0.1:37903_ze c:control_collection s:shard1  x:control_collection_shard1_replica_n1] o.a.s.c.ShardLeaderElectionContext Enough replicas found to continue.
   [junit4]   2> 2595629 INFO  (qtp1466882133-27405) [n:127.0.0.1:37903_ze c:control_collection s:shard1  x:control_collection_shard1_replica_n1] o.a.s.c.ShardLeaderElectionContext I may be the new leader - try and sync
   [junit4]   2> 2595629 INFO  (qtp1466882133-27405) [n:127.0.0.1:37903_ze c:control_collection s:shard1  x:control_collection_shard1_replica_n1] o.a.s.c.SyncStrategy Sync replicas to http://127.0.0.1:37903/ze/control_collection_shard1_replica_n1/
   [junit4]   2> 2595629 INFO  (qtp1466882133-27405) [n:127.0.0.1:37903_ze c:control_collection s:shard1  x:control_collection_shard1_replica_n1] o.a.s.c.SyncStrategy Sync Success - now sync replicas to me
   [junit4]   2> 2595630 INFO  (qtp1466882133-27405) [n:127.0.0.1:37903_ze c:control_collection s:shard1  x:control_collection_shard1_replica_n1] o.a.s.c.SyncStrategy http://127.0.0.1:37903/ze/control_collection_shard1_replica_n1/ has no replicas
   [junit4]   2> 2595630 INFO  (qtp1466882133-27405) [n:127.0.0.1:37903_ze c:control_collection s:shard1  x:control_collection_shard1_replica_n1] o.a.s.c.ShardLeaderElectionContext Found all replicas participating in election, clear LIR
   [junit4]   2> 2595631 INFO  (qtp1466882133-27405) [n:127.0.0.1:37903_ze c:control_collection s:shard1  x:control_collection_shard1_replica_n1] o.a.s.c.ShardLeaderElectionContext I am the new leader: http://127.0.0.1:37903/ze/control_collection_shard1_replica_n1/ shard1
   [junit4]   2> 2595733 INFO  (qtp1466882133-27405) [n:127.0.0.1:37903_ze c:control_collection s:shard1  x:control_collection_shard1_replica_n1] o.a.s.c.ZkController I am the leader, no recovery necessary
   [junit4]   2> 2595739 INFO  (qtp1466882133-27405) [n:127.0.0.1:37903_ze c:control_collection s:shard1  x:control_collection_shard1_replica_n1] o.a.s.s.HttpSolrCall [admin] webapp=null path=/admin/cores params={qt=/admin/cores&collection.configName=conf1&newCollection=true&name=control_collection_shard1_replica_n1&action=CREATE&numShards=1&collection=control_collection&shard=shard1&wt=javabin&version=2&replicaType=NRT} status=0 QTime=1270
   [junit4]   2> 2595740 INFO  (qtp1466882133-27410) [n:127.0.0.1:37903_ze    ] o.a.s.h.a.CollectionsHandler Wait for new collection to be active for at most 30 seconds. Check all shard replicas
   [junit4]   2> 2595835 INFO  (zkCallback-5943-thread-1) [    ] o.a.s.c.c.ZkStateReader A cluster state change: [WatchedEvent state:SyncConnected type:NodeDataChanged path:/collections/control_collection/state.json] for collection [control_collection] has occurred - updating... (live nodes size: [1])
   [junit4]   2> 2596366 INFO  (OverseerCollectionConfigSetProcessor-72153196070699012-127.0.0.1:37903_ze-n_0000000000) [n:127.0.0.1:37903_ze    ] o.a.s.c.OverseerTaskQueue Response ZK path: /overseer/collection-queue-work/qnr-0000000000 doesn't exist.  Requestor may have disconnected from ZooKeeper
   [junit4]   2> 2596740 INFO  (qtp1466882133-27410) [n:127.0.0.1:37903_ze    ] o.a.s.s.HttpSolrCall [admin] webapp=null path=/admin/collections params={collection.configName=conf1&name=control_collection&nrtReplicas=1&action=CREATE&numShards=1&createNodeSet=127.0.0.1:37903_ze&wt=javabin&version=2} status=0 QTime=2379
   [junit4]   2> 2596743 INFO  (zkConnectionManagerCallback-5962-thread-1) [    ] o.a.s.c.c.ConnectionManager zkClient has connected
   [junit4]   2> 2596743 INFO  (TEST-SSLMigrationTest.test-seed#[242E8F1A3C07F4AE]) [    ] o.a.s.c.c.ZkStateReader Updated live nodes from ZooKeeper... (0) -> (1)
   [junit4]   2> 2596744 INFO  (TEST-SSLMigrationTest.test-seed#[242E8F1A3C07F4AE]) [    ] o.a.s.c.s.i.ZkClientClusterStateProvider Cluster at 127.0.0.1:44113/solr ready
   [junit4]   2> 2596744 INFO  (TEST-SSLMigrationTest.test-seed#[242E8F1A3C07F4AE]) [    ] o.a.s.c.ChaosMonkey monkey: init - expire sessions:false cause connection loss:false
   [junit4]   2> 2596744 INFO  (qtp1466882133-27406) [n:127.0.0.1:37903_ze    ] o.a.s.h.a.CollectionsHandler Invoked Collection Action :create with params collection.configName=conf1&name=collection1&nrtReplicas=1&action=CREATE&numShards=2&createNodeSet=&stateFormat=1&wt=javabin&version=2 and sendToOCPQueue=true
   [junit4]   2> 2596747 INFO  (OverseerThreadFactory-9618-thread-2-processing-n:127.0.0.1:37903_ze) [n:127.0.0.1:37903_ze    ] o.a.s.c.a.c.CreateCollectionCmd Create collection collection1
   [junit4]   2> 2596949 WARN  (OverseerThreadFactory-9618-thread-2-processing-n:127.0.0.1:37903_ze) [n:127.0.0.1:37903_ze    ] o.a.s.c.a.c.CreateCollectionCmd It is unusual to create a collection (collection1) without cores.
   [junit4]   2> 2596950 INFO  (qtp1466882133-27406) [n:127.0.0.1:37903_ze    ] o.a.s.h.a.CollectionsHandler Wait for new collection to be active for at most 30 seconds. Check all shard replicas
   [junit4]   2> 2596950 INFO  (qtp1466882133-27406) [n:127.0.0.1:37903_ze    ] o.a.s.s.HttpSolrCall [admin] webapp=null path=/admin/collections params={collection.configName=conf1&name=collection1&nrtReplicas=1&action=CREATE&numShards=2&createNodeSet=&stateFormat=1&wt=javabin&version=2} status=0 QTime=205
   [junit4]   2> 2597011 INFO  (TEST-SSLMigrationTest.test-seed#[242E8F1A3C07F4AE]) [    ] o.a.s.c.AbstractFullDistribZkTestBase create jetty 1 in directory /home/jenkins/workspace/Lucene-Solr-BadApples-master-Linux/solr/build/solr-core/test/J0/temp/solr.cloud.SSLMigrationTest_242E8F1A3C07F4AE-001/shard-1-001 of type NRT
   [junit4]   2> 2597011 INFO  (TEST-SSLMigrationTest.test-seed#[242E8F1A3C07F4AE]) [    ] o.e.j.s.Server jetty-9.4.11.v20180605; built: 2018-06-05T18:24:03.829Z; git: d5fc0523cfa96bfebfbda19606cad384d772f04c; jvm 10+46
   [junit4]   2> 2597013 INFO  (TEST-SSLMigrationTest.test-seed#[242E8F1A3C07F4AE]) [    ] o.e.j.s.session DefaultSessionIdManager workerName=node0
   [junit4]   2> 2597013 INFO  (TEST-SSLMigrationTest.test-seed#[242E8F1A3C07F4AE]) [    ] o.e.j.s.session No SessionScavenger set, using defaults
   [junit4]   2> 2597013 INFO  (TEST-SSLMigrationTest.test-seed#[242E8F1A3C07F4AE]) [    ] o.e.j.s.session node0 Scavenging every 660000ms
   [junit4]   2> 2597013 INFO  (TEST-SSLMigrationTest.test-seed#[242E8F1A3C07F4AE]) [    ] o.e.j.s.h.ContextHandler Started o.e.j.s.ServletContextHandler@30c5739{/ze,null,AVAILABLE}
   [junit4]   2> 2597013 INFO  (TEST-SSLMigrationTest.test-seed#[242E8F1A3C07F4AE]) [    ] o.e.j.s.AbstractConnector Started ServerConnector@25ad012b{HTTP/1.1,[http/1.1]}{127.0.0.1:38189}
   [junit4]   2> 2597013 INFO  (TEST-SSLMigrationTest.test-seed#[242E8F1A3C07F4AE]) [    ] o.e.j.s.Server Started @2597039ms
   [junit4]   2> 2597013 INFO  (TEST-SSLMigrationTest.test-seed#[242E8F1A3C07F4AE]) [    ] o.a.s.c.s.e.JettySolrRunner Jetty properties: {hostContext=/ze, solrconfig=solrconfig.xml, solr.data.dir=/home/jenkins/workspace/Lucene-Solr-BadApples-master-Linux/solr/build/solr-core/test/J0/temp/solr.cloud.SSLMigrationTest_242E8F1A3C07F4AE-001/tempDir-001/jetty1, hostPort=38189, coreRootDirectory=/home/jenkins/workspace/Lucene-Solr-BadApples-master-Linux/solr/build/solr-core/test/J0/../../../../../../../../../home/jenkins/workspace/Lucene-Solr-BadApples-master-Linux/solr/build/solr-core/test/J0/temp/solr.cloud.SSLMigrationTest_242E8F1A3C07F4AE-001/shard-1-001/cores}
   [junit4]   2> 2597013 ERROR (TEST-SSLMigrationTest.test-seed#[242E8F1A3C07F4AE]) [    ] o.a.s.u.StartupLoggingUtils Missing Java Option solr.log.dir. Logging may be missing or incomplete.
   [junit4]   2> 2597013 INFO  (TEST-SSLMigrationTest.test-seed#[242E8F1A3C07F4AE]) [    ] o.a.s.s.SolrDispatchFilter Using logger factory org.apache.logging.slf4j.Log4jLoggerFactory
   [junit4]   2> 2597013 INFO  (TEST-SSLMigrationTest.test-seed#[242E8F1A3C07F4AE]) [    ] o.a.s.s.SolrDispatchFilter  ___      _       Welcome to Apache Solr? version 8.0.0
   [junit4]   2> 2597013 INFO  (TEST-SSLMigrationTest.test-seed#[242E8F1A3C07F4AE]) [    ] o.a.s.s.SolrDispatchFilter / __| ___| |_ _   Starting in cloud mode on port null
   [junit4]   2> 2597013 INFO  (TEST-SSLMigrationTest.test-seed#[242E8F1A3C07F4AE]) [    ] o.a.s.s.SolrDispatchFilter \__ \/ _ \ | '_|  Install dir: null
   [junit4]   2> 2597013 INFO  (TEST-SSLMigrationTest.test-seed#[242E8F1A3C07F4AE]) [    ] o.a.s.s.SolrDispatchFilter |___/\___/_|_|    Start time: 2018-09-02T04:38:16.844752Z
   [junit4]   2> 2597014 INFO  (zkConnectionManagerCallback-5964-thread-1) [    ] o.a.s.c.c.ConnectionManager zkClient has connected
   [junit4]   2> 2597015 INFO  (TEST-SSLMigrationTest.test-seed#[242E8F1A3C07F4AE]) [    ] o.a.s.s.SolrDispatchFilter Loading solr.xml from SolrHome (not found in ZooKeeper)
   [junit4]   2> 2597015 INFO  (TEST-SSLMigrationTest.test-seed#[242E8F1A3C07F4AE]) [    ] o.a.s.c.SolrXmlConfig Loading container configuration from /home/jenkins/workspace/Lucene-Solr-BadApples-master-Linux/solr/build/solr-core/test/J0/temp/solr.cloud.SSLMigrationTest_242E8F1A3C07F4AE-001/shard-1-001/solr.xml
   [junit4]   2> 2597016 INFO  (TEST-SSLMigrationTest.test-seed#[242E8F1A3C07F4AE]) [    ] o.a.s.c.SolrXmlConfig Configuration parameter autoReplicaFailoverWorkLoopDelay is ignored
   [junit4]   2> 2597016 INFO  (TEST-SSLMigrationTest.test-seed#[242E8F1A3C07F4AE]) [    ] o.a.s.c.SolrXmlConfig Configuration parameter autoReplicaFailoverBadNodeExpiration is ignored
   [junit4]   2> 2597017 INFO  (TEST-SSLMigrationTest.test-seed#[242E8F1A3C07F4AE]) [    ] o.a.s.c.SolrXmlConfig MBean server found: com.sun.jmx.mbeanserver.JmxMBeanServer@36c7b8d7, but no JMX reporters were configured - adding default JMX reporter.
   [junit4]   2> 2597136 INFO  (TEST-SSLMigrationTest.test-seed#[242E8F1A3C07F4AE]) [    ] o.a.s.c.ZkContainer Zookeeper client=127.0.0.1:44113/solr
   [junit4]   2> 2597137 INFO  (zkConnectionManagerCallback-5968-thread-1) [    ] o.a.s.c.c.ConnectionManager zkClient has connected
   [junit4]   2> 2597138 INFO  (zkConnectionManagerCallback-5970-thread-1) [    ] o.a.s.c.c.ConnectionManager zkClient has connected
   [junit4]   2> 2597140 INFO  (TEST-SSLMigrationTest.test-seed#[242E8F1A3C07F4AE]) [    ] o.a.s.c.c.ZkStateReader Updated live nodes from ZooKeeper... (0) -> (1)
   [junit4]   2> 2597142 INFO  (TEST-SSLMigrationTest.test-seed#[242E8F1A3C07F4AE]) [    ] o.a.s.c.TransientSolrCoreCacheDefault Allocating transient cache for 4 transient cores
   [junit4]   2> 2597142 INFO  (TEST-SSLMigrationTest.test-seed#[242E8F1A3C07F4AE]) [    ] o.a.s.c.ZkController Register node as live in ZooKeeper:/live_nodes/127.0.0.1:38189_ze
   [junit4]   2> 2597142 INFO  (zkCallback-5950-thread-1) [    ] o.a.s.c.c.ZkStateReader Updated live nodes from ZooKeeper... (1) -> (2)
   [junit4]   2> 2597142 INFO  (zkCallback-5961-thread-1) [    ] o.a.s.c.c.ZkStateReader Updated live nodes from ZooKeeper... (1) -> (2)
   [junit4]   2> 2597142 INFO  (zkCallback-5943-thread-1) [    ] o.a.s.c.c.ZkStateReader Updated live nodes from ZooKeeper... (1) -> (2)
   [junit4]   2> 2597143 INFO  (zkCallback-5969-thread-1) [    ] o.a.s.c.c.ZkStateReader Updated live nodes from ZooKeeper... (1) -> (2)
   [junit4]   2> 2597152 INFO  (zkConnectionManagerCallback-5977-thread-1) [    ] o.a.s.c.c.ConnectionManager zkClient has connected
   [junit4]   2> 2597152 INFO  (TEST-SSLMigrationTest.test-seed#[242E8F1A3C07F4AE]) [    ] o.a.s.c.c.ZkStateReader Updated live nodes from ZooKeeper... (0) -> (2)
   [junit4]   2> 2597152 INFO  (TEST-SSLMigrationTest.test-seed#[242E8F1A3C07F4AE]) [    ] o.a.s.c.s.i.ZkClientClusterStateProvider Cluster at 127.0.0.1:44113/solr ready
   [junit4]   2> 2597153 INFO  (TEST-SSLMigrationTest.test-seed#[242E8F1A3C07F4AE]) [    ] o.a.s.h.a.MetricsHistoryHandler No .system collection, keeping metrics history in memory.
   [junit4]   2> 2597163 INFO  (TEST-SSLMigrationTest.test-seed#[242E8F1A3C07F4AE]) [    ] o.a.s.m.r.SolrJmxReporter JMX monitoring for 'solr.node' (registry 'solr.node') enabled at server: com.sun.jmx.mbeanserver.JmxMBeanServer@36c7b8d7
   [junit4]   2> 2597170 INFO  (TEST-SSLMigrationTest.test-seed#[242E8F1A3C07F4AE]) [    ] o.a.s.m.r.SolrJmxReporter JMX monitoring for 'solr.jvm' (registry 'solr.jvm') enabled at server: com.sun.jmx.mbeanserver.JmxMBeanServer@36c7b8d7
   [junit4]   2> 2597170 INFO  (TEST-SSLMigrationTest.test-seed#[242E8F1A3C07F4AE]) [    ] o.a.s.m.r.SolrJmxReporter JMX monitoring for 'solr.jetty' (registry 'solr.jetty') enabled at server: com.sun.jmx.mbeanserver.JmxMBeanServer@36c7b8d7
   [junit4]   2> 2597171 INFO  (TEST-SSLMigrationTest.test-seed#[242E8F1A3C07F4AE]) [    ] o.a.s.c.CorePropertiesLocator Found 0 core definitions underneath /home/jenkins/workspace/Lucene-Solr-BadApples-master-Linux/solr/build/solr-core/test/J0/../../../../../../../../../home/jenkins/workspace/Lucene-Solr-BadApples-master-Linux/solr/build/solr-core/test/J0/temp/solr.cloud.SSLMigrationTest_242E8F1A3C07F4AE-001/shard-1-001/cores
   [junit4]   2> 2597185 INFO  (qtp1466882133-27408) [n:127.0.0.1:37903_ze    ] o.a.s.h.a.CollectionsHandler Invoked Collection Action :addreplica with params node=127.0.0.1:38189_ze&action=ADDREPLICA&collection=collection1&shard=shard2&type=NRT&wt=javabin&version=2 and sendToOCPQueue=true
   [junit4]   2> 2597187 INFO  (OverseerCollectionConfigSetProcessor-72153196070699012-127.0.0.1:37903_ze-n_0000000000) [n:127.0.0.1:37903_ze    ] o.a.s.c.OverseerTaskQueue Response ZK path: /overseer/collection-queue-work/qnr-0000000002 doesn't exist.  Requestor may have disconnected from ZooKeeper
   [junit4]   2> 2597187 INFO  (OverseerThreadFactory-9618-thread-3-processing-n:127.0.0.1:37903_ze) [n:127.0.0.1:37903_ze c:collection1 s:shard2  ] o.a.s.c.a.c.AddReplicaCmd Node Identified 127.0.0.1:38189_ze for creating new replica of shard shard2
   [junit4]   2> 2597189 INFO  (qtp295066700-27467) [n:127.0.0.1:38189_ze    x:collection1_shard2_replica_n41] o.a.s.h.a.CoreAdminOperation core create command qt=/admin/cores&collection.configName=conf1&name=collection1_shard2_replica_n41&action=CREATE&collection=collection1&shard=shard2&wt=javabin&version=2&replicaType=NRT
   [junit4]   2> 2598198 INFO  (qtp295066700-27467) [n:127.0.0.1:38189_ze c:collection1 s:shard2  x:collection1_shard2_replica_n41] o.a.s.c.SolrConfig Using Lucene MatchVersion: 8.0.0
   [junit4]   2> 2598210 INFO  (qtp295066700-27467) [n:127.0.0.1:38189_ze c:collection1 s:shard2  x:collection1_shard2_replica_n41] o.a.s.s.IndexSchema [collection1_shard2_replica_n41] Schema name=test
   [junit4]   2> 2598260 INFO  (qtp295066700-27467) [n:127.0.0.1:38189_ze c:collection1 s:shard2  x:collection1_shard2_replica_n41] o.a.s.s.IndexSchema Loaded schema test/1.0 with uniqueid field id
   [junit4]   2> 2598267 INFO  (qtp295066700-27467) [n:127.0.0.1:38189_ze c:collection1 s:shard2  x:collection1_shard2_replica_n41] o.a.s.c.CoreContainer Creating SolrCore 'collection1_shard2_replica_n41' using configuration from collection collection1, trusted=true
   [junit4]   2> 2598267 INFO  (qtp295066700-27467) [n:127.0.0.1:38189_ze c:collection1 s:shard2  x:collection1_shard2_replica_n41] o.a.s.m.r.SolrJmxReporter JMX monitoring for 'solr.core.collection1.shard2.replica_n41' (registry 'solr.core.collection1.shard2.replica_n41') enabled at server: com.sun.jmx.mbeanserver.JmxMBeanServer@36c7b8d7
   [junit4]   2> 2598267 INFO  (qtp295066700-27467) [n:127.0.0.1:38189_ze c:collection1 s:shard2  x:collection1_shard2_replica_n41] o.a.s.c.SolrCore solr.RecoveryStrategy.Builder
   [junit4]   2> 2598267 INFO  (qtp295066700-27467) [n:127.0.0.1:38189_ze c:collection1 s:shard2  x:collection1_shard2_replica_n41] o.a.s.c.SolrCore [[collection1_shard2_replica_n41] ] Opening new SolrCore at [/home/jenkins/workspace/Lucene-Solr-BadApples-master-Linux/solr/build/solr-core/test/J0/temp/solr.cloud.SSLMigrationTest_242E8F1A3C07F4AE-001/shard-1-001/cores/collection1_shard2_replica_n41], dataDir=[/home/jenkins/workspace/Lucene-Solr-BadApples-master-Linux/solr/build/solr-core/test/J0/../../../../../../../../../home/jenkins/workspace/Lucene-Solr-BadApples-master-Linux/solr/build/solr-core/test/J0/temp/solr.cloud.SSLMigrationTest_242E8F1A3C07F4AE-001/shard-1-001/cores/collection1_shard2_replica_n41/data/]
   [junit4]   2> 2598268 INFO  (qtp295066700-27467) [n:127.0.0.1:38189_ze c:collection1 s:shard2  x:collection1_shard2_replica_n41] o.a.s.u.RandomMergePolicy RandomMergePolicy wrapping class org.apache.lucene.index.TieredMergePolicy: [TieredMergePolicy: maxMergeAtOnce=25, maxMergeAtOnceExplicit=13, maxMergedSegmentMB=75.4072265625, floorSegmentMB=0.31640625, forceMergeDeletesPctAllowed=18.44192338657029, segmentsPerTier=38.0, maxCFSSegmentSizeMB=1.3662109375, noCFSRatio=0.0, deletesPctAllowed=42.232666875284465
   [junit4]   2> 2598269 WARN  (qtp295066700-27467) [n:127.0.0.1:38189_ze c:collection1 s:shard2  x:collection1_shard2_replica_n41] o.a.s.c.RequestHandlers INVALID paramSet a in requestHandler {type = requestHandler,name = /dump,class = DumpRequestHandler,attributes = {initParams=a, name=/dump, class=DumpRequestHandler},args = {defaults={a=A,b=B}}}
   [junit4]   2> 2598291 INFO  (qtp295066700-27467) [n:127.0.0.1:38189_ze c:collection1 s:shard2  x:collection1_shard2_replica_n41] o.a.s.u.UpdateHandler Using UpdateLog implementation: org.apache.solr.update.UpdateLog
   [junit4]   2> 2598291 INFO  (qtp295066700-27467) [n:127.0.0.1:38189_ze c:collection1 s:shard2  x:collection1_shard2_replica_n41] o.a.s.u.UpdateLog Initializing UpdateLog: dataDir= defaultSyncLevel=FLUSH numRecordsToKeep=100 maxNumLogsToKeep=10 numVersionBuckets=65536
   [junit4]   2> 2598292 INFO  (qtp295066700-27467) [n:127.0.0.1:38189_ze c:collection1 s:shard2  x:collection1_shard2_replica_n41] o.a.s.u.CommitTracker Hard AutoCommit: disabled
   [junit4]   2> 2598292 INFO  (qtp295066700-27467) [n:127.0.0.1:38189_ze c:collection1 s:shard2  x:collection1_shard2_replica_n41] o.a.s.u.CommitTracker Soft AutoCommit: disabled
   [junit4]   2> 2598293 INFO  (qtp295066700-27467) [n:127.0.0.1:38189_ze c:collection1 s:shard2  x:collection1_shard2_replica_n41] o.a.s.u.RandomMergePolicy RandomMergePolicy wrapping class org.apache.lucene.index.LogDocMergePolicy: [LogDocMergePolicy: minMergeSize=1000, mergeFactor=24, maxMergeSize=9223372036854775807, maxMergeSizeForForcedMerge=9223372036854775807, calibrateSizeByDeletes=false, maxMergeDocs=2147483647, maxCFSSegmentSizeMB=8.796093022207999E12, noCFSRatio=1.0]
   [junit4]   2> 2598293 INFO  (qtp295066700-27467) [n:127.0.0.1:38189_ze c:collection1 s:shard2  x:collection1_shard2_replica_n41] o.a.s.s.SolrIndexSearcher Opening [Searcher@22542179[collection1_shard2_replica_n41] main]
   [junit4]   2> 2598294 INFO  (qtp295066700-27467) [n:127.0.0.1:38189_ze c:collection1 s:shard2  x:collection1_shard2_replica_n41] o.a.s.r.ManagedResourceStorage Configured ZooKeeperStorageIO with znodeBase: /configs/conf1
   [junit4]   2> 2598294 INFO  (qtp295066700-27467) [n:127.0.0.1:38189_ze c:collection1 s:shard2  x:collection1_shard2_replica_n41] o.a.s.r.ManagedResourceStorage Loaded null at path _rest_managed.json using ZooKeeperStorageIO:path=/configs/conf1
   [junit4]   2> 2598294 INFO  (qtp295066700-27467) [n:127.0.0.1:38189_ze c:collection1 s:shard2  x:collection1_shard2_replica_n41] o.a.s.h.ReplicationHandler Commits will be reserved for 10000ms.
   [junit4]   2> 2598295 INFO  (qtp295066700-27467) [n:127.0.0.1:38189_ze c:collection1 s:shard2  x:collection1_shard2_replica_n41] o.a.s.u.UpdateLog Could not find max version in index or recent updates, using new clock 1610469183980568576
   [junit4]   2> 2598295 INFO  (searcherExecutor-9637-thread-1-processing-n:127.0.0.1:38189_ze x:collection1_shard2_replica_n41 c:collection1 s:shard2) [n:127.0.0.1:38189_ze c:collection1 s:shard2  x:collection1_shard2_replica_n41] o.a.s.c.SolrCore [collection1_shard2_replica_n41] Registered new searcher Searcher@22542179[collection1_shard2_replica_n41] main{ExitableDirectoryReader(UninvertingDirectoryReader())}
   [junit4]   2> 2598298 INFO  (qtp295066700-27467) [n:127.0.0.1:38189_ze c:collection1 s:shard2  x:collection1_shard2_replica_n41] o.a.s.c.ZkShardTerms Successful update of terms at /collections/collection1/terms/shard2 to Terms{values={core_node42=0}, version=0}
   [junit4]   2> 2598299 INFO  (qtp295066700-27467) [n:127.0.0.1:38189_ze c:collection1 s:shard2  x:collection1_shard2_replica_n41] o.a.s.c.ShardLeaderElectionContext Enough replicas found to continue.
   [junit4]   2> 2598299 INFO  (qtp295066700-27467) [n:127.0.0.1:38189_ze c:collection1 s:shard2  x:collection1_shard2_replica_n41] o.a.s.c.ShardLeaderElectionContext I may be the new leader - try and sync
   [junit4]   2> 2598299 INFO  (qtp295066700-27467) [n:127.0.0.1:38189_ze c:collection1 s:shard2  x:collection1_shard2_replica_n41] o.a.s.c.SyncStrategy Sync replicas to http://127.0.0.1:38189/ze/collection1_shard2_replica_n41/
   [junit4]   2> 2598299 INFO  (qtp295066700-27467) [n:127.0.0.1:38189_ze c:collection1 s:shard2  x:collection1_shard2_replica_n41] o.a.s.c.SyncStrategy Sync Success - now sync replicas to me
   [junit4]   2> 2598299 INFO  (qtp295066700-27467) [n:127.0.0.1:38189_ze c:collection1 s:shard2  x:collection1_shard2_replica_n41] o.a.s.c.SyncStrategy http://127.0.0.1:38189/ze/collection1_shard2_replica_n41/ has no replicas
   [junit4]   2> 2598299 INFO  (qtp295066700-27467) [n:127.0.0.1:38189_ze c:collection1 s:shard2  x:collection1_shard2_replica_n41] o.a.s.c.ShardLeaderElectionContext Found all replicas participating in election, clear LIR
   [junit4]   2> 2598300 INFO  (qtp295066700-27467) [n:127.0.0.1:38189_ze c:collection1 s:shard2  x:collection1_shard2_replica_n41] o.a.s.c.ShardLeaderElectionContext I am the new leader: http://127.0.0.1:38189/ze/collection1_shard2_replica_n41/ shard2
   [junit4]   2> 2598451 INFO  (qtp295066700-27467) [n:127.0.0.1:38189_ze c:collection1 s:shard2  x:collection1_shard2_replica_n41] o.a.s.c.ZkController I am the leader, no recovery necessary
   [junit4]   2> 2598452 INFO  (qtp295066700-27467) [n:127.0.0.1:38189_ze c:collection1 s:shard2  x:collection1_shard2_replica_n41] o.a.s.s.HttpSolrCall [admin] webapp=null path=/admin/cores params={qt=/admin/cores&collection.configName=conf1&name=collection1_shard2_replica_n41&action=CREATE&collection=collection1&shard=shard2&wt=javabin&version=2&replicaType=NRT} status=0 QTime=1263
   [junit4]   2> 2598453 INFO  (qtp1466882133-27408) [n:127.0.0.1:37903_ze c:collection1   ] o.a.s.s.HttpSolrCall [admin] webapp=null path=/admin/collections params={node=127.0.0.1:38189_ze&action=ADDREPLICA&collection=collection1&shard=shard2&type=NRT&wt=javabin&version=2} status=0 QTime=1267
   [junit4]   2> 2598544 INFO  (TEST-SSLMigrationTest.test-seed#[242E8F1A3C07F4AE]) [    ] o.a.s.c.AbstractFullDistribZkTestBase create jetty 2 in directory /home/jenkins/workspace/Lucene-Solr-BadApples-master-Linux/solr/build/solr-core/test/J0/temp/solr.cloud.SSLMigrationTest_242E8F1A3C07F4AE-001/shard-2-001 of type NRT
   [junit4]   2> 2598544 INFO  (TEST-SSLMigrationTest.test-seed#[242E8F1A3C07F4AE]) [    ] o.e.j.s.Server jetty-9.4.11.v20180605; built: 2018-06-05T18:24:03.829Z; git: d5fc0523cfa96bfebfbda19606cad384d772f04c; jvm 10+46
   [junit4]   2> 2598545 INFO  (TEST-SSLMigrationTest.test-seed#[242E8F1A3C07F4AE]) [    ] o.e.j.s.session DefaultSessionIdManager workerName=node0
   [junit4]   2> 2598545 INFO  (TEST-SSLMigrationTest.test-seed#[242E8F1A3C07F4AE]) [    ] o.e.j.s.session No SessionScavenger set, using defaults
   [junit4]   2> 2598545 INFO  (TEST-SSLMigrationTest.test-seed#[242E8F1A3C07F4AE]) [    ] o.e.j.s.session node0 Scavenging every 660000ms
   [junit4]   2> 2598545 INFO  (TEST-SSLMigrationTest.test-seed#[242E8F1A3C07F4AE]) [    ] o.e.j.s.h.ContextHandler Started o.e.j.s.ServletContextHandler@ab00843{/ze,null,AVAILABLE}
   [junit4]   2> 2598546 INFO  (TEST-SSLMigrationTest.test-seed#[242E8F1A3C07F4AE]) [    ] o.e.j.s.AbstractConnector Started ServerConnector@275973fb{HTTP/1.1,[http/1.1]}{127.0.0.1:39343}
   [junit4]   2> 2598546 INFO  (TEST-SSLMigrationTest.test-seed#[242E8F1A3C07F4AE]) [    ] o.e.j.s.Server Started @2598572ms
   [junit4]   2> 2598546 INFO  (TEST-SSLMigrationTest.test-seed#[242E8F1A3C07F4AE]) [    ] o.a.s.c.s.e.JettySolrRunner Jetty properties: {hostContext=/ze, solrconfig=solrconfig.xml, solr.data.dir=/home/jenkins/workspace/Lucene-Solr-BadApples-master-Linux/solr/build/solr-core/test/J0/temp/solr.cloud.SSLMigrationTest_242E8F1A3C07F4AE-001/tempDir-001/jetty2, hostPort=39343, coreRootDirectory=/home/jenkins/workspace/Lucene-Solr-BadApples-master-Linux/solr/build/solr-core/test/J0/../../../../../../../../../home/jenkins/workspace/Lucene-Solr-BadApples-master-Linux/solr/build/solr-core/test/J0/temp/solr.cloud.SSLMigrationTest_242E8F1A3C07F4AE-001/shard-2-001/cores}
   [junit4]   2> 2598546 ERROR (TEST-SSLMigrationTest.test-seed#[242E8F1A3C07F4AE]) [    ] o.a.s.u.StartupLoggingUtils Missing Java Option solr.log.dir. Logging may be missing or incomplete.
   [junit4]   2> 2598546 INFO  (TEST-SSLMigrationTest.test-seed#[242E8F1A3C07F4AE]) [    ] o.a.s.s.SolrDispatchFilter Using logger factory org.apache.logging.slf4j.Log4jLoggerFactory
   [junit4]   2> 2598546 INFO  (TEST-SSLMigrationTest.test-seed#[242E8F1A3C07F4AE]) [    ] o.a.s.s.SolrDispatchFilter  ___      _       Welcome to Apache Solr? version 8.0.0
   [junit4]   2> 2598546 INFO  (TEST-SSLMigrationTest.test-seed#[242E8F1A3C07F4AE]) [    ] o.a.s.s.SolrDispatchFilter / __| ___| |_ _   Starting in cloud mode on port null
   [junit4]   2> 2598546 INFO  (TEST-SSLMigrationTest.test-seed#[242E8F1A3C07F4AE]) [    ] o.a.s.s.SolrDispatchFilter \__ \/ _ \ | '_|  Install dir: null
   [junit4]   2> 2598546 INFO  (TEST-SSLMigrationTest.test-seed#[242E8F1A3C07F4AE]) [    ] o.a.s.s.SolrDispatchFilter |___/\___/_|_|    Start time: 2018-09-02T04:38:18.377413Z
   [junit4]   2> 2598547 INFO  (zkConnectionManagerCallback-5980-thread-1) [    ] o.a.s.c.c.ConnectionManager zkClient has connected
   [junit4]   2> 2598548 INFO  (TEST-SSLMigrationTest.test-seed#[242E8F1A3C07F4AE]) [    ] o.a.s.s.SolrDispatchFilter Loading solr.xml from SolrHome (not found in ZooKeeper)
   [junit4]   2> 2598548 INFO  (TEST-SSLMigrationTest.test-seed#[242E8F1A3C07F4AE]) [    ] o.a.s.c.SolrXmlConfig Loading container configuration from /home/jenkins/workspace/Lucene-Solr-BadApples-master-Linux/solr/build/solr-core/test/J0/temp/solr.cloud.SSLMigrationTest_242E8F1A3C07F4AE-001/shard-2-001/solr.xml
   [junit4]   2> 2598549 INFO  (TEST-SSLMigrationTest.test-seed#[242E8F1A3C07F4AE]) [    ] o.a.s.c.SolrXmlConfig Configuration parameter autoReplicaFailoverWorkLoopDelay is ignored
   [junit4]   2> 2598549 INFO  (TEST-SSLMigrationTest.test-seed#[242E8F1A3C07F4AE]) [    ] o.a.s.c.SolrXmlConfig Configuration parameter autoReplicaFailoverBadNodeExpiration is ignored
   [junit4]   2> 2598550 INFO  (TEST-SSLMigrationTest.test-seed#[242E8F1A3C07F4AE]) [    ] o.a.s.c.SolrXmlConfig MBean server found: com.sun.jmx.mbeanserver.JmxMBeanServer@36c7b8d7, but no JMX reporters were configured - adding default JMX reporter.
   [junit4]   2> 2598632 INFO  (TEST-SSLMigrationTest.test-seed#[242E8F1A3C07F4AE]) [    ] o.a.s.c.ZkContainer Zookeeper client=127.0.0.1:44113/solr
   [junit4]   2> 2598634 INFO  (zkConnectionManagerCallback-5984-thread-1) [    ] o.a.s.c.c.ConnectionManager zkClient has connected
   [junit4]   2> 2598636 INFO  (zkConnectionManagerCallback-5986-thread-1) [    ] o.a.s.c.c.ConnectionManager zkClient has connected
   [junit4]   2> 2598639 INFO  (TEST-SSLMigrationTest.test-seed#[242E8F1A3C07F4AE]) [    ] o.a.s.c.c.ZkStateReader Updated live nodes from ZooKeeper... (0) -> (2)
   [junit4]   2> 2598644 INFO  (TEST-SSLMigrationTest.test-seed#[242E8F1A3C07F4AE]) [    ] o.a.s.c.TransientSolrCoreCacheDefault Allocating transient cache for 4 transient cores
   [junit4]   2> 2598644 INFO  (TEST-SSLMigrationTest.test-seed#[242E8F1A3C07F4AE]) [    ] o.a.s.c.ZkController Register node as live in ZooKeeper:/live_nodes/127.0.0.1:39343_ze
   [junit4]   2> 2598644 INFO  (zkCallback-5961-thread-1) [    ] o.a.s.c.c.ZkStateReader Updated live nodes from ZooKeeper... (2) -> (3)
   [junit4]   2> 2598644 INFO  (zkCallback-5950-thread-1) [    ] o.a.s.c.c.ZkStateReader Updated live nodes from ZooKeeper... (2) -> (3)
   [junit4]   2> 2598644 INFO  (zkCallback-5943-thread-1) [    ] o.a.s.c.c.ZkStateReader Updated live nodes from ZooKeeper... (2) -> (3)
   [junit4]   2> 2598645 INFO  (zkCallback-5976-thread-1) [    ] o.a.s.c.c.ZkStateReader Updated live nodes from ZooKeeper... (2) -> (3)
   [junit4]   2> 2598645 INFO  (zkCallback-5969-thread-1) [    ] o.a.s.c.c.ZkStateReader Updated live nodes from ZooKeeper... (2) -> (3)
   [junit4]   2> 2598649 INFO  (zkCallback-5985-thread-1) [    ] o.a.s.c.c.ZkStateReader Updated live nodes from ZooKeeper... (2) -> (3)
   [junit4]   2> 2598659 INFO  (zkConnectionManagerCallback-5993-thread-1) [    ] o.a.s.c.c.ConnectionManager zkClient has connected
   [junit4]   2> 2598659 INFO  (TEST-SSLMigrationTest.test-seed#[242E8F1A3C07F4AE]) [    ] o.a.s.c.c.ZkStateReader Updated live nodes from ZooKeeper... (0) -> (3)
   [junit4]   2> 2598659 INFO  (TEST-SSLMigrationTest.test-seed#[242E8F1A3C07F4AE]) [    ] o.a.s.c.s.i.ZkClientClusterStateProvider Cluster at 127.0.0.1:44113/solr ready
   [junit4]   2> 2598662 INFO  (TEST-SSLMigrationTest.test-seed#[242E8F1A3C07F4AE]) [    ] o.a.s.h.a.MetricsHistoryHandler No .system collection, keeping metrics history in memory.
   [junit4]   2> 2598673 INFO  (TEST-SSLMigrationTest.test-seed#[242E8F1A3C07F4AE]) [    ] o.a.s.m.r.SolrJmxReporter JMX monitoring for 'solr.node' (registry 'solr.node') enabled at server: com.sun.jmx.mbeanserver.JmxMBeanServer@36c7b8d7
   [junit4]   2> 2598680 INFO  (TEST-SSLMigrationTest.test-seed#[242E8F1A3C07F4AE]) [    ] o.a.s.m.r.SolrJmxReporter JMX monitoring for 'solr.jvm' (registry 'solr.jvm') enabled at server: com.sun.jmx.mbeanserver.JmxMBeanServer@36c7b8d7
   [junit4]   2> 2598680 INFO  (TEST-SSLMigrationTest.test-seed#[242E8F1A3C07F4AE]) [    ] o.a.s.m.r.SolrJmxReporter JMX monitoring for 'solr.jetty' (registry 'solr.jetty') enabled at server: com.sun.jmx.mbeanserver.JmxMBeanServer@36c7b8d7
   [junit4]   2> 2598681 INFO  (TEST-SSLMigrationTest.test-seed#[242E8F1A3C07F4AE]) [    ] o.a.s.c.CorePropertiesLocator Found 0 core definitions underneath /home/jenkins/workspace/Lucene-Solr-BadApples-master-Linux/solr/build/solr-core/test/J0/../../../../../../../../../home/jenkins/workspace/Lucene-Solr-BadApples-master-Linux/solr/build/solr-core/test/J0/temp/solr.cloud.SSLMigrationTest_242E8F1A3C07F4AE-001/shard-2-001/cores
   [junit4]   2> 2598702 INFO  (qtp1466882133-27404) [n:127.0.0.1:37903_ze    ] o.a.s.h.a.CollectionsHandler Invoked Collection Action :addreplica with params node=127.0.0.1:39343_ze&action=ADDREPLICA&collection=collection1&shard=shard1&type=NRT&wt=javabin&version=2 and sendToOCPQueue=true
   [junit4]   2> 2598704 INFO  (OverseerCollectionConfigSetProcessor-72153196070699012-127.0.0.1:37903_ze-n_0000000000) [n:127.0.0.1:37903_ze    ] o.a.s.c.OverseerTaskQueue Response ZK path: /overseer/collection-queue-work/qnr-0000000004 doesn't exist.  Requestor may have disconnected from ZooKeeper
   [junit4]   2> 2598704 INFO  (OverseerThreadFactory-9618-thread-4-processing-n:127.0.0.1:37903_ze) [n:127.0.0.1:37903_ze c:collection1 s:shard1  ] o.a.s.c.a.c.AddReplicaCmd Node Identified 127.0.0.1:39343_ze for creating new replica of shard shard1
   [junit4]   2> 2598705 INFO  (qtp501735822-27505) [n:127.0.0.1:39343_ze    x:collection1_shard1_replica_n43] o.a.s.h.a.CoreAdminOperation core create command qt=/admin/cores&collection.configName=conf1&name=collection1_shard1_replica_n43&action=CREATE&collection=collection1&shard=shard1&wt=javabin&version=2&replicaType=NRT
   [junit4]   2> 2599712 INFO  (qtp501735822-27505) [n:127.0.0.1:39343_ze c:collection1 s:shard1  x:collection1_shard1_replica_n43] o.a.s.c.SolrConfig Using Lucene MatchVersion: 8.0.0
   [junit4]   2> 2599725 INFO  (qtp501735822-27505) [n:127.0.0.1:39343_ze c:collection1 s:shard1  x:collection1_shard1_replica_n43] o.a.s.s.IndexSchema [collection1_shard1_replica_n43] Schema name=test
   [junit4]   2> 2599782 INFO  (qtp501735822-27505) [n:127.0.0.1:39343_ze c:collection1 s:shard1  x:collection1_shard1_replica_n43] o.a.s.s.IndexSchema Loaded schema test/1.0 with uniqueid field id
   [junit4]   2> 2599791 INFO  (qtp501735822-27505) [n:127.0.0.1:39343_ze c:collection1 s:shard1  x:collection1_shard1_replica_n43] o.a.s.c.CoreContainer Creating SolrCore 'collection1_shard1_replica_n43' using configuration from collection collection1, trusted=true
   [junit4]   2> 2599791 INFO  (qtp501735822-27505) [n:127.0.0.1:39343_ze c:collection1 s:shard1  x:collection1_shard1_replica_n43] o.a.s.m.r.SolrJmxReporter JMX monitoring for 'solr.core.collection1.shard1.replica_n43' (registry 'solr.core.collection1.shard1.replica_n43') enabled at server: com.sun.jmx.mbeanserver.JmxMBeanServer@36c7b8d7
   [junit4]   2> 2599791 INFO  (qtp501735822-27505) [n:127.0.0.1:39343_ze c:collection1 s:shard1  x:collection1_shard1_replica_n43] o.a.s.c.SolrCore solr.RecoveryStrategy.Builder
   [junit4]   2> 2599791 INFO  (qtp501735822-27505) [n:127.0.0.1:39343_ze c:collection1 s:shard1  x:collection1_shard1_replica_n43] o.a.s.c.SolrCore [[collection1_shard1_replica_n43] ] Opening new SolrCore at [/home/jenkins/workspace/Lucene-Solr-BadApples-master-Linux/solr/build/solr-core/test/J0/temp/solr.cloud.SSLMigrationTest_242E8F1A3C07F4AE-001/shard-2-001/cores/collection1_shard1_replica_n43], dataDir=[/home/jenkins/workspace/Lucene-Solr-BadApples-master-Linux/solr/build/solr-core/test/J0/../../../../../../../../../home/jenkins/workspace/Lucene-Solr-BadApples-master-Linux/solr/build/solr-core/test/J0/temp/solr.cloud.SSLMigrationTest_242E8F1A3C07F4AE-001/shard-2-001/cores/collection1_shard1_replica_n43/data/]
   [junit4]   2> 2599793 INFO  (qtp501735822-27505) [n:127.0.0.1:39343_ze c:collection1 s:shard1  x:collection1_shard1_replica_n43] o.a.s.u.RandomMergePolicy RandomMergePolicy wrapping class org.apache.lucene.index.TieredMergePolicy: [TieredMergePolicy: maxMergeAtOnce=25, maxMergeAtOnceExplicit=13, maxMergedSegmentMB=75.4072265625, floorSegmentMB=0.31640625, forceMergeDeletesPctAllowed=18.44192338657029, segmentsPerTier=38.0, maxCFSSegmentSizeMB=1.3662109375, noCFSRatio=0.0, deletesPctAllowed=42.232666875284465
   [junit4]   2> 2599793 WARN  (qtp501735822-27505) [n:127.0.0.1:39343_ze c:collection1 s:shard1  x:collection1_shard1_replica_n43] o.a.s.c.RequestHandlers INVALID paramSet a in requestHandler {type = requestHandler,name = /dump,class = DumpRequestHandler,attributes = {initParams=a, name=/dump, class=DumpRequestHandler},args = {defaults={a=A,b=B}}}
   [junit4]   2> 2599816 INFO  (qtp501735822-27505) [n:127.0.0.1:39343_ze c:collection1 s:shard1  x:collection1_shard1_replica_n43] o.a.s.u.UpdateHandler Using UpdateLog implementation: org.apache.solr.update.UpdateLog
   [junit4]   2> 2599816 INFO  (qtp501735822-27505) [n:127.0.0.1:39343_ze c:collection1 s:shard1  x:collection1_shard1_replica_n43] o.a.s.u.UpdateLog Initializing UpdateLog: dataDir= defaultSyncLevel=FLUSH numRecordsToKeep=100 maxNumLogsToKeep=10 numVersionBuckets=65536
   [junit4]   2> 2599817 INFO  (qtp501735822-27505) [n:127.0.0.1:39343_ze c:collection1 s:shard1  x:collection1_shard1_replica_n43] o.a.s.u.CommitTracker Hard AutoCommit: disabled
   [junit4]   2> 2599817 INFO  (qtp501735822-27505) [n:127.0.0.1:39343_ze c:collection1 s:shard1  x:collection1_shard1_replica_n43] o.a.s.u.CommitTracker Soft AutoCommit: disabled
   [junit4]   2> 2599817 INFO  (qtp501735822-27505) [n:127.0.0.1:39343_ze c:collection1 s:shard1  x:collection1_shard1_replica_n43] o.a.s.u.RandomMergePolicy RandomMergePolicy wrapping class org.apache.lucene.index.LogDocMergePolicy: [LogDocMergePolicy: minMergeSize=1000, mergeFactor=24, maxMergeSize=9223372036854775807, maxMergeSizeForForcedMerge=9223372036854775807, calibrateSizeByDeletes=false, maxMergeDocs=2147483647, maxCFSSegmentSizeMB=8.796093022207999E12, noCFSRatio=1.0]
   [junit4]   2> 2599818 INFO  (qtp501735822-27505) [n:127.0.0.1:39343_ze c:collection1 s:shard1  x:collection1_shard1_replica_n43] o.a.s.s.SolrIndexSearcher Opening [Searcher@4c2d82b4[collection1_shard1_replica_n43] main]
   [junit4]   2> 2599818 INFO  (qtp501735822-27505) [n:127.0.0.1:39343_ze c:collection1 s:shard1  x:collection1_shard1_replica_n43] o.a.s.r.ManagedResourceStorage Configured ZooKeeperStorageIO with znodeBase: /configs/conf1
   [junit4]   2> 2599819 INFO  (qtp501735822-27505) [n:127.0.0.1:39343_ze c:collection1 s:shard1  x:collection1_shard1_replica_n43] o.a.s.r.ManagedResourceStorage Loaded null at path _rest_managed.json using ZooKeeperStorageIO:path=/configs/conf1
   [junit4]   2> 2599819 INFO  (qtp501735822-27505) [n:127.0.0.1:39343_ze c:collection1 s:shard1  x:collection1_shard1_replica_n43] o.a.s.h.ReplicationHandler Commits will be reserved for 10000ms.
   [junit4]   2> 2599819 INFO  (qtp501735822-27505) [n:127.0.0.1:39343_ze c:collection1 s:shard1  x:collection1_shard1_replica_n43] o.a.s.u.UpdateLog Could not find max version in index or recent updates, using new clock 1610469185578598400
   [junit4]   2> 2599820 INFO  (searcherExecutor-9651-thread-1-processing-n:127.0.0.1:39343_ze x:collection1_shard1_replica_n43 c:collection1 s:shard1) [n:127.0.0.1:39343_ze c:collection1 s:shard1  x:collection1_shard1_replica_n43] o.a.s.c.SolrCore [collection1_shard1_replica_n43] Registered new searcher Searcher@4c2d82b4[collection1_shard1_replica_n43] main{ExitableDirectoryReader(UninvertingDirectoryReader())}
   [junit4]   2> 2599822 INFO  (qtp501735822-27505) [n:127.0.0.1:39343_ze c:collection1 s:shard1  x:collection1_shard1_replica_n43] o.a.s.c.ZkShardTerms Successful update of terms at /collections/collection1/terms/shard1 to Terms{values={core_node44=0}, version=0}
   [junit4]   2> 2599822 INFO  (qtp501735822-27505) [n:127.0.0.1:39343_ze c:collection1 s:shard1  x:collection1_shard1_replica_n43] o.a.s.c.ShardLeaderElectionContext Enough replicas found to continue.
   [junit4]   2> 2599822 INFO  (qtp501735822-27505) [n:127.0.0.1:39343_ze c:collection1 s:shard1  x:collection1_shard1_replica_n43] o.a.s.c.ShardLeaderElectionContext I may be the new leader - try and sync
   [junit4]   2> 2599822 INFO  (qtp501735822-27505) [n:127.0.0.1:39343_ze c:collection1 s:shard1  x:collection1_shard1_replica_n43] o.a.s.c.SyncStrategy Sync replicas to http://127.0.0.1:39343/ze/collection1_shard1_replica_n43/
   [junit4]   2> 2599822 INFO  (qtp501735822-27505) [n:127.0.0.1:39343_ze c:collection1 s:shard1  x:collection1_shard1_replica_n43] o.a.s.c.SyncStrategy Sync Success - now sync replicas to me
   [junit4]   2> 2599822 INFO  (qtp501735822-27505) [n:127.0.0.1:39343_ze c:collection1 s:shard1  x:collection1_shard1_replica_n43] o.a.s.c.SyncStrategy http://127.0.0.1:39343/ze/collection1_shard1_replica_n43/ has no replicas
   [junit4]   2> 2599822 INFO  (qtp501735822-27505) [n:127.0.0.1:39343_ze c:collection1 s:shard1  x:collection1_shard1_replica_n43] o.a.s.c.ShardLeaderElectionContext Found all replicas participating in election, clear LIR
   [junit4]   2> 2599824 INFO  (qtp501735822-27505) [n:127.0.0.1:39343_ze c:collection1 s:shard1  x:collection1_shard1_replica_n43] o.a.s.c.ShardLeaderElectionContext I am the new leader: http://127.0.0.1:39343/ze/collection1_shard1_replica_n43/ shard1
   [junit4]   2> 2599974 INFO  (qtp501735822-27505) [n:127.0.0.1:39343_ze c:collection1 s:shard1  x:collection1_shard1_replica_n43] o.a.s.c.ZkController I am the leader, no recovery necessary
   [junit4]   2> 2599975 INFO  (qtp501735822-27505) [n:127.0.0.1:39343_ze c:collection1 s:shard1  x:collection1_shard1_replica_n43] o.a.s.s.HttpSolrCall [admin] webapp=null path=/admin/cores params={qt=/admin/cores&collection.configName=conf1&name=collection1_shard1_replica_n43&action=CREATE&collection=collection1&shard=shard1&wt=javabin&version=2&replicaType=NRT} status=0 QTime=1270
   [junit4]   2> 2599976 INFO  (qtp1466882133-27404) [n:127.0.0.1:37903_ze c:collection1   ] o.a.s.s.HttpSolrCall [admin] webapp=null path=/admin/collections params={node=127.0.0.1:39343_ze&action=ADDREPLICA&collection=collection1&shard=shard1&type=NRT&wt=javabin&version=2} status=0 QTime=1274
   [junit4]   2> 2600044 INFO  (TEST-SSLMigrationTest.test-seed#[242E8F1A3C07F4AE]) [    ] o.a.s.c.AbstractFullDistribZkTestBase create jetty 3 in directory /home/jenkins/workspace/Lucene-Solr-BadApples-master-Linux/solr/build/solr-core/test/J0/temp/solr.cloud.SSLMigrationTest_242E8F1A3C07F4AE-001/shard-3-001 of type NRT
   [junit4]   2> 2600044 INFO  (TEST-SSLMigrationTest.test-seed#[242E8F1A3C07F4AE]) [    ] o.e.j.s.Server jetty-9.4.11.v20180605; built: 2018-06-05T18:24:03.829Z; git: d5fc0523cfa96bfebfbda19606cad384d772f04c; jvm 10+46
   [junit4]   2> 2600045 INFO  (TEST-SSLMigrationTest.test-seed#[242E8F1A3C07F4AE]) [    ] o.e.j.s.session DefaultSessionIdManager workerName=node0
   [junit4]   2> 2600045 INFO  (TEST-SSLMigrationTest.test-seed#[242E8F1A3C07F4AE]) [    ] o.e.j.s.session No SessionScavenger set, using defaults
   [junit4]   2> 2600045 INFO  (TEST-SSLMigrationTest.test-seed#[242E8F1A3C07F4AE]) [    ] o.e.j.s.session node0 Scavenging every 660000ms
   [junit4]   2> 2600045 INFO  (TEST-SSLMigrationTest.test-seed#[242E8F1A3C07F4AE]) [    ] o.e.j.s.h.ContextHandler Started o.e.j.s.ServletContextHandler@79793cb2{/ze,null,AVAILABLE}
   [junit4]   2> 2600045 INFO  (TEST-SSLMigrationTest.test-seed#[242E8F1A3C07F4AE]) [    ] o.e.j.s.AbstractConnector Started ServerConnector@16625f05{HTTP/1.1,[http/1.1]}{127.0.0.1:32857}
   [junit4]   2> 2600045 INFO  (TEST-SSLMigrationTest.test-seed#[242E8F1A3C07F4AE]) [    ] o.e.j.s.Server Started @2600071ms
   [junit4]   2> 2600045 INFO  (TEST-SSLMigrationTest.test-seed#[242E8F1A3C07F4AE]) [    ] o.a.s.c.s.e.JettySolrRunner Jetty properties: {hostContext=/ze, solrconfig=solrconfig.xml, solr.data.dir=/home/jenkins/workspace/Lucene-Solr-BadApples-master-Linux/solr/build/solr-core/test/J0/temp/solr.cloud.SSLMigrationTest_242E8F1A3C07F4AE-001/tempDir-001/jetty3, hostPort=32857, coreRootDirectory=/home/jenkins/workspace/Lucene-Solr-BadApples-master-Linux/solr/build/solr-core/test/J0/../../../../../../../../../home/jenkins/workspace/Lucene-Solr-BadApples-master-Linux/solr/build/solr-core/test/J0/temp/solr.cloud.SSLMigrationTest_242E8F1A3C07F4AE-001/shard-3-001/cores, replicaType=NRT}
   [junit4]   2> 2600045 ERROR (TEST-SSLMigrationTest.test-seed#[242E8F1A3C07F4AE]) [    ] o.a.s.u.StartupLoggingUtils Missing Java Option solr.log.dir. Logging may be missing or incomplete.
   [junit4]   2> 2600045 INFO  (TEST-SSLMigrationTest.test-seed#[242E8F1A3C07F4AE]) [    ] o.a.s.s.SolrDispatchFilter Using logger factory org.apache.logging.slf4j.Log4jLoggerFactory
   [junit4]   2> 2600046 INFO  (TEST-SSLMigrationTest.test-seed#[242E8F1A3C07F4AE]) [    ] o.a.s.s.SolrDispatchFilter  ___      _       Welcome to Apache Solr? version 8.0.0
   [junit4]   2> 2600046 INFO  (TEST-SSLMigrationTest.test-seed#[242E8F1A3C07F4AE]) [    ] o.a.s.s.SolrDispatchFilter / __| ___| |_ _   Starting in cloud mode on port null
   [junit4]   2> 2600046 INFO  (TEST-SSLMigrationTest.test-seed#[242E8F1A3C07F4AE]) [    ] o.a.s.s.SolrDispatchFilter \__ \/ _ \ | '_|  Install dir: null
   [junit4]   2> 2600046 INFO  (TEST-SSLMigrationTest.test-seed#[242E8F1A3C07F4AE]) [    ] o.a.s.s.SolrDispatchFilter |___/\___/_|_|    Start time: 2018-09-02T04:38:19.877095Z
   [junit4]   2> 2600046 INFO  (zkConnectionManagerCallback-5996-thread-1) [    ] o.a.s.c.c.ConnectionManager zkClient has connected
   [junit4]   2> 2600047 INFO  (TEST-SSLMigrationTest.test-seed#[242E8F1A3C07F4AE]) [    ] o.a.s.s.SolrDispatchFilter Loading solr.xml from SolrHome (not found in ZooKeeper)
   [junit4]   2> 2600047 INFO  (TEST-SSLMigrationTest.test-seed#[242E8F1A3C07F4AE]) [    ] o.a.s.c.SolrXmlConfig Loading container configuration from /home/jenkins/workspace/Lucene-Solr-BadApples-master-Linux/solr/build/solr-core/test/J0/temp/solr.cloud.SSLMigrationTest_242E8F1A3C07F4AE-001/shard-3-001/solr.xml
   [junit4]   2> 2600048 INFO  (TEST-SSLMigrationTest.test-seed#[242E8F1A3C07F4AE]) [    ] o.a.s.c.SolrXmlConfig Configuration parameter autoReplicaFailoverWorkLoopDelay is ignored
   [junit4]   2> 2600048 INFO  (TEST-SSLMigrationTest.test-seed#[242E8F1A3C07F4AE]) [    ] o.a.s.c.SolrXmlConfig Configuration parameter autoReplicaFailoverBadNodeExpiration is ignored
   [junit4]   2> 2600049 INFO  (TEST-SSLMigrationTest.test-seed#[242E8F1A3C07F4AE]) [    ] o.a.s.c.SolrXmlConfig MBean server found: com.sun.jmx.mbeanserver.JmxMBeanServer@36c7b8d7, but no JMX reporters were configured - adding default JMX reporter.
   [junit4]   2> 2600117 INFO  (TEST-SSLMigrationTest.test-seed#[242E8F1A3C07F4AE]) [    ] o.a.s.c.ZkContainer Zookeeper client=127.0.0.1:44113/solr
   [junit4]   2> 2600117 INFO  (zkConnectionManagerCallback-6000-thread-1) [    ] o.a.s.c.c.ConnectionManager zkClient has connected
   [junit4]   2> 2600119 INFO  (zkConnectionManagerCallback-6002-thread-1) [    ] o.a.s.c.c.ConnectionManager zkClient has connected
   [junit4]   2> 2600122 INFO  (TEST-SSLMigrationTest.test-seed#[242E8F1A3C07F4AE]) [    ] o.a.s.c.c.ZkStateReader Updated live nodes from ZooKeeper... (0) -> (3)
   [junit4]   2> 2600123 INFO  (TEST-SSLMigrationTest.test-seed#[242E8F1A3C07F4AE]) [    ] o.a.s.c.TransientSolrCoreCacheDefault Allocating transient cache for 4 transient cores
   [junit4]   2> 2600123 INFO  (TEST-SSLMigrationTest.test-seed#[242E8F1A3C07F4AE]) [    ] o.a.s.c.ZkController Register node as live in ZooKeeper:/live_nodes/127.0.0.1:32857_ze
   [junit4]   2> 2600124 INFO  (zkCallback-5950-thread-1) [    ] o.a.s.c.c.ZkStateReader Updated live nodes from ZooKeeper... (3) -> (4)
   [junit4]   2> 2600124 INFO  (zkCallback-5992-thread-1) [    ] o.a.s.c.c.ZkStateReader Updated live nodes from ZooKeeper... (3) -> (4)
   [junit4]   2> 2600124 INFO  (zkCallback-5985-thread-1) [    ] o.a.s.c.c.ZkStateReader Updated live nodes from ZooKeeper... (3) -> (4)
   [junit4]   2> 2600124 INFO  (zkCallback-5943-thread-1) [    ] o.a.s.c.c.ZkStateReader Updated live nodes from ZooKeeper... (3) -> (4)
   [junit4]   2> 2600124 INFO  (zkCallback-5976-thread-1) [    ] o.a.s.c.c.ZkStateReader Updated live nodes from ZooKeeper... (3) -> (4)
   [junit4]   2> 2600124 INFO  (zkCallback-5961-thread-1) [    ] o.a.s.c.c.ZkStateReader Updated live nodes from ZooKeeper... (3) -> (4)
   [junit4]   2> 2600124 INFO  (zkCallback-5969-thread-1) [    ] o.a.s.c.c.ZkStateReader Updated live nodes from ZooKeeper... (3) -> (4)
   [junit4]   2> 2600129 INFO  (zkCallback-6001-thread-1) [    ] o.a.s.c.c.ZkStateReader Updated live nodes from ZooKeeper... (3) -> (4)
   [junit4]   2> 2600134 INFO  (zkConnectionManagerCallback-6009-thread-1) [    ] o.a.s.c.c.ConnectionManager zkClient has connected
   [junit4]   2> 2600134 INFO  (TEST-SSLMigrationTest.test-seed#[242E8F1A3C07F4AE]) [    ] o.a.s.c.c.ZkStateReader Updated live nodes from ZooKeeper... (0) -> (4)
   [junit4]   2> 2600135 INFO  (TEST-SSLMigrationTest.test-seed#[242E8F1A3C07F4AE]) [    ] o.a.s.c.s.i.ZkClientClusterStateProvider Cluster at 127.0.0.1:44113/solr ready
   [junit4]   2> 2600135 INFO  (TEST-SSLMigrationTest.test-seed#[242E8F1A3C07F4AE]) [    ] o.a.s.h.a.MetricsHistoryHandler No .system collection, keeping metrics history in memory.
   [junit4]   2> 2600152 INFO  (TEST-SSLMigrationTest.test-seed#[242E8F1A3C07F4AE]) [    ] o.a.s.m.r.SolrJmxReporter JMX monitoring for 'solr.node' (registry 'solr.node') enabled at server: com.sun.jmx.mbeanserver.JmxMBeanServer@36c7b8d7
   [junit4]   2> 2600163 INFO  (TEST-SSLMigrationTest.test-seed#[242E8F1A3C07F4AE]) [    ] o.a.s.m.r.SolrJmxReporter JMX monitoring for 'solr.jvm' (registry 'solr.jvm') enabled at server: com.sun.jmx.mbeanserver.JmxMBeanServer@36c7b8d7
   [junit4]   2> 2600163 INFO  (TEST-SSLMigrationTest.test-seed#[242E8F1A3C07F4AE]) [    ] o.a.s.m.r.SolrJmxReporter JMX monitoring for 'solr.jetty' (registry 'solr.jetty') enabled at server: com.sun.jmx.mbeanserver.JmxMBeanServer@36c7b8d7
   [junit4]   2> 2600165 INFO  (TEST-SSLMigrationTest.test-seed#[242E8F1A3C07F4AE]) [    ] o.a.s.c.CorePropertiesLocator Found 0 core definitions underneath /home/jenkins/workspace/Lucene-Solr-BadApples-master-Linux/solr/build/solr-core/test/J0/../../../../../../../../../home/jenkins/workspace/Lucene-Solr-BadApples-master-Linux/solr/build/solr-core/test/J0/temp/solr.cloud.SSLMigrationTest_242E8F1A3C07F4AE-001/shard-3-001/cores
   [junit4]   2> 2600202 INFO  (qtp1321667924-27543) [n:127.0.0.1:32857_ze    ] o.a.s.h.a.CollectionsHandler Invoked Collection Action :addreplica with params node=127.0.0.1:32857_ze&action=ADDREPLICA&collection=collection1&shard=shard2&type=NRT&wt=javabin&version=2 and sendToOCPQueue=true
   [junit4]   2> 2600205 INFO  (OverseerCollectionConfigSetProcessor-72153196070699012-127.0.0.1:37903_ze-n_0000000000) [n:127.0.0.1:37903_ze    ] o.a.s.c.OverseerTaskQueue Response ZK path: /overseer/collection-queue-work/qnr-0000000006 doesn't exist.  Requestor may have disconnected from ZooKeeper
   [junit4]   2> 2600205 INFO  (OverseerThreadFactory-9618-thread-5-processing-n:127.0.0.1:37903_ze) [n:127.0.0.1:37903_ze c:collection1 s:shard2  ] o.a.s.c.a.c.AddReplicaCmd Node Identified 127.0.0.1:32857_ze for creating new replica of shard shard2
   [junit4]   2> 2600206 INFO  (qtp1321667924-27538) [n:127.0.0.1:32857_ze    x:collection1_shard2_replica_n45] o.a.s.h.a.CoreAdminOperation core create command qt=/admin/cores&collection.configName=conf1&name=collection1_shard2_replica_n45&action=CREATE&collection=collection1&shard=shard2&wt=javabin&version=2&replicaType=NRT
   [junit4]   2> 2601261 INFO  (qtp1321667924-27538) [n:127.0.0.1:32857_ze c:collection1 s:shard2  x:collection1_shard2_replica_n45] o.a.s.c.SolrConfig Using Lucene MatchVersion: 8.0.0
   [junit4]   2> 2601274 INFO  (qtp1321667924-27538) [n:127.0.0.1:32857_ze c:collection1 s:shard2  x:collection1_shard2_replica_n45] o.a.s.s.IndexSchema [collection1_shard2_replica_n45] Schema name=test
   [junit4]   2> 2601324 INFO  (qtp1321667924-27538) [n:127.0.0.1:32857_ze c:collection1 s:shard2  x:collection1_shard2_replica_n45] o.a.s.s.IndexSchema Loaded schema test/1.0 with uniqueid field id
   [junit4]   2> 2601332 INFO  (qtp1321667924-27538) [n:127.0.0.1:32857_ze c:collection1 s:shard2  x:collection1_shard2_replica_n45] o.a.s.c.CoreContainer Creating SolrCore 'collection1_shard2_replica_n45' using configuration from collection collection1, trusted=true
   [junit4]   2> 2601332 INFO  (qtp1321667924-27538) [n:127.0.0.1:32857_ze c:collection1 s:shard2  x:collection1_shard2_replica_n45] o.a.s.m.r.SolrJmxReporter JMX monitoring for 'solr.core.collection1.shard2.replica_n45' (registry 'solr.core.collection1.shard2.replica_n45') enabled at server: com.sun.jmx.mbeanserver.JmxMBeanServer@36c7b8d7
   [junit4]   2> 2601332 INFO  (qtp1321667924-27538) [n:127.0.0.1:32857_ze c:collection1 s:shard2  x:collection1_shard2_replica_n45] o.a.s.c.SolrCore solr.RecoveryStrategy.Builder
   [junit4]   2> 2601332 INFO  (qtp1321667924-27538) [n:127.0.0.1:32857_ze c:collection1 s:shard2  x:collection1_shard2_replica_n45] o.a.s.c.SolrCore [[collection1_shard2_replica_n45] ] Opening new SolrCore at [/home/jenkins/workspace/Lucene-Solr-BadApples-master-Linux/solr/build/solr-core/test/J0/temp/solr.cloud.SSLMigrationTest_242E8F1A3C07F4AE-001/shard-3-001/cores/collection1_shard2_replica_n45], dataDir=[/home/jenkins/workspace/Lucene-Solr-BadApples-master-Linux/solr/build/solr-core/test/J0/../../../../../../../../../home/jenkins/workspace/Lucene-Solr-BadApples-master-Linux/solr/build/solr-core/test/J0/temp/solr.cloud.SSLMigrationTest_242E8F1A3C07F4AE-001/shard-3-001/cores/collection1_shard2_replica_n45/data/]
   [junit4]   2> 2601334 INFO  (qtp1321667924-27538) [n:127.0.0.1:32857_ze c:collection1 s:shard2  x:collection1_shard2_replica_n45] o.a.s.u.RandomMergePolicy RandomMergePolicy wrapping class org.apache.lucene.index.TieredMergePolicy: [TieredMergePolicy: maxMergeAtOnce=25, maxMergeAtOnceExplicit=13, maxMergedSegmentMB=75.4072265625, floorSegmentMB=0.31640625, forceMergeDeletesPctAllowed=18.44192338657029, segmentsPerTier=38.0, maxCFSSegmentSizeMB=1.3662109375, noCFSRatio=0.0, deletesPctAllowed=42.232666875284465
   [junit4]   2> 2601334 WARN  (qtp1321667924-27538) [n:127.0.0.1:32857_ze c:collection1 s:shard2  x:collection1_shard2_replica_n45] o.a.s.c.RequestHandlers INVALID paramSet a in requestHandler {type = requestHandler,name = /dump,class = DumpRequestHandler,attributes = {initParams=a, name=/dump, class=DumpRequestHandler},args = {defaults={a=A,b=B}}}
   [junit4]   2> 2601367 INFO  (qtp1321667924-27538) [n:127.0.0.1:32857_ze c:collection1 s:shard2  x:collection1_shard2_replica_n45] o.a.s.u.UpdateHandler Using UpdateLog implementation: org.apache.solr.update.UpdateLog
   [junit4]   2> 2601367 INFO  (qtp1321667924-27538) [n:127.0.0.1:32857_ze c:collection1 s:shard2  x:collection1_shard2_replica_n45] o.a.s.u.UpdateLog Initializing UpdateLog: dataDir= defaultSyncLevel=FLUSH numRecordsToKeep=100 maxNumLogsToKeep=10 numVersionBuckets=65536
   [junit4]   2> 2601368 INFO  (qtp1321667924-27538) [n:127.0.0.1:32857_ze c:collection1 s:shard2  x:collection1_shard2_replica_n45] o.a.s.u.CommitTracker Hard AutoCommit: disabled
   [junit4]   2> 2601368 INFO  (qtp1321667924-27538) [n:127.0.0.1:32857_ze c:collection1 s:shard2  x:collection1_shard2_replica_n45] o.a.s.u.CommitTracker Soft AutoCommit: disabled
   [junit4]   2> 2601369 INFO  (qtp1321667924-27538) [n:127.0.0.1:32857_ze c:collection1 s:shard2  x:collection1_shard2_replica_n45] o.a.s.u.RandomMergePolicy RandomMergePolicy wrapping class org.apache.lucene.index.LogDocMergePolicy: [LogDocMergePolicy: minMergeSize=1000, mergeFactor=24, maxMergeSize=9223372036854775807, maxMergeSizeForForcedMerge=9223372036854775807, calibrateSizeByDeletes=false, maxMergeDocs=2147483647, maxCFSSegmentSizeMB=8.796093022207999E12, noCFSRatio=1.0]
   [junit4]   2> 2601369 INFO  (qtp1321667924-27538) [n:127.0.0.1:32857_ze c:collection1 s:shard2  x:collection1_shard2_replica_n45] o.a.s.s.SolrIndexSearcher Opening [Searcher@4587b1f0[collection1_shard2_replica_n45] main]
   [junit4]   2> 2601370 INFO  (qtp1321667924-27538) [n:127.0.0.1:32857_ze c:collection1 s:shard2  x:collection1_shard2_replica_n45] o.a.s.r.ManagedResourceStorage Configured ZooKeeperStorageIO with znodeBase: /configs/conf1
   [junit4]   2> 2601370 INFO  (qtp1321667924-27538) [n:127.0.0.1:32857_ze c:collection1 s:shard2  x:collection1_shard2_replica_n45] o.a.s.r.ManagedResourceStorage Loaded null at path _rest_managed.json using ZooKeeperStorageIO:path=/configs/conf1
   [junit4]   2> 2601371 INFO  (qtp1321667924-27538) [n:127.0.0.1:32857_ze c:collection1 s:shard2  x:collection1_shard2_replica_n45] o.a.s.h.ReplicationHandler Commits will be reserved for 10000ms.
   [junit4]   2> 2601371 INFO  (qtp1321667924-27538) [n:127.0.0.1:32857_ze c:collection1 s:shard2  x:collection1_shard2_replica_n45] o.a.s.u.UpdateLog Could not find max version in index or recent updates, using new clock 1610469187205988352
   [junit4]   2> 2601371 INFO  (searcherExecutor-9665-thread-1-processing-n:127.0.0.1:32857_ze x:collection1_shard2_replica_n45 c:collection1 s:shard2) [n:127.0.0.1:32857_ze c:collection1 s:shard2  x:collection1_shard2_replica_n45] o.a.s.c.SolrCore [collection1_shard2_replica_n45] Registered new searcher Searcher@4587b1f0[collection1_shard2_replica_n45] main{ExitableDirectoryReader(UninvertingDirectoryReader())}
   [junit4]   2> 2601374 INFO  (qtp1321667924-27538) [n:127.0.0.1:32857_ze c:collection1 s:shard2  x:collection1_shard2_replica_n45] o.a.s.c.ZkShardTerms Successful update of terms at /collections/collection1/terms/shard2 to Terms{values={core_node42=0, core_node46=0}, version=1}
   [junit4]   2> 2601375 INFO  (qtp1321667924-27538) [n:127.0.0.1:32857_ze c:collection1 s:shard2  x:collection1_shard2_replica_n45] o.a.s.c.ZkController Core needs to recover:collection1_shard2_replica_n45
   [junit4]   2> 2601375 INFO  (updateExecutor-5997-thread-1-processing-n:127.0.0.1:32857_ze x:collection1_shard2_replica_n45 c:collection1 s:shard2) [n:127.0.0.1:32857_ze c:collection1 s:shard2 r:core_node46 x:collection1_shard2_replica_n45] o.a.s.u.DefaultSolrCoreState Running recovery
   [junit4]   2> 2601375 INFO  (recoveryExecutor-5998-thread-1-processing-n:127.0.0.1:32857_ze x:collection1_shard2_replica_n45 c:collection1 s:shard2 r:core_node46) [n:127.0.0.1:32857_ze c:collection1 s:shard2 r:core_node46 x:collection1_shard2_replica_n45] o.a.s.c.RecoveryStrategy Starting recovery process. recoveringAfterStartup=true
   [junit4]   2> 2601375 INFO  (recoveryExecutor-5998-thread-1-processing-n:127.0.0.1:32857_ze x:collection1_shard2_replica_n45 c:collection1 s:shard2 r:core_node46) [n:127.0.0.1:32857_ze c:collection1 s:shard2 r:core_node46 x:collection1_shard2_replica_n45] o.a.s.c.RecoveryStrategy ###### startupVersions=[[]]
   [junit4]   2> 2601376 INFO  (qtp1321667924-27538) [n:127.0.0.1:32857_ze c:collection1 s:shard2  x:collection1_shard2_replica_n45] o.a.s.s.HttpSolrCall [admin] webapp=null path=/admin/cores params={qt=/admin/cores&collection.configName=conf1&name=collection1_shard2_replica_n45&action=CREATE&collection=collection1&shard=shard2&wt=javabin&version=2&replicaType=NRT} status=0 QTime=1169
   [junit4]   2> 2601376 INFO  (qtp295066700-27462) [n:127.0.0.1:38189_ze c:collection1 s:shard2 r:core_node42 x:collection1_shard2_replica_n41] o.a.s.c.S.Request [collection1_shard2_replica_n41]  webapp=/ze path=/admin/ping params={wt=javabin&version=2} hits=0 status=0 QTime=0
   [junit4]   2> 2601376 INFO  (qtp295066700-27462) [n:127.0.0.1:38189_ze c:collection1 s:shard2 r:core_node42 x:collection1_shard2_replica_n41] o.a.s.c.S.Request [collection1_shard2_replica_n41]  webapp=/ze path=/admin/ping params={wt=javabin&version=2} status=0 QTime=0
   [junit4]   2> 2601376 INFO  (recoveryExecutor-5998-thread-1-processing-n:127.0.0.1:32857_ze x:collection1_shard2_replica_n45 c:collection1 s:shard2 r:core_node46) [n:127.0.0.1:32857_ze c:collection1 s:shard2 r:core_node46 x:collection1_shard2_replica_n45] o.a.s.c.RecoveryStrategy Begin buffering updates. core=[collection1_shard2_replica_n45]
   [junit4]   2> 2601376 INFO  (recoveryExecutor-5998-thread-1-processing-n:127.0.0.1:32857_ze x:collection1_shard2_replica_n45 c:collection1 s:shard2 r:core_node46) [n:127.0.0.1:32857_ze c:collection1 s:shard2 r:core_node46 x:collection1_shard2_replica_n45] o.a.s.u.UpdateLog Starting to buffer updates. FSUpdateLog{state=ACTIVE, tlog=null}
   [junit4]   2> 2601376 INFO  (recoveryExecutor-5998-thread-1-processing-n:127.0.0.1:32857_ze x:collection1_shard2_replica_n45 c:collection1 s:shard2 r:core_node46) [n:127.0.0.1:32857_ze c:collection1 s:shard2 r:core_node46 x:collection1_shard2_replica_n45] o.a.s.c.RecoveryStrategy Publishing state of core [collection1_shard2_replica_n45] as recovering, leader is [http://127.0.0.1:38189/ze/collection1_shard2_replica_n41/] and I am [http://127.0.0.1:32857/ze/collection1_shard2_replica_n45/]
   [junit4]   2> 2601377 INFO  (recoveryExecutor-5998-thread-1-processing-n:127.0.0.1:32857_ze x:collection1_shard2_replica_n45 c:collection1 s:shard2 r:core_node46) [n:127.0.0.1:32857_ze c:collection1 s:shard2 r:core_node46 x:collection1_shard2_replica_n45] o.a.s.c.ZkShardTerms Successful update of terms at /collections/collection1/terms/shard2 to Terms{values={core_node42=0, core_node46=0, core_node46_recovering

[...truncated too long message...]

  (zkCallback-375-thread-1) [n:127.0.0.1:44473_ze c:collection1 s:shard1 r:core_node48 x:collection1_shard1_replica_n47] o.a.s.m.SolrMetricManager Closing metric reporters for registry=solr.collection.collection1.shard1.leader, tag=447082ab
   [junit4]   2> 64309 ERROR (coreZkRegister-349-thread-1-processing-n:127.0.0.1:44473_ze x:collection1_shard1_replica_n47 c:collection1 s:shard1 r:core_node48) [n:127.0.0.1:44473_ze c:collection1 s:shard1 r:core_node48 x:collection1_shard1_replica_n47] o.a.s.c.ZkController Error getting leader from zk
   [junit4]   2> org.apache.solr.common.SolrException: CoreContainer is closed
   [junit4]   2> 	at org.apache.solr.cloud.ZkController.getLeaderProps(ZkController.java:1342) ~[java/:?]
   [junit4]   2> 	at org.apache.solr.cloud.ZkController.getLeaderProps(ZkController.java:1309) ~[java/:?]
   [junit4]   2> 	at org.apache.solr.cloud.ZkController.getLeader(ZkController.java:1265) ~[java/:?]
   [junit4]   2> 	at org.apache.solr.cloud.ZkController.register(ZkController.java:1149) ~[java/:?]
   [junit4]   2> 	at org.apache.solr.cloud.ZkController.register(ZkController.java:1080) ~[java/:?]
   [junit4]   2> 	at org.apache.solr.core.ZkContainer.lambda$registerInZk$0(ZkContainer.java:187) ~[java/:?]
   [junit4]   2> 	at org.apache.solr.common.util.ExecutorUtil$MDCAwareThreadPoolExecutor.lambda$execute$0(ExecutorUtil.java:209) ~[java/:?]
   [junit4]   2> 	at java.util.concurrent.ThreadPoolExecutor.runWorker(ThreadPoolExecutor.java:1135) ~[?:?]
   [junit4]   2> 	at java.util.concurrent.ThreadPoolExecutor$Worker.run(ThreadPoolExecutor.java:635) ~[?:?]
   [junit4]   2> 	at java.lang.Thread.run(Thread.java:844) [?:?]
   [junit4]   2> 64310 ERROR (coreZkRegister-349-thread-1-processing-n:127.0.0.1:44473_ze x:collection1_shard1_replica_n47 c:collection1 s:shard1 r:core_node48) [n:127.0.0.1:44473_ze c:collection1 s:shard1 r:core_node48 x:collection1_shard1_replica_n47] o.a.s.c.ZkContainer :org.apache.solr.common.SolrException: Error getting leader from zk for shard shard1
   [junit4]   2> 	at org.apache.solr.cloud.ZkController.getLeader(ZkController.java:1298)
   [junit4]   2> 	at org.apache.solr.cloud.ZkController.register(ZkController.java:1149)
   [junit4]   2> 	at org.apache.solr.cloud.ZkController.register(ZkController.java:1080)
   [junit4]   2> 	at org.apache.solr.core.ZkContainer.lambda$registerInZk$0(ZkContainer.java:187)
   [junit4]   2> 	at org.apache.solr.common.util.ExecutorUtil$MDCAwareThreadPoolExecutor.lambda$execute$0(ExecutorUtil.java:209)
   [junit4]   2> 	at java.base/java.util.concurrent.ThreadPoolExecutor.runWorker(ThreadPoolExecutor.java:1135)
   [junit4]   2> 	at java.base/java.util.concurrent.ThreadPoolExecutor$Worker.run(ThreadPoolExecutor.java:635)
   [junit4]   2> 	at java.base/java.lang.Thread.run(Thread.java:844)
   [junit4]   2> Caused by: org.apache.solr.common.SolrException: CoreContainer is closed
   [junit4]   2> 	at org.apache.solr.cloud.ZkController.getLeaderProps(ZkController.java:1342)
   [junit4]   2> 	at org.apache.solr.cloud.ZkController.getLeaderProps(ZkController.java:1309)
   [junit4]   2> 	at org.apache.solr.cloud.ZkController.getLeader(ZkController.java:1265)
   [junit4]   2> 	... 7 more
   [junit4]   2> 
   [junit4]   2> 64310 INFO  (TEST-SSLMigrationTest.test-seed#[242E8F1A3C07F4AE]) [    ] o.e.j.s.AbstractConnector Stopped ServerConnector@6a0de3a3{SSL,[ssl, http/1.1]}{127.0.0.1:44473}
   [junit4]   2> 64310 INFO  (TEST-SSLMigrationTest.test-seed#[242E8F1A3C07F4AE]) [    ] o.e.j.s.h.ContextHandler Stopped o.e.j.s.ServletContextHandler@6536fdd6{/ze,null,UNAVAILABLE}
   [junit4]   2> 64311 INFO  (TEST-SSLMigrationTest.test-seed#[242E8F1A3C07F4AE]) [    ] o.e.j.s.session node0 Stopped scavenging
   [junit4]   2> 64313 ERROR (TEST-SSLMigrationTest.test-seed#[242E8F1A3C07F4AE]) [    ] o.a.z.s.ZooKeeperServer ZKShutdownHandler is not registered, so ZooKeeper server won't take any action on ERROR or SHUTDOWN server state changes
   [junit4]   2> 64314 INFO  (TEST-SSLMigrationTest.test-seed#[242E8F1A3C07F4AE]) [    ] o.a.s.c.ZkTestServer connecting to 127.0.0.1:40139 40139
   [junit4]   2> 65177 INFO  (Thread-138) [    ] o.a.s.c.ZkTestServer connecting to 127.0.0.1:40139 40139
   [junit4]   2> 65178 WARN  (Thread-138) [    ] o.a.s.c.ZkTestServer Watch limit violations: 
   [junit4]   2> Maximum concurrent create/delete watches above limit:
   [junit4]   2> 
   [junit4]   2> 	20	/solr/aliases.json
   [junit4]   2> 	12	/solr/collections/collection1/state.json
   [junit4]   2> 	9	/solr/security.json
   [junit4]   2> 	9	/solr/configs/conf1
   [junit4]   2> 	9	/solr/collections/collection1/terms/shard1
   [junit4]   2> 	9	/solr/collections/collection1/terms/shard2
   [junit4]   2> 	2	/solr/collections/control_collection/terms/shard1
   [junit4]   2> 
   [junit4]   2> Maximum concurrent data watches above limit:
   [junit4]   2> 
   [junit4]   2> 	20	/solr/clusterprops.json
   [junit4]   2> 	20	/solr/clusterstate.json
   [junit4]   2> 	5	/solr/overseer_elect/election/72153307153367044-127.0.0.1:35889_ze-n_0000000000
   [junit4]   2> 	5	/solr/autoscaling.json
   [junit4]   2> 
   [junit4]   2> Maximum concurrent children watches above limit:
   [junit4]   2> 
   [junit4]   2> 	20	/solr/live_nodes
   [junit4]   2> 	20	/solr/collections
   [junit4]   2> 	5	/solr/overseer/queue
   [junit4]   2> 	5	/solr/autoscaling/events/.scheduled_maintenance
   [junit4]   2> 	5	/solr/overseer/collection-queue-work
   [junit4]   2> 	5	/solr/overseer/queue-work
   [junit4]   2> 	4	/solr/autoscaling/events/.auto_add_replicas
   [junit4]   2> 
   [junit4]   2> NOTE: reproduce with: ant test  -Dtestcase=SSLMigrationTest -Dtests.method=test -Dtests.seed=242E8F1A3C07F4AE -Dtests.multiplier=3 -Dtests.slow=true -Dtests.badapples=true -Dtests.locale=en-IO -Dtests.timezone=Africa/Conakry -Dtests.asserts=true -Dtests.file.encoding=ISO-8859-1
   [junit4] FAILURE 25.0s J0 | SSLMigrationTest.test <<<
   [junit4]    > Throwable #1: java.lang.AssertionError: Replica didn't have the proper urlScheme in the ClusterState
   [junit4]    > 	at __randomizedtesting.SeedInfo.seed([242E8F1A3C07F4AE:AC7AB0C092FB9956]:0)
   [junit4]    > 	at org.apache.solr.cloud.SSLMigrationTest.assertReplicaInformation(SSLMigrationTest.java:104)
   [junit4]    > 	at org.apache.solr.cloud.SSLMigrationTest.testMigrateSSL(SSLMigrationTest.java:97)
   [junit4]    > 	at org.apache.solr.cloud.SSLMigrationTest.test(SSLMigrationTest.java:61)
   [junit4]    > 	at java.base/jdk.internal.reflect.NativeMethodAccessorImpl.invoke0(Native Method)
   [junit4]    > 	at java.base/jdk.internal.reflect.NativeMethodAccessorImpl.invoke(NativeMethodAccessorImpl.java:62)
   [junit4]    > 	at java.base/jdk.internal.reflect.DelegatingMethodAccessorImpl.invoke(DelegatingMethodAccessorImpl.java:43)
   [junit4]    > 	at java.base/java.lang.reflect.Method.invoke(Method.java:564)
   [junit4]    > 	at org.apache.solr.BaseDistributedSearchTestCase$ShardsRepeatRule$ShardsFixedStatement.callStatement(BaseDistributedSearchTestCase.java:1008)
   [junit4]    > 	at org.apache.solr.BaseDistributedSearchTestCase$ShardsRepeatRule$ShardsStatement.evaluate(BaseDistributedSearchTestCase.java:983)
   [junit4]    > 	at java.base/java.lang.Thread.run(Thread.java:844)
   [junit4]   2> NOTE: leaving temporary files on disk at: /home/jenkins/workspace/Lucene-Solr-BadApples-master-Linux/solr/build/solr-core/test/J0/temp/solr.cloud.SSLMigrationTest_242E8F1A3C07F4AE-001
   [junit4]   2> NOTE: test params are: codec=Asserting(Lucene80): {}, docValues:{}, maxPointsInLeafNode=1341, maxMBSortInHeap=6.876103310974202, sim=Asserting(org.apache.lucene.search.similarities.AssertingSimilarity@1d65d068), locale=en-IO, timezone=Africa/Conakry
   [junit4]   2> NOTE: Linux 4.15.0-32-generic amd64/Oracle Corporation 10 (64-bit)/cpus=8,threads=1,free=434968768,total=536870912
   [junit4]   2> NOTE: All tests run in this JVM: [SSLMigrationTest, SSLMigrationTest]
   [junit4] Completed [4/5 (1!)] on J0 in 25.04s, 1 test, 1 failure <<< FAILURES!

[...truncated 15 lines...]
BUILD FAILED
/home/jenkins/workspace/Lucene-Solr-BadApples-master-Linux/lucene/common-build.xml:1568: The following error occurred while executing this line:
/home/jenkins/workspace/Lucene-Solr-BadApples-master-Linux/lucene/common-build.xml:1092: There were test failures: 5 suites, 5 tests, 1 failure [seed: 242E8F1A3C07F4AE]

Total time: 1 minute 10 seconds

[repro] Setting last failure code to 256

[repro] Failures:
[repro]   1/5 failed: org.apache.solr.cloud.SSLMigrationTest
[repro] Exiting with code 256
+ mv lucene/build lucene/build.repro
+ mv solr/build solr/build.repro
+ mv lucene/build.orig lucene/build
+ mv solr/build.orig solr/build
Archiving artifacts
Setting ANT_1_8_2_HOME=/var/lib/jenkins/tools/hudson.tasks.Ant_AntInstallation/ANT_1.8.2
[WARNINGS] Parsing warnings in console log with parser Java Compiler (javac)
Setting ANT_1_8_2_HOME=/var/lib/jenkins/tools/hudson.tasks.Ant_AntInstallation/ANT_1.8.2
Setting ANT_1_8_2_HOME=/var/lib/jenkins/tools/hudson.tasks.Ant_AntInstallation/ANT_1.8.2
<Git Blamer> Using GitBlamer to create author and commit information for all warnings.
<Git Blamer> GIT_COMMIT=d93c46ea94dec612aa53e37d119fe34b5e8a828e, workspace=/var/lib/jenkins/workspace/Lucene-Solr-BadApples-master-Linux
[WARNINGS] Computing warning deltas based on reference build #85
Recording test results
Setting ANT_1_8_2_HOME=/var/lib/jenkins/tools/hudson.tasks.Ant_AntInstallation/ANT_1.8.2
Build step 'Publish JUnit test result report' changed build result to UNSTABLE
Email was triggered for: Unstable (Test Failures)
Sending email for trigger: Unstable (Test Failures)
Setting ANT_1_8_2_HOME=/var/lib/jenkins/tools/hudson.tasks.Ant_AntInstallation/ANT_1.8.2
Setting ANT_1_8_2_HOME=/var/lib/jenkins/tools/hudson.tasks.Ant_AntInstallation/ANT_1.8.2
Setting ANT_1_8_2_HOME=/var/lib/jenkins/tools/hudson.tasks.Ant_AntInstallation/ANT_1.8.2
Setting ANT_1_8_2_HOME=/var/lib/jenkins/tools/hudson.tasks.Ant_AntInstallation/ANT_1.8.2

Mime
View raw message