lucene-dev mailing list archives

Site index · List index
Message view « Date » · « Thread »
Top « Date » · « Thread »
From Policeman Jenkins Server <jenk...@thetaphi.de>
Subject [JENKINS-EA] Lucene-Solr-master-Linux (64bit/jdk-11-ea+28) - Build # 22851 - Still Unstable!
Date Thu, 13 Sep 2018 13:28:56 GMT
Build: https://jenkins.thetaphi.de/job/Lucene-Solr-master-Linux/22851/
Java: 64bit/jdk-11-ea+28 -XX:+UseCompressedOops -XX:+UseSerialGC

14 tests failed.
FAILED:  junit.framework.TestSuite.org.apache.solr.handler.extraction.ExtractingRequestHandlerTest

Error Message:
SOLR-12759 JDK 11 (1st release) and Tika 1.x can result in extracting dates in a bad format.

Stack Trace:
java.lang.AssertionError: SOLR-12759 JDK 11 (1st release) and Tika 1.x can result in extracting dates in a bad format.
	at __randomizedtesting.SeedInfo.seed([1E0494F6BD610A4C]:0)
	at org.junit.Assert.fail(Assert.java:93)
	at org.junit.Assert.assertTrue(Assert.java:43)
	at org.junit.Assert.assertFalse(Assert.java:68)
	at org.apache.solr.handler.extraction.ExtractingRequestHandlerTest.beforeClass(ExtractingRequestHandlerTest.java:44)
	at java.base/jdk.internal.reflect.NativeMethodAccessorImpl.invoke0(Native Method)
	at java.base/jdk.internal.reflect.NativeMethodAccessorImpl.invoke(NativeMethodAccessorImpl.java:62)
	at java.base/jdk.internal.reflect.DelegatingMethodAccessorImpl.invoke(DelegatingMethodAccessorImpl.java:43)
	at java.base/java.lang.reflect.Method.invoke(Method.java:566)
	at com.carrotsearch.randomizedtesting.RandomizedRunner.invoke(RandomizedRunner.java:1742)
	at com.carrotsearch.randomizedtesting.RandomizedRunner$6.evaluate(RandomizedRunner.java:875)
	at com.carrotsearch.randomizedtesting.RandomizedRunner$7.evaluate(RandomizedRunner.java:891)
	at com.carrotsearch.randomizedtesting.rules.StatementAdapter.evaluate(StatementAdapter.java:36)
	at com.carrotsearch.randomizedtesting.rules.SystemPropertiesRestoreRule$1.evaluate(SystemPropertiesRestoreRule.java:57)
	at org.apache.lucene.util.AbstractBeforeAfterRule$1.evaluate(AbstractBeforeAfterRule.java:45)
	at com.carrotsearch.randomizedtesting.rules.StatementAdapter.evaluate(StatementAdapter.java:36)
	at org.apache.lucene.util.TestRuleStoreClassName$1.evaluate(TestRuleStoreClassName.java:41)
	at com.carrotsearch.randomizedtesting.rules.NoShadowingOrOverridesOnMethodsRule$1.evaluate(NoShadowingOrOverridesOnMethodsRule.java:40)
	at com.carrotsearch.randomizedtesting.rules.NoShadowingOrOverridesOnMethodsRule$1.evaluate(NoShadowingOrOverridesOnMethodsRule.java:40)
	at com.carrotsearch.randomizedtesting.rules.StatementAdapter.evaluate(StatementAdapter.java:36)
	at com.carrotsearch.randomizedtesting.rules.StatementAdapter.evaluate(StatementAdapter.java:36)
	at org.apache.lucene.util.TestRuleAssertionsRequired$1.evaluate(TestRuleAssertionsRequired.java:53)
	at org.apache.lucene.util.TestRuleMarkFailure$1.evaluate(TestRuleMarkFailure.java:47)
	at org.apache.lucene.util.TestRuleIgnoreAfterMaxFailures$1.evaluate(TestRuleIgnoreAfterMaxFailures.java:64)
	at org.apache.lucene.util.TestRuleIgnoreTestSuites$1.evaluate(TestRuleIgnoreTestSuites.java:54)
	at com.carrotsearch.randomizedtesting.rules.StatementAdapter.evaluate(StatementAdapter.java:36)
	at com.carrotsearch.randomizedtesting.ThreadLeakControl$StatementRunner.run(ThreadLeakControl.java:368)
	at java.base/java.lang.Thread.run(Thread.java:834)


FAILED:  junit.framework.TestSuite.org.apache.solr.handler.extraction.ExtractingRequestHandlerTest

Error Message:
SOLR-12759 JDK 11 (1st release) and Tika 1.x can result in extracting dates in a bad format.

Stack Trace:
java.lang.AssertionError: SOLR-12759 JDK 11 (1st release) and Tika 1.x can result in extracting dates in a bad format.
	at __randomizedtesting.SeedInfo.seed([1E0494F6BD610A4C]:0)
	at org.junit.Assert.fail(Assert.java:93)
	at org.junit.Assert.assertTrue(Assert.java:43)
	at org.junit.Assert.assertFalse(Assert.java:68)
	at org.apache.solr.handler.extraction.ExtractingRequestHandlerTest.beforeClass(ExtractingRequestHandlerTest.java:44)
	at java.base/jdk.internal.reflect.NativeMethodAccessorImpl.invoke0(Native Method)
	at java.base/jdk.internal.reflect.NativeMethodAccessorImpl.invoke(NativeMethodAccessorImpl.java:62)
	at java.base/jdk.internal.reflect.DelegatingMethodAccessorImpl.invoke(DelegatingMethodAccessorImpl.java:43)
	at java.base/java.lang.reflect.Method.invoke(Method.java:566)
	at com.carrotsearch.randomizedtesting.RandomizedRunner.invoke(RandomizedRunner.java:1742)
	at com.carrotsearch.randomizedtesting.RandomizedRunner$6.evaluate(RandomizedRunner.java:875)
	at com.carrotsearch.randomizedtesting.RandomizedRunner$7.evaluate(RandomizedRunner.java:891)
	at com.carrotsearch.randomizedtesting.rules.StatementAdapter.evaluate(StatementAdapter.java:36)
	at com.carrotsearch.randomizedtesting.rules.SystemPropertiesRestoreRule$1.evaluate(SystemPropertiesRestoreRule.java:57)
	at org.apache.lucene.util.AbstractBeforeAfterRule$1.evaluate(AbstractBeforeAfterRule.java:45)
	at com.carrotsearch.randomizedtesting.rules.StatementAdapter.evaluate(StatementAdapter.java:36)
	at org.apache.lucene.util.TestRuleStoreClassName$1.evaluate(TestRuleStoreClassName.java:41)
	at com.carrotsearch.randomizedtesting.rules.NoShadowingOrOverridesOnMethodsRule$1.evaluate(NoShadowingOrOverridesOnMethodsRule.java:40)
	at com.carrotsearch.randomizedtesting.rules.NoShadowingOrOverridesOnMethodsRule$1.evaluate(NoShadowingOrOverridesOnMethodsRule.java:40)
	at com.carrotsearch.randomizedtesting.rules.StatementAdapter.evaluate(StatementAdapter.java:36)
	at com.carrotsearch.randomizedtesting.rules.StatementAdapter.evaluate(StatementAdapter.java:36)
	at org.apache.lucene.util.TestRuleAssertionsRequired$1.evaluate(TestRuleAssertionsRequired.java:53)
	at org.apache.lucene.util.TestRuleMarkFailure$1.evaluate(TestRuleMarkFailure.java:47)
	at org.apache.lucene.util.TestRuleIgnoreAfterMaxFailures$1.evaluate(TestRuleIgnoreAfterMaxFailures.java:64)
	at org.apache.lucene.util.TestRuleIgnoreTestSuites$1.evaluate(TestRuleIgnoreTestSuites.java:54)
	at com.carrotsearch.randomizedtesting.rules.StatementAdapter.evaluate(StatementAdapter.java:36)
	at com.carrotsearch.randomizedtesting.ThreadLeakControl$StatementRunner.run(ThreadLeakControl.java:368)
	at java.base/java.lang.Thread.run(Thread.java:834)


FAILED:  junit.framework.TestSuite.org.apache.solr.handler.extraction.ExtractingRequestHandlerTest

Error Message:
SOLR-12759 JDK 11 (1st release) and Tika 1.x can result in extracting dates in a bad format.

Stack Trace:
java.lang.AssertionError: SOLR-12759 JDK 11 (1st release) and Tika 1.x can result in extracting dates in a bad format.
	at __randomizedtesting.SeedInfo.seed([1E0494F6BD610A4C]:0)
	at org.junit.Assert.fail(Assert.java:93)
	at org.junit.Assert.assertTrue(Assert.java:43)
	at org.junit.Assert.assertFalse(Assert.java:68)
	at org.apache.solr.handler.extraction.ExtractingRequestHandlerTest.beforeClass(ExtractingRequestHandlerTest.java:44)
	at java.base/jdk.internal.reflect.NativeMethodAccessorImpl.invoke0(Native Method)
	at java.base/jdk.internal.reflect.NativeMethodAccessorImpl.invoke(NativeMethodAccessorImpl.java:62)
	at java.base/jdk.internal.reflect.DelegatingMethodAccessorImpl.invoke(DelegatingMethodAccessorImpl.java:43)
	at java.base/java.lang.reflect.Method.invoke(Method.java:566)
	at com.carrotsearch.randomizedtesting.RandomizedRunner.invoke(RandomizedRunner.java:1742)
	at com.carrotsearch.randomizedtesting.RandomizedRunner$6.evaluate(RandomizedRunner.java:875)
	at com.carrotsearch.randomizedtesting.RandomizedRunner$7.evaluate(RandomizedRunner.java:891)
	at com.carrotsearch.randomizedtesting.rules.StatementAdapter.evaluate(StatementAdapter.java:36)
	at com.carrotsearch.randomizedtesting.rules.SystemPropertiesRestoreRule$1.evaluate(SystemPropertiesRestoreRule.java:57)
	at org.apache.lucene.util.AbstractBeforeAfterRule$1.evaluate(AbstractBeforeAfterRule.java:45)
	at com.carrotsearch.randomizedtesting.rules.StatementAdapter.evaluate(StatementAdapter.java:36)
	at org.apache.lucene.util.TestRuleStoreClassName$1.evaluate(TestRuleStoreClassName.java:41)
	at com.carrotsearch.randomizedtesting.rules.NoShadowingOrOverridesOnMethodsRule$1.evaluate(NoShadowingOrOverridesOnMethodsRule.java:40)
	at com.carrotsearch.randomizedtesting.rules.NoShadowingOrOverridesOnMethodsRule$1.evaluate(NoShadowingOrOverridesOnMethodsRule.java:40)
	at com.carrotsearch.randomizedtesting.rules.StatementAdapter.evaluate(StatementAdapter.java:36)
	at com.carrotsearch.randomizedtesting.rules.StatementAdapter.evaluate(StatementAdapter.java:36)
	at org.apache.lucene.util.TestRuleAssertionsRequired$1.evaluate(TestRuleAssertionsRequired.java:53)
	at org.apache.lucene.util.TestRuleMarkFailure$1.evaluate(TestRuleMarkFailure.java:47)
	at org.apache.lucene.util.TestRuleIgnoreAfterMaxFailures$1.evaluate(TestRuleIgnoreAfterMaxFailures.java:64)
	at org.apache.lucene.util.TestRuleIgnoreTestSuites$1.evaluate(TestRuleIgnoreTestSuites.java:54)
	at com.carrotsearch.randomizedtesting.rules.StatementAdapter.evaluate(StatementAdapter.java:36)
	at com.carrotsearch.randomizedtesting.ThreadLeakControl$StatementRunner.run(ThreadLeakControl.java:368)
	at java.base/java.lang.Thread.run(Thread.java:834)


FAILED:  junit.framework.TestSuite.org.apache.solr.handler.extraction.ExtractingRequestHandlerTest

Error Message:
SOLR-12759 JDK 11 (1st release) and Tika 1.x can result in extracting dates in a bad format.

Stack Trace:
java.lang.AssertionError: SOLR-12759 JDK 11 (1st release) and Tika 1.x can result in extracting dates in a bad format.
	at __randomizedtesting.SeedInfo.seed([1E0494F6BD610A4C]:0)
	at org.junit.Assert.fail(Assert.java:93)
	at org.junit.Assert.assertTrue(Assert.java:43)
	at org.junit.Assert.assertFalse(Assert.java:68)
	at org.apache.solr.handler.extraction.ExtractingRequestHandlerTest.beforeClass(ExtractingRequestHandlerTest.java:44)
	at java.base/jdk.internal.reflect.NativeMethodAccessorImpl.invoke0(Native Method)
	at java.base/jdk.internal.reflect.NativeMethodAccessorImpl.invoke(NativeMethodAccessorImpl.java:62)
	at java.base/jdk.internal.reflect.DelegatingMethodAccessorImpl.invoke(DelegatingMethodAccessorImpl.java:43)
	at java.base/java.lang.reflect.Method.invoke(Method.java:566)
	at com.carrotsearch.randomizedtesting.RandomizedRunner.invoke(RandomizedRunner.java:1742)
	at com.carrotsearch.randomizedtesting.RandomizedRunner$6.evaluate(RandomizedRunner.java:875)
	at com.carrotsearch.randomizedtesting.RandomizedRunner$7.evaluate(RandomizedRunner.java:891)
	at com.carrotsearch.randomizedtesting.rules.StatementAdapter.evaluate(StatementAdapter.java:36)
	at com.carrotsearch.randomizedtesting.rules.SystemPropertiesRestoreRule$1.evaluate(SystemPropertiesRestoreRule.java:57)
	at org.apache.lucene.util.AbstractBeforeAfterRule$1.evaluate(AbstractBeforeAfterRule.java:45)
	at com.carrotsearch.randomizedtesting.rules.StatementAdapter.evaluate(StatementAdapter.java:36)
	at org.apache.lucene.util.TestRuleStoreClassName$1.evaluate(TestRuleStoreClassName.java:41)
	at com.carrotsearch.randomizedtesting.rules.NoShadowingOrOverridesOnMethodsRule$1.evaluate(NoShadowingOrOverridesOnMethodsRule.java:40)
	at com.carrotsearch.randomizedtesting.rules.NoShadowingOrOverridesOnMethodsRule$1.evaluate(NoShadowingOrOverridesOnMethodsRule.java:40)
	at com.carrotsearch.randomizedtesting.rules.StatementAdapter.evaluate(StatementAdapter.java:36)
	at com.carrotsearch.randomizedtesting.rules.StatementAdapter.evaluate(StatementAdapter.java:36)
	at org.apache.lucene.util.TestRuleAssertionsRequired$1.evaluate(TestRuleAssertionsRequired.java:53)
	at org.apache.lucene.util.TestRuleMarkFailure$1.evaluate(TestRuleMarkFailure.java:47)
	at org.apache.lucene.util.TestRuleIgnoreAfterMaxFailures$1.evaluate(TestRuleIgnoreAfterMaxFailures.java:64)
	at org.apache.lucene.util.TestRuleIgnoreTestSuites$1.evaluate(TestRuleIgnoreTestSuites.java:54)
	at com.carrotsearch.randomizedtesting.rules.StatementAdapter.evaluate(StatementAdapter.java:36)
	at com.carrotsearch.randomizedtesting.ThreadLeakControl$StatementRunner.run(ThreadLeakControl.java:368)
	at java.base/java.lang.Thread.run(Thread.java:834)


FAILED:  org.apache.solr.cloud.autoscaling.MetricTriggerIntegrationTest.testMetricTrigger

Error Message:
Timed out waiting for collection:testMetricTrigger to become active null Live Nodes: [127.0.0.1:38467_solr, 127.0.0.1:39645_solr] Last available state: null

Stack Trace:
java.lang.AssertionError: Timed out waiting for collection:testMetricTrigger to become active
null
Live Nodes: [127.0.0.1:38467_solr, 127.0.0.1:39645_solr]
Last available state: null
	at __randomizedtesting.SeedInfo.seed([FC5959527B2FEFEA:46556EDD24C739A5]:0)
	at org.junit.Assert.fail(Assert.java:93)
	at org.apache.solr.cloud.SolrCloudTestCase.waitForState(SolrCloudTestCase.java:280)
	at org.apache.solr.cloud.autoscaling.MetricTriggerIntegrationTest.testMetricTrigger(MetricTriggerIntegrationTest.java:95)
	at java.base/jdk.internal.reflect.NativeMethodAccessorImpl.invoke0(Native Method)
	at java.base/jdk.internal.reflect.NativeMethodAccessorImpl.invoke(NativeMethodAccessorImpl.java:62)
	at java.base/jdk.internal.reflect.DelegatingMethodAccessorImpl.invoke(DelegatingMethodAccessorImpl.java:43)
	at java.base/java.lang.reflect.Method.invoke(Method.java:566)
	at com.carrotsearch.randomizedtesting.RandomizedRunner.invoke(RandomizedRunner.java:1742)
	at com.carrotsearch.randomizedtesting.RandomizedRunner$8.evaluate(RandomizedRunner.java:935)
	at com.carrotsearch.randomizedtesting.RandomizedRunner$9.evaluate(RandomizedRunner.java:971)
	at com.carrotsearch.randomizedtesting.RandomizedRunner$10.evaluate(RandomizedRunner.java:985)
	at com.carrotsearch.randomizedtesting.rules.SystemPropertiesRestoreRule$1.evaluate(SystemPropertiesRestoreRule.java:57)
	at org.apache.lucene.util.TestRuleSetupTeardownChained$1.evaluate(TestRuleSetupTeardownChained.java:49)
	at org.apache.lucene.util.AbstractBeforeAfterRule$1.evaluate(AbstractBeforeAfterRule.java:45)
	at org.apache.lucene.util.TestRuleThreadAndTestName$1.evaluate(TestRuleThreadAndTestName.java:48)
	at org.apache.lucene.util.TestRuleIgnoreAfterMaxFailures$1.evaluate(TestRuleIgnoreAfterMaxFailures.java:64)
	at org.apache.lucene.util.TestRuleMarkFailure$1.evaluate(TestRuleMarkFailure.java:47)
	at com.carrotsearch.randomizedtesting.rules.StatementAdapter.evaluate(StatementAdapter.java:36)
	at com.carrotsearch.randomizedtesting.ThreadLeakControl$StatementRunner.run(ThreadLeakControl.java:368)
	at com.carrotsearch.randomizedtesting.ThreadLeakControl.forkTimeoutingTask(ThreadLeakControl.java:817)
	at com.carrotsearch.randomizedtesting.ThreadLeakControl$3.evaluate(ThreadLeakControl.java:468)
	at com.carrotsearch.randomizedtesting.RandomizedRunner.runSingleTest(RandomizedRunner.java:944)
	at com.carrotsearch.randomizedtesting.RandomizedRunner$5.evaluate(RandomizedRunner.java:830)
	at com.carrotsearch.randomizedtesting.RandomizedRunner$6.evaluate(RandomizedRunner.java:880)
	at com.carrotsearch.randomizedtesting.RandomizedRunner$7.evaluate(RandomizedRunner.java:891)
	at com.carrotsearch.randomizedtesting.rules.StatementAdapter.evaluate(StatementAdapter.java:36)
	at com.carrotsearch.randomizedtesting.rules.SystemPropertiesRestoreRule$1.evaluate(SystemPropertiesRestoreRule.java:57)
	at org.apache.lucene.util.AbstractBeforeAfterRule$1.evaluate(AbstractBeforeAfterRule.java:45)
	at com.carrotsearch.randomizedtesting.rules.StatementAdapter.evaluate(StatementAdapter.java:36)
	at org.apache.lucene.util.TestRuleStoreClassName$1.evaluate(TestRuleStoreClassName.java:41)
	at com.carrotsearch.randomizedtesting.rules.NoShadowingOrOverridesOnMethodsRule$1.evaluate(NoShadowingOrOverridesOnMethodsRule.java:40)
	at com.carrotsearch.randomizedtesting.rules.NoShadowingOrOverridesOnMethodsRule$1.evaluate(NoShadowingOrOverridesOnMethodsRule.java:40)
	at com.carrotsearch.randomizedtesting.rules.StatementAdapter.evaluate(StatementAdapter.java:36)
	at com.carrotsearch.randomizedtesting.rules.StatementAdapter.evaluate(StatementAdapter.java:36)
	at org.apache.lucene.util.TestRuleAssertionsRequired$1.evaluate(TestRuleAssertionsRequired.java:53)
	at org.apache.lucene.util.TestRuleMarkFailure$1.evaluate(TestRuleMarkFailure.java:47)
	at org.apache.lucene.util.TestRuleIgnoreAfterMaxFailures$1.evaluate(TestRuleIgnoreAfterMaxFailures.java:64)
	at org.apache.lucene.util.TestRuleIgnoreTestSuites$1.evaluate(TestRuleIgnoreTestSuites.java:54)
	at com.carrotsearch.randomizedtesting.rules.StatementAdapter.evaluate(StatementAdapter.java:36)
	at com.carrotsearch.randomizedtesting.ThreadLeakControl$StatementRunner.run(ThreadLeakControl.java:368)
	at java.base/java.lang.Thread.run(Thread.java:834)


FAILED:  org.apache.solr.cloud.autoscaling.MetricTriggerIntegrationTest.testMetricTrigger

Error Message:
Timed out waiting for collection:testMetricTrigger to become active null Live Nodes: [127.0.0.1:34991_solr, 127.0.0.1:38503_solr] Last available state: null

Stack Trace:
java.lang.AssertionError: Timed out waiting for collection:testMetricTrigger to become active
null
Live Nodes: [127.0.0.1:34991_solr, 127.0.0.1:38503_solr]
Last available state: null
	at __randomizedtesting.SeedInfo.seed([FC5959527B2FEFEA:46556EDD24C739A5]:0)
	at org.junit.Assert.fail(Assert.java:93)
	at org.apache.solr.cloud.SolrCloudTestCase.waitForState(SolrCloudTestCase.java:280)
	at org.apache.solr.cloud.autoscaling.MetricTriggerIntegrationTest.testMetricTrigger(MetricTriggerIntegrationTest.java:95)
	at java.base/jdk.internal.reflect.NativeMethodAccessorImpl.invoke0(Native Method)
	at java.base/jdk.internal.reflect.NativeMethodAccessorImpl.invoke(NativeMethodAccessorImpl.java:62)
	at java.base/jdk.internal.reflect.DelegatingMethodAccessorImpl.invoke(DelegatingMethodAccessorImpl.java:43)
	at java.base/java.lang.reflect.Method.invoke(Method.java:566)
	at com.carrotsearch.randomizedtesting.RandomizedRunner.invoke(RandomizedRunner.java:1742)
	at com.carrotsearch.randomizedtesting.RandomizedRunner$8.evaluate(RandomizedRunner.java:935)
	at com.carrotsearch.randomizedtesting.RandomizedRunner$9.evaluate(RandomizedRunner.java:971)
	at com.carrotsearch.randomizedtesting.RandomizedRunner$10.evaluate(RandomizedRunner.java:985)
	at com.carrotsearch.randomizedtesting.rules.SystemPropertiesRestoreRule$1.evaluate(SystemPropertiesRestoreRule.java:57)
	at org.apache.lucene.util.TestRuleSetupTeardownChained$1.evaluate(TestRuleSetupTeardownChained.java:49)
	at org.apache.lucene.util.AbstractBeforeAfterRule$1.evaluate(AbstractBeforeAfterRule.java:45)
	at org.apache.lucene.util.TestRuleThreadAndTestName$1.evaluate(TestRuleThreadAndTestName.java:48)
	at org.apache.lucene.util.TestRuleIgnoreAfterMaxFailures$1.evaluate(TestRuleIgnoreAfterMaxFailures.java:64)
	at org.apache.lucene.util.TestRuleMarkFailure$1.evaluate(TestRuleMarkFailure.java:47)
	at com.carrotsearch.randomizedtesting.rules.StatementAdapter.evaluate(StatementAdapter.java:36)
	at com.carrotsearch.randomizedtesting.ThreadLeakControl$StatementRunner.run(ThreadLeakControl.java:368)
	at com.carrotsearch.randomizedtesting.ThreadLeakControl.forkTimeoutingTask(ThreadLeakControl.java:817)
	at com.carrotsearch.randomizedtesting.ThreadLeakControl$3.evaluate(ThreadLeakControl.java:468)
	at com.carrotsearch.randomizedtesting.RandomizedRunner.runSingleTest(RandomizedRunner.java:944)
	at com.carrotsearch.randomizedtesting.RandomizedRunner$5.evaluate(RandomizedRunner.java:830)
	at com.carrotsearch.randomizedtesting.RandomizedRunner$6.evaluate(RandomizedRunner.java:880)
	at com.carrotsearch.randomizedtesting.RandomizedRunner$7.evaluate(RandomizedRunner.java:891)
	at com.carrotsearch.randomizedtesting.rules.StatementAdapter.evaluate(StatementAdapter.java:36)
	at com.carrotsearch.randomizedtesting.rules.SystemPropertiesRestoreRule$1.evaluate(SystemPropertiesRestoreRule.java:57)
	at org.apache.lucene.util.AbstractBeforeAfterRule$1.evaluate(AbstractBeforeAfterRule.java:45)
	at com.carrotsearch.randomizedtesting.rules.StatementAdapter.evaluate(StatementAdapter.java:36)
	at org.apache.lucene.util.TestRuleStoreClassName$1.evaluate(TestRuleStoreClassName.java:41)
	at com.carrotsearch.randomizedtesting.rules.NoShadowingOrOverridesOnMethodsRule$1.evaluate(NoShadowingOrOverridesOnMethodsRule.java:40)
	at com.carrotsearch.randomizedtesting.rules.NoShadowingOrOverridesOnMethodsRule$1.evaluate(NoShadowingOrOverridesOnMethodsRule.java:40)
	at com.carrotsearch.randomizedtesting.rules.StatementAdapter.evaluate(StatementAdapter.java:36)
	at com.carrotsearch.randomizedtesting.rules.StatementAdapter.evaluate(StatementAdapter.java:36)
	at org.apache.lucene.util.TestRuleAssertionsRequired$1.evaluate(TestRuleAssertionsRequired.java:53)
	at org.apache.lucene.util.TestRuleMarkFailure$1.evaluate(TestRuleMarkFailure.java:47)
	at org.apache.lucene.util.TestRuleIgnoreAfterMaxFailures$1.evaluate(TestRuleIgnoreAfterMaxFailures.java:64)
	at org.apache.lucene.util.TestRuleIgnoreTestSuites$1.evaluate(TestRuleIgnoreTestSuites.java:54)
	at com.carrotsearch.randomizedtesting.rules.StatementAdapter.evaluate(StatementAdapter.java:36)
	at com.carrotsearch.randomizedtesting.ThreadLeakControl$StatementRunner.run(ThreadLeakControl.java:368)
	at java.base/java.lang.Thread.run(Thread.java:834)


FAILED:  org.apache.solr.cloud.autoscaling.MetricTriggerIntegrationTest.testMetricTrigger

Error Message:
{srt=[CapturedEvent{timestamp=1536843674261000000, stage=AFTER_ACTION, actionName='compute', event={   "id":"8aa92b20490dbTyw3o735czvqe26da5nglw0oq",   "source":"metric_trigger",   "eventTime":2439346842276059,   "eventType":"METRIC",   "properties":{     "node":{"127.0.0.1:32995_solr":13779},     "__start__":1,     "metric":"metrics:solr.core.testMetricTrigger.shard1.replica_n3:INDEX.sizeInBytes",     "collection":"testMetricTrigger",     "shard":"shard1",     "preferredOperation":"addreplica",     "_enqueue_time_":2439351868656498,     "requestedOps":[{         "action":"ADDREPLICA",         "hints":{           "COLL_SHARD":[{               "first":"testMetricTrigger",               "second":"shard1"}],           "SRC_NODE":["127.0.0.1:32995_solr"]}}]}}, context={properties.operations=[{class=org.apache.solr.client.solrj.request.CollectionAdminRequest$AddReplica, method=GET, params.action=ADDREPLICA, params.collection=testMetricTrigger, params.shard=shard1, params.node=127.0.0.1:34435_solr, params.type=NRT}], properties.BEFORE_ACTION=[compute], source=metric_trigger, properties.AFTER_ACTION=[compute]}, config={   "beforeAction":[],   "trigger":"metric_trigger",   "stage":[     "FAILED",     "SUCCEEDED"],   "afterAction":[     "compute",     "execute",     "test"],   "class":"org.apache.solr.cloud.autoscaling.MetricTriggerIntegrationTest$TestTriggerListener"}, message='null'}, CapturedEvent{timestamp=1536843679276000000, stage=AFTER_ACTION, actionName='execute', event={   "id":"8aa92b20490dbTyw3o735czvqe26da5nglw0oq",   "source":"metric_trigger",   "eventTime":2439346842276059,   "eventType":"METRIC",   "properties":{     "node":{"127.0.0.1:32995_solr":13779},     "__start__":1,     "metric":"metrics:solr.core.testMetricTrigger.shard1.replica_n3:INDEX.sizeInBytes",     "collection":"testMetricTrigger",     "shard":"shard1",     "preferredOperation":"addreplica",     "_enqueue_time_":2439351868656498,     "requestedOps":[{         "action":"ADDREPLICA",         "hints":{           "COLL_SHARD":[{               "first":"testMetricTrigger",               "second":"shard1"}],           "SRC_NODE":["127.0.0.1:32995_solr"]}}]}}, context={properties.operations=[{class=org.apache.solr.client.solrj.request.CollectionAdminRequest$AddReplica, method=GET, params.action=ADDREPLICA, params.async=metric_trigger/8aa92b20490dbTyw3o735czvqe26da5nglw0oq/0, params.waitForFinalState=true, params.collection=testMetricTrigger, params.shard=shard1, params.node=127.0.0.1:34435_solr, params.type=NRT}], properties.BEFORE_ACTION=[compute, execute], properties.responses=[{responseHeader={status=0,QTime=1},success={127.0.0.1:34435_solr={responseHeader={status=0,QTime=0}}},metric_trigger/8aa92b20490dbTyw3o735czvqe26da5nglw0oq/02439352000123647={responseHeader={status=0,QTime=0},STATUS=completed,Response=TaskId: metric_trigger/8aa92b20490dbTyw3o735czvqe26da5nglw0oq/02439352000123647 webapp=null path=/admin/cores params={async=metric_trigger/8aa92b20490dbTyw3o735czvqe26da5nglw0oq/02439352000123647&qt=/admin/cores&coreNodeName=core_node12&collection.configName=conf&name=testMetricTrigger_shard1_replica_n11&action=CREATE&collection=testMetricTrigger&shard=shard1&wt=javabin&version=2&replicaType=NRT} status=0 QTime=0},status={state=completed,msg=found [metric_trigger/8aa92b20490dbTyw3o735czvqe26da5nglw0oq/0] in completed tasks}}], source=metric_trigger, properties.AFTER_ACTION=[compute, execute]}, config={   "beforeAction":[],   "trigger":"metric_trigger",   "stage":[     "FAILED",     "SUCCEEDED"],   "afterAction":[     "compute",     "execute",     "test"],   "class":"org.apache.solr.cloud.autoscaling.MetricTriggerIntegrationTest$TestTriggerListener"}, message='null'}, CapturedEvent{timestamp=1536843679276000000, stage=AFTER_ACTION, actionName='test', event={   "id":"8aa92b20490dbTyw3o735czvqe26da5nglw0oq",   "source":"metric_trigger",   "eventTime":2439346842276059,   "eventType":"METRIC",   "properties":{     "node":{"127.0.0.1:32995_solr":13779},     "__start__":1,     "metric":"metrics:solr.core.testMetricTrigger.shard1.replica_n3:INDEX.sizeInBytes",     "collection":"testMetricTrigger",     "shard":"shard1",     "preferredOperation":"addreplica",     "_enqueue_time_":2439351868656498,     "requestedOps":[{         "action":"ADDREPLICA",         "hints":{           "COLL_SHARD":[{               "first":"testMetricTrigger",               "second":"shard1"}],           "SRC_NODE":["127.0.0.1:32995_solr"]}}]}}, context={properties.operations=[{class=org.apache.solr.client.solrj.request.CollectionAdminRequest$AddReplica, method=GET, params.action=ADDREPLICA, params.async=metric_trigger/8aa92b20490dbTyw3o735czvqe26da5nglw0oq/0, params.waitForFinalState=true, params.collection=testMetricTrigger, params.shard=shard1, params.node=127.0.0.1:34435_solr, params.type=NRT}], properties.BEFORE_ACTION=[compute, execute, test], properties.responses=[{responseHeader={status=0,QTime=1},success={127.0.0.1:34435_solr={responseHeader={status=0,QTime=0}}},metric_trigger/8aa92b20490dbTyw3o735czvqe26da5nglw0oq/02439352000123647={responseHeader={status=0,QTime=0},STATUS=completed,Response=TaskId: metric_trigger/8aa92b20490dbTyw3o735czvqe26da5nglw0oq/02439352000123647 webapp=null path=/admin/cores params={async=metric_trigger/8aa92b20490dbTyw3o735czvqe26da5nglw0oq/02439352000123647&qt=/admin/cores&coreNodeName=core_node12&collection.configName=conf&name=testMetricTrigger_shard1_replica_n11&action=CREATE&collection=testMetricTrigger&shard=shard1&wt=javabin&version=2&replicaType=NRT} status=0 QTime=0},status={state=completed,msg=found [metric_trigger/8aa92b20490dbTyw3o735czvqe26da5nglw0oq/0] in completed tasks}}], source=metric_trigger, properties.AFTER_ACTION=[compute, execute, test]}, config={   "beforeAction":[],   "trigger":"metric_trigger",   "stage":[     "FAILED",     "SUCCEEDED"],   "afterAction":[     "compute",     "execute",     "test"],   "class":"org.apache.solr.cloud.autoscaling.MetricTriggerIntegrationTest$TestTriggerListener"}, message='null'}, CapturedEvent{timestamp=1536843679277000000, stage=SUCCEEDED, actionName='null', event={   "id":"8aa92b20490dbTyw3o735czvqe26da5nglw0oq",   "source":"metric_trigger",   "eventTime":2439346842276059,   "eventType":"METRIC",   "properties":{     "node":{"127.0.0.1:32995_solr":13779},     "__start__":1,     "metric":"metrics:solr.core.testMetricTrigger.shard1.replica_n3:INDEX.sizeInBytes",     "collection":"testMetricTrigger",     "shard":"shard1",     "preferredOperation":"addreplica",     "_enqueue_time_":2439351868656498,     "requestedOps":[{         "action":"ADDREPLICA",         "hints":{           "COLL_SHARD":[{               "first":"testMetricTrigger",               "second":"shard1"}],           "SRC_NODE":["127.0.0.1:32995_solr"]}}]}}, context={}, config={   "beforeAction":[],   "trigger":"metric_trigger",   "stage":[     "FAILED",     "SUCCEEDED"],   "afterAction":[     "compute",     "execute",     "test"],   "class":"org.apache.solr.cloud.autoscaling.MetricTriggerIntegrationTest$TestTriggerListener"}, message='null'}, CapturedEvent{timestamp=1536844580042000000, stage=AFTER_ACTION, actionName='compute', event={   "id":"8ab659666f220Tyw3o735czvqe26da5nglw0r3",   "source":"metric_trigger",   "eventTime":2440252617060896,   "eventType":"METRIC",   "properties":{     "node":{"127.0.0.1:45851_solr":13602},     "__start__":1,     "metric":"metrics:solr.core.testMetricTrigger.shard1.replica_n1:INDEX.sizeInBytes",     "collection":"testMetricTrigger",     "shard":"shard1",     "preferredOperation":"movereplica",     "_enqueue_time_":2440257635924181,     "requestedOps":[{         "action":"MOVEREPLICA",         "hints":{           "COLL_SHARD":[{               "first":"testMetricTrigger",               "second":"shard1"}],           "SRC_NODE":["127.0.0.1:45851_solr"]}}]}}, context={properties.operations=[{class=org.apache.solr.client.solrj.request.CollectionAdminRequest$MoveReplica, method=GET, params.action=MOVEREPLICA, params.collection=testMetricTrigger, params.targetNode=127.0.0.1:46761_solr, params.inPlaceMove=true, params.replica=core_node3}], properties.BEFORE_ACTION=[compute], source=metric_trigger, properties.AFTER_ACTION=[compute]}, config={   "beforeAction":[],   "trigger":"metric_trigger",   "stage":[     "FAILED",     "SUCCEEDED"],   "afterAction":[     "compute",     "execute",     "test"],   "class":"org.apache.solr.cloud.autoscaling.MetricTriggerIntegrationTest$TestTriggerListener"}, message='null'}, CapturedEvent{timestamp=1536844585053000000, stage=AFTER_ACTION, actionName='execute', event={   "id":"8ab659666f220Tyw3o735czvqe26da5nglw0r3",   "source":"metric_trigger",   "eventTime":2440252617060896,   "eventType":"METRIC",   "properties":{     "node":{"127.0.0.1:45851_solr":13602},     "__start__":1,     "metric":"metrics:solr.core.testMetricTrigger.shard1.replica_n1:INDEX.sizeInBytes",     "collection":"testMetricTrigger",     "shard":"shard1",     "preferredOperation":"movereplica",     "_enqueue_time_":2440257635924181,     "requestedOps":[{         "action":"MOVEREPLICA",         "hints":{           "COLL_SHARD":[{               "first":"testMetricTrigger",               "second":"shard1"}],           "SRC_NODE":["127.0.0.1:45851_solr"]}}]}}, context={properties.operations=[{class=org.apache.solr.client.solrj.request.CollectionAdminRequest$MoveReplica, method=GET, params.action=MOVEREPLICA, params.async=metric_trigger/8ab659666f220Tyw3o735czvqe26da5nglw0r3/0, params.waitForFinalState=true, params.collection=testMetricTrigger, params.targetNode=127.0.0.1:46761_solr, params.inPlaceMove=true, params.replica=core_node3}], properties.BEFORE_ACTION=[compute, execute], properties.responses=[{responseHeader={status=0,QTime=1},success=MOVEREPLICA action completed successfully, moved replica=testMetricTrigger_shard1_replica_n1 at node=127.0.0.1:45851_solr to replica=testMetricTrigger_shard1_replica_n9 at node=127.0.0.1:46761_solr,status={state=completed,msg=found [metric_trigger/8ab659666f220Tyw3o735czvqe26da5nglw0r3/0] in completed tasks}}], source=metric_trigger, properties.AFTER_ACTION=[compute, execute]}, config={   "beforeAction":[],   "trigger":"metric_trigger",   "stage":[     "FAILED",     "SUCCEEDED"],   "afterAction":[     "compute",     "execute",     "test"],   "class":"org.apache.solr.cloud.autoscaling.MetricTriggerIntegrationTest$TestTriggerListener"}, message='null'}, CapturedEvent{timestamp=1536844585053000000, stage=AFTER_ACTION, actionName='test', event={   "id":"8ab659666f220Tyw3o735czvqe26da5nglw0r3",   "source":"metric_trigger",   "eventTime":2440252617060896,   "eventType":"METRIC",   "properties":{     "node":{"127.0.0.1:45851_solr":13602},     "__start__":1,     "metric":"metrics:solr.core.testMetricTrigger.shard1.replica_n1:INDEX.sizeInBytes",     "collection":"testMetricTrigger",     "shard":"shard1",     "preferredOperation":"movereplica",     "_enqueue_time_":2440257635924181,     "requestedOps":[{         "action":"MOVEREPLICA",         "hints":{           "COLL_SHARD":[{               "first":"testMetricTrigger",               "second":"shard1"}],           "SRC_NODE":["127.0.0.1:45851_solr"]}}]}}, context={properties.operations=[{class=org.apache.solr.client.solrj.request.CollectionAdminRequest$MoveReplica, method=GET, params.action=MOVEREPLICA, params.async=metric_trigger/8ab659666f220Tyw3o735czvqe26da5nglw0r3/0, params.waitForFinalState=true, params.collection=testMetricTrigger, params.targetNode=127.0.0.1:46761_solr, params.inPlaceMove=true, params.replica=core_node3}], properties.BEFORE_ACTION=[compute, execute, test], properties.responses=[{responseHeader={status=0,QTime=1},success=MOVEREPLICA action completed successfully, moved replica=testMetricTrigger_shard1_replica_n1 at node=127.0.0.1:45851_solr to replica=testMetricTrigger_shard1_replica_n9 at node=127.0.0.1:46761_solr,status={state=completed,msg=found [metric_trigger/8ab659666f220Tyw3o735czvqe26da5nglw0r3/0] in completed tasks}}], source=metric_trigger, properties.AFTER_ACTION=[compute, execute, test]}, config={   "beforeAction":[],   "trigger":"metric_trigger",   "stage":[     "FAILED",     "SUCCEEDED"],   "afterAction":[     "compute",     "execute",     "test"],   "class":"org.apache.solr.cloud.autoscaling.MetricTriggerIntegrationTest$TestTriggerListener"}, message='null'}, CapturedEvent{timestamp=1536844585054000000, stage=SUCCEEDED, actionName='null', event={   "id":"8ab659666f220Tyw3o735czvqe26da5nglw0r3",   "source":"metric_trigger",   "eventTime":2440252617060896,   "eventType":"METRIC",   "properties":{     "node":{"127.0.0.1:45851_solr":13602},     "__start__":1,     "metric":"metrics:solr.core.testMetricTrigger.shard1.replica_n1:INDEX.sizeInBytes",     "collection":"testMetricTrigger",     "shard":"shard1",     "preferredOperation":"movereplica",     "_enqueue_time_":2440257635924181,     "requestedOps":[{         "action":"MOVEREPLICA",         "hints":{           "COLL_SHARD":[{               "first":"testMetricTrigger",               "second":"shard1"}],           "SRC_NODE":["127.0.0.1:45851_solr"]}}]}}, context={}, config={   "beforeAction":[],   "trigger":"metric_trigger",   "stage":[     "FAILED",     "SUCCEEDED"],   "afterAction":[     "compute",     "execute",     "test"],   "class":"org.apache.solr.cloud.autoscaling.MetricTriggerIntegrationTest$TestTriggerListener"}, message='null'}]} expected:<4> but was:<8>

Stack Trace:
java.lang.AssertionError: {srt=[CapturedEvent{timestamp=1536843674261000000, stage=AFTER_ACTION, actionName='compute', event={
  "id":"8aa92b20490dbTyw3o735czvqe26da5nglw0oq",
  "source":"metric_trigger",
  "eventTime":2439346842276059,
  "eventType":"METRIC",
  "properties":{
    "node":{"127.0.0.1:32995_solr":13779},
    "__start__":1,
    "metric":"metrics:solr.core.testMetricTrigger.shard1.replica_n3:INDEX.sizeInBytes",
    "collection":"testMetricTrigger",
    "shard":"shard1",
    "preferredOperation":"addreplica",
    "_enqueue_time_":2439351868656498,
    "requestedOps":[{
        "action":"ADDREPLICA",
        "hints":{
          "COLL_SHARD":[{
              "first":"testMetricTrigger",
              "second":"shard1"}],
          "SRC_NODE":["127.0.0.1:32995_solr"]}}]}}, context={properties.operations=[{class=org.apache.solr.client.solrj.request.CollectionAdminRequest$AddReplica, method=GET, params.action=ADDREPLICA, params.collection=testMetricTrigger, params.shard=shard1, params.node=127.0.0.1:34435_solr, params.type=NRT}], properties.BEFORE_ACTION=[compute], source=metric_trigger, properties.AFTER_ACTION=[compute]}, config={
  "beforeAction":[],
  "trigger":"metric_trigger",
  "stage":[
    "FAILED",
    "SUCCEEDED"],
  "afterAction":[
    "compute",
    "execute",
    "test"],
  "class":"org.apache.solr.cloud.autoscaling.MetricTriggerIntegrationTest$TestTriggerListener"}, message='null'}, CapturedEvent{timestamp=1536843679276000000, stage=AFTER_ACTION, actionName='execute', event={
  "id":"8aa92b20490dbTyw3o735czvqe26da5nglw0oq",
  "source":"metric_trigger",
  "eventTime":2439346842276059,
  "eventType":"METRIC",
  "properties":{
    "node":{"127.0.0.1:32995_solr":13779},
    "__start__":1,
    "metric":"metrics:solr.core.testMetricTrigger.shard1.replica_n3:INDEX.sizeInBytes",
    "collection":"testMetricTrigger",
    "shard":"shard1",
    "preferredOperation":"addreplica",
    "_enqueue_time_":2439351868656498,
    "requestedOps":[{
        "action":"ADDREPLICA",
        "hints":{
          "COLL_SHARD":[{
              "first":"testMetricTrigger",
              "second":"shard1"}],
          "SRC_NODE":["127.0.0.1:32995_solr"]}}]}}, context={properties.operations=[{class=org.apache.solr.client.solrj.request.CollectionAdminRequest$AddReplica, method=GET, params.action=ADDREPLICA, params.async=metric_trigger/8aa92b20490dbTyw3o735czvqe26da5nglw0oq/0, params.waitForFinalState=true, params.collection=testMetricTrigger, params.shard=shard1, params.node=127.0.0.1:34435_solr, params.type=NRT}], properties.BEFORE_ACTION=[compute, execute], properties.responses=[{responseHeader={status=0,QTime=1},success={127.0.0.1:34435_solr={responseHeader={status=0,QTime=0}}},metric_trigger/8aa92b20490dbTyw3o735czvqe26da5nglw0oq/02439352000123647={responseHeader={status=0,QTime=0},STATUS=completed,Response=TaskId: metric_trigger/8aa92b20490dbTyw3o735czvqe26da5nglw0oq/02439352000123647 webapp=null path=/admin/cores params={async=metric_trigger/8aa92b20490dbTyw3o735czvqe26da5nglw0oq/02439352000123647&qt=/admin/cores&coreNodeName=core_node12&collection.configName=conf&name=testMetricTrigger_shard1_replica_n11&action=CREATE&collection=testMetricTrigger&shard=shard1&wt=javabin&version=2&replicaType=NRT} status=0 QTime=0},status={state=completed,msg=found [metric_trigger/8aa92b20490dbTyw3o735czvqe26da5nglw0oq/0] in completed tasks}}], source=metric_trigger, properties.AFTER_ACTION=[compute, execute]}, config={
  "beforeAction":[],
  "trigger":"metric_trigger",
  "stage":[
    "FAILED",
    "SUCCEEDED"],
  "afterAction":[
    "compute",
    "execute",
    "test"],
  "class":"org.apache.solr.cloud.autoscaling.MetricTriggerIntegrationTest$TestTriggerListener"}, message='null'}, CapturedEvent{timestamp=1536843679276000000, stage=AFTER_ACTION, actionName='test', event={
  "id":"8aa92b20490dbTyw3o735czvqe26da5nglw0oq",
  "source":"metric_trigger",
  "eventTime":2439346842276059,
  "eventType":"METRIC",
  "properties":{
    "node":{"127.0.0.1:32995_solr":13779},
    "__start__":1,
    "metric":"metrics:solr.core.testMetricTrigger.shard1.replica_n3:INDEX.sizeInBytes",
    "collection":"testMetricTrigger",
    "shard":"shard1",
    "preferredOperation":"addreplica",
    "_enqueue_time_":2439351868656498,
    "requestedOps":[{
        "action":"ADDREPLICA",
        "hints":{
          "COLL_SHARD":[{
              "first":"testMetricTrigger",
              "second":"shard1"}],
          "SRC_NODE":["127.0.0.1:32995_solr"]}}]}}, context={properties.operations=[{class=org.apache.solr.client.solrj.request.CollectionAdminRequest$AddReplica, method=GET, params.action=ADDREPLICA, params.async=metric_trigger/8aa92b20490dbTyw3o735czvqe26da5nglw0oq/0, params.waitForFinalState=true, params.collection=testMetricTrigger, params.shard=shard1, params.node=127.0.0.1:34435_solr, params.type=NRT}], properties.BEFORE_ACTION=[compute, execute, test], properties.responses=[{responseHeader={status=0,QTime=1},success={127.0.0.1:34435_solr={responseHeader={status=0,QTime=0}}},metric_trigger/8aa92b20490dbTyw3o735czvqe26da5nglw0oq/02439352000123647={responseHeader={status=0,QTime=0},STATUS=completed,Response=TaskId: metric_trigger/8aa92b20490dbTyw3o735czvqe26da5nglw0oq/02439352000123647 webapp=null path=/admin/cores params={async=metric_trigger/8aa92b20490dbTyw3o735czvqe26da5nglw0oq/02439352000123647&qt=/admin/cores&coreNodeName=core_node12&collection.configName=conf&name=testMetricTrigger_shard1_replica_n11&action=CREATE&collection=testMetricTrigger&shard=shard1&wt=javabin&version=2&replicaType=NRT} status=0 QTime=0},status={state=completed,msg=found [metric_trigger/8aa92b20490dbTyw3o735czvqe26da5nglw0oq/0] in completed tasks}}], source=metric_trigger, properties.AFTER_ACTION=[compute, execute, test]}, config={
  "beforeAction":[],
  "trigger":"metric_trigger",
  "stage":[
    "FAILED",
    "SUCCEEDED"],
  "afterAction":[
    "compute",
    "execute",
    "test"],
  "class":"org.apache.solr.cloud.autoscaling.MetricTriggerIntegrationTest$TestTriggerListener"}, message='null'}, CapturedEvent{timestamp=1536843679277000000, stage=SUCCEEDED, actionName='null', event={
  "id":"8aa92b20490dbTyw3o735czvqe26da5nglw0oq",
  "source":"metric_trigger",
  "eventTime":2439346842276059,
  "eventType":"METRIC",
  "properties":{
    "node":{"127.0.0.1:32995_solr":13779},
    "__start__":1,
    "metric":"metrics:solr.core.testMetricTrigger.shard1.replica_n3:INDEX.sizeInBytes",
    "collection":"testMetricTrigger",
    "shard":"shard1",
    "preferredOperation":"addreplica",
    "_enqueue_time_":2439351868656498,
    "requestedOps":[{
        "action":"ADDREPLICA",
        "hints":{
          "COLL_SHARD":[{
              "first":"testMetricTrigger",
              "second":"shard1"}],
          "SRC_NODE":["127.0.0.1:32995_solr"]}}]}}, context={}, config={
  "beforeAction":[],
  "trigger":"metric_trigger",
  "stage":[
    "FAILED",
    "SUCCEEDED"],
  "afterAction":[
    "compute",
    "execute",
    "test"],
  "class":"org.apache.solr.cloud.autoscaling.MetricTriggerIntegrationTest$TestTriggerListener"}, message='null'}, CapturedEvent{timestamp=1536844580042000000, stage=AFTER_ACTION, actionName='compute', event={
  "id":"8ab659666f220Tyw3o735czvqe26da5nglw0r3",
  "source":"metric_trigger",
  "eventTime":2440252617060896,
  "eventType":"METRIC",
  "properties":{
    "node":{"127.0.0.1:45851_solr":13602},
    "__start__":1,
    "metric":"metrics:solr.core.testMetricTrigger.shard1.replica_n1:INDEX.sizeInBytes",
    "collection":"testMetricTrigger",
    "shard":"shard1",
    "preferredOperation":"movereplica",
    "_enqueue_time_":2440257635924181,
    "requestedOps":[{
        "action":"MOVEREPLICA",
        "hints":{
          "COLL_SHARD":[{
              "first":"testMetricTrigger",
              "second":"shard1"}],
          "SRC_NODE":["127.0.0.1:45851_solr"]}}]}}, context={properties.operations=[{class=org.apache.solr.client.solrj.request.CollectionAdminRequest$MoveReplica, method=GET, params.action=MOVEREPLICA, params.collection=testMetricTrigger, params.targetNode=127.0.0.1:46761_solr, params.inPlaceMove=true, params.replica=core_node3}], properties.BEFORE_ACTION=[compute], source=metric_trigger, properties.AFTER_ACTION=[compute]}, config={
  "beforeAction":[],
  "trigger":"metric_trigger",
  "stage":[
    "FAILED",
    "SUCCEEDED"],
  "afterAction":[
    "compute",
    "execute",
    "test"],
  "class":"org.apache.solr.cloud.autoscaling.MetricTriggerIntegrationTest$TestTriggerListener"}, message='null'}, CapturedEvent{timestamp=1536844585053000000, stage=AFTER_ACTION, actionName='execute', event={
  "id":"8ab659666f220Tyw3o735czvqe26da5nglw0r3",
  "source":"metric_trigger",
  "eventTime":2440252617060896,
  "eventType":"METRIC",
  "properties":{
    "node":{"127.0.0.1:45851_solr":13602},
    "__start__":1,
    "metric":"metrics:solr.core.testMetricTrigger.shard1.replica_n1:INDEX.sizeInBytes",
    "collection":"testMetricTrigger",
    "shard":"shard1",
    "preferredOperation":"movereplica",
    "_enqueue_time_":2440257635924181,
    "requestedOps":[{
        "action":"MOVEREPLICA",
        "hints":{
          "COLL_SHARD":[{
              "first":"testMetricTrigger",
              "second":"shard1"}],
          "SRC_NODE":["127.0.0.1:45851_solr"]}}]}}, context={properties.operations=[{class=org.apache.solr.client.solrj.request.CollectionAdminRequest$MoveReplica, method=GET, params.action=MOVEREPLICA, params.async=metric_trigger/8ab659666f220Tyw3o735czvqe26da5nglw0r3/0, params.waitForFinalState=true, params.collection=testMetricTrigger, params.targetNode=127.0.0.1:46761_solr, params.inPlaceMove=true, params.replica=core_node3}], properties.BEFORE_ACTION=[compute, execute], properties.responses=[{responseHeader={status=0,QTime=1},success=MOVEREPLICA action completed successfully, moved replica=testMetricTrigger_shard1_replica_n1 at node=127.0.0.1:45851_solr to replica=testMetricTrigger_shard1_replica_n9 at node=127.0.0.1:46761_solr,status={state=completed,msg=found [metric_trigger/8ab659666f220Tyw3o735czvqe26da5nglw0r3/0] in completed tasks}}], source=metric_trigger, properties.AFTER_ACTION=[compute, execute]}, config={
  "beforeAction":[],
  "trigger":"metric_trigger",
  "stage":[
    "FAILED",
    "SUCCEEDED"],
  "afterAction":[
    "compute",
    "execute",
    "test"],
  "class":"org.apache.solr.cloud.autoscaling.MetricTriggerIntegrationTest$TestTriggerListener"}, message='null'}, CapturedEvent{timestamp=1536844585053000000, stage=AFTER_ACTION, actionName='test', event={
  "id":"8ab659666f220Tyw3o735czvqe26da5nglw0r3",
  "source":"metric_trigger",
  "eventTime":2440252617060896,
  "eventType":"METRIC",
  "properties":{
    "node":{"127.0.0.1:45851_solr":13602},
    "__start__":1,
    "metric":"metrics:solr.core.testMetricTrigger.shard1.replica_n1:INDEX.sizeInBytes",
    "collection":"testMetricTrigger",
    "shard":"shard1",
    "preferredOperation":"movereplica",
    "_enqueue_time_":2440257635924181,
    "requestedOps":[{
        "action":"MOVEREPLICA",
        "hints":{
          "COLL_SHARD":[{
              "first":"testMetricTrigger",
              "second":"shard1"}],
          "SRC_NODE":["127.0.0.1:45851_solr"]}}]}}, context={properties.operations=[{class=org.apache.solr.client.solrj.request.CollectionAdminRequest$MoveReplica, method=GET, params.action=MOVEREPLICA, params.async=metric_trigger/8ab659666f220Tyw3o735czvqe26da5nglw0r3/0, params.waitForFinalState=true, params.collection=testMetricTrigger, params.targetNode=127.0.0.1:46761_solr, params.inPlaceMove=true, params.replica=core_node3}], properties.BEFORE_ACTION=[compute, execute, test], properties.responses=[{responseHeader={status=0,QTime=1},success=MOVEREPLICA action completed successfully, moved replica=testMetricTrigger_shard1_replica_n1 at node=127.0.0.1:45851_solr to replica=testMetricTrigger_shard1_replica_n9 at node=127.0.0.1:46761_solr,status={state=completed,msg=found [metric_trigger/8ab659666f220Tyw3o735czvqe26da5nglw0r3/0] in completed tasks}}], source=metric_trigger, properties.AFTER_ACTION=[compute, execute, test]}, config={
  "beforeAction":[],
  "trigger":"metric_trigger",
  "stage":[
    "FAILED",
    "SUCCEEDED"],
  "afterAction":[
    "compute",
    "execute",
    "test"],
  "class":"org.apache.solr.cloud.autoscaling.MetricTriggerIntegrationTest$TestTriggerListener"}, message='null'}, CapturedEvent{timestamp=1536844585054000000, stage=SUCCEEDED, actionName='null', event={
  "id":"8ab659666f220Tyw3o735czvqe26da5nglw0r3",
  "source":"metric_trigger",
  "eventTime":2440252617060896,
  "eventType":"METRIC",
  "properties":{
    "node":{"127.0.0.1:45851_solr":13602},
    "__start__":1,
    "metric":"metrics:solr.core.testMetricTrigger.shard1.replica_n1:INDEX.sizeInBytes",
    "collection":"testMetricTrigger",
    "shard":"shard1",
    "preferredOperation":"movereplica",
    "_enqueue_time_":2440257635924181,
    "requestedOps":[{
        "action":"MOVEREPLICA",
        "hints":{
          "COLL_SHARD":[{
              "first":"testMetricTrigger",
              "second":"shard1"}],
          "SRC_NODE":["127.0.0.1:45851_solr"]}}]}}, context={}, config={
  "beforeAction":[],
  "trigger":"metric_trigger",
  "stage":[
    "FAILED",
    "SUCCEEDED"],
  "afterAction":[
    "compute",
    "execute",
    "test"],
  "class":"org.apache.solr.cloud.autoscaling.MetricTriggerIntegrationTest$TestTriggerListener"}, message='null'}]} expected:<4> but was:<8>
	at __randomizedtesting.SeedInfo.seed([FC5959527B2FEFEA:46556EDD24C739A5]:0)
	at org.junit.Assert.fail(Assert.java:93)
	at org.junit.Assert.failNotEquals(Assert.java:647)
	at org.junit.Assert.assertEquals(Assert.java:128)
	at org.junit.Assert.assertEquals(Assert.java:472)
	at org.apache.solr.cloud.autoscaling.MetricTriggerIntegrationTest.testMetricTrigger(MetricTriggerIntegrationTest.java:157)
	at java.base/jdk.internal.reflect.NativeMethodAccessorImpl.invoke0(Native Method)
	at java.base/jdk.internal.reflect.NativeMethodAccessorImpl.invoke(NativeMethodAccessorImpl.java:62)
	at java.base/jdk.internal.reflect.DelegatingMethodAccessorImpl.invoke(DelegatingMethodAccessorImpl.java:43)
	at java.base/java.lang.reflect.Method.invoke(Method.java:566)
	at com.carrotsearch.randomizedtesting.RandomizedRunner.invoke(RandomizedRunner.java:1742)
	at com.carrotsearch.randomizedtesting.RandomizedRunner$8.evaluate(RandomizedRunner.java:935)
	at com.carrotsearch.randomizedtesting.RandomizedRunner$9.evaluate(RandomizedRunner.java:971)
	at com.carrotsearch.randomizedtesting.RandomizedRunner$10.evaluate(RandomizedRunner.java:985)
	at com.carrotsearch.randomizedtesting.rules.SystemPropertiesRestoreRule$1.evaluate(SystemPropertiesRestoreRule.java:57)
	at org.apache.lucene.util.TestRuleSetupTeardownChained$1.evaluate(TestRuleSetupTeardownChained.java:49)
	at org.apache.lucene.util.AbstractBeforeAfterRule$1.evaluate(AbstractBeforeAfterRule.java:45)
	at org.apache.lucene.util.TestRuleThreadAndTestName$1.evaluate(TestRuleThreadAndTestName.java:48)
	at org.apache.lucene.util.TestRuleIgnoreAfterMaxFailures$1.evaluate(TestRuleIgnoreAfterMaxFailures.java:64)
	at org.apache.lucene.util.TestRuleMarkFailure$1.evaluate(TestRuleMarkFailure.java:47)
	at com.carrotsearch.randomizedtesting.rules.StatementAdapter.evaluate(StatementAdapter.java:36)
	at com.carrotsearch.randomizedtesting.ThreadLeakControl$StatementRunner.run(ThreadLeakControl.java:368)
	at com.carrotsearch.randomizedtesting.ThreadLeakControl.forkTimeoutingTask(ThreadLeakControl.java:817)
	at com.carrotsearch.randomizedtesting.ThreadLeakControl$3.evaluate(ThreadLeakControl.java:468)
	at com.carrotsearch.randomizedtesting.RandomizedRunner.runSingleTest(RandomizedRunner.java:944)
	at com.carrotsearch.randomizedtesting.RandomizedRunner$5.evaluate(RandomizedRunner.java:830)
	at com.carrotsearch.randomizedtesting.RandomizedRunner$6.evaluate(RandomizedRunner.java:880)
	at com.carrotsearch.randomizedtesting.RandomizedRunner$7.evaluate(RandomizedRunner.java:891)
	at com.carrotsearch.randomizedtesting.rules.StatementAdapter.evaluate(StatementAdapter.java:36)
	at com.carrotsearch.randomizedtesting.rules.SystemPropertiesRestoreRule$1.evaluate(SystemPropertiesRestoreRule.java:57)
	at org.apache.lucene.util.AbstractBeforeAfterRule$1.evaluate(AbstractBeforeAfterRule.java:45)
	at com.carrotsearch.randomizedtesting.rules.StatementAdapter.evaluate(StatementAdapter.java:36)
	at org.apache.lucene.util.TestRuleStoreClassName$1.evaluate(TestRuleStoreClassName.java:41)
	at com.carrotsearch.randomizedtesting.rules.NoShadowingOrOverridesOnMethodsRule$1.evaluate(NoShadowingOrOverridesOnMethodsRule.java:40)
	at com.carrotsearch.randomizedtesting.rules.NoShadowingOrOverridesOnMethodsRule$1.evaluate(NoShadowingOrOverridesOnMethodsRule.java:40)
	at com.carrotsearch.randomizedtesting.rules.StatementAdapter.evaluate(StatementAdapter.java:36)
	at com.carrotsearch.randomizedtesting.rules.StatementAdapter.evaluate(StatementAdapter.java:36)
	at org.apache.lucene.util.TestRuleAssertionsRequired$1.evaluate(TestRuleAssertionsRequired.java:53)
	at org.apache.lucene.util.TestRuleMarkFailure$1.evaluate(TestRuleMarkFailure.java:47)
	at org.apache.lucene.util.TestRuleIgnoreAfterMaxFailures$1.evaluate(TestRuleIgnoreAfterMaxFailures.java:64)
	at org.apache.lucene.util.TestRuleIgnoreTestSuites$1.evaluate(TestRuleIgnoreTestSuites.java:54)
	at com.carrotsearch.randomizedtesting.rules.StatementAdapter.evaluate(StatementAdapter.java:36)
	at com.carrotsearch.randomizedtesting.ThreadLeakControl$StatementRunner.run(ThreadLeakControl.java:368)
	at java.base/java.lang.Thread.run(Thread.java:834)


FAILED:  org.apache.solr.cloud.autoscaling.MetricTriggerIntegrationTest.testMetricTrigger

Error Message:
Timed out waiting for collection:testMetricTrigger to become active null Live Nodes: [127.0.0.1:34535_solr, 127.0.0.1:40005_solr] Last available state: null

Stack Trace:
java.lang.AssertionError: Timed out waiting for collection:testMetricTrigger to become active
null
Live Nodes: [127.0.0.1:34535_solr, 127.0.0.1:40005_solr]
Last available state: null
	at __randomizedtesting.SeedInfo.seed([FC5959527B2FEFEA:46556EDD24C739A5]:0)
	at org.junit.Assert.fail(Assert.java:93)
	at org.apache.solr.cloud.SolrCloudTestCase.waitForState(SolrCloudTestCase.java:280)
	at org.apache.solr.cloud.autoscaling.MetricTriggerIntegrationTest.testMetricTrigger(MetricTriggerIntegrationTest.java:95)
	at java.base/jdk.internal.reflect.NativeMethodAccessorImpl.invoke0(Native Method)
	at java.base/jdk.internal.reflect.NativeMethodAccessorImpl.invoke(NativeMethodAccessorImpl.java:62)
	at java.base/jdk.internal.reflect.DelegatingMethodAccessorImpl.invoke(DelegatingMethodAccessorImpl.java:43)
	at java.base/java.lang.reflect.Method.invoke(Method.java:566)
	at com.carrotsearch.randomizedtesting.RandomizedRunner.invoke(RandomizedRunner.java:1742)
	at com.carrotsearch.randomizedtesting.RandomizedRunner$8.evaluate(RandomizedRunner.java:935)
	at com.carrotsearch.randomizedtesting.RandomizedRunner$9.evaluate(RandomizedRunner.java:971)
	at com.carrotsearch.randomizedtesting.RandomizedRunner$10.evaluate(RandomizedRunner.java:985)
	at com.carrotsearch.randomizedtesting.rules.SystemPropertiesRestoreRule$1.evaluate(SystemPropertiesRestoreRule.java:57)
	at org.apache.lucene.util.TestRuleSetupTeardownChained$1.evaluate(TestRuleSetupTeardownChained.java:49)
	at org.apache.lucene.util.AbstractBeforeAfterRule$1.evaluate(AbstractBeforeAfterRule.java:45)
	at org.apache.lucene.util.TestRuleThreadAndTestName$1.evaluate(TestRuleThreadAndTestName.java:48)
	at org.apache.lucene.util.TestRuleIgnoreAfterMaxFailures$1.evaluate(TestRuleIgnoreAfterMaxFailures.java:64)
	at org.apache.lucene.util.TestRuleMarkFailure$1.evaluate(TestRuleMarkFailure.java:47)
	at com.carrotsearch.randomizedtesting.rules.StatementAdapter.evaluate(StatementAdapter.java:36)
	at com.carrotsearch.randomizedtesting.ThreadLeakControl$StatementRunner.run(ThreadLeakControl.java:368)
	at com.carrotsearch.randomizedtesting.ThreadLeakControl.forkTimeoutingTask(ThreadLeakControl.java:817)
	at com.carrotsearch.randomizedtesting.ThreadLeakControl$3.evaluate(ThreadLeakControl.java:468)
	at com.carrotsearch.randomizedtesting.RandomizedRunner.runSingleTest(RandomizedRunner.java:944)
	at com.carrotsearch.randomizedtesting.RandomizedRunner$5.evaluate(RandomizedRunner.java:830)
	at com.carrotsearch.randomizedtesting.RandomizedRunner$6.evaluate(RandomizedRunner.java:880)
	at com.carrotsearch.randomizedtesting.RandomizedRunner$7.evaluate(RandomizedRunner.java:891)
	at com.carrotsearch.randomizedtesting.rules.StatementAdapter.evaluate(StatementAdapter.java:36)
	at com.carrotsearch.randomizedtesting.rules.SystemPropertiesRestoreRule$1.evaluate(SystemPropertiesRestoreRule.java:57)
	at org.apache.lucene.util.AbstractBeforeAfterRule$1.evaluate(AbstractBeforeAfterRule.java:45)
	at com.carrotsearch.randomizedtesting.rules.StatementAdapter.evaluate(StatementAdapter.java:36)
	at org.apache.lucene.util.TestRuleStoreClassName$1.evaluate(TestRuleStoreClassName.java:41)
	at com.carrotsearch.randomizedtesting.rules.NoShadowingOrOverridesOnMethodsRule$1.evaluate(NoShadowingOrOverridesOnMethodsRule.java:40)
	at com.carrotsearch.randomizedtesting.rules.NoShadowingOrOverridesOnMethodsRule$1.evaluate(NoShadowingOrOverridesOnMethodsRule.java:40)
	at com.carrotsearch.randomizedtesting.rules.StatementAdapter.evaluate(StatementAdapter.java:36)
	at com.carrotsearch.randomizedtesting.rules.StatementAdapter.evaluate(StatementAdapter.java:36)
	at org.apache.lucene.util.TestRuleAssertionsRequired$1.evaluate(TestRuleAssertionsRequired.java:53)
	at org.apache.lucene.util.TestRuleMarkFailure$1.evaluate(TestRuleMarkFailure.java:47)
	at org.apache.lucene.util.TestRuleIgnoreAfterMaxFailures$1.evaluate(TestRuleIgnoreAfterMaxFailures.java:64)
	at org.apache.lucene.util.TestRuleIgnoreTestSuites$1.evaluate(TestRuleIgnoreTestSuites.java:54)
	at com.carrotsearch.randomizedtesting.rules.StatementAdapter.evaluate(StatementAdapter.java:36)
	at com.carrotsearch.randomizedtesting.ThreadLeakControl$StatementRunner.run(ThreadLeakControl.java:368)
	at java.base/java.lang.Thread.run(Thread.java:834)


FAILED:  org.apache.solr.cloud.autoscaling.MetricTriggerIntegrationTest.testMetricTrigger

Error Message:
Timed out waiting for collection:testMetricTrigger to become active null Live Nodes: [127.0.0.1:38491_solr, 127.0.0.1:45759_solr] Last available state: null

Stack Trace:
java.lang.AssertionError: Timed out waiting for collection:testMetricTrigger to become active
null
Live Nodes: [127.0.0.1:38491_solr, 127.0.0.1:45759_solr]
Last available state: null
	at __randomizedtesting.SeedInfo.seed([FC5959527B2FEFEA:46556EDD24C739A5]:0)
	at org.junit.Assert.fail(Assert.java:93)
	at org.apache.solr.cloud.SolrCloudTestCase.waitForState(SolrCloudTestCase.java:280)
	at org.apache.solr.cloud.autoscaling.MetricTriggerIntegrationTest.testMetricTrigger(MetricTriggerIntegrationTest.java:95)
	at java.base/jdk.internal.reflect.NativeMethodAccessorImpl.invoke0(Native Method)
	at java.base/jdk.internal.reflect.NativeMethodAccessorImpl.invoke(NativeMethodAccessorImpl.java:62)
	at java.base/jdk.internal.reflect.DelegatingMethodAccessorImpl.invoke(DelegatingMethodAccessorImpl.java:43)
	at java.base/java.lang.reflect.Method.invoke(Method.java:566)
	at com.carrotsearch.randomizedtesting.RandomizedRunner.invoke(RandomizedRunner.java:1742)
	at com.carrotsearch.randomizedtesting.RandomizedRunner$8.evaluate(RandomizedRunner.java:935)
	at com.carrotsearch.randomizedtesting.RandomizedRunner$9.evaluate(RandomizedRunner.java:971)
	at com.carrotsearch.randomizedtesting.RandomizedRunner$10.evaluate(RandomizedRunner.java:985)
	at com.carrotsearch.randomizedtesting.rules.SystemPropertiesRestoreRule$1.evaluate(SystemPropertiesRestoreRule.java:57)
	at org.apache.lucene.util.TestRuleSetupTeardownChained$1.evaluate(TestRuleSetupTeardownChained.java:49)
	at org.apache.lucene.util.AbstractBeforeAfterRule$1.evaluate(AbstractBeforeAfterRule.java:45)
	at org.apache.lucene.util.TestRuleThreadAndTestName$1.evaluate(TestRuleThreadAndTestName.java:48)
	at org.apache.lucene.util.TestRuleIgnoreAfterMaxFailures$1.evaluate(TestRuleIgnoreAfterMaxFailures.java:64)
	at org.apache.lucene.util.TestRuleMarkFailure$1.evaluate(TestRuleMarkFailure.java:47)
	at com.carrotsearch.randomizedtesting.rules.StatementAdapter.evaluate(StatementAdapter.java:36)
	at com.carrotsearch.randomizedtesting.ThreadLeakControl$StatementRunner.run(ThreadLeakControl.java:368)
	at com.carrotsearch.randomizedtesting.ThreadLeakControl.forkTimeoutingTask(ThreadLeakControl.java:817)
	at com.carrotsearch.randomizedtesting.ThreadLeakControl$3.evaluate(ThreadLeakControl.java:468)
	at com.carrotsearch.randomizedtesting.RandomizedRunner.runSingleTest(RandomizedRunner.java:944)
	at com.carrotsearch.randomizedtesting.RandomizedRunner$5.evaluate(RandomizedRunner.java:830)
	at com.carrotsearch.randomizedtesting.RandomizedRunner$6.evaluate(RandomizedRunner.java:880)
	at com.carrotsearch.randomizedtesting.RandomizedRunner$7.evaluate(RandomizedRunner.java:891)
	at com.carrotsearch.randomizedtesting.rules.StatementAdapter.evaluate(StatementAdapter.java:36)
	at com.carrotsearch.randomizedtesting.rules.SystemPropertiesRestoreRule$1.evaluate(SystemPropertiesRestoreRule.java:57)
	at org.apache.lucene.util.AbstractBeforeAfterRule$1.evaluate(AbstractBeforeAfterRule.java:45)
	at com.carrotsearch.randomizedtesting.rules.StatementAdapter.evaluate(StatementAdapter.java:36)
	at org.apache.lucene.util.TestRuleStoreClassName$1.evaluate(TestRuleStoreClassName.java:41)
	at com.carrotsearch.randomizedtesting.rules.NoShadowingOrOverridesOnMethodsRule$1.evaluate(NoShadowingOrOverridesOnMethodsRule.java:40)
	at com.carrotsearch.randomizedtesting.rules.NoShadowingOrOverridesOnMethodsRule$1.evaluate(NoShadowingOrOverridesOnMethodsRule.java:40)
	at com.carrotsearch.randomizedtesting.rules.StatementAdapter.evaluate(StatementAdapter.java:36)
	at com.carrotsearch.randomizedtesting.rules.StatementAdapter.evaluate(StatementAdapter.java:36)
	at org.apache.lucene.util.TestRuleAssertionsRequired$1.evaluate(TestRuleAssertionsRequired.java:53)
	at org.apache.lucene.util.TestRuleMarkFailure$1.evaluate(TestRuleMarkFailure.java:47)
	at org.apache.lucene.util.TestRuleIgnoreAfterMaxFailures$1.evaluate(TestRuleIgnoreAfterMaxFailures.java:64)
	at org.apache.lucene.util.TestRuleIgnoreTestSuites$1.evaluate(TestRuleIgnoreTestSuites.java:54)
	at com.carrotsearch.randomizedtesting.rules.StatementAdapter.evaluate(StatementAdapter.java:36)
	at com.carrotsearch.randomizedtesting.ThreadLeakControl$StatementRunner.run(ThreadLeakControl.java:368)
	at java.base/java.lang.Thread.run(Thread.java:834)


FAILED:  org.apache.solr.cloud.TestPullReplicaErrorHandling.testCantConnectToLeader

Error Message:
Error from server at http://127.0.0.1:33219/solr: Could not find collection : pull_replica_error_handling_test_cant_connect_to_leader

Stack Trace:
org.apache.solr.client.solrj.impl.HttpSolrClient$RemoteSolrException: Error from server at http://127.0.0.1:33219/solr: Could not find collection : pull_replica_error_handling_test_cant_connect_to_leader
	at __randomizedtesting.SeedInfo.seed([FC5959527B2FEFEA:725539220E376BC0]:0)
	at org.apache.solr.client.solrj.impl.HttpSolrClient.executeMethod(HttpSolrClient.java:643)
	at org.apache.solr.client.solrj.impl.HttpSolrClient.request(HttpSolrClient.java:255)
	at org.apache.solr.client.solrj.impl.HttpSolrClient.request(HttpSolrClient.java:244)
	at org.apache.solr.client.solrj.impl.LBHttpSolrClient.doRequest(LBHttpSolrClient.java:483)
	at org.apache.solr.client.solrj.impl.LBHttpSolrClient.request(LBHttpSolrClient.java:413)
	at org.apache.solr.client.solrj.impl.CloudSolrClient.sendRequest(CloudSolrClient.java:1107)
	at org.apache.solr.client.solrj.impl.CloudSolrClient.requestWithRetryOnStaleState(CloudSolrClient.java:884)
	at org.apache.solr.client.solrj.impl.CloudSolrClient.request(CloudSolrClient.java:817)
	at org.apache.solr.client.solrj.SolrRequest.process(SolrRequest.java:194)
	at org.apache.solr.client.solrj.SolrRequest.process(SolrRequest.java:211)
	at org.apache.solr.cloud.TestPullReplicaErrorHandling.tearDown(TestPullReplicaErrorHandling.java:128)
	at java.base/jdk.internal.reflect.NativeMethodAccessorImpl.invoke0(Native Method)
	at java.base/jdk.internal.reflect.NativeMethodAccessorImpl.invoke(NativeMethodAccessorImpl.java:62)
	at java.base/jdk.internal.reflect.DelegatingMethodAccessorImpl.invoke(DelegatingMethodAccessorImpl.java:43)
	at java.base/java.lang.reflect.Method.invoke(Method.java:566)
	at com.carrotsearch.randomizedtesting.RandomizedRunner.invoke(RandomizedRunner.java:1742)
	at com.carrotsearch.randomizedtesting.RandomizedRunner$10.evaluate(RandomizedRunner.java:993)
	at com.carrotsearch.randomizedtesting.rules.SystemPropertiesRestoreRule$1.evaluate(SystemPropertiesRestoreRule.java:57)
	at org.apache.lucene.util.TestRuleSetupTeardownChained$1.evaluate(TestRuleSetupTeardownChained.java:49)
	at org.apache.lucene.util.AbstractBeforeAfterRule$1.evaluate(AbstractBeforeAfterRule.java:45)
	at org.apache.lucene.util.TestRuleThreadAndTestName$1.evaluate(TestRuleThreadAndTestName.java:48)
	at org.apache.lucene.util.TestRuleIgnoreAfterMaxFailures$1.evaluate(TestRuleIgnoreAfterMaxFailures.java:64)
	at org.apache.lucene.util.TestRuleMarkFailure$1.evaluate(TestRuleMarkFailure.java:47)
	at com.carrotsearch.randomizedtesting.rules.StatementAdapter.evaluate(StatementAdapter.java:36)
	at com.carrotsearch.randomizedtesting.ThreadLeakControl$StatementRunner.run(ThreadLeakControl.java:368)
	at com.carrotsearch.randomizedtesting.ThreadLeakControl.forkTimeoutingTask(ThreadLeakControl.java:817)
	at com.carrotsearch.randomizedtesting.ThreadLeakControl$3.evaluate(ThreadLeakControl.java:468)
	at com.carrotsearch.randomizedtesting.RandomizedRunner.runSingleTest(RandomizedRunner.java:944)
	at com.carrotsearch.randomizedtesting.RandomizedRunner$5.evaluate(RandomizedRunner.java:830)
	at com.carrotsearch.randomizedtesting.RandomizedRunner$6.evaluate(RandomizedRunner.java:880)
	at com.carrotsearch.randomizedtesting.RandomizedRunner$7.evaluate(RandomizedRunner.java:891)
	at com.carrotsearch.randomizedtesting.rules.StatementAdapter.evaluate(StatementAdapter.java:36)
	at com.carrotsearch.randomizedtesting.rules.SystemPropertiesRestoreRule$1.evaluate(SystemPropertiesRestoreRule.java:57)
	at org.apache.lucene.util.AbstractBeforeAfterRule$1.evaluate(AbstractBeforeAfterRule.java:45)
	at com.carrotsearch.randomizedtesting.rules.StatementAdapter.evaluate(StatementAdapter.java:36)
	at org.apache.lucene.util.TestRuleStoreClassName$1.evaluate(TestRuleStoreClassName.java:41)
	at com.carrotsearch.randomizedtesting.rules.NoShadowingOrOverridesOnMethodsRule$1.evaluate(NoShadowingOrOverridesOnMethodsRule.java:40)
	at com.carrotsearch.randomizedtesting.rules.NoShadowingOrOverridesOnMethodsRule$1.evaluate(NoShadowingOrOverridesOnMethodsRule.java:40)
	at com.carrotsearch.randomizedtesting.rules.StatementAdapter.evaluate(StatementAdapter.java:36)
	at com.carrotsearch.randomizedtesting.rules.StatementAdapter.evaluate(StatementAdapter.java:36)
	at org.apache.lucene.util.TestRuleAssertionsRequired$1.evaluate(TestRuleAssertionsRequired.java:53)
	at org.apache.lucene.util.TestRuleMarkFailure$1.evaluate(TestRuleMarkFailure.java:47)
	at org.apache.lucene.util.TestRuleIgnoreAfterMaxFailures$1.evaluate(TestRuleIgnoreAfterMaxFailures.java:64)
	at org.apache.lucene.util.TestRuleIgnoreTestSuites$1.evaluate(TestRuleIgnoreTestSuites.java:54)
	at com.carrotsearch.randomizedtesting.rules.StatementAdapter.evaluate(StatementAdapter.java:36)
	at com.carrotsearch.randomizedtesting.ThreadLeakControl$StatementRunner.run(ThreadLeakControl.java:368)
	at java.base/java.lang.Thread.run(Thread.java:834)


FAILED:  org.apache.solr.cloud.TestPullReplicaErrorHandling.testCantConnectToLeader

Error Message:
Error from server at http://127.0.0.1:34339/solr: Could not find collection : pull_replica_error_handling_test_cant_connect_to_leader

Stack Trace:
org.apache.solr.client.solrj.impl.HttpSolrClient$RemoteSolrException: Error from server at http://127.0.0.1:34339/solr: Could not find collection : pull_replica_error_handling_test_cant_connect_to_leader
	at __randomizedtesting.SeedInfo.seed([FC5959527B2FEFEA:725539220E376BC0]:0)
	at org.apache.solr.client.solrj.impl.HttpSolrClient.executeMethod(HttpSolrClient.java:643)
	at org.apache.solr.client.solrj.impl.HttpSolrClient.request(HttpSolrClient.java:255)
	at org.apache.solr.client.solrj.impl.HttpSolrClient.request(HttpSolrClient.java:244)
	at org.apache.solr.client.solrj.impl.LBHttpSolrClient.doRequest(LBHttpSolrClient.java:483)
	at org.apache.solr.client.solrj.impl.LBHttpSolrClient.request(LBHttpSolrClient.java:413)
	at org.apache.solr.client.solrj.impl.CloudSolrClient.sendRequest(CloudSolrClient.java:1107)
	at org.apache.solr.client.solrj.impl.CloudSolrClient.requestWithRetryOnStaleState(CloudSolrClient.java:884)
	at org.apache.solr.client.solrj.impl.CloudSolrClient.request(CloudSolrClient.java:817)
	at org.apache.solr.client.solrj.SolrRequest.process(SolrRequest.java:194)
	at org.apache.solr.client.solrj.SolrRequest.process(SolrRequest.java:211)
	at org.apache.solr.cloud.TestPullReplicaErrorHandling.tearDown(TestPullReplicaErrorHandling.java:128)
	at java.base/jdk.internal.reflect.NativeMethodAccessorImpl.invoke0(Native Method)
	at java.base/jdk.internal.reflect.NativeMethodAccessorImpl.invoke(NativeMethodAccessorImpl.java:62)
	at java.base/jdk.internal.reflect.DelegatingMethodAccessorImpl.invoke(DelegatingMethodAccessorImpl.java:43)
	at java.base/java.lang.reflect.Method.invoke(Method.java:566)
	at com.carrotsearch.randomizedtesting.RandomizedRunner.invoke(RandomizedRunner.java:1742)
	at com.carrotsearch.randomizedtesting.RandomizedRunner$10.evaluate(RandomizedRunner.java:993)
	at com.carrotsearch.randomizedtesting.rules.SystemPropertiesRestoreRule$1.evaluate(SystemPropertiesRestoreRule.java:57)
	at org.apache.lucene.util.TestRuleSetupTeardownChained$1.evaluate(TestRuleSetupTeardownChained.java:49)
	at org.apache.lucene.util.AbstractBeforeAfterRule$1.evaluate(AbstractBeforeAfterRule.java:45)
	at org.apache.lucene.util.TestRuleThreadAndTestName$1.evaluate(TestRuleThreadAndTestName.java:48)
	at org.apache.lucene.util.TestRuleIgnoreAfterMaxFailures$1.evaluate(TestRuleIgnoreAfterMaxFailures.java:64)
	at org.apache.lucene.util.TestRuleMarkFailure$1.evaluate(TestRuleMarkFailure.java:47)
	at com.carrotsearch.randomizedtesting.rules.StatementAdapter.evaluate(StatementAdapter.java:36)
	at com.carrotsearch.randomizedtesting.ThreadLeakControl$StatementRunner.run(ThreadLeakControl.java:368)
	at com.carrotsearch.randomizedtesting.ThreadLeakControl.forkTimeoutingTask(ThreadLeakControl.java:817)
	at com.carrotsearch.randomizedtesting.ThreadLeakControl$3.evaluate(ThreadLeakControl.java:468)
	at com.carrotsearch.randomizedtesting.RandomizedRunner.runSingleTest(RandomizedRunner.java:944)
	at com.carrotsearch.randomizedtesting.RandomizedRunner$5.evaluate(RandomizedRunner.java:830)
	at com.carrotsearch.randomizedtesting.RandomizedRunner$6.evaluate(RandomizedRunner.java:880)
	at com.carrotsearch.randomizedtesting.RandomizedRunner$7.evaluate(RandomizedRunner.java:891)
	at com.carrotsearch.randomizedtesting.rules.StatementAdapter.evaluate(StatementAdapter.java:36)
	at com.carrotsearch.randomizedtesting.rules.SystemPropertiesRestoreRule$1.evaluate(SystemPropertiesRestoreRule.java:57)
	at org.apache.lucene.util.AbstractBeforeAfterRule$1.evaluate(AbstractBeforeAfterRule.java:45)
	at com.carrotsearch.randomizedtesting.rules.StatementAdapter.evaluate(StatementAdapter.java:36)
	at org.apache.lucene.util.TestRuleStoreClassName$1.evaluate(TestRuleStoreClassName.java:41)
	at com.carrotsearch.randomizedtesting.rules.NoShadowingOrOverridesOnMethodsRule$1.evaluate(NoShadowingOrOverridesOnMethodsRule.java:40)
	at com.carrotsearch.randomizedtesting.rules.NoShadowingOrOverridesOnMethodsRule$1.evaluate(NoShadowingOrOverridesOnMethodsRule.java:40)
	at com.carrotsearch.randomizedtesting.rules.StatementAdapter.evaluate(StatementAdapter.java:36)
	at com.carrotsearch.randomizedtesting.rules.StatementAdapter.evaluate(StatementAdapter.java:36)
	at org.apache.lucene.util.TestRuleAssertionsRequired$1.evaluate(TestRuleAssertionsRequired.java:53)
	at org.apache.lucene.util.TestRuleMarkFailure$1.evaluate(TestRuleMarkFailure.java:47)
	at org.apache.lucene.util.TestRuleIgnoreAfterMaxFailures$1.evaluate(TestRuleIgnoreAfterMaxFailures.java:64)
	at org.apache.lucene.util.TestRuleIgnoreTestSuites$1.evaluate(TestRuleIgnoreTestSuites.java:54)
	at com.carrotsearch.randomizedtesting.rules.StatementAdapter.evaluate(StatementAdapter.java:36)
	at com.carrotsearch.randomizedtesting.ThreadLeakControl$StatementRunner.run(ThreadLeakControl.java:368)
	at java.base/java.lang.Thread.run(Thread.java:834)


FAILED:  org.apache.solr.cloud.TestPullReplicaErrorHandling.testCantConnectToLeader

Error Message:
Error from server at http://127.0.0.1:46673/solr: Could not find collection : pull_replica_error_handling_test_cant_connect_to_leader

Stack Trace:
org.apache.solr.client.solrj.impl.HttpSolrClient$RemoteSolrException: Error from server at http://127.0.0.1:46673/solr: Could not find collection : pull_replica_error_handling_test_cant_connect_to_leader
	at __randomizedtesting.SeedInfo.seed([FC5959527B2FEFEA:725539220E376BC0]:0)
	at org.apache.solr.client.solrj.impl.HttpSolrClient.executeMethod(HttpSolrClient.java:643)
	at org.apache.solr.client.solrj.impl.HttpSolrClient.request(HttpSolrClient.java:255)
	at org.apache.solr.client.solrj.impl.HttpSolrClient.request(HttpSolrClient.java:244)
	at org.apache.solr.client.solrj.impl.LBHttpSolrClient.doRequest(LBHttpSolrClient.java:483)
	at org.apache.solr.client.solrj.impl.LBHttpSolrClient.request(LBHttpSolrClient.java:413)
	at org.apache.solr.client.solrj.impl.CloudSolrClient.sendRequest(CloudSolrClient.java:1107)
	at org.apache.solr.client.solrj.impl.CloudSolrClient.requestWithRetryOnStaleState(CloudSolrClient.java:884)
	at org.apache.solr.client.solrj.impl.CloudSolrClient.request(CloudSolrClient.java:817)
	at org.apache.solr.client.solrj.SolrRequest.process(SolrRequest.java:194)
	at org.apache.solr.client.solrj.SolrRequest.process(SolrRequest.java:211)
	at org.apache.solr.cloud.TestPullReplicaErrorHandling.tearDown(TestPullReplicaErrorHandling.java:128)
	at java.base/jdk.internal.reflect.NativeMethodAccessorImpl.invoke0(Native Method)
	at java.base/jdk.internal.reflect.NativeMethodAccessorImpl.invoke(NativeMethodAccessorImpl.java:62)
	at java.base/jdk.internal.reflect.DelegatingMethodAccessorImpl.invoke(DelegatingMethodAccessorImpl.java:43)
	at java.base/java.lang.reflect.Method.invoke(Method.java:566)
	at com.carrotsearch.randomizedtesting.RandomizedRunner.invoke(RandomizedRunner.java:1742)
	at com.carrotsearch.randomizedtesting.RandomizedRunner$10.evaluate(RandomizedRunner.java:993)
	at com.carrotsearch.randomizedtesting.rules.SystemPropertiesRestoreRule$1.evaluate(SystemPropertiesRestoreRule.java:57)
	at org.apache.lucene.util.TestRuleSetupTeardownChained$1.evaluate(TestRuleSetupTeardownChained.java:49)
	at org.apache.lucene.util.AbstractBeforeAfterRule$1.evaluate(AbstractBeforeAfterRule.java:45)
	at org.apache.lucene.util.TestRuleThreadAndTestName$1.evaluate(TestRuleThreadAndTestName.java:48)
	at org.apache.lucene.util.TestRuleIgnoreAfterMaxFailures$1.evaluate(TestRuleIgnoreAfterMaxFailures.java:64)
	at org.apache.lucene.util.TestRuleMarkFailure$1.evaluate(TestRuleMarkFailure.java:47)
	at com.carrotsearch.randomizedtesting.rules.StatementAdapter.evaluate(StatementAdapter.java:36)
	at com.carrotsearch.randomizedtesting.ThreadLeakControl$StatementRunner.run(ThreadLeakControl.java:368)
	at com.carrotsearch.randomizedtesting.ThreadLeakControl.forkTimeoutingTask(ThreadLeakControl.java:817)
	at com.carrotsearch.randomizedtesting.ThreadLeakControl$3.evaluate(ThreadLeakControl.java:468)
	at com.carrotsearch.randomizedtesting.RandomizedRunner.runSingleTest(RandomizedRunner.java:944)
	at com.carrotsearch.randomizedtesting.RandomizedRunner$5.evaluate(RandomizedRunner.java:830)
	at com.carrotsearch.randomizedtesting.RandomizedRunner$6.evaluate(RandomizedRunner.java:880)
	at com.carrotsearch.randomizedtesting.RandomizedRunner$7.evaluate(RandomizedRunner.java:891)
	at com.carrotsearch.randomizedtesting.rules.StatementAdapter.evaluate(StatementAdapter.java:36)
	at com.carrotsearch.randomizedtesting.rules.SystemPropertiesRestoreRule$1.evaluate(SystemPropertiesRestoreRule.java:57)
	at org.apache.lucene.util.AbstractBeforeAfterRule$1.evaluate(AbstractBeforeAfterRule.java:45)
	at com.carrotsearch.randomizedtesting.rules.StatementAdapter.evaluate(StatementAdapter.java:36)
	at org.apache.lucene.util.TestRuleStoreClassName$1.evaluate(TestRuleStoreClassName.java:41)
	at com.carrotsearch.randomizedtesting.rules.NoShadowingOrOverridesOnMethodsRule$1.evaluate(NoShadowingOrOverridesOnMethodsRule.java:40)
	at com.carrotsearch.randomizedtesting.rules.NoShadowingOrOverridesOnMethodsRule$1.evaluate(NoShadowingOrOverridesOnMethodsRule.java:40)
	at com.carrotsearch.randomizedtesting.rules.StatementAdapter.evaluate(StatementAdapter.java:36)
	at com.carrotsearch.randomizedtesting.rules.StatementAdapter.evaluate(StatementAdapter.java:36)
	at org.apache.lucene.util.TestRuleAssertionsRequired$1.evaluate(TestRuleAssertionsRequired.java:53)
	at org.apache.lucene.util.TestRuleMarkFailure$1.evaluate(TestRuleMarkFailure.java:47)
	at org.apache.lucene.util.TestRuleIgnoreAfterMaxFailures$1.evaluate(TestRuleIgnoreAfterMaxFailures.java:64)
	at org.apache.lucene.util.TestRuleIgnoreTestSuites$1.evaluate(TestRuleIgnoreTestSuites.java:54)
	at com.carrotsearch.randomizedtesting.rules.StatementAdapter.evaluate(StatementAdapter.java:36)
	at com.carrotsearch.randomizedtesting.ThreadLeakControl$StatementRunner.run(ThreadLeakControl.java:368)
	at java.base/java.lang.Thread.run(Thread.java:834)


FAILED:  org.apache.solr.cloud.TestPullReplicaErrorHandling.testCantConnectToLeader

Error Message:
Error from server at http://127.0.0.1:46727/solr: Could not find collection : pull_replica_error_handling_test_cant_connect_to_leader

Stack Trace:
org.apache.solr.client.solrj.impl.HttpSolrClient$RemoteSolrException: Error from server at http://127.0.0.1:46727/solr: Could not find collection : pull_replica_error_handling_test_cant_connect_to_leader
	at __randomizedtesting.SeedInfo.seed([FC5959527B2FEFEA:725539220E376BC0]:0)
	at org.apache.solr.client.solrj.impl.HttpSolrClient.executeMethod(HttpSolrClient.java:643)
	at org.apache.solr.client.solrj.impl.HttpSolrClient.request(HttpSolrClient.java:255)
	at org.apache.solr.client.solrj.impl.HttpSolrClient.request(HttpSolrClient.java:244)
	at org.apache.solr.client.solrj.impl.LBHttpSolrClient.doRequest(LBHttpSolrClient.java:483)
	at org.apache.solr.client.solrj.impl.LBHttpSolrClient.request(LBHttpSolrClient.java:413)
	at org.apache.solr.client.solrj.impl.CloudSolrClient.sendRequest(CloudSolrClient.java:1107)
	at org.apache.solr.client.solrj.impl.CloudSolrClient.requestWithRetryOnStaleState(CloudSolrClient.java:884)
	at org.apache.solr.client.solrj.impl.CloudSolrClient.request(CloudSolrClient.java:817)
	at org.apache.solr.client.solrj.SolrRequest.process(SolrRequest.java:194)
	at org.apache.solr.client.solrj.SolrRequest.process(SolrRequest.java:211)
	at org.apache.solr.cloud.TestPullReplicaErrorHandling.tearDown(TestPullReplicaErrorHandling.java:128)
	at java.base/jdk.internal.reflect.NativeMethodAccessorImpl.invoke0(Native Method)
	at java.base/jdk.internal.reflect.NativeMethodAccessorImpl.invoke(NativeMethodAccessorImpl.java:62)
	at java.base/jdk.internal.reflect.DelegatingMethodAccessorImpl.invoke(DelegatingMethodAccessorImpl.java:43)
	at java.base/java.lang.reflect.Method.invoke(Method.java:566)
	at com.carrotsearch.randomizedtesting.RandomizedRunner.invoke(RandomizedRunner.java:1742)
	at com.carrotsearch.randomizedtesting.RandomizedRunner$10.evaluate(RandomizedRunner.java:993)
	at com.carrotsearch.randomizedtesting.rules.SystemPropertiesRestoreRule$1.evaluate(SystemPropertiesRestoreRule.java:57)
	at org.apache.lucene.util.TestRuleSetupTeardownChained$1.evaluate(TestRuleSetupTeardownChained.java:49)
	at org.apache.lucene.util.AbstractBeforeAfterRule$1.evaluate(AbstractBeforeAfterRule.java:45)
	at org.apache.lucene.util.TestRuleThreadAndTestName$1.evaluate(TestRuleThreadAndTestName.java:48)
	at org.apache.lucene.util.TestRuleIgnoreAfterMaxFailures$1.evaluate(TestRuleIgnoreAfterMaxFailures.java:64)
	at org.apache.lucene.util.TestRuleMarkFailure$1.evaluate(TestRuleMarkFailure.java:47)
	at com.carrotsearch.randomizedtesting.rules.StatementAdapter.evaluate(StatementAdapter.java:36)
	at com.carrotsearch.randomizedtesting.ThreadLeakControl$StatementRunner.run(ThreadLeakControl.java:368)
	at com.carrotsearch.randomizedtesting.ThreadLeakControl.forkTimeoutingTask(ThreadLeakControl.java:817)
	at com.carrotsearch.randomizedtesting.ThreadLeakControl$3.evaluate(ThreadLeakControl.java:468)
	at com.carrotsearch.randomizedtesting.RandomizedRunner.runSingleTest(RandomizedRunner.java:944)
	at com.carrotsearch.randomizedtesting.RandomizedRunner$5.evaluate(RandomizedRunner.java:830)
	at com.carrotsearch.randomizedtesting.RandomizedRunner$6.evaluate(RandomizedRunner.java:880)
	at com.carrotsearch.randomizedtesting.RandomizedRunner$7.evaluate(RandomizedRunner.java:891)
	at com.carrotsearch.randomizedtesting.rules.StatementAdapter.evaluate(StatementAdapter.java:36)
	at com.carrotsearch.randomizedtesting.rules.SystemPropertiesRestoreRule$1.evaluate(SystemPropertiesRestoreRule.java:57)
	at org.apache.lucene.util.AbstractBeforeAfterRule$1.evaluate(AbstractBeforeAfterRule.java:45)
	at com.carrotsearch.randomizedtesting.rules.StatementAdapter.evaluate(StatementAdapter.java:36)
	at org.apache.lucene.util.TestRuleStoreClassName$1.evaluate(TestRuleStoreClassName.java:41)
	at com.carrotsearch.randomizedtesting.rules.NoShadowingOrOverridesOnMethodsRule$1.evaluate(NoShadowingOrOverridesOnMethodsRule.java:40)
	at com.carrotsearch.randomizedtesting.rules.NoShadowingOrOverridesOnMethodsRule$1.evaluate(NoShadowingOrOverridesOnMethodsRule.java:40)
	at com.carrotsearch.randomizedtesting.rules.StatementAdapter.evaluate(StatementAdapter.java:36)
	at com.carrotsearch.randomizedtesting.rules.StatementAdapter.evaluate(StatementAdapter.java:36)
	at org.apache.lucene.util.TestRuleAssertionsRequired$1.evaluate(TestRuleAssertionsRequired.java:53)
	at org.apache.lucene.util.TestRuleMarkFailure$1.evaluate(TestRuleMarkFailure.java:47)
	at org.apache.lucene.util.TestRuleIgnoreAfterMaxFailures$1.evaluate(TestRuleIgnoreAfterMaxFailures.java:64)
	at org.apache.lucene.util.TestRuleIgnoreTestSuites$1.evaluate(TestRuleIgnoreTestSuites.java:54)
	at com.carrotsearch.randomizedtesting.rules.StatementAdapter.evaluate(StatementAdapter.java:36)
	at com.carrotsearch.randomizedtesting.ThreadLeakControl$StatementRunner.run(ThreadLeakControl.java:368)
	at java.base/java.lang.Thread.run(Thread.java:834)


FAILED:  org.apache.solr.cloud.TestPullReplicaErrorHandling.testCantConnectToLeader

Error Message:
Error from server at http://127.0.0.1:40379/solr: Could not find collection : pull_replica_error_handling_test_cant_connect_to_leader

Stack Trace:
org.apache.solr.client.solrj.impl.HttpSolrClient$RemoteSolrException: Error from server at http://127.0.0.1:40379/solr: Could not find collection : pull_replica_error_handling_test_cant_connect_to_leader
	at __randomizedtesting.SeedInfo.seed([FC5959527B2FEFEA:725539220E376BC0]:0)
	at org.apache.solr.client.solrj.impl.HttpSolrClient.executeMethod(HttpSolrClient.java:643)
	at org.apache.solr.client.solrj.impl.HttpSolrClient.request(HttpSolrClient.java:255)
	at org.apache.solr.client.solrj.impl.HttpSolrClient.request(HttpSolrClient.java:244)
	at org.apache.solr.client.solrj.impl.LBHttpSolrClient.doRequest(LBHttpSolrClient.java:483)
	at org.apache.solr.client.solrj.impl.LBHttpSolrClient.request(LBHttpSolrClient.java:413)
	at org.apache.solr.client.solrj.impl.CloudSolrClient.sendRequest(CloudSolrClient.java:1107)
	at org.apache.solr.client.solrj.impl.CloudSolrClient.requestWithRetryOnStaleState(CloudSolrClient.java:884)
	at org.apache.solr.client.solrj.impl.CloudSolrClient.request(CloudSolrClient.java:817)
	at org.apache.solr.client.solrj.SolrRequest.process(SolrRequest.java:194)
	at org.apache.solr.client.solrj.SolrRequest.process(SolrRequest.java:211)
	at org.apache.solr.cloud.TestPullReplicaErrorHandling.tearDown(TestPullReplicaErrorHandling.java:128)
	at jdk.internal.reflect.GeneratedMethodAccessor7.invoke(Unknown Source)
	at java.base/jdk.internal.reflect.DelegatingMethodAccessorImpl.invoke(DelegatingMethodAccessorImpl.java:43)
	at java.base/java.lang.reflect.Method.invoke(Method.java:566)
	at com.carrotsearch.randomizedtesting.RandomizedRunner.invoke(RandomizedRunner.java:1742)
	at com.carrotsearch.randomizedtesting.RandomizedRunner$10.evaluate(RandomizedRunner.java:993)
	at com.carrotsearch.randomizedtesting.rules.SystemPropertiesRestoreRule$1.evaluate(SystemPropertiesRestoreRule.java:57)
	at org.apache.lucene.util.TestRuleSetupTeardownChained$1.evaluate(TestRuleSetupTeardownChained.java:49)
	at org.apache.lucene.util.AbstractBeforeAfterRule$1.evaluate(AbstractBeforeAfterRule.java:45)
	at org.apache.lucene.util.TestRuleThreadAndTestName$1.evaluate(TestRuleThreadAndTestName.java:48)
	at org.apache.lucene.util.TestRuleIgnoreAfterMaxFailures$1.evaluate(TestRuleIgnoreAfterMaxFailures.java:64)
	at org.apache.lucene.util.TestRuleMarkFailure$1.evaluate(TestRuleMarkFailure.java:47)
	at com.carrotsearch.randomizedtesting.rules.StatementAdapter.evaluate(StatementAdapter.java:36)
	at com.carrotsearch.randomizedtesting.ThreadLeakControl$StatementRunner.run(ThreadLeakControl.java:368)
	at com.carrotsearch.randomizedtesting.ThreadLeakControl.forkTimeoutingTask(ThreadLeakControl.java:817)
	at com.carrotsearch.randomizedtesting.ThreadLeakControl$3.evaluate(ThreadLeakControl.java:468)
	at com.carrotsearch.randomizedtesting.RandomizedRunner.runSingleTest(RandomizedRunner.java:944)
	at com.carrotsearch.randomizedtesting.RandomizedRunner$5.evaluate(RandomizedRunner.java:830)
	at com.carrotsearch.randomizedtesting.RandomizedRunner$6.evaluate(RandomizedRunner.java:880)
	at com.carrotsearch.randomizedtesting.RandomizedRunner$7.evaluate(RandomizedRunner.java:891)
	at com.carrotsearch.randomizedtesting.rules.StatementAdapter.evaluate(StatementAdapter.java:36)
	at com.carrotsearch.randomizedtesting.rules.SystemPropertiesRestoreRule$1.evaluate(SystemPropertiesRestoreRule.java:57)
	at org.apache.lucene.util.AbstractBeforeAfterRule$1.evaluate(AbstractBeforeAfterRule.java:45)
	at com.carrotsearch.randomizedtesting.rules.StatementAdapter.evaluate(StatementAdapter.java:36)
	at org.apache.lucene.util.TestRuleStoreClassName$1.evaluate(TestRuleStoreClassName.java:41)
	at com.carrotsearch.randomizedtesting.rules.NoShadowingOrOverridesOnMethodsRule$1.evaluate(NoShadowingOrOverridesOnMethodsRule.java:40)
	at com.carrotsearch.randomizedtesting.rules.NoShadowingOrOverridesOnMethodsRule$1.evaluate(NoShadowingOrOverridesOnMethodsRule.java:40)
	at com.carrotsearch.randomizedtesting.rules.StatementAdapter.evaluate(StatementAdapter.java:36)
	at com.carrotsearch.randomizedtesting.rules.StatementAdapter.evaluate(StatementAdapter.java:36)
	at org.apache.lucene.util.TestRuleAssertionsRequired$1.evaluate(TestRuleAssertionsRequired.java:53)
	at org.apache.lucene.util.TestRuleMarkFailure$1.evaluate(TestRuleMarkFailure.java:47)
	at org.apache.lucene.util.TestRuleIgnoreAfterMaxFailures$1.evaluate(TestRuleIgnoreAfterMaxFailures.java:64)
	at org.apache.lucene.util.TestRuleIgnoreTestSuites$1.evaluate(TestRuleIgnoreTestSuites.java:54)
	at com.carrotsearch.randomizedtesting.rules.StatementAdapter.evaluate(StatementAdapter.java:36)
	at com.carrotsearch.randomizedtesting.ThreadLeakControl$StatementRunner.run(ThreadLeakControl.java:368)
	at java.base/java.lang.Thread.run(Thread.java:834)




Build Log:
[...truncated 14128 lines...]
   [junit4] Suite: org.apache.solr.cloud.autoscaling.MetricTriggerIntegrationTest
   [junit4]   2> Creating dataDir: /home/jenkins/workspace/Lucene-Solr-master-Linux/solr/build/solr-core/test/J1/temp/solr.cloud.autoscaling.MetricTriggerIntegrationTest_FC5959527B2FEFEA-001/init-core-data-001
   [junit4]   2> 1766257 WARN  (SUITE-MetricTriggerIntegrationTest-seed#[FC5959527B2FEFEA]-worker) [    ] o.a.s.SolrTestCaseJ4 startTrackingSearchers: numOpens=4 numCloses=4
   [junit4]   2> 1766257 INFO  (SUITE-MetricTriggerIntegrationTest-seed#[FC5959527B2FEFEA]-worker) [    ] o.a.s.SolrTestCaseJ4 Using PointFields (NUMERIC_POINTS_SYSPROP=true) w/NUMERIC_DOCVALUES_SYSPROP=true
   [junit4]   2> 1766258 INFO  (SUITE-MetricTriggerIntegrationTest-seed#[FC5959527B2FEFEA]-worker) [    ] o.a.s.SolrTestCaseJ4 Randomized ssl (true) and clientAuth (false) via: @org.apache.solr.util.RandomizeSSL(reason="", ssl=0.0/0.0, value=0.0/0.0, clientAuth=0.0/0.0)
   [junit4]   2> 1766258 INFO  (SUITE-MetricTriggerIntegrationTest-seed#[FC5959527B2FEFEA]-worker) [    ] o.a.s.SolrTestCaseJ4 SecureRandom sanity checks: test.solr.allowed.securerandom=null & java.security.egd=file:/dev/./urandom
   [junit4]   2> 1766258 INFO  (SUITE-MetricTriggerIntegrationTest-seed#[FC5959527B2FEFEA]-worker) [    ] o.a.s.c.MiniSolrCloudCluster Starting cluster of 2 servers in /home/jenkins/workspace/Lucene-Solr-master-Linux/solr/build/solr-core/test/J1/temp/solr.cloud.autoscaling.MetricTriggerIntegrationTest_FC5959527B2FEFEA-001/tempDir-001
   [junit4]   2> 1766258 INFO  (SUITE-MetricTriggerIntegrationTest-seed#[FC5959527B2FEFEA]-worker) [    ] o.a.s.c.ZkTestServer STARTING ZK TEST SERVER
   [junit4]   2> 1766259 INFO  (Thread-3720) [    ] o.a.s.c.ZkTestServer client port:0.0.0.0/0.0.0.0:0
   [junit4]   2> 1766259 INFO  (Thread-3720) [    ] o.a.s.c.ZkTestServer Starting server
   [junit4]   2> 1766260 ERROR (Thread-3720) [    ] o.a.z.s.ZooKeeperServer ZKShutdownHandler is not registered, so ZooKeeper server won't take any action on ERROR or SHUTDOWN server state changes
   [junit4]   2> 1766359 INFO  (SUITE-MetricTriggerIntegrationTest-seed#[FC5959527B2FEFEA]-worker) [    ] o.a.s.c.ZkTestServer start zk server on port:33829
   [junit4]   2> 1766360 INFO  (zkConnectionManagerCallback-10529-thread-1) [    ] o.a.s.c.c.ConnectionManager zkClient has connected
   [junit4]   2> 1766364 INFO  (jetty-launcher-10526-thread-1) [    ] o.e.j.s.Server jetty-9.4.11.v20180605; built: 2018-06-05T18:24:03.829Z; git: d5fc0523cfa96bfebfbda19606cad384d772f04c; jvm 11+28
   [junit4]   2> 1766364 INFO  (jetty-launcher-10526-thread-2) [    ] o.e.j.s.Server jetty-9.4.11.v20180605; built: 2018-06-05T18:24:03.829Z; git: d5fc0523cfa96bfebfbda19606cad384d772f04c; jvm 11+28
   [junit4]   2> 1766365 INFO  (jetty-launcher-10526-thread-1) [    ] o.e.j.s.session DefaultSessionIdManager workerName=node0
   [junit4]   2> 1766365 INFO  (jetty-launcher-10526-thread-1) [    ] o.e.j.s.session No SessionScavenger set, using defaults
   [junit4]   2> 1766365 INFO  (jetty-launcher-10526-thread-1) [    ] o.e.j.s.session node0 Scavenging every 660000ms
   [junit4]   2> 1766365 INFO  (jetty-launcher-10526-thread-2) [    ] o.e.j.s.session DefaultSessionIdManager workerName=node0
   [junit4]   2> 1766365 INFO  (jetty-launcher-10526-thread-2) [    ] o.e.j.s.session No SessionScavenger set, using defaults
   [junit4]   2> 1766365 INFO  (jetty-launcher-10526-thread-2) [    ] o.e.j.s.session node0 Scavenging every 660000ms
   [junit4]   2> 1766365 INFO  (jetty-launcher-10526-thread-1) [    ] o.e.j.s.h.ContextHandler Started o.e.j.s.ServletContextHandler@a751483{/solr,null,

[...truncated too long message...]

erCnxn Unable to read additional data from client sessionid 0x100916ef7bb001a, likely client has closed socket
   [junit4]   2> 1274684 WARN  (NIOServerCxn.Factory:0.0.0.0/0.0.0.0:0) [    ] o.a.z.s.NIOServerCnxn Unable to read additional data from client sessionid 0x100916ef7bb001d, likely client has closed socket
   [junit4]   2> 1274684 INFO  (zkCallback-278-thread-2) [    ] o.a.s.c.c.ZkStateReader Updated live nodes from ZooKeeper... (1) -> (0)
   [junit4]   2> 1274684 INFO  (zkCallback-271-thread-3) [    ] o.a.s.c.c.ZkStateReader Updated live nodes from ZooKeeper... (1) -> (0)
   [junit4]   2> 1274684 INFO  (zkCallback-223-thread-6) [    ] o.a.s.c.c.ZkStateReader Updated live nodes from ZooKeeper... (1) -> (0)
   [junit4]   2> 1274684 INFO  (zkCallback-239-thread-7) [    ] o.a.s.c.c.ZkStateReader Updated live nodes from ZooKeeper... (1) -> (0)
   [junit4]   2> 1274688 INFO  (jetty-closer-143-thread-4) [    ] o.e.j.s.h.ContextHandler Stopped o.e.j.s.ServletContextHandler@770a063e{/solr,null,UNAVAILABLE}
   [junit4]   2> 1274688 INFO  (jetty-closer-143-thread-4) [    ] o.e.j.s.session node0 Stopped scavenging
   [junit4]   2> 1276184 WARN  (zkCallback-246-thread-2) [    ] o.a.s.c.c.ZkStateReader ZooKeeper watch triggered, but Solr cannot talk to ZK: [KeeperErrorCode = Session expired for /live_nodes]
   [junit4]   2> 1276184 WARN  (zkCallback-255-thread-4) [    ] o.a.s.c.c.ZkStateReader ZooKeeper watch triggered, but Solr cannot talk to ZK: [KeeperErrorCode = Session expired for /live_nodes]
   [junit4]   2> 1276184 WARN  (zkCallback-230-thread-2) [    ] o.a.s.c.c.ZkStateReader ZooKeeper watch triggered, but Solr cannot talk to ZK: [KeeperErrorCode = Session expired for /live_nodes]
   [junit4]   2> 1276184 INFO  (jetty-closer-143-thread-3) [    ] o.e.j.s.h.ContextHandler Stopped o.e.j.s.ServletContextHandler@4c3a2a80{/solr,null,UNAVAILABLE}
   [junit4]   2> 1276185 INFO  (jetty-closer-143-thread-3) [    ] o.e.j.s.session node0 Stopped scavenging
   [junit4]   2> 1276185 WARN  (NIOServerCxn.Factory:0.0.0.0/0.0.0.0:0) [    ] o.a.z.s.NIOServerCnxn Unable to read additional data from client sessionid 0x100916ef7bb0023, likely client has closed socket
   [junit4]   2> 1276186 WARN  (NIOServerCxn.Factory:0.0.0.0/0.0.0.0:0) [    ] o.a.z.s.NIOServerCnxn Unable to read additional data from client sessionid 0x100916ef7bb0015, likely client has closed socket
   [junit4]   2> 1276186 INFO  (jetty-closer-143-thread-2) [    ] o.e.j.s.h.ContextHandler Stopped o.e.j.s.ServletContextHandler@592655ba{/solr,null,UNAVAILABLE}
   [junit4]   2> 1276187 INFO  (jetty-closer-143-thread-2) [    ] o.e.j.s.session node0 Stopped scavenging
   [junit4]   2> 1276187 INFO  (jetty-closer-143-thread-1) [    ] o.e.j.s.h.ContextHandler Stopped o.e.j.s.ServletContextHandler@62300756{/solr,null,UNAVAILABLE}
   [junit4]   2> 1276188 INFO  (jetty-closer-143-thread-1) [    ] o.e.j.s.session node0 Stopped scavenging
   [junit4]   2> 1276188 ERROR (SUITE-TestPullReplicaErrorHandling-seed#[FC5959527B2FEFEA]-worker) [    ] o.a.z.s.ZooKeeperServer ZKShutdownHandler is not registered, so ZooKeeper server won't take any action on ERROR or SHUTDOWN server state changes
   [junit4]   2> 1276188 INFO  (SUITE-TestPullReplicaErrorHandling-seed#[FC5959527B2FEFEA]-worker) [    ] o.a.s.c.ZkTestServer connecting to 127.0.0.1:41371 41371
   [junit4]   2> 1276233 INFO  (Thread-98) [    ] o.a.s.c.ZkTestServer connecting to 127.0.0.1:41371 41371
   [junit4]   2> 1276234 WARN  (Thread-98) [    ] o.a.s.c.ZkTestServer Watch limit violations: 
   [junit4]   2> Maximum concurrent create/delete watches above limit:
   [junit4]   2> 
   [junit4]   2> 	18	/solr/aliases.json
   [junit4]   2> 	17	/solr/clusterprops.json
   [junit4]   2> 	9	/solr/collections/pull_replica_error_handling_test_pull_replica_disconnects_from_zoo_keeper/terms/shard1
   [junit4]   2> 	9	/solr/security.json
   [junit4]   2> 	8	/solr/collections/pull_replica_error_handling_test_cant_connect_to_leader/terms/shard1
   [junit4]   2> 	8	/solr/configs/conf
   [junit4]   2> 	7	/solr/collections/pull_replica_error_handling_test_cant_connect_to_pull_replica/terms/shard2
   [junit4]   2> 	6	/solr/collections/pull_replica_error_handling_test_cant_connect_to_pull_replica/terms/shard1
   [junit4]   2> 
   [junit4]   2> Maximum concurrent data watches above limit:
   [junit4]   2> 
   [junit4]   2> 	18	/solr/clusterstate.json
   [junit4]   2> 	10	/solr/clusterprops.json
   [junit4]   2> 	7	/solr/collections/pull_replica_error_handling_test_pull_replica_disconnects_from_zoo_keeper/state.json
   [junit4]   2> 	4	/solr/collections/pull_replica_error_handling_test_cant_connect_to_pull_replica/state.json
   [junit4]   2> 	4	/solr/overseer_elect/election/72217499826585621-127.0.0.1:46117_solr-n_0000000004
   [junit4]   2> 	3	/solr/overseer_elect/election/72217499826585610-127.0.0.1:36779_solr-n_0000000001
   [junit4]   2> 	3	/solr/autoscaling.json
   [junit4]   2> 	2	/solr/collections/pull_replica_error_handling_test_cant_connect_to_leader/state.json
   [junit4]   2> 
   [junit4]   2> Maximum concurrent children watches above limit:
   [junit4]   2> 
   [junit4]   2> 	18	/solr/collections
   [junit4]   2> 	17	/solr/live_nodes
   [junit4]   2> 	3	/solr/overseer/queue
   [junit4]   2> 	3	/solr/autoscaling/events/.scheduled_maintenance
   [junit4]   2> 	3	/solr/autoscaling/events/.auto_add_replicas
   [junit4]   2> 	3	/solr/overseer/collection-queue-work
   [junit4]   2> 	3	/solr/overseer/queue-work
   [junit4]   2> 
   [junit4]   2> NOTE: leaving temporary files on disk at: /home/jenkins/workspace/Lucene-Solr-master-Linux/solr/build/solr-core/test/J0/temp/solr.cloud.TestPullReplicaErrorHandling_FC5959527B2FEFEA-002
   [junit4]   2> Sep 13, 2018 1:22:00 PM com.carrotsearch.randomizedtesting.ThreadLeakControl checkThreadLeaks
   [junit4]   2> WARNING: Will linger awaiting termination of 3 leaked thread(s).
   [junit4]   2> NOTE: test params are: codec=FastCompressingStoredFields(storedFieldsFormat=CompressingStoredFieldsFormat(compressionMode=FAST, chunkSize=16012, maxDocsPerChunk=4, blockSize=975), termVectorsFormat=CompressingTermVectorsFormat(compressionMode=FAST, chunkSize=16012, blockSize=975)), sim=Asserting(org.apache.lucene.search.similarities.AssertingSimilarity@7deea640), locale=ff-SN, timezone=PLT
   [junit4]   2> NOTE: Linux 4.15.0-32-generic amd64/Oracle Corporation 11 (64-bit)/cpus=8,threads=1,free=385394456,total=518979584
   [junit4]   2> NOTE: All tests run in this JVM: [TestPullReplicaErrorHandling, TestPullReplicaErrorHandling]
   [junit4] Completed [10/10 (9!)] on J0 in 630.44s, 3 tests, 1 error <<< FAILURES!
   [junit4] 
   [junit4] 
   [junit4] Tests with failures [seed: FC5959527B2FEFEA]:
   [junit4]   - org.apache.solr.cloud.autoscaling.MetricTriggerIntegrationTest.testMetricTrigger
   [junit4]   - org.apache.solr.cloud.autoscaling.MetricTriggerIntegrationTest.testMetricTrigger
   [junit4]   - org.apache.solr.cloud.TestPullReplicaErrorHandling.testCantConnectToLeader
   [junit4]   - org.apache.solr.cloud.TestPullReplicaErrorHandling.testCantConnectToLeader
   [junit4]   - org.apache.solr.cloud.TestPullReplicaErrorHandling.testCantConnectToLeader
   [junit4]   - org.apache.solr.cloud.autoscaling.MetricTriggerIntegrationTest.testMetricTrigger
   [junit4]   - org.apache.solr.cloud.autoscaling.MetricTriggerIntegrationTest.testMetricTrigger
   [junit4]   - org.apache.solr.cloud.TestPullReplicaErrorHandling.testCantConnectToLeader
   [junit4]   - org.apache.solr.cloud.TestPullReplicaErrorHandling.testCantConnectToLeader
   [junit4] 
   [junit4] 
   [junit4] JVM J0:     0.87 ..  1278.29 =  1277.42s
   [junit4] JVM J1:     0.87 ..  1271.09 =  1270.22s
   [junit4] JVM J2:     0.87 ..  1080.31 =  1079.44s
   [junit4] Execution time total: 21 minutes 18 seconds
   [junit4] Tests summary: 10 suites, 20 tests, 5 errors, 4 failures

BUILD FAILED
/home/jenkins/workspace/Lucene-Solr-master-Linux/lucene/common-build.xml:1567: The following error occurred while executing this line:
/home/jenkins/workspace/Lucene-Solr-master-Linux/lucene/common-build.xml:1092: There were test failures: 10 suites, 20 tests, 5 errors, 4 failures [seed: FC5959527B2FEFEA]

Total time: 21 minutes 20 seconds

[repro] Setting last failure code to 256

[repro] Failures:
[repro]   4/5 failed: org.apache.solr.cloud.autoscaling.MetricTriggerIntegrationTest
[repro]   5/5 failed: org.apache.solr.cloud.TestPullReplicaErrorHandling
[repro]   5/5 failed: org.apache.solr.handler.extraction.ExtractingRequestHandlerTest
[repro] Exiting with code 256
+ mv lucene/build lucene/build.repro
+ mv solr/build solr/build.repro
+ mv lucene/build.orig lucene/build
+ mv solr/build.orig solr/build
Archiving artifacts
Setting ANT_1_8_2_HOME=/var/lib/jenkins/tools/hudson.tasks.Ant_AntInstallation/ANT_1.8.2
[WARNINGS] Parsing warnings in console log with parser Java Compiler (javac)
Setting ANT_1_8_2_HOME=/var/lib/jenkins/tools/hudson.tasks.Ant_AntInstallation/ANT_1.8.2
Setting ANT_1_8_2_HOME=/var/lib/jenkins/tools/hudson.tasks.Ant_AntInstallation/ANT_1.8.2
<Git Blamer> Using GitBlamer to create author and commit information for all warnings.
<Git Blamer> GIT_COMMIT=4a5b914eaa8683009191748bf6c0b1be14d59661, workspace=/var/lib/jenkins/workspace/Lucene-Solr-master-Linux
[WARNINGS] Computing warning deltas based on reference build #22850
Recording test results
Setting ANT_1_8_2_HOME=/var/lib/jenkins/tools/hudson.tasks.Ant_AntInstallation/ANT_1.8.2
Build step 'Publish JUnit test result report' changed build result to UNSTABLE
Email was triggered for: Unstable (Test Failures)
Sending email for trigger: Unstable (Test Failures)
Setting ANT_1_8_2_HOME=/var/lib/jenkins/tools/hudson.tasks.Ant_AntInstallation/ANT_1.8.2
Setting ANT_1_8_2_HOME=/var/lib/jenkins/tools/hudson.tasks.Ant_AntInstallation/ANT_1.8.2
Setting ANT_1_8_2_HOME=/var/lib/jenkins/tools/hudson.tasks.Ant_AntInstallation/ANT_1.8.2
Setting ANT_1_8_2_HOME=/var/lib/jenkins/tools/hudson.tasks.Ant_AntInstallation/ANT_1.8.2

Mime
View raw message