lucene-dev mailing list archives

Site index · List index
Message view « Date » · « Thread »
Top « Date » · « Thread »
From Policeman Jenkins Server <jenk...@thetaphi.de>
Subject [JENKINS-EA] Lucene-Solr-7.x-Linux (64bit/jdk-11-ea+28) - Build # 2673 - Still Unstable!
Date Sun, 02 Sep 2018 11:43:45 GMT
Build: https://jenkins.thetaphi.de/job/Lucene-Solr-7.x-Linux/2673/
Java: 64bit/jdk-11-ea+28 -XX:-UseCompressedOops -XX:+UseParallelGC

13 tests failed.
FAILED:  junit.framework.TestSuite.org.apache.solr.handler.TestSQLHandler

Error Message:
1 thread leaked from SUITE scope at org.apache.solr.handler.TestSQLHandler:     1) Thread[id=2201, name=Connection evictor, state=TIMED_WAITING, group=TGRP-TestSQLHandler]         at java.base@11/java.lang.Thread.sleep(Native Method)         at app//org.apache.http.impl.client.IdleConnectionEvictor$1.run(IdleConnectionEvictor.java:66)         at java.base@11/java.lang.Thread.run(Thread.java:834)

Stack Trace:
com.carrotsearch.randomizedtesting.ThreadLeakError: 1 thread leaked from SUITE scope at org.apache.solr.handler.TestSQLHandler: 
   1) Thread[id=2201, name=Connection evictor, state=TIMED_WAITING, group=TGRP-TestSQLHandler]
        at java.base@11/java.lang.Thread.sleep(Native Method)
        at app//org.apache.http.impl.client.IdleConnectionEvictor$1.run(IdleConnectionEvictor.java:66)
        at java.base@11/java.lang.Thread.run(Thread.java:834)
	at __randomizedtesting.SeedInfo.seed([F8F6C78538383BE7]:0)


FAILED:  junit.framework.TestSuite.org.apache.solr.handler.TestSQLHandler

Error Message:
1 thread leaked from SUITE scope at org.apache.solr.handler.TestSQLHandler:     1) Thread[id=3032, name=Connection evictor, state=TIMED_WAITING, group=TGRP-TestSQLHandler]         at java.base@11/java.lang.Thread.sleep(Native Method)         at app//org.apache.http.impl.client.IdleConnectionEvictor$1.run(IdleConnectionEvictor.java:66)         at java.base@11/java.lang.Thread.run(Thread.java:834)

Stack Trace:
com.carrotsearch.randomizedtesting.ThreadLeakError: 1 thread leaked from SUITE scope at org.apache.solr.handler.TestSQLHandler: 
   1) Thread[id=3032, name=Connection evictor, state=TIMED_WAITING, group=TGRP-TestSQLHandler]
        at java.base@11/java.lang.Thread.sleep(Native Method)
        at app//org.apache.http.impl.client.IdleConnectionEvictor$1.run(IdleConnectionEvictor.java:66)
        at java.base@11/java.lang.Thread.run(Thread.java:834)
	at __randomizedtesting.SeedInfo.seed([F8F6C78538383BE7]:0)


FAILED:  junit.framework.TestSuite.org.apache.solr.handler.TestSQLHandler

Error Message:
1 thread leaked from SUITE scope at org.apache.solr.handler.TestSQLHandler:     1) Thread[id=3356, name=Connection evictor, state=TIMED_WAITING, group=TGRP-TestSQLHandler]         at java.base@11/java.lang.Thread.sleep(Native Method)         at app//org.apache.http.impl.client.IdleConnectionEvictor$1.run(IdleConnectionEvictor.java:66)         at java.base@11/java.lang.Thread.run(Thread.java:834)

Stack Trace:
com.carrotsearch.randomizedtesting.ThreadLeakError: 1 thread leaked from SUITE scope at org.apache.solr.handler.TestSQLHandler: 
   1) Thread[id=3356, name=Connection evictor, state=TIMED_WAITING, group=TGRP-TestSQLHandler]
        at java.base@11/java.lang.Thread.sleep(Native Method)
        at app//org.apache.http.impl.client.IdleConnectionEvictor$1.run(IdleConnectionEvictor.java:66)
        at java.base@11/java.lang.Thread.run(Thread.java:834)
	at __randomizedtesting.SeedInfo.seed([F8F6C78538383BE7]:0)


FAILED:  junit.framework.TestSuite.org.apache.solr.handler.TestSQLHandler

Error Message:
1 thread leaked from SUITE scope at org.apache.solr.handler.TestSQLHandler:     1) Thread[id=2522, name=Connection evictor, state=TIMED_WAITING, group=TGRP-TestSQLHandler]         at java.base@11/java.lang.Thread.sleep(Native Method)         at app//org.apache.http.impl.client.IdleConnectionEvictor$1.run(IdleConnectionEvictor.java:66)         at java.base@11/java.lang.Thread.run(Thread.java:834)

Stack Trace:
com.carrotsearch.randomizedtesting.ThreadLeakError: 1 thread leaked from SUITE scope at org.apache.solr.handler.TestSQLHandler: 
   1) Thread[id=2522, name=Connection evictor, state=TIMED_WAITING, group=TGRP-TestSQLHandler]
        at java.base@11/java.lang.Thread.sleep(Native Method)
        at app//org.apache.http.impl.client.IdleConnectionEvictor$1.run(IdleConnectionEvictor.java:66)
        at java.base@11/java.lang.Thread.run(Thread.java:834)
	at __randomizedtesting.SeedInfo.seed([F8F6C78538383BE7]:0)


FAILED:  junit.framework.TestSuite.org.apache.solr.handler.TestSQLHandler

Error Message:
1 thread leaked from SUITE scope at org.apache.solr.handler.TestSQLHandler:     1) Thread[id=17642, name=Connection evictor, state=TIMED_WAITING, group=TGRP-TestSQLHandler]         at java.base@11/java.lang.Thread.sleep(Native Method)         at app//org.apache.http.impl.client.IdleConnectionEvictor$1.run(IdleConnectionEvictor.java:66)         at java.base@11/java.lang.Thread.run(Thread.java:834)

Stack Trace:
com.carrotsearch.randomizedtesting.ThreadLeakError: 1 thread leaked from SUITE scope at org.apache.solr.handler.TestSQLHandler: 
   1) Thread[id=17642, name=Connection evictor, state=TIMED_WAITING, group=TGRP-TestSQLHandler]
        at java.base@11/java.lang.Thread.sleep(Native Method)
        at app//org.apache.http.impl.client.IdleConnectionEvictor$1.run(IdleConnectionEvictor.java:66)
        at java.base@11/java.lang.Thread.run(Thread.java:834)
	at __randomizedtesting.SeedInfo.seed([F8F6C78538383BE7]:0)


FAILED:  org.apache.solr.cloud.TestTlogReplica.testAddDocs

Error Message:
Append replicas should recive all updates. Replica: core_node6:{"core":"tlog_replica_test_add_docs_shard1_replica_t4","base_url":"https://127.0.0.1:45925/solr","node_name":"127.0.0.1:45925_solr","state":"active","type":"TLOG","force_set_state":"false"}, response: {responseHeader={status=0,QTime=1},plugins={CONTAINER={},ADMIN={/admin/luke={name=org.apache.solr.handler.admin.LukeRequestHandler,description=Lucene Index Browser.  Inspired and modeled after Luke: http://www.getopt.org/luke/,stats={ADMIN./admin/luke.clientErrors.count=0, ADMIN./admin/luke.serverErrors.count=0, ADMIN./admin/luke.errors.count=0, ADMIN./admin/luke.requests=0, ADMIN./admin/luke.handlerStart=1535888162244, ADMIN./admin/luke.totalTime=0, ADMIN./admin/luke.requestTimes.meanRate=0.0, ADMIN./admin/luke.timeouts.count=0}},/admin/segments={name=org.apache.solr.handler.admin.SegmentsInfoRequestHandler,description=Lucene segments info.,stats={ADMIN./admin/segments.timeouts.count=0, ADMIN./admin/segments.clientErrors.count=0, ADMIN./admin/segments.requests=0, ADMIN./admin/segments.totalTime=0, ADMIN./admin/segments.handlerStart=1535888162244, ADMIN./admin/segments.requestTimes.meanRate=0.0, ADMIN./admin/segments.serverErrors.count=0, ADMIN./admin/segments.errors.count=0}},/admin/system={name=org.apache.solr.handler.admin.SystemInfoHandler,description=Get System Info,stats={ADMIN./admin/system.handlerStart=1535888162245, ADMIN./admin/system.serverErrors.count=0, ADMIN./admin/system.timeouts.count=0, ADMIN./admin/system.clientErrors.count=0, ADMIN./admin/system.requestTimes.meanRate=0.0, ADMIN./admin/system.errors.count=0, ADMIN./admin/system.totalTime=0, ADMIN./admin/system.requests=0}},/config={name=org.apache.solr.handler.SolrConfigHandler,description=Edit solrconfig.xml,stats={ADMIN./config.clientErrors.count=0, ADMIN./config.requestTimes.meanRate=0.0, ADMIN./config.errors.count=0, ADMIN./config.requests=0, ADMIN./config.totalTime=0, ADMIN./config.timeouts.count=0, ADMIN./config.serverErrors.count=0, ADMIN./config.handlerStart=1535888162220}},/schema={name=org.apache.solr.handler.SchemaHandler,description=CRUD operations over the Solr schema,stats={ADMIN./schema.handlerStart=1535888162227, ADMIN./schema.totalTime=0, ADMIN./schema.errors.count=0, ADMIN./schema.requestTimes.meanRate=0.0, ADMIN./schema.clientErrors.count=0, ADMIN./schema.serverErrors.count=0, ADMIN./schema.timeouts.count=0, ADMIN./schema.requests=0}},/admin/plugins={name=org.apache.solr.handler.admin.PluginInfoHandler,description=Registry,stats={ADMIN./admin/plugins.timeouts.count=0, ADMIN./admin/plugins.errors.count=0, ADMIN./admin/plugins.handlerStart=1535888162246, ADMIN./admin/plugins.requests=72, ADMIN./admin/plugins.serverErrors.count=0, ADMIN./admin/plugins.totalTime=182163277, ADMIN./admin/plugins.requestTimes.meanRate=5.844822366337691, ADMIN./admin/plugins.clientErrors.count=0}},/admin/logging={name=org.apache.solr.handler.admin.LoggingHandler,description=Logging Handler,stats={ADMIN./admin/logging.requests=0, ADMIN./admin/logging.totalTime=0, ADMIN./admin/logging.timeouts.count=0, ADMIN./admin/logging.requestTimes.meanRate=0.0, ADMIN./admin/logging.serverErrors.count=0, ADMIN./admin/logging.errors.count=0, ADMIN./admin/logging.clientErrors.count=0, ADMIN./admin/logging.handlerStart=1535888162248}},/admin/mbeans={name=org.apache.solr.handler.admin.SolrInfoMBeanHandler,description=Get Info (and statistics) for registered SolrInfoMBeans,stats={ADMIN./admin/mbeans.serverErrors.count=0, ADMIN./admin/mbeans.clientErrors.count=0, ADMIN./admin/mbeans.requestTimes.meanRate=0.0, ADMIN./admin/mbeans.requests=0, ADMIN./admin/mbeans.handlerStart=1535888162245, ADMIN./admin/mbeans.timeouts.count=0, ADMIN./admin/mbeans.errors.count=0, ADMIN./admin/mbeans.totalTime=0}},/admin/properties={name=org.apache.solr.handler.admin.PropertiesRequestHandler,description=Get System Properties,stats={ADMIN./admin/properties.handlerStart=1535888162247, ADMIN./admin/properties.serverErrors.count=0, ADMIN./admin/properties.clientErrors.count=0, ADMIN./admin/properties.timeouts.count=0, ADMIN./admin/properties.totalTime=0, ADMIN./admin/properties.errors.count=0, ADMIN./admin/properties.requestTimes.meanRate=0.0, ADMIN./admin/properties.requests=0}},/admin/threads={name=org.apache.solr.handler.admin.ThreadDumpHandler,description=Thread Dump,stats={ADMIN./admin/threads.requests=0, ADMIN./admin/threads.requestTimes.meanRate=0.0, ADMIN./admin/threads.timeouts.count=0, ADMIN./admin/threads.totalTime=0, ADMIN./admin/threads.handlerStart=1535888162247, ADMIN./admin/threads.clientErrors.count=0, ADMIN./admin/threads.errors.count=0, ADMIN./admin/threads.serverErrors.count=0}},/admin/ping={name=org.apache.solr.handler.PingRequestHandler,description=Reports application health to a load-balancer,stats={ADMIN./admin/ping.clientErrors.count=0, ADMIN./admin/ping.errors.count=0, ADMIN./admin/ping.serverErrors.count=0, ADMIN./admin/ping.requestTimes.meanRate=0.0, ADMIN./admin/ping.timeouts.count=0, ADMIN./admin/ping.totalTime=0, ADMIN./admin/ping.handlerStart=1535888162242, ADMIN./admin/ping.requests=0}},/admin/file={name=org.apache.solr.handler.admin.ShowFileRequestHandler,description=Admin Config File -- view or update config files directly,stats={ADMIN./admin/file.requests=0, ADMIN./admin/file.timeouts.count=0, ADMIN./admin/file.errors.count=0, ADMIN./admin/file.clientErrors.count=0, ADMIN./admin/file.serverErrors.count=0, ADMIN./admin/file.totalTime=0, ADMIN./admin/file.requestTimes.meanRate=0.0, ADMIN./admin/file.handlerStart=1535888162248}}},CORE={searcher={name=org.apache.solr.search.SolrIndexSearcher,description=index searcher,stats={SEARCHER.searcher.maxDoc=1, SEARCHER.searcher.caching=true, SEARCHER.searcher.registeredAt=Sun Sep 02 08:36:05 BRT 2018, SEARCHER.searcher.deletedDocs=0, SEARCHER.searcher.warmupTime=0, SEARCHER.searcher.searcherName=Searcher@2914dfad[tlog_replica_test_add_docs_shard1_replica_t4] main, SEARCHER.searcher.indexVersion=6, SEARCHER.searcher.openedAt=Sun Sep 02 08:36:05 BRT 2018, SEARCHER.searcher.readerDir=MockDirectoryWrapper(RAMDirectory@6e14eee8 lockFactory=org.apache.lucene.store.SingleInstanceLockFactory@625fb5d6), SEARCHER.searcher.numDocs=1, SEARCHER.searcher.reader=ExitableDirectoryReader(UninvertingDirectoryReader(Uninverting(_0(7.5.0):C1)))}},Searcher@2914dfad[tlog_replica_test_add_docs_shard1_replica_t4] main={name=org.apache.solr.search.SolrIndexSearcher,description=index searcher,stats={SEARCHER.searcher.maxDoc=1, SEARCHER.searcher.caching=true, SEARCHER.searcher.registeredAt=Sun Sep 02 08:36:05 BRT 2018, SEARCHER.searcher.deletedDocs=0, SEARCHER.searcher.warmupTime=0, SEARCHER.searcher.searcherName=Searcher@2914dfad[tlog_replica_test_add_docs_shard1_replica_t4] main, SEARCHER.searcher.indexVersion=6, SEARCHER.searcher.openedAt=Sun Sep 02 08:36:05 BRT 2018, SEARCHER.searcher.readerDir=MockDirectoryWrapper(RAMDirectory@6e14eee8 lockFactory=org.apache.lucene.store.SingleInstanceLockFactory@625fb5d6), SEARCHER.searcher.numDocs=1, SEARCHER.searcher.reader=ExitableDirectoryReader(UninvertingDirectoryReader(Uninverting(_0(7.5.0):C1)))}},core={name=tlog_replica_test_add_docs_shard1_replica_t4,description=SolrCore,stats={CORE.fs.totalSpace=469456388096, CORE.fs.path=/home/jenkins/workspace/Lucene-Solr-7.x-Linux/solr/build/solr-core/test/J2/temp/solr.cloud.TestTlogReplica_F8F6C78538383BE7-001/tempDir-001/node2/./tlog_replica_test_add_docs_shard1_replica_t4/data, CORE.coreName=tlog_replica_test_add_docs_shard1_replica_t4, CORE.indexDir=/home/jenkins/workspace/Lucene-Solr-7.x-Linux/solr/build/solr-core/test/J2/temp/solr.cloud.TestTlogReplica_F8F6C78538383BE7-001/tempDir-001/node2/./tlog_replica_test_add_docs_shard1_replica_t4/data/index/, INDEX.sizeInBytes=3199, CORE.shard=shard1, SEARCHER.new.errors=0, CORE.refCount=2, CORE.collection=tlog_replica_test_add_docs, INDEX.size=3.12 KB, CORE.startTime=Sun Sep 02 08:36:02 BRT 2018, SEARCHER.new=2, CORE.fs.usableSpace=211100041216, CORE.aliases=[tlog_replica_test_add_docs_shard1_replica_t4], SEARCHER.new.maxReached=0, CORE.instanceDir=/home/jenkins/workspace/Lucene-Solr-7.x-Linux/solr/build/solr-core/test/J2/temp/solr.cloud.TestTlogReplica_F8F6C78538383BE7-001/tempDir-001/node2/tlog_replica_test_add_docs_shard1_replica_t4, SEARCHER.new.time.meanRate=0.16415444946177943, SEARCHER.new.warmup.meanRate=0.0, CORE.fs.spins=false}}},QUERY={terms={name=terms,description=A Component for working with Term Enumerators,stats=null},query={name=query,description=query,stats=null},/sql={name=org.apache.solr.handler.SQLHandler,description=SQLHandler,stats={QUERY./sql.totalTime=0, QUERY./sql.clientErrors.count=0, QUERY./sql.timeouts.count=0, QUERY./sql.serverErrors.count=0, QUERY./sql.requestTimes.meanRate=0.0, QUERY./sql.handlerStart=1535888162252, QUERY./sql.errors.count=0, QUERY./sql.requests=0}},/select={name=org.apache.solr.handler.component.SearchHandler,description=Search using components: query,facet,facet_module,mlt,highlight,stats,expand,terms,debug,,stats={QUERY./select.errors.count=0, QUERY./select.handlerStart=1535888162254, QUERY./select.clientErrors.count=0, QUERY./select.requestTimes.meanRate=5.930734020809221, QUERY./select.serverErrors.count=0, QUERY./select.timeouts.count=0, QUERY./select.totalTime=8628186, QUERY./select.requests=72}},expand={name=expand,description=Expand Component,stats=null},mlt={name=mlt,description=More Like This,stats=null},/debug/dump={name=org.apache.solr.handler.DumpRequestHandler,description=Dump handler (debug),stats={QUERY./debug/dump.requestTimes.meanRate=0.0, QUERY./debug/dump.timeouts.count=0, QUERY./debug/dump.errors.count=0, QUERY./debug/dump.serverErrors.count=0, QUERY./debug/dump.requests=0, QUERY./debug/dump.handlerStart=1535888162253, QUERY./debug/dump.clientErrors.count=0, QUERY./debug/dump.totalTime=0}},/export={name=org.apache.solr.handler.ExportHandler,description=Search using components: ,stats={QUERY./export.totalTime=0, QUERY./export.errors.count=0, QUERY./export.handlerStart=1535888162249, QUERY./export.timeouts.count=0, QUERY./export.requests=0, QUERY./export.clientErrors.count=0, QUERY./export.serverErrors.count=0, QUERY./export.requestTimes.meanRate=0.0}},/get={name=org.apache.solr.handler.RealTimeGetHandler,description=The realtime get handler,stats={QUERY./get.handlerStart=1535888162242, QUERY./get.errors.count=0, QUERY./get.requests=1, QUERY./get.totalTime=299246, QUERY./get.requestTimes.meanRate=0.08228441659332053, QUERY./get.clientErrors.count=0, QUERY./get.serverErrors.count=0, QUERY./get.timeouts.count=0}},get={name=get,description=query,stats=null},/graph={name=org.apache.solr.handler.GraphHandler,description=StreamHandler,stats={QUERY./graph.requests=0, QUERY./graph.totalTime=0, QUERY./graph.clientErrors.count=0, QUERY./graph.errors.count=0, QUERY./graph.serverErrors.count=0, QUERY./graph.handlerStart=1535888162250, QUERY./graph.timeouts.count=0, QUERY./graph.requestTimes.meanRate=0.0}},facet_module={name=facet_module,description=Facet Module,stats=null},/stream={name=org.apache.solr.handler.StreamHandler,description=StreamHandler,stats={QUERY./stream.requests=0, QUERY./stream.totalTime=0, QUERY./stream.timeouts.count=0, QUERY./stream.errors.count=0, QUERY./stream.clientErrors.count=0, QUERY./stream.serverErrors.count=0, QUERY./stream.requestTimes.meanRate=0.0, QUERY./stream.handlerStart=1535888162251}},facet={name=facet,description=Handle Faceting,stats=null},/terms={name=org.apache.solr.handler.component.SearchHandler,description=Search using components: ,stats={QUERY./terms.handlerStart=1535888162252, QUERY./terms.errors.count=0, QUERY./terms.serverErrors.count=0, QUERY./terms.clientErrors.count=0, QUERY./terms.timeouts.count=0, QUERY./terms.totalTime=0, QUERY./terms.requestTimes.meanRate=0.0, QUERY./terms.requests=0}}},UPDATE={/update/json={name=org.apache.solr.handler.UpdateRequestHandler,description=Add documents using XML (with XSLT), CSV, JSON, or javabin,stats={UPDATE./update/json.errors.count=0, UPDATE./update/json.requestTimes.meanRate=0.0, UPDATE./update/json.requests=0, UPDATE./update/json.clientErrors.count=0, UPDATE./update/json.serverErrors.count=0, UPDATE./update/json.totalTime=0, UPDATE./update/json.handlerStart=1535888162216, UPDATE./update/json.timeouts.count=0}},update={name=org.apache.solr.handler.UpdateRequestHandlerApi,description=Add documents using XML (with XSLT), CSV, JSON, or javabin,stats={UPDATE.update.requests=0, UPDATE.update.serverErrors.count=0, UPDATE.update.clientErrors.count=0, UPDATE.update.handlerStart=1535888162219, UPDATE.update.timeouts.count=0, UPDATE.update.requestTimes.meanRate=0.0, UPDATE.update.errors.count=0, UPDATE.update.totalTime=0}},/update/json/docs={name=org.apache.solr.handler.UpdateRequestHandler,description=Add documents using XML (with XSLT), CSV, JSON, or javabin,stats={UPDATE./update/json/docs.serverErrors.count=0, UPDATE./update/json/docs.requests=0, UPDATE./update/json/docs.clientErrors.count=0, UPDATE./update/json/docs.handlerStart=1535888162218, UPDATE./update/json/docs.requestTimes.meanRate=0.0, UPDATE./update/json/docs.timeouts.count=0, UPDATE./update/json/docs.errors.count=0, UPDATE./update/json/docs.totalTime=0}},updateHandler={name=org.apache.solr.update.DirectUpdateHandler2,description=Update handler that efficiently directly updates the on-disk main lucene index,stats={UPDATE.updateHandler.rollbacks.count=0, UPDATE.updateHandler.autoCommits=0, UPDATE.updateHandler.softAutoCommits=0, UPDATE.updateHandler.commits.count=0, UPDATE.updateHandler.deletesByQuery=0, UPDATE.updateHandler.cumulativeAdds.count=0, UPDATE.updateHandler.deletesById=0, UPDATE.updateHandler.cumulativeDeletesById.count=0, UPDATE.updateHandler.optimizes.count=0, UPDATE.updateHandler.cumulativeErrors.count=0, UPDATE.updateHandler.expungeDeletes.count=0, UPDATE.updateHandler.splits.count=0, UPDATE.updateHandler.merges.count=0, UPDATE.updateHandler.docsPending=0, UPDATE.updateHandler.errors=0, UPDATE.updateHandler.cumulativeDeletesByQuery.count=0, UPDATE.updateHandler.adds=0}},/update/csv={name=org.apache.solr.handler.UpdateRequestHandler,description=Add documents using XML (with XSLT), CSV, JSON, or javabin,stats={UPDATE./update/csv.requestTimes.meanRate=0.0, UPDATE./update/csv.errors.count=0, UPDATE./update/csv.serverErrors.count=0, UPDATE./update/csv.clientErrors.count=0, UPDATE./update/csv.timeouts.count=0, UPDATE./update/csv.requests=0, UPDATE./update/csv.totalTime=0, UPDATE./update/csv.handlerStart=1535888162217}},/update={name=org.apache.solr.handler.UpdateRequestHandler,description=Add documents using XML (with XSLT), CSV, JSON, or javabin,stats={UPDATE./update.clientErrors.count=0, UPDATE./update.serverErrors.count=0, UPDATE./update.requestTimes.meanRate=0.08210898489750572, UPDATE./update.timeouts.count=0, UPDATE./update.errors.count=0, UPDATE./update.totalTime=64348, UPDATE./update.requests=1, UPDATE./update.handlerStart=1535888162216}}},CACHE={fieldValueCache={name=org.apache.solr.search.FastLRUCache,description=Concurrent LRU Cache(maxSize=10000, initialSize=10, minSize=9000, acceptableSize=9500, cleanupThread=false),stats={CACHE.searcher.fieldValueCache.warmupTime=0, CACHE.searcher.fieldValueCache.inserts=0, CACHE.searcher.fieldValueCache.hits=0, CACHE.searcher.fieldValueCache.lookups=0, CACHE.searcher.fieldValueCache.cumulative_hitratio=0.0, CACHE.searcher.fieldValueCache.hitratio=0.0, CACHE.searcher.fieldValueCache.cumulative_hits=0, CACHE.searcher.fieldValueCache.size=0, CACHE.searcher.fieldValueCache.evictions=0, CACHE.searcher.fieldValueCache.cumulative_lookups=0, CACHE.searcher.fieldValueCache.cumulative_inserts=0, CACHE.searcher.fieldValueCache.cumulative_evictions=0}},fieldCache={name=org.apache.solr.search.SolrFieldCacheBean,description=Provides introspection of the Solr FieldCache ,stats={CACHE.core.fieldCache.entries_count=0, CACHE.core.fieldCache.total_size=0 bytes}}},HIGHLIGHTER={highlight={name=highlight,description=Highlighting,stats=null}},QUERYPARSER={org.apache.solr.search.BoostQParserPlugin={name=org.apache.solr.search.BoostQParserPlugin,description=,stats=null},org.apache.solr.search.LuceneQParserPlugin={name=org.apache.solr.search.LuceneQParserPlugin,description=,stats=null},org.apache.solr.search.FunctionQParserPlugin={name=org.apache.solr.search.FunctionQParserPlugin,description=,stats=null},org.apache.solr.search.DisMaxQParserPlugin={name=org.apache.solr.search.DisMaxQParserPlugin,description=,stats=null},org.apache.solr.search.XmlQParserPlugin={name=org.apache.solr.search.XmlQParserPlugin,description=,stats=null},org.apache.solr.search.JoinQParserPlugin={name=org.apache.solr.search.JoinQParserPlugin,description=,stats=null},org.apache.solr.search.GraphTermsQParserPlugin={name=org.apache.solr.search.GraphTermsQParserPlugin,description=,stats=null},org.apache.solr.search.SimpleQParserPlugin={name=org.apache.solr.search.SimpleQParserPlugin,description=,stats=null},org.apache.solr.search.ComplexPhraseQParserPlugin={name=org.apache.solr.search.ComplexPhraseQParserPlugin,description=,stats=null},org.apache.solr.search.PayloadScoreQParserPlugin={name=org.apache.solr.search.PayloadScoreQParserPlugin,description=,stats=null},org.apache.solr.search.SignificantTermsQParserPlugin={name=org.apache.solr.search.SignificantTermsQParserPlugin,description=,stats=null},org.apache.solr.search.SwitchQParserPlugin={name=org.apache.solr.search.SwitchQParserPlugin,description=,stats=null},org.apache.solr.search.TextLogisticRegressionQParserPlugin={name=org.apache.solr.search.TextLogisticRegressionQParserPlugin,description=,stats=null},org.apache.solr.search.HashQParserPlugin={name=org.apache.solr.search.HashQParserPlugin,description=,stats=null},org.apache.solr.search.join.BlockJoinParentQParserPlugin={name=org.apache.solr.search.join.BlockJoinParentQParserPlugin,description=,stats=null},org.apache.solr.search.MaxScoreQParserPlugin={name=org.apache.solr.search.MaxScoreQParserPlugin,description=,stats=null},org.apache.solr.search.join.GraphQParserPlugin={name=org.apache.solr.search.join.GraphQParserPlugin,description=,stats=null},org.apache.solr.search.PrefixQParserPlugin={name=org.apache.solr.search.PrefixQParserPlugin,description=,stats=null},org.apache.solr.search.NestedQParserPlugin={name=org.apache.solr.search.NestedQParserPlugin,description=,stats=null},org.apache.solr.search.CollapsingQParserPlugin={name=org.apache.solr.search.CollapsingQParserPlugin,description=,stats=null},org.apache.solr.search.SpatialBoxQParserPlugin={name=org.apache.solr.search.SpatialBoxQParserPlugin,description=,stats=null},org.apache.solr.search.TermQParserPlugin={name=org.apache.solr.search.TermQParserPlugin,description=,stats=null},org.apache.solr.search.FieldQParserPlugin={name=org.apache.solr.search.FieldQParserPlugin,description=,stats=null},org.apache.solr.search.TermsQParserPlugin={name=org.apache.solr.search.TermsQParserPlugin,description=,stats=null},org.apache.solr.search.RawQParserPlugin={name=org.apache.solr.search.RawQParserPlugin,description=,stats=null},org.apache.solr.search.ReRankQParserPlugin={name=org.apache.solr.search.ReRankQParserPlugin,description=,stats=null},org.apache.solr.search.PayloadCheckQParserPlugin={name=org.apache.solr.search.PayloadCheckQParserPlugin,description=,stats=null},org.apache.solr.search.ExportQParserPlugin={name=org.apache.solr.search.ExportQParserPlugin,description=,stats=null},org.apache.solr.search.SpatialFilterQParserPlugin={name=org.apache.solr.search.SpatialFilterQParserPlugin,description=,stats=null},org.apache.solr.search.IGainTermsQParserPlugin={name=org.apache.solr.search.IGainTermsQParserPlugin,description=,stats=null},org.apache.solr.search.mlt.MLTQParserPlugin={name=org.apache.solr.search.mlt.MLTQParserPlugin,description=,stats=null},org.apache.solr.search.SurroundQParserPlugin={name=org.apache.solr.search.SurroundQParserPlugin,description=,stats=null},org.apache.solr.search.FunctionRangeQParserPlugin={name=org.apache.solr.search.FunctionRangeQParserPlugin,description=,stats=null},org.apache.solr.search.join.FiltersQParserPlugin={name=org.apache.solr.search.join.FiltersQParserPlugin,description=,stats=null},org.apache.solr.search.BoolQParserPlugin={name=org.apache.solr.search.BoolQParserPlugin,description=,stats=null},org.apache.solr.search.ExtendedDismaxQParserPlugin={name=org.apache.solr.search.ExtendedDismaxQParserPlugin,description=,stats=null},org.apache.solr.search.join.BlockJoinChildQParserPlugin={name=org.apache.solr.search.join.BlockJoinChildQParserPlugin,description=,stats=null}},SPELLCHECKER={},SEARCHER={},REPLICATION={/replication={name=org.apache.solr.handler.ReplicationHandler,description=ReplicationHandler provides replication of index and configuration files from Master to Slaves,stats={REPLICATION./replication.handlerStart=1535888162240, REPLICATION./replication.confFilesToReplicate=, REPLICATION./replication.fetcher.lastCycleBytesDownloaded=3403, REPLICATION./replication.indexVersion=generation=2,version=1535888164284, REPLICATION./replication.fetcher.masterUrl=https://127.0.0.1:44705/solr/tlog_replica_test_add_docs_shard1_replica_t2/, REPLICATION./replication.indexSize=3.12 KB, REPLICATION./replication.fetcher.indexReplicatedAt=Sun Sep 02 08:36:05 BRT 2018, REPLICATION./replication.generation=2, REPLICATION./replication.indexPath=/home/jenkins/workspace/Lucene-Solr-7.x-Linux/solr/build/solr-core/test/J2/temp/solr.cloud.TestTlogReplica_F8F6C78538383BE7-001/tempDir-001/node2/./tlog_replica_test_add_docs_shard1_replica_t4/data/index/, REPLICATION./replication.replicateAfter=[commit], REPLICATION./replication.isMaster=true, REPLICATION./replication.clientErrors.count=0, REPLICATION./replication.isSlave=false, REPLICATION./replication.fetcher.timesIndexReplicated=1, REPLICATION./replication.fetcher.isReplicating=false, REPLICATION./replication.requests=0, REPLICATION./replication.fetcher.previousCycleTimeInSeconds=0, REPLICATION./replication.errors.count=0, REPLICATION./replication.requestTimes.meanRate=0.0, REPLICATION./replication.timeouts.count=0, REPLICATION./replication.serverErrors.count=0, REPLICATION./replication.replicationEnabled=true, REPLICATION./replication.totalTime=0, REPLICATION./replication.fetcher.isPollingDisabled=false}}},TLOG={},INDEX={},DIRECTORY={},HTTP={},OTHER={stats={name=stats,description=Calculate Statistics,stats=null},debug={name=debug,description=Debug Information,stats=null}}}} expected:<1> but was:<0>

Stack Trace:
java.lang.AssertionError: Append replicas should recive all updates. Replica: core_node6:{"core":"tlog_replica_test_add_docs_shard1_replica_t4","base_url":"https://127.0.0.1:45925/solr","node_name":"127.0.0.1:45925_solr","state":"active","type":"TLOG","force_set_state":"false"}, response: {responseHeader={status=0,QTime=1},plugins={CONTAINER={},ADMIN={/admin/luke={name=org.apache.solr.handler.admin.LukeRequestHandler,description=Lucene Index Browser.  Inspired and modeled after Luke: http://www.getopt.org/luke/,stats={ADMIN./admin/luke.clientErrors.count=0, ADMIN./admin/luke.serverErrors.count=0, ADMIN./admin/luke.errors.count=0, ADMIN./admin/luke.requests=0, ADMIN./admin/luke.handlerStart=1535888162244, ADMIN./admin/luke.totalTime=0, ADMIN./admin/luke.requestTimes.meanRate=0.0, ADMIN./admin/luke.timeouts.count=0}},/admin/segments={name=org.apache.solr.handler.admin.SegmentsInfoRequestHandler,description=Lucene segments info.,stats={ADMIN./admin/segments.timeouts.count=0, ADMIN./admin/segments.clientErrors.count=0, ADMIN./admin/segments.requests=0, ADMIN./admin/segments.totalTime=0, ADMIN./admin/segments.handlerStart=1535888162244, ADMIN./admin/segments.requestTimes.meanRate=0.0, ADMIN./admin/segments.serverErrors.count=0, ADMIN./admin/segments.errors.count=0}},/admin/system={name=org.apache.solr.handler.admin.SystemInfoHandler,description=Get System Info,stats={ADMIN./admin/system.handlerStart=1535888162245, ADMIN./admin/system.serverErrors.count=0, ADMIN./admin/system.timeouts.count=0, ADMIN./admin/system.clientErrors.count=0, ADMIN./admin/system.requestTimes.meanRate=0.0, ADMIN./admin/system.errors.count=0, ADMIN./admin/system.totalTime=0, ADMIN./admin/system.requests=0}},/config={name=org.apache.solr.handler.SolrConfigHandler,description=Edit solrconfig.xml,stats={ADMIN./config.clientErrors.count=0, ADMIN./config.requestTimes.meanRate=0.0, ADMIN./config.errors.count=0, ADMIN./config.requests=0, ADMIN./config.totalTime=0, ADMIN./config.timeouts.count=0, ADMIN./config.serverErrors.count=0, ADMIN./config.handlerStart=1535888162220}},/schema={name=org.apache.solr.handler.SchemaHandler,description=CRUD operations over the Solr schema,stats={ADMIN./schema.handlerStart=1535888162227, ADMIN./schema.totalTime=0, ADMIN./schema.errors.count=0, ADMIN./schema.requestTimes.meanRate=0.0, ADMIN./schema.clientErrors.count=0, ADMIN./schema.serverErrors.count=0, ADMIN./schema.timeouts.count=0, ADMIN./schema.requests=0}},/admin/plugins={name=org.apache.solr.handler.admin.PluginInfoHandler,description=Registry,stats={ADMIN./admin/plugins.timeouts.count=0, ADMIN./admin/plugins.errors.count=0, ADMIN./admin/plugins.handlerStart=1535888162246, ADMIN./admin/plugins.requests=72, ADMIN./admin/plugins.serverErrors.count=0, ADMIN./admin/plugins.totalTime=182163277, ADMIN./admin/plugins.requestTimes.meanRate=5.844822366337691, ADMIN./admin/plugins.clientErrors.count=0}},/admin/logging={name=org.apache.solr.handler.admin.LoggingHandler,description=Logging Handler,stats={ADMIN./admin/logging.requests=0, ADMIN./admin/logging.totalTime=0, ADMIN./admin/logging.timeouts.count=0, ADMIN./admin/logging.requestTimes.meanRate=0.0, ADMIN./admin/logging.serverErrors.count=0, ADMIN./admin/logging.errors.count=0, ADMIN./admin/logging.clientErrors.count=0, ADMIN./admin/logging.handlerStart=1535888162248}},/admin/mbeans={name=org.apache.solr.handler.admin.SolrInfoMBeanHandler,description=Get Info (and statistics) for registered SolrInfoMBeans,stats={ADMIN./admin/mbeans.serverErrors.count=0, ADMIN./admin/mbeans.clientErrors.count=0, ADMIN./admin/mbeans.requestTimes.meanRate=0.0, ADMIN./admin/mbeans.requests=0, ADMIN./admin/mbeans.handlerStart=1535888162245, ADMIN./admin/mbeans.timeouts.count=0, ADMIN./admin/mbeans.errors.count=0, ADMIN./admin/mbeans.totalTime=0}},/admin/properties={name=org.apache.solr.handler.admin.PropertiesRequestHandler,description=Get System Properties,stats={ADMIN./admin/properties.handlerStart=1535888162247, ADMIN./admin/properties.serverErrors.count=0, ADMIN./admin/properties.clientErrors.count=0, ADMIN./admin/properties.timeouts.count=0, ADMIN./admin/properties.totalTime=0, ADMIN./admin/properties.errors.count=0, ADMIN./admin/properties.requestTimes.meanRate=0.0, ADMIN./admin/properties.requests=0}},/admin/threads={name=org.apache.solr.handler.admin.ThreadDumpHandler,description=Thread Dump,stats={ADMIN./admin/threads.requests=0, ADMIN./admin/threads.requestTimes.meanRate=0.0, ADMIN./admin/threads.timeouts.count=0, ADMIN./admin/threads.totalTime=0, ADMIN./admin/threads.handlerStart=1535888162247, ADMIN./admin/threads.clientErrors.count=0, ADMIN./admin/threads.errors.count=0, ADMIN./admin/threads.serverErrors.count=0}},/admin/ping={name=org.apache.solr.handler.PingRequestHandler,description=Reports application health to a load-balancer,stats={ADMIN./admin/ping.clientErrors.count=0, ADMIN./admin/ping.errors.count=0, ADMIN./admin/ping.serverErrors.count=0, ADMIN./admin/ping.requestTimes.meanRate=0.0, ADMIN./admin/ping.timeouts.count=0, ADMIN./admin/ping.totalTime=0, ADMIN./admin/ping.handlerStart=1535888162242, ADMIN./admin/ping.requests=0}},/admin/file={name=org.apache.solr.handler.admin.ShowFileRequestHandler,description=Admin Config File -- view or update config files directly,stats={ADMIN./admin/file.requests=0, ADMIN./admin/file.timeouts.count=0, ADMIN./admin/file.errors.count=0, ADMIN./admin/file.clientErrors.count=0, ADMIN./admin/file.serverErrors.count=0, ADMIN./admin/file.totalTime=0, ADMIN./admin/file.requestTimes.meanRate=0.0, ADMIN./admin/file.handlerStart=1535888162248}}},CORE={searcher={name=org.apache.solr.search.SolrIndexSearcher,description=index searcher,stats={SEARCHER.searcher.maxDoc=1, SEARCHER.searcher.caching=true, SEARCHER.searcher.registeredAt=Sun Sep 02 08:36:05 BRT 2018, SEARCHER.searcher.deletedDocs=0, SEARCHER.searcher.warmupTime=0, SEARCHER.searcher.searcherName=Searcher@2914dfad[tlog_replica_test_add_docs_shard1_replica_t4] main, SEARCHER.searcher.indexVersion=6, SEARCHER.searcher.openedAt=Sun Sep 02 08:36:05 BRT 2018, SEARCHER.searcher.readerDir=MockDirectoryWrapper(RAMDirectory@6e14eee8 lockFactory=org.apache.lucene.store.SingleInstanceLockFactory@625fb5d6), SEARCHER.searcher.numDocs=1, SEARCHER.searcher.reader=ExitableDirectoryReader(UninvertingDirectoryReader(Uninverting(_0(7.5.0):C1)))}},Searcher@2914dfad[tlog_replica_test_add_docs_shard1_replica_t4] main={name=org.apache.solr.search.SolrIndexSearcher,description=index searcher,stats={SEARCHER.searcher.maxDoc=1, SEARCHER.searcher.caching=true, SEARCHER.searcher.registeredAt=Sun Sep 02 08:36:05 BRT 2018, SEARCHER.searcher.deletedDocs=0, SEARCHER.searcher.warmupTime=0, SEARCHER.searcher.searcherName=Searcher@2914dfad[tlog_replica_test_add_docs_shard1_replica_t4] main, SEARCHER.searcher.indexVersion=6, SEARCHER.searcher.openedAt=Sun Sep 02 08:36:05 BRT 2018, SEARCHER.searcher.readerDir=MockDirectoryWrapper(RAMDirectory@6e14eee8 lockFactory=org.apache.lucene.store.SingleInstanceLockFactory@625fb5d6), SEARCHER.searcher.numDocs=1, SEARCHER.searcher.reader=ExitableDirectoryReader(UninvertingDirectoryReader(Uninverting(_0(7.5.0):C1)))}},core={name=tlog_replica_test_add_docs_shard1_replica_t4,description=SolrCore,stats={CORE.fs.totalSpace=469456388096, CORE.fs.path=/home/jenkins/workspace/Lucene-Solr-7.x-Linux/solr/build/solr-core/test/J2/temp/solr.cloud.TestTlogReplica_F8F6C78538383BE7-001/tempDir-001/node2/./tlog_replica_test_add_docs_shard1_replica_t4/data, CORE.coreName=tlog_replica_test_add_docs_shard1_replica_t4, CORE.indexDir=/home/jenkins/workspace/Lucene-Solr-7.x-Linux/solr/build/solr-core/test/J2/temp/solr.cloud.TestTlogReplica_F8F6C78538383BE7-001/tempDir-001/node2/./tlog_replica_test_add_docs_shard1_replica_t4/data/index/, INDEX.sizeInBytes=3199, CORE.shard=shard1, SEARCHER.new.errors=0, CORE.refCount=2, CORE.collection=tlog_replica_test_add_docs, INDEX.size=3.12 KB, CORE.startTime=Sun Sep 02 08:36:02 BRT 2018, SEARCHER.new=2, CORE.fs.usableSpace=211100041216, CORE.aliases=[tlog_replica_test_add_docs_shard1_replica_t4], SEARCHER.new.maxReached=0, CORE.instanceDir=/home/jenkins/workspace/Lucene-Solr-7.x-Linux/solr/build/solr-core/test/J2/temp/solr.cloud.TestTlogReplica_F8F6C78538383BE7-001/tempDir-001/node2/tlog_replica_test_add_docs_shard1_replica_t4, SEARCHER.new.time.meanRate=0.16415444946177943, SEARCHER.new.warmup.meanRate=0.0, CORE.fs.spins=false}}},QUERY={terms={name=terms,description=A Component for working with Term Enumerators,stats=null},query={name=query,description=query,stats=null},/sql={name=org.apache.solr.handler.SQLHandler,description=SQLHandler,stats={QUERY./sql.totalTime=0, QUERY./sql.clientErrors.count=0, QUERY./sql.timeouts.count=0, QUERY./sql.serverErrors.count=0, QUERY./sql.requestTimes.meanRate=0.0, QUERY./sql.handlerStart=1535888162252, QUERY./sql.errors.count=0, QUERY./sql.requests=0}},/select={name=org.apache.solr.handler.component.SearchHandler,description=Search using components: query,facet,facet_module,mlt,highlight,stats,expand,terms,debug,,stats={QUERY./select.errors.count=0, QUERY./select.handlerStart=1535888162254, QUERY./select.clientErrors.count=0, QUERY./select.requestTimes.meanRate=5.930734020809221, QUERY./select.serverErrors.count=0, QUERY./select.timeouts.count=0, QUERY./select.totalTime=8628186, QUERY./select.requests=72}},expand={name=expand,description=Expand Component,stats=null},mlt={name=mlt,description=More Like This,stats=null},/debug/dump={name=org.apache.solr.handler.DumpRequestHandler,description=Dump handler (debug),stats={QUERY./debug/dump.requestTimes.meanRate=0.0, QUERY./debug/dump.timeouts.count=0, QUERY./debug/dump.errors.count=0, QUERY./debug/dump.serverErrors.count=0, QUERY./debug/dump.requests=0, QUERY./debug/dump.handlerStart=1535888162253, QUERY./debug/dump.clientErrors.count=0, QUERY./debug/dump.totalTime=0}},/export={name=org.apache.solr.handler.ExportHandler,description=Search using components: ,stats={QUERY./export.totalTime=0, QUERY./export.errors.count=0, QUERY./export.handlerStart=1535888162249, QUERY./export.timeouts.count=0, QUERY./export.requests=0, QUERY./export.clientErrors.count=0, QUERY./export.serverErrors.count=0, QUERY./export.requestTimes.meanRate=0.0}},/get={name=org.apache.solr.handler.RealTimeGetHandler,description=The realtime get handler,stats={QUERY./get.handlerStart=1535888162242, QUERY./get.errors.count=0, QUERY./get.requests=1, QUERY./get.totalTime=299246, QUERY./get.requestTimes.meanRate=0.08228441659332053, QUERY./get.clientErrors.count=0, QUERY./get.serverErrors.count=0, QUERY./get.timeouts.count=0}},get={name=get,description=query,stats=null},/graph={name=org.apache.solr.handler.GraphHandler,description=StreamHandler,stats={QUERY./graph.requests=0, QUERY./graph.totalTime=0, QUERY./graph.clientErrors.count=0, QUERY./graph.errors.count=0, QUERY./graph.serverErrors.count=0, QUERY./graph.handlerStart=1535888162250, QUERY./graph.timeouts.count=0, QUERY./graph.requestTimes.meanRate=0.0}},facet_module={name=facet_module,description=Facet Module,stats=null},/stream={name=org.apache.solr.handler.StreamHandler,description=StreamHandler,stats={QUERY./stream.requests=0, QUERY./stream.totalTime=0, QUERY./stream.timeouts.count=0, QUERY./stream.errors.count=0, QUERY./stream.clientErrors.count=0, QUERY./stream.serverErrors.count=0, QUERY./stream.requestTimes.meanRate=0.0, QUERY./stream.handlerStart=1535888162251}},facet={name=facet,description=Handle Faceting,stats=null},/terms={name=org.apache.solr.handler.component.SearchHandler,description=Search using components: ,stats={QUERY./terms.handlerStart=1535888162252, QUERY./terms.errors.count=0, QUERY./terms.serverErrors.count=0, QUERY./terms.clientErrors.count=0, QUERY./terms.timeouts.count=0, QUERY./terms.totalTime=0, QUERY./terms.requestTimes.meanRate=0.0, QUERY./terms.requests=0}}},UPDATE={/update/json={name=org.apache.solr.handler.UpdateRequestHandler,description=Add documents using XML (with XSLT), CSV, JSON, or javabin,stats={UPDATE./update/json.errors.count=0, UPDATE./update/json.requestTimes.meanRate=0.0, UPDATE./update/json.requests=0, UPDATE./update/json.clientErrors.count=0, UPDATE./update/json.serverErrors.count=0, UPDATE./update/json.totalTime=0, UPDATE./update/json.handlerStart=1535888162216, UPDATE./update/json.timeouts.count=0}},update={name=org.apache.solr.handler.UpdateRequestHandlerApi,description=Add documents using XML (with XSLT), CSV, JSON, or javabin,stats={UPDATE.update.requests=0, UPDATE.update.serverErrors.count=0, UPDATE.update.clientErrors.count=0, UPDATE.update.handlerStart=1535888162219, UPDATE.update.timeouts.count=0, UPDATE.update.requestTimes.meanRate=0.0, UPDATE.update.errors.count=0, UPDATE.update.totalTime=0}},/update/json/docs={name=org.apache.solr.handler.UpdateRequestHandler,description=Add documents using XML (with XSLT), CSV, JSON, or javabin,stats={UPDATE./update/json/docs.serverErrors.count=0, UPDATE./update/json/docs.requests=0, UPDATE./update/json/docs.clientErrors.count=0, UPDATE./update/json/docs.handlerStart=1535888162218, UPDATE./update/json/docs.requestTimes.meanRate=0.0, UPDATE./update/json/docs.timeouts.count=0, UPDATE./update/json/docs.errors.count=0, UPDATE./update/json/docs.totalTime=0}},updateHandler={name=org.apache.solr.update.DirectUpdateHandler2,description=Update handler that efficiently directly updates the on-disk main lucene index,stats={UPDATE.updateHandler.rollbacks.count=0, UPDATE.updateHandler.autoCommits=0, UPDATE.updateHandler.softAutoCommits=0, UPDATE.updateHandler.commits.count=0, UPDATE.updateHandler.deletesByQuery=0, UPDATE.updateHandler.cumulativeAdds.count=0, UPDATE.updateHandler.deletesById=0, UPDATE.updateHandler.cumulativeDeletesById.count=0, UPDATE.updateHandler.optimizes.count=0, UPDATE.updateHandler.cumulativeErrors.count=0, UPDATE.updateHandler.expungeDeletes.count=0, UPDATE.updateHandler.splits.count=0, UPDATE.updateHandler.merges.count=0, UPDATE.updateHandler.docsPending=0, UPDATE.updateHandler.errors=0, UPDATE.updateHandler.cumulativeDeletesByQuery.count=0, UPDATE.updateHandler.adds=0}},/update/csv={name=org.apache.solr.handler.UpdateRequestHandler,description=Add documents using XML (with XSLT), CSV, JSON, or javabin,stats={UPDATE./update/csv.requestTimes.meanRate=0.0, UPDATE./update/csv.errors.count=0, UPDATE./update/csv.serverErrors.count=0, UPDATE./update/csv.clientErrors.count=0, UPDATE./update/csv.timeouts.count=0, UPDATE./update/csv.requests=0, UPDATE./update/csv.totalTime=0, UPDATE./update/csv.handlerStart=1535888162217}},/update={name=org.apache.solr.handler.UpdateRequestHandler,description=Add documents using XML (with XSLT), CSV, JSON, or javabin,stats={UPDATE./update.clientErrors.count=0, UPDATE./update.serverErrors.count=0, UPDATE./update.requestTimes.meanRate=0.08210898489750572, UPDATE./update.timeouts.count=0, UPDATE./update.errors.count=0, UPDATE./update.totalTime=64348, UPDATE./update.requests=1, UPDATE./update.handlerStart=1535888162216}}},CACHE={fieldValueCache={name=org.apache.solr.search.FastLRUCache,description=Concurrent LRU Cache(maxSize=10000, initialSize=10, minSize=9000, acceptableSize=9500, cleanupThread=false),stats={CACHE.searcher.fieldValueCache.warmupTime=0, CACHE.searcher.fieldValueCache.inserts=0, CACHE.searcher.fieldValueCache.hits=0, CACHE.searcher.fieldValueCache.lookups=0, CACHE.searcher.fieldValueCache.cumulative_hitratio=0.0, CACHE.searcher.fieldValueCache.hitratio=0.0, CACHE.searcher.fieldValueCache.cumulative_hits=0, CACHE.searcher.fieldValueCache.size=0, CACHE.searcher.fieldValueCache.evictions=0, CACHE.searcher.fieldValueCache.cumulative_lookups=0, CACHE.searcher.fieldValueCache.cumulative_inserts=0, CACHE.searcher.fieldValueCache.cumulative_evictions=0}},fieldCache={name=org.apache.solr.search.SolrFieldCacheBean,description=Provides introspection of the Solr FieldCache ,stats={CACHE.core.fieldCache.entries_count=0, CACHE.core.fieldCache.total_size=0 bytes}}},HIGHLIGHTER={highlight={name=highlight,description=Highlighting,stats=null}},QUERYPARSER={org.apache.solr.search.BoostQParserPlugin={name=org.apache.solr.search.BoostQParserPlugin,description=,stats=null},org.apache.solr.search.LuceneQParserPlugin={name=org.apache.solr.search.LuceneQParserPlugin,description=,stats=null},org.apache.solr.search.FunctionQParserPlugin={name=org.apache.solr.search.FunctionQParserPlugin,description=,stats=null},org.apache.solr.search.DisMaxQParserPlugin={name=org.apache.solr.search.DisMaxQParserPlugin,description=,stats=null},org.apache.solr.search.XmlQParserPlugin={name=org.apache.solr.search.XmlQParserPlugin,description=,stats=null},org.apache.solr.search.JoinQParserPlugin={name=org.apache.solr.search.JoinQParserPlugin,description=,stats=null},org.apache.solr.search.GraphTermsQParserPlugin={name=org.apache.solr.search.GraphTermsQParserPlugin,description=,stats=null},org.apache.solr.search.SimpleQParserPlugin={name=org.apache.solr.search.SimpleQParserPlugin,description=,stats=null},org.apache.solr.search.ComplexPhraseQParserPlugin={name=org.apache.solr.search.ComplexPhraseQParserPlugin,description=,stats=null},org.apache.solr.search.PayloadScoreQParserPlugin={name=org.apache.solr.search.PayloadScoreQParserPlugin,description=,stats=null},org.apache.solr.search.SignificantTermsQParserPlugin={name=org.apache.solr.search.SignificantTermsQParserPlugin,description=,stats=null},org.apache.solr.search.SwitchQParserPlugin={name=org.apache.solr.search.SwitchQParserPlugin,description=,stats=null},org.apache.solr.search.TextLogisticRegressionQParserPlugin={name=org.apache.solr.search.TextLogisticRegressionQParserPlugin,description=,stats=null},org.apache.solr.search.HashQParserPlugin={name=org.apache.solr.search.HashQParserPlugin,description=,stats=null},org.apache.solr.search.join.BlockJoinParentQParserPlugin={name=org.apache.solr.search.join.BlockJoinParentQParserPlugin,description=,stats=null},org.apache.solr.search.MaxScoreQParserPlugin={name=org.apache.solr.search.MaxScoreQParserPlugin,description=,stats=null},org.apache.solr.search.join.GraphQParserPlugin={name=org.apache.solr.search.join.GraphQParserPlugin,description=,stats=null},org.apache.solr.search.PrefixQParserPlugin={name=org.apache.solr.search.PrefixQParserPlugin,description=,stats=null},org.apache.solr.search.NestedQParserPlugin={name=org.apache.solr.search.NestedQParserPlugin,description=,stats=null},org.apache.solr.search.CollapsingQParserPlugin={name=org.apache.solr.search.CollapsingQParserPlugin,description=,stats=null},org.apache.solr.search.SpatialBoxQParserPlugin={name=org.apache.solr.search.SpatialBoxQParserPlugin,description=,stats=null},org.apache.solr.search.TermQParserPlugin={name=org.apache.solr.search.TermQParserPlugin,description=,stats=null},org.apache.solr.search.FieldQParserPlugin={name=org.apache.solr.search.FieldQParserPlugin,description=,stats=null},org.apache.solr.search.TermsQParserPlugin={name=org.apache.solr.search.TermsQParserPlugin,description=,stats=null},org.apache.solr.search.RawQParserPlugin={name=org.apache.solr.search.RawQParserPlugin,description=,stats=null},org.apache.solr.search.ReRankQParserPlugin={name=org.apache.solr.search.ReRankQParserPlugin,description=,stats=null},org.apache.solr.search.PayloadCheckQParserPlugin={name=org.apache.solr.search.PayloadCheckQParserPlugin,description=,stats=null},org.apache.solr.search.ExportQParserPlugin={name=org.apache.solr.search.ExportQParserPlugin,description=,stats=null},org.apache.solr.search.SpatialFilterQParserPlugin={name=org.apache.solr.search.SpatialFilterQParserPlugin,description=,stats=null},org.apache.solr.search.IGainTermsQParserPlugin={name=org.apache.solr.search.IGainTermsQParserPlugin,description=,stats=null},org.apache.solr.search.mlt.MLTQParserPlugin={name=org.apache.solr.search.mlt.MLTQParserPlugin,description=,stats=null},org.apache.solr.search.SurroundQParserPlugin={name=org.apache.solr.search.SurroundQParserPlugin,description=,stats=null},org.apache.solr.search.FunctionRangeQParserPlugin={name=org.apache.solr.search.FunctionRangeQParserPlugin,description=,stats=null},org.apache.solr.search.join.FiltersQParserPlugin={name=org.apache.solr.search.join.FiltersQParserPlugin,description=,stats=null},org.apache.solr.search.BoolQParserPlugin={name=org.apache.solr.search.BoolQParserPlugin,description=,stats=null},org.apache.solr.search.ExtendedDismaxQParserPlugin={name=org.apache.solr.search.ExtendedDismaxQParserPlugin,description=,stats=null},org.apache.solr.search.join.BlockJoinChildQParserPlugin={name=org.apache.solr.search.join.BlockJoinChildQParserPlugin,description=,stats=null}},SPELLCHECKER={},SEARCHER={},REPLICATION={/replication={name=org.apache.solr.handler.ReplicationHandler,description=ReplicationHandler provides replication of index and configuration files from Master to Slaves,stats={REPLICATION./replication.handlerStart=1535888162240, REPLICATION./replication.confFilesToReplicate=, REPLICATION./replication.fetcher.lastCycleBytesDownloaded=3403, REPLICATION./replication.indexVersion=generation=2,version=1535888164284, REPLICATION./replication.fetcher.masterUrl=https://127.0.0.1:44705/solr/tlog_replica_test_add_docs_shard1_replica_t2/, REPLICATION./replication.indexSize=3.12 KB, REPLICATION./replication.fetcher.indexReplicatedAt=Sun Sep 02 08:36:05 BRT 2018, REPLICATION./replication.generation=2, REPLICATION./replication.indexPath=/home/jenkins/workspace/Lucene-Solr-7.x-Linux/solr/build/solr-core/test/J2/temp/solr.cloud.TestTlogReplica_F8F6C78538383BE7-001/tempDir-001/node2/./tlog_replica_test_add_docs_shard1_replica_t4/data/index/, REPLICATION./replication.replicateAfter=[commit], REPLICATION./replication.isMaster=true, REPLICATION./replication.clientErrors.count=0, REPLICATION./replication.isSlave=false, REPLICATION./replication.fetcher.timesIndexReplicated=1, REPLICATION./replication.fetcher.isReplicating=false, REPLICATION./replication.requests=0, REPLICATION./replication.fetcher.previousCycleTimeInSeconds=0, REPLICATION./replication.errors.count=0, REPLICATION./replication.requestTimes.meanRate=0.0, REPLICATION./replication.timeouts.count=0, REPLICATION./replication.serverErrors.count=0, REPLICATION./replication.replicationEnabled=true, REPLICATION./replication.totalTime=0, REPLICATION./replication.fetcher.isPollingDisabled=false}}},TLOG={},INDEX={},DIRECTORY={},HTTP={},OTHER={stats={name=stats,description=Calculate Statistics,stats=null},debug={name=debug,description=Debug Information,stats=null}}}} expected:<1> but was:<0>
	at __randomizedtesting.SeedInfo.seed([F8F6C78538383BE7:187DDC83DB76C90A]:0)
	at org.junit.Assert.fail(Assert.java:93)
	at org.junit.Assert.failNotEquals(Assert.java:647)
	at org.junit.Assert.assertEquals(Assert.java:128)
	at org.apache.solr.cloud.TestTlogReplica.testAddDocs(TestTlogReplica.java:251)
	at java.base/jdk.internal.reflect.NativeMethodAccessorImpl.invoke0(Native Method)
	at java.base/jdk.internal.reflect.NativeMethodAccessorImpl.invoke(NativeMethodAccessorImpl.java:62)
	at java.base/jdk.internal.reflect.DelegatingMethodAccessorImpl.invoke(DelegatingMethodAccessorImpl.java:43)
	at java.base/java.lang.reflect.Method.invoke(Method.java:566)
	at com.carrotsearch.randomizedtesting.RandomizedRunner.invoke(RandomizedRunner.java:1737)
	at com.carrotsearch.randomizedtesting.RandomizedRunner$8.evaluate(RandomizedRunner.java:934)
	at com.carrotsearch.randomizedtesting.RandomizedRunner$9.evaluate(RandomizedRunner.java:970)
	at com.carrotsearch.randomizedtesting.RandomizedRunner$10.evaluate(RandomizedRunner.java:984)
	at com.carrotsearch.randomizedtesting.rules.SystemPropertiesRestoreRule$1.evaluate(SystemPropertiesRestoreRule.java:57)
	at org.apache.lucene.util.TestRuleSetupTeardownChained$1.evaluate(TestRuleSetupTeardownChained.java:49)
	at org.apache.lucene.util.AbstractBeforeAfterRule$1.evaluate(AbstractBeforeAfterRule.java:45)
	at org.apache.lucene.util.TestRuleThreadAndTestName$1.evaluate(TestRuleThreadAndTestName.java:48)
	at org.apache.lucene.util.TestRuleIgnoreAfterMaxFailures$1.evaluate(TestRuleIgnoreAfterMaxFailures.java:64)
	at org.apache.lucene.util.TestRuleMarkFailure$1.evaluate(TestRuleMarkFailure.java:47)
	at com.carrotsearch.randomizedtesting.rules.StatementAdapter.evaluate(StatementAdapter.java:36)
	at com.carrotsearch.randomizedtesting.ThreadLeakControl$StatementRunner.run(ThreadLeakControl.java:368)
	at com.carrotsearch.randomizedtesting.ThreadLeakControl.forkTimeoutingTask(ThreadLeakControl.java:817)
	at com.carrotsearch.randomizedtesting.ThreadLeakControl$3.evaluate(ThreadLeakControl.java:468)
	at com.carrotsearch.randomizedtesting.RandomizedRunner.runSingleTest(RandomizedRunner.java:943)
	at com.carrotsearch.randomizedtesting.RandomizedRunner$5.evaluate(RandomizedRunner.java:829)
	at com.carrotsearch.randomizedtesting.RandomizedRunner$6.evaluate(RandomizedRunner.java:879)
	at com.carrotsearch.randomizedtesting.RandomizedRunner$7.evaluate(RandomizedRunner.java:890)
	at com.carrotsearch.randomizedtesting.rules.StatementAdapter.evaluate(StatementAdapter.java:36)
	at com.carrotsearch.randomizedtesting.rules.SystemPropertiesRestoreRule$1.evaluate(SystemPropertiesRestoreRule.java:57)
	at org.apache.lucene.util.AbstractBeforeAfterRule$1.evaluate(AbstractBeforeAfterRule.java:45)
	at com.carrotsearch.randomizedtesting.rules.StatementAdapter.evaluate(StatementAdapter.java:36)
	at org.apache.lucene.util.TestRuleStoreClassName$1.evaluate(TestRuleStoreClassName.java:41)
	at com.carrotsearch.randomizedtesting.rules.NoShadowingOrOverridesOnMethodsRule$1.evaluate(NoShadowingOrOverridesOnMethodsRule.java:40)
	at com.carrotsearch.randomizedtesting.rules.NoShadowingOrOverridesOnMethodsRule$1.evaluate(NoShadowingOrOverridesOnMethodsRule.java:40)
	at com.carrotsearch.randomizedtesting.rules.StatementAdapter.evaluate(StatementAdapter.java:36)
	at com.carrotsearch.randomizedtesting.rules.StatementAdapter.evaluate(StatementAdapter.java:36)
	at org.apache.lucene.util.TestRuleAssertionsRequired$1.evaluate(TestRuleAssertionsRequired.java:53)
	at org.apache.lucene.util.TestRuleMarkFailure$1.evaluate(TestRuleMarkFailure.java:47)
	at org.apache.lucene.util.TestRuleIgnoreAfterMaxFailures$1.evaluate(TestRuleIgnoreAfterMaxFailures.java:64)
	at org.apache.lucene.util.TestRuleIgnoreTestSuites$1.evaluate(TestRuleIgnoreTestSuites.java:54)
	at com.carrotsearch.randomizedtesting.rules.StatementAdapter.evaluate(StatementAdapter.java:36)
	at com.carrotsearch.randomizedtesting.ThreadLeakControl$StatementRunner.run(ThreadLeakControl.java:368)
	at java.base/java.lang.Thread.run(Thread.java:834)


FAILED:  org.apache.solr.cloud.TestTlogReplica.testRealTimeGet

Error Message:


Stack Trace:
java.lang.NullPointerException
	at __randomizedtesting.SeedInfo.seed([F8F6C78538383BE7:A09B32869A82952E]:0)
	at org.apache.solr.cloud.TestTlogReplica.testRealTimeGet(TestTlogReplica.java:349)
	at java.base/jdk.internal.reflect.NativeMethodAccessorImpl.invoke0(Native Method)
	at java.base/jdk.internal.reflect.NativeMethodAccessorImpl.invoke(NativeMethodAccessorImpl.java:62)
	at java.base/jdk.internal.reflect.DelegatingMethodAccessorImpl.invoke(DelegatingMethodAccessorImpl.java:43)
	at java.base/java.lang.reflect.Method.invoke(Method.java:566)
	at com.carrotsearch.randomizedtesting.RandomizedRunner.invoke(RandomizedRunner.java:1737)
	at com.carrotsearch.randomizedtesting.RandomizedRunner$8.evaluate(RandomizedRunner.java:934)
	at com.carrotsearch.randomizedtesting.RandomizedRunner$9.evaluate(RandomizedRunner.java:970)
	at com.carrotsearch.randomizedtesting.RandomizedRunner$10.evaluate(RandomizedRunner.java:984)
	at com.carrotsearch.randomizedtesting.rules.SystemPropertiesRestoreRule$1.evaluate(SystemPropertiesRestoreRule.java:57)
	at org.apache.lucene.util.TestRuleSetupTeardownChained$1.evaluate(TestRuleSetupTeardownChained.java:49)
	at org.apache.lucene.util.AbstractBeforeAfterRule$1.evaluate(AbstractBeforeAfterRule.java:45)
	at org.apache.lucene.util.TestRuleThreadAndTestName$1.evaluate(TestRuleThreadAndTestName.java:48)
	at org.apache.lucene.util.TestRuleIgnoreAfterMaxFailures$1.evaluate(TestRuleIgnoreAfterMaxFailures.java:64)
	at org.apache.lucene.util.TestRuleMarkFailure$1.evaluate(TestRuleMarkFailure.java:47)
	at com.carrotsearch.randomizedtesting.rules.StatementAdapter.evaluate(StatementAdapter.java:36)
	at com.carrotsearch.randomizedtesting.ThreadLeakControl$StatementRunner.run(ThreadLeakControl.java:368)
	at com.carrotsearch.randomizedtesting.ThreadLeakControl.forkTimeoutingTask(ThreadLeakControl.java:817)
	at com.carrotsearch.randomizedtesting.ThreadLeakControl$3.evaluate(ThreadLeakControl.java:468)
	at com.carrotsearch.randomizedtesting.RandomizedRunner.runSingleTest(RandomizedRunner.java:943)
	at com.carrotsearch.randomizedtesting.RandomizedRunner$5.evaluate(RandomizedRunner.java:829)
	at com.carrotsearch.randomizedtesting.RandomizedRunner$6.evaluate(RandomizedRunner.java:879)
	at com.carrotsearch.randomizedtesting.RandomizedRunner$7.evaluate(RandomizedRunner.java:890)
	at com.carrotsearch.randomizedtesting.rules.StatementAdapter.evaluate(StatementAdapter.java:36)
	at com.carrotsearch.randomizedtesting.rules.SystemPropertiesRestoreRule$1.evaluate(SystemPropertiesRestoreRule.java:57)
	at org.apache.lucene.util.AbstractBeforeAfterRule$1.evaluate(AbstractBeforeAfterRule.java:45)
	at com.carrotsearch.randomizedtesting.rules.StatementAdapter.evaluate(StatementAdapter.java:36)
	at org.apache.lucene.util.TestRuleStoreClassName$1.evaluate(TestRuleStoreClassName.java:41)
	at com.carrotsearch.randomizedtesting.rules.NoShadowingOrOverridesOnMethodsRule$1.evaluate(NoShadowingOrOverridesOnMethodsRule.java:40)
	at com.carrotsearch.randomizedtesting.rules.NoShadowingOrOverridesOnMethodsRule$1.evaluate(NoShadowingOrOverridesOnMethodsRule.java:40)
	at com.carrotsearch.randomizedtesting.rules.StatementAdapter.evaluate(StatementAdapter.java:36)
	at com.carrotsearch.randomizedtesting.rules.StatementAdapter.evaluate(StatementAdapter.java:36)
	at org.apache.lucene.util.TestRuleAssertionsRequired$1.evaluate(TestRuleAssertionsRequired.java:53)
	at org.apache.lucene.util.TestRuleMarkFailure$1.evaluate(TestRuleMarkFailure.java:47)
	at org.apache.lucene.util.TestRuleIgnoreAfterMaxFailures$1.evaluate(TestRuleIgnoreAfterMaxFailures.java:64)
	at org.apache.lucene.util.TestRuleIgnoreTestSuites$1.evaluate(TestRuleIgnoreTestSuites.java:54)
	at com.carrotsearch.randomizedtesting.rules.StatementAdapter.evaluate(StatementAdapter.java:36)
	at com.carrotsearch.randomizedtesting.ThreadLeakControl$StatementRunner.run(ThreadLeakControl.java:368)
	at java.base/java.lang.Thread.run(Thread.java:834)


FAILED:  org.apache.solr.cloud.cdcr.CdcrBidirectionalTest.testBiDir

Error Message:
Captured an uncaught exception in thread: Thread[id=26284, name=cdcr-replicator-8320-thread-1, state=RUNNABLE, group=TGRP-CdcrBidirectionalTest]

Stack Trace:
com.carrotsearch.randomizedtesting.UncaughtExceptionError: Captured an uncaught exception in thread: Thread[id=26284, name=cdcr-replicator-8320-thread-1, state=RUNNABLE, group=TGRP-CdcrBidirectionalTest]
Caused by: java.lang.AssertionError: 1610493760620199936 != 1610493760619151360
	at __randomizedtesting.SeedInfo.seed([F8F6C78538383BE7]:0)
	at org.apache.solr.update.CdcrUpdateLog$CdcrLogReader.forwardSeek(CdcrUpdateLog.java:611)
	at org.apache.solr.handler.CdcrReplicator.run(CdcrReplicator.java:105)
	at org.apache.solr.handler.CdcrReplicatorScheduler.lambda$start$0(CdcrReplicatorScheduler.java:81)
	at org.apache.solr.common.util.ExecutorUtil$MDCAwareThreadPoolExecutor.lambda$execute$0(ExecutorUtil.java:209)
	at java.base/java.util.concurrent.ThreadPoolExecutor.runWorker(ThreadPoolExecutor.java:1128)
	at java.base/java.util.concurrent.ThreadPoolExecutor$Worker.run(ThreadPoolExecutor.java:628)
	at java.base/java.lang.Thread.run(Thread.java:834)


FAILED:  org.apache.solr.handler.TestSQLHandler.doTest

Error Message:
--> https://127.0.0.1:43957/collection1_shard2_replica_n41:Failed to execute sqlQuery 'select str_s, count(*), sum(field_i), min(field_i), max(field_i), avg(field_i) from collection1 where text='XXXX' group by str_s order by sum(field_i) asc limit 2' against JDBC connection 'jdbc:calcitesolr:'. Error while executing SQL "select str_s, count(*), sum(field_i), min(field_i), max(field_i), avg(field_i) from collection1 where text='XXXX' group by str_s order by sum(field_i) asc limit 2": java.io.IOException: java.util.concurrent.ExecutionException: java.io.IOException: --> https://127.0.0.1:37399/collection1_shard2_replica_n45/:java.util.concurrent.ExecutionException: java.io.IOException: params fl=field_i,str_s&q=text:"XXXX"&wt=javabin&qt=/export&partitionKeys=str_s&sort=str_s+asc&distrib=false

Stack Trace:
java.io.IOException: --> https://127.0.0.1:43957/collection1_shard2_replica_n41:Failed to execute sqlQuery 'select str_s, count(*), sum(field_i), min(field_i), max(field_i), avg(field_i) from collection1 where text='XXXX' group by str_s order by sum(field_i) asc limit 2' against JDBC connection 'jdbc:calcitesolr:'.
Error while executing SQL "select str_s, count(*), sum(field_i), min(field_i), max(field_i), avg(field_i) from collection1 where text='XXXX' group by str_s order by sum(field_i) asc limit 2": java.io.IOException: java.util.concurrent.ExecutionException: java.io.IOException: --> https://127.0.0.1:37399/collection1_shard2_replica_n45/:java.util.concurrent.ExecutionException: java.io.IOException: params fl=field_i,str_s&q=text:"XXXX"&wt=javabin&qt=/export&partitionKeys=str_s&sort=str_s+asc&distrib=false
	at __randomizedtesting.SeedInfo.seed([F8F6C78538383BE7:5FB27F215583285E]:0)
	at org.apache.solr.client.solrj.io.stream.SolrStream.read(SolrStream.java:215)
	at org.apache.solr.handler.TestSQLHandler.getTuples(TestSQLHandler.java:2712)
	at org.apache.solr.handler.TestSQLHandler.testParallelBasicGrouping(TestSQLHandler.java:1969)
	at org.apache.solr.handler.TestSQLHandler.doTest(TestSQLHandler.java:99)
	at java.base/jdk.internal.reflect.NativeMethodAccessorImpl.invoke0(Native Method)
	at java.base/jdk.internal.reflect.NativeMethodAccessorImpl.invoke(NativeMethodAccessorImpl.java:62)
	at java.base/jdk.internal.reflect.DelegatingMethodAccessorImpl.invoke(DelegatingMethodAccessorImpl.java:43)
	at java.base/java.lang.reflect.Method.invoke(Method.java:566)
	at com.carrotsearch.randomizedtesting.RandomizedRunner.invoke(RandomizedRunner.java:1737)
	at com.carrotsearch.randomizedtesting.RandomizedRunner$8.evaluate(RandomizedRunner.java:934)
	at com.carrotsearch.randomizedtesting.RandomizedRunner$9.evaluate(RandomizedRunner.java:970)
	at com.carrotsearch.randomizedtesting.RandomizedRunner$10.evaluate(RandomizedRunner.java:984)
	at org.apache.solr.BaseDistributedSearchTestCase$ShardsRepeatRule$ShardsFixedStatement.callStatement(BaseDistributedSearchTestCase.java:1008)
	at org.apache.solr.BaseDistributedSearchTestCase$ShardsRepeatRule$ShardsStatement.evaluate(BaseDistributedSearchTestCase.java:983)
	at com.carrotsearch.randomizedtesting.rules.SystemPropertiesRestoreRule$1.evaluate(SystemPropertiesRestoreRule.java:57)
	at org.apache.lucene.util.TestRuleSetupTeardownChained$1.evaluate(TestRuleSetupTeardownChained.java:49)
	at org.apache.lucene.util.AbstractBeforeAfterRule$1.evaluate(AbstractBeforeAfterRule.java:45)
	at org.apache.lucene.util.TestRuleThreadAndTestName$1.evaluate(TestRuleThreadAndTestName.java:48)
	at org.apache.lucene.util.TestRuleIgnoreAfterMaxFailures$1.evaluate(TestRuleIgnoreAfterMaxFailures.java:64)
	at org.apache.lucene.util.TestRuleMarkFailure$1.evaluate(TestRuleMarkFailure.java:47)
	at com.carrotsearch.randomizedtesting.rules.StatementAdapter.evaluate(StatementAdapter.java:36)
	at com.carrotsearch.randomizedtesting.ThreadLeakControl$StatementRunner.run(ThreadLeakControl.java:368)
	at com.carrotsearch.randomizedtesting.ThreadLeakControl.forkTimeoutingTask(ThreadLeakControl.java:817)
	at com.carrotsearch.randomizedtesting.ThreadLeakControl$3.evaluate(ThreadLeakControl.java:468)
	at com.carrotsearch.randomizedtesting.RandomizedRunner.runSingleTest(RandomizedRunner.java:943)
	at com.carrotsearch.randomizedtesting.RandomizedRunner$5.evaluate(RandomizedRunner.java:829)
	at com.carrotsearch.randomizedtesting.RandomizedRunner$6.evaluate(RandomizedRunner.java:879)
	at com.carrotsearch.randomizedtesting.RandomizedRunner$7.evaluate(RandomizedRunner.java:890)
	at com.carrotsearch.randomizedtesting.rules.StatementAdapter.evaluate(StatementAdapter.java:36)
	at com.carrotsearch.randomizedtesting.rules.SystemPropertiesRestoreRule$1.evaluate(SystemPropertiesRestoreRule.java:57)
	at org.apache.lucene.util.AbstractBeforeAfterRule$1.evaluate(AbstractBeforeAfterRule.java:45)
	at com.carrotsearch.randomizedtesting.rules.StatementAdapter.evaluate(StatementAdapter.java:36)
	at org.apache.lucene.util.TestRuleStoreClassName$1.evaluate(TestRuleStoreClassName.java:41)
	at com.carrotsearch.randomizedtesting.rules.NoShadowingOrOverridesOnMethodsRule$1.evaluate(NoShadowingOrOverridesOnMethodsRule.java:40)
	at com.carrotsearch.randomizedtesting.rules.NoShadowingOrOverridesOnMethodsRule$1.evaluate(NoShadowingOrOverridesOnMethodsRule.java:40)
	at com.carrotsearch.randomizedtesting.rules.StatementAdapter.evaluate(StatementAdapter.java:36)
	at com.carrotsearch.randomizedtesting.rules.StatementAdapter.evaluate(StatementAdapter.java:36)
	at org.apache.lucene.util.TestRuleAssertionsRequired$1.evaluate(TestRuleAssertionsRequired.java:53)
	at org.apache.lucene.util.TestRuleMarkFailure$1.evaluate(TestRuleMarkFailure.java:47)
	at org.apache.lucene.util.TestRuleIgnoreAfterMaxFailures$1.evaluate(TestRuleIgnoreAfterMaxFailures.java:64)
	at org.apache.lucene.util.TestRuleIgnoreTestSuites$1.evaluate(TestRuleIgnoreTestSuites.java:54)
	at com.carrotsearch.randomizedtesting.rules.StatementAdapter.evaluate(StatementAdapter.java:36)
	at com.carrotsearch.randomizedtesting.ThreadLeakControl$StatementRunner.run(ThreadLeakControl.java:368)
	at java.base/java.lang.Thread.run(Thread.java:834)


FAILED:  org.apache.solr.handler.TestSQLHandler.doTest

Error Message:
--> https://127.0.0.1:45589/collection1_shard2_replica_n41:Failed to execute sqlQuery 'select id, field_i, str_s, field_i_p, field_f_p, field_d_p, field_l_p from collection1 where (text='(XXXX)' OR text='XXXX') AND text='XXXX' order by field_i desc' against JDBC connection 'jdbc:calcitesolr:'. Error while executing SQL "select id, field_i, str_s, field_i_p, field_f_p, field_d_p, field_l_p from collection1 where (text='(XXXX)' OR text='XXXX') AND text='XXXX' order by field_i desc": java.io.IOException: java.util.concurrent.ExecutionException: java.io.IOException: --> https://127.0.0.1:40393/collection1_shard2_replica_n45/:can not sort on a field w/o docValues unless it is indexed and supports Uninversion: field_i

Stack Trace:
java.io.IOException: --> https://127.0.0.1:45589/collection1_shard2_replica_n41:Failed to execute sqlQuery 'select id, field_i, str_s, field_i_p, field_f_p, field_d_p, field_l_p from collection1 where (text='(XXXX)' OR text='XXXX') AND text='XXXX' order by field_i desc' against JDBC connection 'jdbc:calcitesolr:'.
Error while executing SQL "select id, field_i, str_s, field_i_p, field_f_p, field_d_p, field_l_p from collection1 where (text='(XXXX)' OR text='XXXX') AND text='XXXX' order by field_i desc": java.io.IOException: java.util.concurrent.ExecutionException: java.io.IOException: --> https://127.0.0.1:40393/collection1_shard2_replica_n45/:can not sort on a field w/o docValues unless it is indexed and supports Uninversion: field_i
	at __randomizedtesting.SeedInfo.seed([F8F6C78538383BE7:5FB27F215583285E]:0)
	at org.apache.solr.client.solrj.io.stream.SolrStream.read(SolrStream.java:215)
	at org.apache.solr.handler.TestSQLHandler.getTuples(TestSQLHandler.java:2712)
	at org.apache.solr.handler.TestSQLHandler.testBasicSelect(TestSQLHandler.java:137)
	at org.apache.solr.handler.TestSQLHandler.doTest(TestSQLHandler.java:85)
	at java.base/jdk.internal.reflect.NativeMethodAccessorImpl.invoke0(Native Method)
	at java.base/jdk.internal.reflect.NativeMethodAccessorImpl.invoke(NativeMethodAccessorImpl.java:62)
	at java.base/jdk.internal.reflect.DelegatingMethodAccessorImpl.invoke(DelegatingMethodAccessorImpl.java:43)
	at java.base/java.lang.reflect.Method.invoke(Method.java:566)
	at com.carrotsearch.randomizedtesting.RandomizedRunner.invoke(RandomizedRunner.java:1737)
	at com.carrotsearch.randomizedtesting.RandomizedRunner$8.evaluate(RandomizedRunner.java:934)
	at com.carrotsearch.randomizedtesting.RandomizedRunner$9.evaluate(RandomizedRunner.java:970)
	at com.carrotsearch.randomizedtesting.RandomizedRunner$10.evaluate(RandomizedRunner.java:984)
	at org.apache.solr.BaseDistributedSearchTestCase$ShardsRepeatRule$ShardsFixedStatement.callStatement(BaseDistributedSearchTestCase.java:1008)
	at org.apache.solr.BaseDistributedSearchTestCase$ShardsRepeatRule$ShardsStatement.evaluate(BaseDistributedSearchTestCase.java:983)
	at com.carrotsearch.randomizedtesting.rules.SystemPropertiesRestoreRule$1.evaluate(SystemPropertiesRestoreRule.java:57)
	at org.apache.lucene.util.TestRuleSetupTeardownChained$1.evaluate(TestRuleSetupTeardownChained.java:49)
	at org.apache.lucene.util.AbstractBeforeAfterRule$1.evaluate(AbstractBeforeAfterRule.java:45)
	at org.apache.lucene.util.TestRuleThreadAndTestName$1.evaluate(TestRuleThreadAndTestName.java:48)
	at org.apache.lucene.util.TestRuleIgnoreAfterMaxFailures$1.evaluate(TestRuleIgnoreAfterMaxFailures.java:64)
	at org.apache.lucene.util.TestRuleMarkFailure$1.evaluate(TestRuleMarkFailure.java:47)
	at com.carrotsearch.randomizedtesting.rules.StatementAdapter.evaluate(StatementAdapter.java:36)
	at com.carrotsearch.randomizedtesting.ThreadLeakControl$StatementRunner.run(ThreadLeakControl.java:368)
	at com.carrotsearch.randomizedtesting.ThreadLeakControl.forkTimeoutingTask(ThreadLeakControl.java:817)
	at com.carrotsearch.randomizedtesting.ThreadLeakControl$3.evaluate(ThreadLeakControl.java:468)
	at com.carrotsearch.randomizedtesting.RandomizedRunner.runSingleTest(RandomizedRunner.java:943)
	at com.carrotsearch.randomizedtesting.RandomizedRunner$5.evaluate(RandomizedRunner.java:829)
	at com.carrotsearch.randomizedtesting.RandomizedRunner$6.evaluate(RandomizedRunner.java:879)
	at com.carrotsearch.randomizedtesting.RandomizedRunner$7.evaluate(RandomizedRunner.java:890)
	at com.carrotsearch.randomizedtesting.rules.StatementAdapter.evaluate(StatementAdapter.java:36)
	at com.carrotsearch.randomizedtesting.rules.SystemPropertiesRestoreRule$1.evaluate(SystemPropertiesRestoreRule.java:57)
	at org.apache.lucene.util.AbstractBeforeAfterRule$1.evaluate(AbstractBeforeAfterRule.java:45)
	at com.carrotsearch.randomizedtesting.rules.StatementAdapter.evaluate(StatementAdapter.java:36)
	at org.apache.lucene.util.TestRuleStoreClassName$1.evaluate(TestRuleStoreClassName.java:41)
	at com.carrotsearch.randomizedtesting.rules.NoShadowingOrOverridesOnMethodsRule$1.evaluate(NoShadowingOrOverridesOnMethodsRule.java:40)
	at com.carrotsearch.randomizedtesting.rules.NoShadowingOrOverridesOnMethodsRule$1.evaluate(NoShadowingOrOverridesOnMethodsRule.java:40)
	at com.carrotsearch.randomizedtesting.rules.StatementAdapter.evaluate(StatementAdapter.java:36)
	at com.carrotsearch.randomizedtesting.rules.StatementAdapter.evaluate(StatementAdapter.java:36)
	at org.apache.lucene.util.TestRuleAssertionsRequired$1.evaluate(TestRuleAssertionsRequired.java:53)
	at org.apache.lucene.util.TestRuleMarkFailure$1.evaluate(TestRuleMarkFailure.java:47)
	at org.apache.lucene.util.TestRuleIgnoreAfterMaxFailures$1.evaluate(TestRuleIgnoreAfterMaxFailures.java:64)
	at org.apache.lucene.util.TestRuleIgnoreTestSuites$1.evaluate(TestRuleIgnoreTestSuites.java:54)
	at com.carrotsearch.randomizedtesting.rules.StatementAdapter.evaluate(StatementAdapter.java:36)
	at com.carrotsearch.randomizedtesting.ThreadLeakControl$StatementRunner.run(ThreadLeakControl.java:368)
	at java.base/java.lang.Thread.run(Thread.java:834)


FAILED:  org.apache.solr.handler.TestSQLHandler.doTest

Error Message:
--> https://127.0.0.1:45347/collection1_shard2_replica_n41:Failed to execute sqlQuery 'select distinct str_s as myString, field_i from collection1 order by myString desc, field_i desc' against JDBC connection 'jdbc:calcitesolr:'. Error while executing SQL "select distinct str_s as myString, field_i from collection1 order by myString desc, field_i desc": java.io.IOException: java.util.concurrent.ExecutionException: java.io.IOException: --> https://127.0.0.1:33709/collection1_shard2_replica_n45/:java.util.concurrent.ExecutionException: java.io.IOException: params fl=str_s,field_i&q=*:*&wt=javabin&qt=/export&partitionKeys=str_s,field_i&sort=str_s+desc,field_i+desc&distrib=false

Stack Trace:
java.io.IOException: --> https://127.0.0.1:45347/collection1_shard2_replica_n41:Failed to execute sqlQuery 'select distinct str_s as myString, field_i from collection1 order by myString desc, field_i desc' against JDBC connection 'jdbc:calcitesolr:'.
Error while executing SQL "select distinct str_s as myString, field_i from collection1 order by myString desc, field_i desc": java.io.IOException: java.util.concurrent.ExecutionException: java.io.IOException: --> https://127.0.0.1:33709/collection1_shard2_replica_n45/:java.util.concurrent.ExecutionException: java.io.IOException: params fl=str_s,field_i&q=*:*&wt=javabin&qt=/export&partitionKeys=str_s,field_i&sort=str_s+desc,field_i+desc&distrib=false
	at __randomizedtesting.SeedInfo.seed([F8F6C78538383BE7:5FB27F215583285E]:0)
	at org.apache.solr.client.solrj.io.stream.SolrStream.read(SolrStream.java:215)
	at org.apache.solr.handler.TestSQLHandler.getTuples(TestSQLHandler.java:2712)
	at org.apache.solr.handler.TestSQLHandler.testParallelSelectDistinct(TestSQLHandler.java:1623)
	at org.apache.solr.handler.TestSQLHandler.doTest(TestSQLHandler.java:100)
	at java.base/jdk.internal.reflect.NativeMethodAccessorImpl.invoke0(Native Method)
	at java.base/jdk.internal.reflect.NativeMethodAccessorImpl.invoke(NativeMethodAccessorImpl.java:62)
	at java.base/jdk.internal.reflect.DelegatingMethodAccessorImpl.invoke(DelegatingMethodAccessorImpl.java:43)
	at java.base/java.lang.reflect.Method.invoke(Method.java:566)
	at com.carrotsearch.randomizedtesting.RandomizedRunner.invoke(RandomizedRunner.java:1737)
	at com.carrotsearch.randomizedtesting.RandomizedRunner$8.evaluate(RandomizedRunner.java:934)
	at com.carrotsearch.randomizedtesting.RandomizedRunner$9.evaluate(RandomizedRunner.java:970)
	at com.carrotsearch.randomizedtesting.RandomizedRunner$10.evaluate(RandomizedRunner.java:984)
	at org.apache.solr.BaseDistributedSearchTestCase$ShardsRepeatRule$ShardsFixedStatement.callStatement(BaseDistributedSearchTestCase.java:1008)
	at org.apache.solr.BaseDistributedSearchTestCase$ShardsRepeatRule$ShardsStatement.evaluate(BaseDistributedSearchTestCase.java:983)
	at com.carrotsearch.randomizedtesting.rules.SystemPropertiesRestoreRule$1.evaluate(SystemPropertiesRestoreRule.java:57)
	at org.apache.lucene.util.TestRuleSetupTeardownChained$1.evaluate(TestRuleSetupTeardownChained.java:49)
	at org.apache.lucene.util.AbstractBeforeAfterRule$1.evaluate(AbstractBeforeAfterRule.java:45)
	at org.apache.lucene.util.TestRuleThreadAndTestName$1.evaluate(TestRuleThreadAndTestName.java:48)
	at org.apache.lucene.util.TestRuleIgnoreAfterMaxFailures$1.evaluate(TestRuleIgnoreAfterMaxFailures.java:64)
	at org.apache.lucene.util.TestRuleMarkFailure$1.evaluate(TestRuleMarkFailure.java:47)
	at com.carrotsearch.randomizedtesting.rules.StatementAdapter.evaluate(StatementAdapter.java:36)
	at com.carrotsearch.randomizedtesting.ThreadLeakControl$StatementRunner.run(ThreadLeakControl.java:368)
	at com.carrotsearch.randomizedtesting.ThreadLeakControl.forkTimeoutingTask(ThreadLeakControl.java:817)
	at com.carrotsearch.randomizedtesting.ThreadLeakControl$3.evaluate(ThreadLeakControl.java:468)
	at com.carrotsearch.randomizedtesting.RandomizedRunner.runSingleTest(RandomizedRunner.java:943)
	at com.carrotsearch.randomizedtesting.RandomizedRunner$5.evaluate(RandomizedRunner.java:829)
	at com.carrotsearch.randomizedtesting.RandomizedRunner$6.evaluate(RandomizedRunner.java:879)
	at com.carrotsearch.randomizedtesting.RandomizedRunner$7.evaluate(RandomizedRunner.java:890)
	at com.carrotsearch.randomizedtesting.rules.StatementAdapter.evaluate(StatementAdapter.java:36)
	at com.carrotsearch.randomizedtesting.rules.SystemPropertiesRestoreRule$1.evaluate(SystemPropertiesRestoreRule.java:57)
	at org.apache.lucene.util.AbstractBeforeAfterRule$1.evaluate(AbstractBeforeAfterRule.java:45)
	at com.carrotsearch.randomizedtesting.rules.StatementAdapter.evaluate(StatementAdapter.java:36)
	at org.apache.lucene.util.TestRuleStoreClassName$1.evaluate(TestRuleStoreClassName.java:41)
	at com.carrotsearch.randomizedtesting.rules.NoShadowingOrOverridesOnMethodsRule$1.evaluate(NoShadowingOrOverridesOnMethodsRule.java:40)
	at com.carrotsearch.randomizedtesting.rules.NoShadowingOrOverridesOnMethodsRule$1.evaluate(NoShadowingOrOverridesOnMethodsRule.java:40)
	at com.carrotsearch.randomizedtesting.rules.StatementAdapter.evaluate(StatementAdapter.java:36)
	at com.carrotsearch.randomizedtesting.rules.StatementAdapter.evaluate(StatementAdapter.java:36)
	at org.apache.lucene.util.TestRuleAssertionsRequired$1.evaluate(TestRuleAssertionsRequired.java:53)
	at org.apache.lucene.util.TestRuleMarkFailure$1.evaluate(TestRuleMarkFailure.java:47)
	at org.apache.lucene.util.TestRuleIgnoreAfterMaxFailures$1.evaluate(TestRuleIgnoreAfterMaxFailures.java:64)
	at org.apache.lucene.util.TestRuleIgnoreTestSuites$1.evaluate(TestRuleIgnoreTestSuites.java:54)
	at com.carrotsearch.randomizedtesting.rules.StatementAdapter.evaluate(StatementAdapter.java:36)
	at com.carrotsearch.randomizedtesting.ThreadLeakControl$StatementRunner.run(ThreadLeakControl.java:368)
	at java.base/java.lang.Thread.run(Thread.java:834)


FAILED:  org.apache.solr.handler.TestSQLHandler.doTest

Error Message:
--> https://127.0.0.1:38831/collection1_shard2_replica_n41:Failed to execute sqlQuery 'select id, field_i, str_s, field_i_p, field_f_p, field_d_p, field_l_p from collection1 where (text='(XXXX)' OR text='XXXX') AND text='XXXX' order by field_i desc' against JDBC connection 'jdbc:calcitesolr:'. Error while executing SQL "select id, field_i, str_s, field_i_p, field_f_p, field_d_p, field_l_p from collection1 where (text='(XXXX)' OR text='XXXX') AND text='XXXX' order by field_i desc": java.io.IOException: java.util.concurrent.ExecutionException: java.io.IOException: --> https://127.0.0.1:44709/collection1_shard2_replica_n45/:can not sort on a field w/o docValues unless it is indexed and supports Uninversion: field_i

Stack Trace:
java.io.IOException: --> https://127.0.0.1:38831/collection1_shard2_replica_n41:Failed to execute sqlQuery 'select id, field_i, str_s, field_i_p, field_f_p, field_d_p, field_l_p from collection1 where (text='(XXXX)' OR text='XXXX') AND text='XXXX' order by field_i desc' against JDBC connection 'jdbc:calcitesolr:'.
Error while executing SQL "select id, field_i, str_s, field_i_p, field_f_p, field_d_p, field_l_p from collection1 where (text='(XXXX)' OR text='XXXX') AND text='XXXX' order by field_i desc": java.io.IOException: java.util.concurrent.ExecutionException: java.io.IOException: --> https://127.0.0.1:44709/collection1_shard2_replica_n45/:can not sort on a field w/o docValues unless it is indexed and supports Uninversion: field_i
	at __randomizedtesting.SeedInfo.seed([F8F6C78538383BE7:5FB27F215583285E]:0)
	at org.apache.solr.client.solrj.io.stream.SolrStream.read(SolrStream.java:215)
	at org.apache.solr.handler.TestSQLHandler.getTuples(TestSQLHandler.java:2712)
	at org.apache.solr.handler.TestSQLHandler.testBasicSelect(TestSQLHandler.java:137)
	at org.apache.solr.handler.TestSQLHandler.doTest(TestSQLHandler.java:85)
	at java.base/jdk.internal.reflect.NativeMethodAccessorImpl.invoke0(Native Method)
	at java.base/jdk.internal.reflect.NativeMethodAccessorImpl.invoke(NativeMethodAccessorImpl.java:62)
	at java.base/jdk.internal.reflect.DelegatingMethodAccessorImpl.invoke(DelegatingMethodAccessorImpl.java:43)
	at java.base/java.lang.reflect.Method.invoke(Method.java:566)
	at com.carrotsearch.randomizedtesting.RandomizedRunner.invoke(RandomizedRunner.java:1737)
	at com.carrotsearch.randomizedtesting.RandomizedRunner$8.evaluate(RandomizedRunner.java:934)
	at com.carrotsearch.randomizedtesting.RandomizedRunner$9.evaluate(RandomizedRunner.java:970)
	at com.carrotsearch.randomizedtesting.RandomizedRunner$10.evaluate(RandomizedRunner.java:984)
	at org.apache.solr.BaseDistributedSearchTestCase$ShardsRepeatRule$ShardsFixedStatement.callStatement(BaseDistributedSearchTestCase.java:1008)
	at org.apache.solr.BaseDistributedSearchTestCase$ShardsRepeatRule$ShardsStatement.evaluate(BaseDistributedSearchTestCase.java:983)
	at com.carrotsearch.randomizedtesting.rules.SystemPropertiesRestoreRule$1.evaluate(SystemPropertiesRestoreRule.java:57)
	at org.apache.lucene.util.TestRuleSetupTeardownChained$1.evaluate(TestRuleSetupTeardownChained.java:49)
	at org.apache.lucene.util.AbstractBeforeAfterRule$1.evaluate(AbstractBeforeAfterRule.java:45)
	at org.apache.lucene.util.TestRuleThreadAndTestName$1.evaluate(TestRuleThreadAndTestName.java:48)
	at org.apache.lucene.util.TestRuleIgnoreAfterMaxFailures$1.evaluate(TestRuleIgnoreAfterMaxFailures.java:64)
	at org.apache.lucene.util.TestRuleMarkFailure$1.evaluate(TestRuleMarkFailure.java:47)
	at com.carrotsearch.randomizedtesting.rules.StatementAdapter.evaluate(StatementAdapter.java:36)
	at com.carrotsearch.randomizedtesting.ThreadLeakControl$StatementRunner.run(ThreadLeakControl.java:368)
	at com.carrotsearch.randomizedtesting.ThreadLeakControl.forkTimeoutingTask(ThreadLeakControl.java:817)
	at com.carrotsearch.randomizedtesting.ThreadLeakControl$3.evaluate(ThreadLeakControl.java:468)
	at com.carrotsearch.randomizedtesting.RandomizedRunner.runSingleTest(RandomizedRunner.java:943)
	at com.carrotsearch.randomizedtesting.RandomizedRunner$5.evaluate(RandomizedRunner.java:829)
	at com.carrotsearch.randomizedtesting.RandomizedRunner$6.evaluate(RandomizedRunner.java:879)
	at com.carrotsearch.randomizedtesting.RandomizedRunner$7.evaluate(RandomizedRunner.java:890)
	at com.carrotsearch.randomizedtesting.rules.StatementAdapter.evaluate(StatementAdapter.java:36)
	at com.carrotsearch.randomizedtesting.rules.SystemPropertiesRestoreRule$1.evaluate(SystemPropertiesRestoreRule.java:57)
	at org.apache.lucene.util.AbstractBeforeAfterRule$1.evaluate(AbstractBeforeAfterRule.java:45)
	at com.carrotsearch.randomizedtesting.rules.StatementAdapter.evaluate(StatementAdapter.java:36)
	at org.apache.lucene.util.TestRuleStoreClassName$1.evaluate(TestRuleStoreClassName.java:41)
	at com.carrotsearch.randomizedtesting.rules.NoShadowingOrOverridesOnMethodsRule$1.evaluate(NoShadowingOrOverridesOnMethodsRule.java:40)
	at com.carrotsearch.randomizedtesting.rules.NoShadowingOrOverridesOnMethodsRule$1.evaluate(NoShadowingOrOverridesOnMethodsRule.java:40)
	at com.carrotsearch.randomizedtesting.rules.StatementAdapter.evaluate(StatementAdapter.java:36)
	at com.carrotsearch.randomizedtesting.rules.StatementAdapter.evaluate(StatementAdapter.java:36)
	at org.apache.lucene.util.TestRuleAssertionsRequired$1.evaluate(TestRuleAssertionsRequired.java:53)
	at org.apache.lucene.util.TestRuleMarkFailure$1.evaluate(TestRuleMarkFailure.java:47)
	at org.apache.lucene.util.TestRuleIgnoreAfterMaxFailures$1.evaluate(TestRuleIgnoreAfterMaxFailures.java:64)
	at org.apache.lucene.util.TestRuleIgnoreTestSuites$1.evaluate(TestRuleIgnoreTestSuites.java:54)
	at com.carrotsearch.randomizedtesting.rules.StatementAdapter.evaluate(StatementAdapter.java:36)
	at com.carrotsearch.randomizedtesting.ThreadLeakControl$StatementRunner.run(ThreadLeakControl.java:368)
	at java.base/java.lang.Thread.run(Thread.java:834)


FAILED:  org.apache.solr.handler.TestSQLHandler.doTest

Error Message:
--> https://127.0.0.1:35589/collection1_shard2_replica_n41:Failed to execute sqlQuery 'select distinct str_s, field_i from collection1 order by str_s desc, field_i desc limit 2' against JDBC connection 'jdbc:calcitesolr:'. Error while executing SQL "select distinct str_s, field_i from collection1 order by str_s desc, field_i desc limit 2": java.io.IOException: java.util.concurrent.ExecutionException: java.io.IOException: --> https://127.0.0.1:37777/collection1_shard2_replica_n45/:java.util.concurrent.ExecutionException: java.io.IOException: params fl=str_s,field_i&q=*:*&wt=javabin&qt=/export&partitionKeys=str_s,field_i&sort=str_s+desc,field_i+desc&distrib=false

Stack Trace:
java.io.IOException: --> https://127.0.0.1:35589/collection1_shard2_replica_n41:Failed to execute sqlQuery 'select distinct str_s, field_i from collection1 order by str_s desc, field_i desc limit 2' against JDBC connection 'jdbc:calcitesolr:'.
Error while executing SQL "select distinct str_s, field_i from collection1 order by str_s desc, field_i desc limit 2": java.io.IOException: java.util.concurrent.ExecutionException: java.io.IOException: --> https://127.0.0.1:37777/collection1_shard2_replica_n45/:java.util.concurrent.ExecutionException: java.io.IOException: params fl=str_s,field_i&q=*:*&wt=javabin&qt=/export&partitionKeys=str_s,field_i&sort=str_s+desc,field_i+desc&distrib=false
	at __randomizedtesting.SeedInfo.seed([F8F6C78538383BE7:5FB27F215583285E]:0)
	at org.apache.solr.client.solrj.io.stream.SolrStream.read(SolrStream.java:215)
	at org.apache.solr.handler.TestSQLHandler.getTuples(TestSQLHandler.java:2712)
	at org.apache.solr.handler.TestSQLHandler.testParallelSelectDistinct(TestSQLHandler.java:1659)
	at org.apache.solr.handler.TestSQLHandler.doTest(TestSQLHandler.java:100)
	at java.base/jdk.internal.reflect.NativeMethodAccessorImpl.invoke0(Native Method)
	at java.base/jdk.internal.reflect.NativeMethodAccessorImpl.invoke(NativeMethodAccessorImpl.java:62)
	at java.base/jdk.internal.reflect.DelegatingMethodAccessorImpl.invoke(DelegatingMethodAccessorImpl.java:43)
	at java.base/java.lang.reflect.Method.invoke(Method.java:566)
	at com.carrotsearch.randomizedtesting.RandomizedRunner.invoke(RandomizedRunner.java:1737)
	at com.carrotsearch.randomizedtesting.RandomizedRunner$8.evaluate(RandomizedRunner.java:934)
	at com.carrotsearch.randomizedtesting.RandomizedRunner$9.evaluate(RandomizedRunner.java:970)
	at com.carrotsearch.randomizedtesting.RandomizedRunner$10.evaluate(RandomizedRunner.java:984)
	at org.apache.solr.BaseDistributedSearchTestCase$ShardsRepeatRule$ShardsFixedStatement.callStatement(BaseDistributedSearchTestCase.java:1008)
	at org.apache.solr.BaseDistributedSearchTestCase$ShardsRepeatRule$ShardsStatement.evaluate(BaseDistributedSearchTestCase.java:983)
	at com.carrotsearch.randomizedtesting.rules.SystemPropertiesRestoreRule$1.evaluate(SystemPropertiesRestoreRule.java:57)
	at org.apache.lucene.util.TestRuleSetupTeardownChained$1.evaluate(TestRuleSetupTeardownChained.java:49)
	at org.apache.lucene.util.AbstractBeforeAfterRule$1.evaluate(AbstractBeforeAfterRule.java:45)
	at org.apache.lucene.util.TestRuleThreadAndTestName$1.evaluate(TestRuleThreadAndTestName.java:48)
	at org.apache.lucene.util.TestRuleIgnoreAfterMaxFailures$1.evaluate(TestRuleIgnoreAfterMaxFailures.java:64)
	at org.apache.lucene.util.TestRuleMarkFailure$1.evaluate(TestRuleMarkFailure.java:47)
	at com.carrotsearch.randomizedtesting.rules.StatementAdapter.evaluate(StatementAdapter.java:36)
	at com.carrotsearch.randomizedtesting.ThreadLeakControl$StatementRunner.run(ThreadLeakControl.java:368)
	at com.carrotsearch.randomizedtesting.ThreadLeakControl.forkTimeoutingTask(ThreadLeakControl.java:817)
	at com.carrotsearch.randomizedtesting.ThreadLeakControl$3.evaluate(ThreadLeakControl.java:468)
	at com.carrotsearch.randomizedtesting.RandomizedRunner.runSingleTest(RandomizedRunner.java:943)
	at com.carrotsearch.randomizedtesting.RandomizedRunner$5.evaluate(RandomizedRunner.java:829)
	at com.carrotsearch.randomizedtesting.RandomizedRunner$6.evaluate(RandomizedRunner.java:879)
	at com.carrotsearch.randomizedtesting.RandomizedRunner$7.evaluate(RandomizedRunner.java:890)
	at com.carrotsearch.randomizedtesting.rules.StatementAdapter.evaluate(StatementAdapter.java:36)
	at com.carrotsearch.randomizedtesting.rules.SystemPropertiesRestoreRule$1.evaluate(SystemPropertiesRestoreRule.java:57)
	at org.apache.lucene.util.AbstractBeforeAfterRule$1.evaluate(AbstractBeforeAfterRule.java:45)
	at com.carrotsearch.randomizedtesting.rules.StatementAdapter.evaluate(StatementAdapter.java:36)
	at org.apache.lucene.util.TestRuleStoreClassName$1.evaluate(TestRuleStoreClassName.java:41)
	at com.carrotsearch.randomizedtesting.rules.NoShadowingOrOverridesOnMethodsRule$1.evaluate(NoShadowingOrOverridesOnMethodsRule.java:40)
	at com.carrotsearch.randomizedtesting.rules.NoShadowingOrOverridesOnMethodsRule$1.evaluate(NoShadowingOrOverridesOnMethodsRule.java:40)
	at com.carrotsearch.randomizedtesting.rules.StatementAdapter.evaluate(StatementAdapter.java:36)
	at com.carrotsearch.randomizedtesting.rules.StatementAdapter.evaluate(StatementAdapter.java:36)
	at org.apache.lucene.util.TestRuleAssertionsRequired$1.evaluate(TestRuleAssertionsRequired.java:53)
	at org.apache.lucene.util.TestRuleMarkFailure$1.evaluate(TestRuleMarkFailure.java:47)
	at org.apache.lucene.util.TestRuleIgnoreAfterMaxFailures$1.evaluate(TestRuleIgnoreAfterMaxFailures.java:64)
	at org.apache.lucene.util.TestRuleIgnoreTestSuites$1.evaluate(TestRuleIgnoreTestSuites.java:54)
	at com.carrotsearch.randomizedtesting.rules.StatementAdapter.evaluate(StatementAdapter.java:36)
	at com.carrotsearch.randomizedtesting.ThreadLeakControl$StatementRunner.run(ThreadLeakControl.java:368)
	at java.base/java.lang.Thread.run(Thread.java:834)




Build Log:
[...truncated 14058 lines...]
   [junit4] Suite: org.apache.solr.cloud.TestTlogReplica
   [junit4]   2> 1917410 INFO  (SUITE-TestTlogReplica-seed#[F8F6C78538383BE7]-worker) [    ] o.a.s.SolrTestCaseJ4 SecureRandom sanity checks: test.solr.allowed.securerandom=null & java.security.egd=file:/dev/./urandom
   [junit4]   2> Creating dataDir: /home/jenkins/workspace/Lucene-Solr-7.x-Linux/solr/build/solr-core/test/J2/temp/solr.cloud.TestTlogReplica_F8F6C78538383BE7-001/init-core-data-001
   [junit4]   2> 1917410 INFO  (SUITE-TestTlogReplica-seed#[F8F6C78538383BE7]-worker) [    ] o.a.s.SolrTestCaseJ4 Using PointFields (NUMERIC_POINTS_SYSPROP=true) w/NUMERIC_DOCVALUES_SYSPROP=true
   [junit4]   

[...truncated too long message...]

(id=72154836051099681-127.0.0.1:44705_solr-n_0000000007) closing
   [junit4]   2> 369027 INFO  (OverseerStateUpdate-72154836051099681-127.0.0.1:44705_solr-n_0000000007) [n:127.0.0.1:44705_solr    ] o.a.s.c.Overseer Overseer Loop exiting : 127.0.0.1:44705_solr
   [junit4]   2> 369027 WARN  (OverseerAutoScalingTriggerThread-72154836051099681-127.0.0.1:44705_solr-n_0000000007) [    ] o.a.s.c.a.OverseerTriggerThread OverseerTriggerThread woken up but we are closed, exiting.
   [junit4]   2> 369028 INFO  (jetty-closer-2644-thread-2) [    ] o.a.s.m.SolrMetricManager Closing metric reporters for registry=solr.jetty, tag=null
   [junit4]   2> 369028 INFO  (jetty-closer-2644-thread-2) [    ] o.a.s.m.r.SolrJmxReporter Closing reporter [org.apache.solr.metrics.reporters.SolrJmxReporter@734d4cfc: rootName = solr_45925, domain = solr.jetty, service url = null, agent id = null] for registry solr.jetty / com.codahale.metrics.MetricRegistry@4fac64bc
   [junit4]   2> 369029 INFO  (jetty-closer-2644-thread-2) [    ] o.a.s.c.ZkController Remove node as live in ZooKeeper:/live_nodes/127.0.0.1:45925_solr
   [junit4]   2> 369029 INFO  (zkCallback-2799-thread-2) [    ] o.a.s.c.OverseerElectionContext I am going to be the leader 127.0.0.1:45925_solr
   [junit4]   2> 369029 INFO  (jetty-closer-2644-thread-2) [    ] o.a.s.m.SolrMetricManager Closing metric reporters for registry=solr.cluster, tag=null
   [junit4]   2> 369030 INFO  (zkCallback-2806-thread-1) [    ] o.a.s.c.c.ZkStateReader Updated live nodes from ZooKeeper... (1) -> (0)
   [junit4]   2> 369030 INFO  (zkCallback-2799-thread-1) [    ] o.a.s.c.c.ZkStateReader Updated live nodes from ZooKeeper... (1) -> (0)
   [junit4]   2> 369036 INFO  (jetty-closer-2644-thread-1) [    ] o.e.j.s.h.ContextHandler Stopped o.e.j.s.ServletContextHandler@68cea0e4{/solr,null,UNAVAILABLE}
   [junit4]   2> 369037 INFO  (jetty-closer-2644-thread-1) [    ] o.e.j.s.session node0 Stopped scavenging
   [junit4]   2> 369037 INFO  (jetty-closer-2644-thread-2) [    ] o.e.j.s.h.ContextHandler Stopped o.e.j.s.ServletContextHandler@217f6000{/solr,null,UNAVAILABLE}
   [junit4]   2> 369037 INFO  (jetty-closer-2644-thread-2) [    ] o.e.j.s.session node0 Stopped scavenging
   [junit4]   2> 369037 ERROR (SUITE-TestTlogReplica-seed#[F8F6C78538383BE7]-worker) [    ] o.a.z.s.ZooKeeperServer ZKShutdownHandler is not registered, so ZooKeeper server won't take any action on ERROR or SHUTDOWN server state changes
   [junit4]   2> 369038 INFO  (SUITE-TestTlogReplica-seed#[F8F6C78538383BE7]-worker) [    ] o.a.s.c.ZkTestServer connecting to 127.0.0.1:32881 32881
   [junit4]   2> 369149 INFO  (Thread-211) [    ] o.a.s.c.ZkTestServer connecting to 127.0.0.1:32881 32881
   [junit4]   2> 369150 WARN  (Thread-211) [    ] o.a.s.c.ZkTestServer Watch limit violations: 
   [junit4]   2> Maximum concurrent create/delete watches above limit:
   [junit4]   2> 
   [junit4]   2> 	34	/solr/configs/conf
   [junit4]   2> 	32	/solr/collections/tlog_replica_test_create_delete/terms/shard2
   [junit4]   2> 	31	/solr/collections/tlog_replica_test_create_delete/terms/shard1
   [junit4]   2> 	27	/solr/collections/tlog_replica_test_recovery/terms/shard1
   [junit4]   2> 	20	/solr/collections/tlog_replica_test_remove_leader/terms/shard1
   [junit4]   2> 	19	/solr/aliases.json
   [junit4]   2> 	19	/solr/collections/tlog_replica_test_add_docs/terms/shard1
   [junit4]   2> 	19	/solr/collections/tlog_replica_test_real_time_get/terms/shard1
   [junit4]   2> 	17	/solr/collections/tlog_replica_test_kill_leader/terms/shard1
   [junit4]   2> 	16	/solr/collections/tlog_replica_test_kill_tlog_replica/terms/shard1
   [junit4]   2> 	15	/solr/collections/tlog_replica_test_basic_leader_election/terms/shard1
   [junit4]   2> 	13	/solr/collections/tlog_replica_test_out_of_order_db_qwith_in_place_updates/terms/shard1
   [junit4]   2> 	11	/solr/collections/tlog_replica_test_only_leader_indexes/terms/shard1
   [junit4]   2> 	9	/solr/collections/tlog_replica_test_delete_by_id/terms/shard1
   [junit4]   2> 	9	/solr/security.json
   [junit4]   2> 	7	/solr/collections/tlog_replica_test_add_remove_tlog_replica/terms/shard1
   [junit4]   2> 	7	/solr/collections/tlog_replica_test_add_remove_tlog_replica/terms/shard2
   [junit4]   2> 
   [junit4]   2> Maximum concurrent data watches above limit:
   [junit4]   2> 
   [junit4]   2> 	28	/solr/collections/tlog_replica_test_out_of_order_db_qwith_in_place_updates/state.json
   [junit4]   2> 	23	/solr/collections/tlog_replica_test_create_delete/state.json
   [junit4]   2> 	19	/solr/clusterstate.json
   [junit4]   2> 	19	/solr/clusterprops.json
   [junit4]   2> 	18	/solr/collections/tlog_replica_test_recovery/state.json
   [junit4]   2> 	13	/solr/collections/tlog_replica_test_kill_leader/state.json
   [junit4]   2> 	13	/solr/collections/tlog_replica_test_basic_leader_election/state.json
   [junit4]   2> 	10	/solr/collections/tlog_replica_test_kill_tlog_replica/state.json
   [junit4]   2> 	9	/solr/collections/tlog_replica_test_remove_leader/state.json
   [junit4]   2> 	7	/solr/collections/tlog_replica_test_real_time_get/state.json
   [junit4]   2> 	5	/solr/collections/tlog_replica_test_add_docs/state.json
   [junit4]   2> 	4	/solr/collections/tlog_replica_test_recovery/leader_elect/shard1/election/72154836051099652-core_node3-n_0000000000
   [junit4]   2> 	4	/solr/autoscaling.json
   [junit4]   2> 	4	/solr/overseer_elect/election/72154836051099652-127.0.0.1:44705_solr-n_0000000001
   [junit4]   2> 	3	/solr/collections/tlog_replica_test_add_remove_tlog_replica/state.json
   [junit4]   2> 	3	/solr/collections/tlog_replica_test_only_leader_indexes/state.json
   [junit4]   2> 	3	/solr/collections/tlog_replica_test_delete_by_id/state.json
   [junit4]   2> 	2	/solr/collections/tlog_replica_test_create_delete/leader_elect/shard2/election/72154836051099673-core_node11-n_0000000000
   [junit4]   2> 	2	/solr/collections/tlog_replica_test_create_delete/leader_elect/shard1/election/72154836051099673-core_node3-n_0000000000
   [junit4]   2> 	2	/solr/collections/tlog_replica_test_real_time_get/leader_elect/shard1/election/72154836051099652-core_node3-n_0000000000
   [junit4]   2> 	2	/solr/collections/tlog_replica_test_kill_tlog_replica/leader_elect/shard1/election/72154836051099681-core_node4-n_0000000000
   [junit4]   2> 	2	/solr/overseer_elect/election/72154836051099673-127.0.0.1:45925_solr-n_0000000005
   [junit4]   2> 
   [junit4]   2> Maximum concurrent children watches above limit:
   [junit4]   2> 
   [junit4]   2> 	19	/solr/live_nodes
   [junit4]   2> 	19	/solr/collections
   [junit4]   2> 	4	/solr/overseer/queue
   [junit4]   2> 	4	/solr/autoscaling/events/.scheduled_maintenance
   [junit4]   2> 	4	/solr/autoscaling/events/.auto_add_replicas
   [junit4]   2> 	4	/solr/overseer/queue-work
   [junit4]   2> 	4	/solr/overseer/collection-queue-work
   [junit4]   2> 
   [junit4]   2> NOTE: leaving temporary files on disk at: /home/jenkins/workspace/Lucene-Solr-7.x-Linux/solr/build/solr-core/test/J2/temp/solr.cloud.TestTlogReplica_F8F6C78538383BE7-001
   [junit4]   2> NOTE: test params are: codec=Asserting(Lucene70): {foo=Lucene50(blocksize=128), title_s=PostingsFormat(name=Memory), id=PostingsFormat(name=LuceneVarGapDocFreqInterval), foo_s=Lucene50(blocksize=128)}, docValues:{_version_=DocValuesFormat(name=Memory), id=DocValuesFormat(name=Lucene70), inplace_updatable_int=DocValuesFormat(name=Asserting)}, maxPointsInLeafNode=767, maxMBSortInHeap=7.737299238792886, sim=RandomSimilarity(queryNorm=true): {}, locale=fr-LU, timezone=America/Belem
   [junit4]   2> NOTE: Linux 4.15.0-32-generic amd64/Oracle Corporation 11 (64-bit)/cpus=8,threads=1,free=233142960,total=520617984
   [junit4]   2> NOTE: All tests run in this JVM: [TestTlogReplica, CdcrBidirectionalTest, TestSQLHandler, TestTlogReplica]
   [junit4] Completed [11/15 (5!)] on J2 in 110.75s, 13 tests, 1 failure <<< FAILURES!

[...truncated 59 lines...]
BUILD FAILED
/home/jenkins/workspace/Lucene-Solr-7.x-Linux/lucene/common-build.xml:1568: The following error occurred while executing this line:
/home/jenkins/workspace/Lucene-Solr-7.x-Linux/lucene/common-build.xml:1092: There were test failures: 15 suites, 75 tests, 4 suite-level errors, 4 errors, 1 failure [seed: F8F6C78538383BE7]

Total time: 6 minutes 59 seconds

[repro] Setting last failure code to 256

[repro] Failures:
[repro]   0/5 failed: org.apache.solr.cloud.cdcr.CdcrBidirectionalTest
[repro]   1/5 failed: org.apache.solr.cloud.TestTlogReplica
[repro]   4/5 failed: org.apache.solr.handler.TestSQLHandler
[repro] Exiting with code 256
+ mv lucene/build lucene/build.repro
+ mv solr/build solr/build.repro
+ mv lucene/build.orig lucene/build
+ mv solr/build.orig solr/build
Archiving artifacts
Setting ANT_1_8_2_HOME=/var/lib/jenkins/tools/hudson.tasks.Ant_AntInstallation/ANT_1.8.2
[WARNINGS] Parsing warnings in console log with parser Java Compiler (javac)
Setting ANT_1_8_2_HOME=/var/lib/jenkins/tools/hudson.tasks.Ant_AntInstallation/ANT_1.8.2
Setting ANT_1_8_2_HOME=/var/lib/jenkins/tools/hudson.tasks.Ant_AntInstallation/ANT_1.8.2
<Git Blamer> Using GitBlamer to create author and commit information for all warnings.
<Git Blamer> GIT_COMMIT=d35b615c66e8974363b7a938abc0d74a85a798dd, workspace=/var/lib/jenkins/workspace/Lucene-Solr-7.x-Linux
[WARNINGS] Computing warning deltas based on reference build #2672
Recording test results
Setting ANT_1_8_2_HOME=/var/lib/jenkins/tools/hudson.tasks.Ant_AntInstallation/ANT_1.8.2
Build step 'Publish JUnit test result report' changed build result to UNSTABLE
Email was triggered for: Unstable (Test Failures)
Sending email for trigger: Unstable (Test Failures)
Setting ANT_1_8_2_HOME=/var/lib/jenkins/tools/hudson.tasks.Ant_AntInstallation/ANT_1.8.2
Setting ANT_1_8_2_HOME=/var/lib/jenkins/tools/hudson.tasks.Ant_AntInstallation/ANT_1.8.2
Setting ANT_1_8_2_HOME=/var/lib/jenkins/tools/hudson.tasks.Ant_AntInstallation/ANT_1.8.2
Setting ANT_1_8_2_HOME=/var/lib/jenkins/tools/hudson.tasks.Ant_AntInstallation/ANT_1.8.2

Mime
View raw message