lucene-dev mailing list archives

Site index · List index
Message view « Date » · « Thread »
Top « Date » · « Thread »
From Policeman Jenkins Server <jenk...@thetaphi.de>
Subject [JENKINS] Lucene-Solr-7.x-Windows (64bit/jdk-10) - Build # 792 - Unstable!
Date Sat, 15 Sep 2018 08:57:31 GMT
Build: https://jenkins.thetaphi.de/job/Lucene-Solr-7.x-Windows/792/
Java: 64bit/jdk-10 -XX:+UseCompressedOops -XX:+UseConcMarkSweepGC

4 tests failed.
FAILED:  org.apache.solr.cloud.autoscaling.ScheduledTriggerTest.testTrigger

Error Message:
expected:<3> but was:<2>

Stack Trace:
java.lang.AssertionError: expected:<3> but was:<2>
	at __randomizedtesting.SeedInfo.seed([8C762486BC0D9086:EFBD120425C2E3AB]:0)
	at org.junit.Assert.fail(Assert.java:93)
	at org.junit.Assert.failNotEquals(Assert.java:647)
	at org.junit.Assert.assertEquals(Assert.java:128)
	at org.junit.Assert.assertEquals(Assert.java:472)
	at org.junit.Assert.assertEquals(Assert.java:456)
	at org.apache.solr.cloud.autoscaling.ScheduledTriggerTest.scheduledTriggerTest(ScheduledTriggerTest.java:113)
	at org.apache.solr.cloud.autoscaling.ScheduledTriggerTest.testTrigger(ScheduledTriggerTest.java:66)
	at java.base/jdk.internal.reflect.NativeMethodAccessorImpl.invoke0(Native Method)
	at java.base/jdk.internal.reflect.NativeMethodAccessorImpl.invoke(NativeMethodAccessorImpl.java:62)
	at java.base/jdk.internal.reflect.DelegatingMethodAccessorImpl.invoke(DelegatingMethodAccessorImpl.java:43)
	at java.base/java.lang.reflect.Method.invoke(Method.java:564)
	at com.carrotsearch.randomizedtesting.RandomizedRunner.invoke(RandomizedRunner.java:1742)
	at com.carrotsearch.randomizedtesting.RandomizedRunner$8.evaluate(RandomizedRunner.java:935)
	at com.carrotsearch.randomizedtesting.RandomizedRunner$9.evaluate(RandomizedRunner.java:971)
	at com.carrotsearch.randomizedtesting.RandomizedRunner$10.evaluate(RandomizedRunner.java:985)
	at com.carrotsearch.randomizedtesting.rules.SystemPropertiesRestoreRule$1.evaluate(SystemPropertiesRestoreRule.java:57)
	at org.apache.lucene.util.TestRuleSetupTeardownChained$1.evaluate(TestRuleSetupTeardownChained.java:49)
	at org.apache.lucene.util.AbstractBeforeAfterRule$1.evaluate(AbstractBeforeAfterRule.java:45)
	at org.apache.lucene.util.TestRuleThreadAndTestName$1.evaluate(TestRuleThreadAndTestName.java:48)
	at org.apache.lucene.util.TestRuleIgnoreAfterMaxFailures$1.evaluate(TestRuleIgnoreAfterMaxFailures.java:64)
	at org.apache.lucene.util.TestRuleMarkFailure$1.evaluate(TestRuleMarkFailure.java:47)
	at com.carrotsearch.randomizedtesting.rules.StatementAdapter.evaluate(StatementAdapter.java:36)
	at com.carrotsearch.randomizedtesting.ThreadLeakControl$StatementRunner.run(ThreadLeakControl.java:368)
	at com.carrotsearch.randomizedtesting.ThreadLeakControl.forkTimeoutingTask(ThreadLeakControl.java:817)
	at com.carrotsearch.randomizedtesting.ThreadLeakControl$3.evaluate(ThreadLeakControl.java:468)
	at com.carrotsearch.randomizedtesting.RandomizedRunner.runSingleTest(RandomizedRunner.java:944)
	at com.carrotsearch.randomizedtesting.RandomizedRunner$5.evaluate(RandomizedRunner.java:830)
	at com.carrotsearch.randomizedtesting.RandomizedRunner$6.evaluate(RandomizedRunner.java:880)
	at com.carrotsearch.randomizedtesting.RandomizedRunner$7.evaluate(RandomizedRunner.java:891)
	at com.carrotsearch.randomizedtesting.rules.StatementAdapter.evaluate(StatementAdapter.java:36)
	at com.carrotsearch.randomizedtesting.rules.SystemPropertiesRestoreRule$1.evaluate(SystemPropertiesRestoreRule.java:57)
	at org.apache.lucene.util.AbstractBeforeAfterRule$1.evaluate(AbstractBeforeAfterRule.java:45)
	at com.carrotsearch.randomizedtesting.rules.StatementAdapter.evaluate(StatementAdapter.java:36)
	at org.apache.lucene.util.TestRuleStoreClassName$1.evaluate(TestRuleStoreClassName.java:41)
	at com.carrotsearch.randomizedtesting.rules.NoShadowingOrOverridesOnMethodsRule$1.evaluate(NoShadowingOrOverridesOnMethodsRule.java:40)
	at com.carrotsearch.randomizedtesting.rules.NoShadowingOrOverridesOnMethodsRule$1.evaluate(NoShadowingOrOverridesOnMethodsRule.java:40)
	at com.carrotsearch.randomizedtesting.rules.StatementAdapter.evaluate(StatementAdapter.java:36)
	at com.carrotsearch.randomizedtesting.rules.StatementAdapter.evaluate(StatementAdapter.java:36)
	at org.apache.lucene.util.TestRuleAssertionsRequired$1.evaluate(TestRuleAssertionsRequired.java:53)
	at org.apache.lucene.util.TestRuleMarkFailure$1.evaluate(TestRuleMarkFailure.java:47)
	at org.apache.lucene.util.TestRuleIgnoreAfterMaxFailures$1.evaluate(TestRuleIgnoreAfterMaxFailures.java:64)
	at org.apache.lucene.util.TestRuleIgnoreTestSuites$1.evaluate(TestRuleIgnoreTestSuites.java:54)
	at com.carrotsearch.randomizedtesting.rules.StatementAdapter.evaluate(StatementAdapter.java:36)
	at com.carrotsearch.randomizedtesting.ThreadLeakControl$StatementRunner.run(ThreadLeakControl.java:368)
	at java.base/java.lang.Thread.run(Thread.java:844)


FAILED:  org.apache.solr.cloud.autoscaling.ScheduledTriggerTest.testTrigger

Error Message:
expected:<3> but was:<2>

Stack Trace:
java.lang.AssertionError: expected:<3> but was:<2>
	at __randomizedtesting.SeedInfo.seed([8C762486BC0D9086:EFBD120425C2E3AB]:0)
	at org.junit.Assert.fail(Assert.java:93)
	at org.junit.Assert.failNotEquals(Assert.java:647)
	at org.junit.Assert.assertEquals(Assert.java:128)
	at org.junit.Assert.assertEquals(Assert.java:472)
	at org.junit.Assert.assertEquals(Assert.java:456)
	at org.apache.solr.cloud.autoscaling.ScheduledTriggerTest.scheduledTriggerTest(ScheduledTriggerTest.java:113)
	at org.apache.solr.cloud.autoscaling.ScheduledTriggerTest.testTrigger(ScheduledTriggerTest.java:66)
	at java.base/jdk.internal.reflect.NativeMethodAccessorImpl.invoke0(Native Method)
	at java.base/jdk.internal.reflect.NativeMethodAccessorImpl.invoke(NativeMethodAccessorImpl.java:62)
	at java.base/jdk.internal.reflect.DelegatingMethodAccessorImpl.invoke(DelegatingMethodAccessorImpl.java:43)
	at java.base/java.lang.reflect.Method.invoke(Method.java:564)
	at com.carrotsearch.randomizedtesting.RandomizedRunner.invoke(RandomizedRunner.java:1742)
	at com.carrotsearch.randomizedtesting.RandomizedRunner$8.evaluate(RandomizedRunner.java:935)
	at com.carrotsearch.randomizedtesting.RandomizedRunner$9.evaluate(RandomizedRunner.java:971)
	at com.carrotsearch.randomizedtesting.RandomizedRunner$10.evaluate(RandomizedRunner.java:985)
	at com.carrotsearch.randomizedtesting.rules.SystemPropertiesRestoreRule$1.evaluate(SystemPropertiesRestoreRule.java:57)
	at org.apache.lucene.util.TestRuleSetupTeardownChained$1.evaluate(TestRuleSetupTeardownChained.java:49)
	at org.apache.lucene.util.AbstractBeforeAfterRule$1.evaluate(AbstractBeforeAfterRule.java:45)
	at org.apache.lucene.util.TestRuleThreadAndTestName$1.evaluate(TestRuleThreadAndTestName.java:48)
	at org.apache.lucene.util.TestRuleIgnoreAfterMaxFailures$1.evaluate(TestRuleIgnoreAfterMaxFailures.java:64)
	at org.apache.lucene.util.TestRuleMarkFailure$1.evaluate(TestRuleMarkFailure.java:47)
	at com.carrotsearch.randomizedtesting.rules.StatementAdapter.evaluate(StatementAdapter.java:36)
	at com.carrotsearch.randomizedtesting.ThreadLeakControl$StatementRunner.run(ThreadLeakControl.java:368)
	at com.carrotsearch.randomizedtesting.ThreadLeakControl.forkTimeoutingTask(ThreadLeakControl.java:817)
	at com.carrotsearch.randomizedtesting.ThreadLeakControl$3.evaluate(ThreadLeakControl.java:468)
	at com.carrotsearch.randomizedtesting.RandomizedRunner.runSingleTest(RandomizedRunner.java:944)
	at com.carrotsearch.randomizedtesting.RandomizedRunner$5.evaluate(RandomizedRunner.java:830)
	at com.carrotsearch.randomizedtesting.RandomizedRunner$6.evaluate(RandomizedRunner.java:880)
	at com.carrotsearch.randomizedtesting.RandomizedRunner$7.evaluate(RandomizedRunner.java:891)
	at com.carrotsearch.randomizedtesting.rules.StatementAdapter.evaluate(StatementAdapter.java:36)
	at com.carrotsearch.randomizedtesting.rules.SystemPropertiesRestoreRule$1.evaluate(SystemPropertiesRestoreRule.java:57)
	at org.apache.lucene.util.AbstractBeforeAfterRule$1.evaluate(AbstractBeforeAfterRule.java:45)
	at com.carrotsearch.randomizedtesting.rules.StatementAdapter.evaluate(StatementAdapter.java:36)
	at org.apache.lucene.util.TestRuleStoreClassName$1.evaluate(TestRuleStoreClassName.java:41)
	at com.carrotsearch.randomizedtesting.rules.NoShadowingOrOverridesOnMethodsRule$1.evaluate(NoShadowingOrOverridesOnMethodsRule.java:40)
	at com.carrotsearch.randomizedtesting.rules.NoShadowingOrOverridesOnMethodsRule$1.evaluate(NoShadowingOrOverridesOnMethodsRule.java:40)
	at com.carrotsearch.randomizedtesting.rules.StatementAdapter.evaluate(StatementAdapter.java:36)
	at com.carrotsearch.randomizedtesting.rules.StatementAdapter.evaluate(StatementAdapter.java:36)
	at org.apache.lucene.util.TestRuleAssertionsRequired$1.evaluate(TestRuleAssertionsRequired.java:53)
	at org.apache.lucene.util.TestRuleMarkFailure$1.evaluate(TestRuleMarkFailure.java:47)
	at org.apache.lucene.util.TestRuleIgnoreAfterMaxFailures$1.evaluate(TestRuleIgnoreAfterMaxFailures.java:64)
	at org.apache.lucene.util.TestRuleIgnoreTestSuites$1.evaluate(TestRuleIgnoreTestSuites.java:54)
	at com.carrotsearch.randomizedtesting.rules.StatementAdapter.evaluate(StatementAdapter.java:36)
	at com.carrotsearch.randomizedtesting.ThreadLeakControl$StatementRunner.run(ThreadLeakControl.java:368)
	at java.base/java.lang.Thread.run(Thread.java:844)


FAILED:  org.apache.solr.cloud.autoscaling.sim.TestSimTriggerIntegration.testEventQueue

Error Message:
action wasn't interrupted

Stack Trace:
java.lang.AssertionError: action wasn't interrupted
	at __randomizedtesting.SeedInfo.seed([8C762486BC0D9086:45C36628B56A5673]:0)
	at org.junit.Assert.fail(Assert.java:93)
	at org.junit.Assert.assertTrue(Assert.java:43)
	at org.apache.solr.cloud.autoscaling.sim.TestSimTriggerIntegration.testEventQueue(TestSimTriggerIntegration.java:677)
	at java.base/jdk.internal.reflect.NativeMethodAccessorImpl.invoke0(Native Method)
	at java.base/jdk.internal.reflect.NativeMethodAccessorImpl.invoke(NativeMethodAccessorImpl.java:62)
	at java.base/jdk.internal.reflect.DelegatingMethodAccessorImpl.invoke(DelegatingMethodAccessorImpl.java:43)
	at java.base/java.lang.reflect.Method.invoke(Method.java:564)
	at com.carrotsearch.randomizedtesting.RandomizedRunner.invoke(RandomizedRunner.java:1742)
	at com.carrotsearch.randomizedtesting.RandomizedRunner$8.evaluate(RandomizedRunner.java:935)
	at com.carrotsearch.randomizedtesting.RandomizedRunner$9.evaluate(RandomizedRunner.java:971)
	at com.carrotsearch.randomizedtesting.RandomizedRunner$10.evaluate(RandomizedRunner.java:985)
	at com.carrotsearch.randomizedtesting.rules.SystemPropertiesRestoreRule$1.evaluate(SystemPropertiesRestoreRule.java:57)
	at org.apache.lucene.util.TestRuleSetupTeardownChained$1.evaluate(TestRuleSetupTeardownChained.java:49)
	at org.apache.lucene.util.AbstractBeforeAfterRule$1.evaluate(AbstractBeforeAfterRule.java:45)
	at org.apache.lucene.util.TestRuleThreadAndTestName$1.evaluate(TestRuleThreadAndTestName.java:48)
	at org.apache.lucene.util.TestRuleIgnoreAfterMaxFailures$1.evaluate(TestRuleIgnoreAfterMaxFailures.java:64)
	at org.apache.lucene.util.TestRuleMarkFailure$1.evaluate(TestRuleMarkFailure.java:47)
	at com.carrotsearch.randomizedtesting.rules.StatementAdapter.evaluate(StatementAdapter.java:36)
	at com.carrotsearch.randomizedtesting.ThreadLeakControl$StatementRunner.run(ThreadLeakControl.java:368)
	at com.carrotsearch.randomizedtesting.ThreadLeakControl.forkTimeoutingTask(ThreadLeakControl.java:817)
	at com.carrotsearch.randomizedtesting.ThreadLeakControl$3.evaluate(ThreadLeakControl.java:468)
	at com.carrotsearch.randomizedtesting.RandomizedRunner.runSingleTest(RandomizedRunner.java:944)
	at com.carrotsearch.randomizedtesting.RandomizedRunner$5.evaluate(RandomizedRunner.java:830)
	at com.carrotsearch.randomizedtesting.RandomizedRunner$6.evaluate(RandomizedRunner.java:880)
	at com.carrotsearch.randomizedtesting.RandomizedRunner$7.evaluate(RandomizedRunner.java:891)
	at com.carrotsearch.randomizedtesting.rules.StatementAdapter.evaluate(StatementAdapter.java:36)
	at com.carrotsearch.randomizedtesting.rules.SystemPropertiesRestoreRule$1.evaluate(SystemPropertiesRestoreRule.java:57)
	at org.apache.lucene.util.AbstractBeforeAfterRule$1.evaluate(AbstractBeforeAfterRule.java:45)
	at com.carrotsearch.randomizedtesting.rules.StatementAdapter.evaluate(StatementAdapter.java:36)
	at org.apache.lucene.util.TestRuleStoreClassName$1.evaluate(TestRuleStoreClassName.java:41)
	at com.carrotsearch.randomizedtesting.rules.NoShadowingOrOverridesOnMethodsRule$1.evaluate(NoShadowingOrOverridesOnMethodsRule.java:40)
	at com.carrotsearch.randomizedtesting.rules.NoShadowingOrOverridesOnMethodsRule$1.evaluate(NoShadowingOrOverridesOnMethodsRule.java:40)
	at com.carrotsearch.randomizedtesting.rules.StatementAdapter.evaluate(StatementAdapter.java:36)
	at com.carrotsearch.randomizedtesting.rules.StatementAdapter.evaluate(StatementAdapter.java:36)
	at org.apache.lucene.util.TestRuleAssertionsRequired$1.evaluate(TestRuleAssertionsRequired.java:53)
	at org.apache.lucene.util.TestRuleMarkFailure$1.evaluate(TestRuleMarkFailure.java:47)
	at org.apache.lucene.util.TestRuleIgnoreAfterMaxFailures$1.evaluate(TestRuleIgnoreAfterMaxFailures.java:64)
	at org.apache.lucene.util.TestRuleIgnoreTestSuites$1.evaluate(TestRuleIgnoreTestSuites.java:54)
	at com.carrotsearch.randomizedtesting.rules.StatementAdapter.evaluate(StatementAdapter.java:36)
	at com.carrotsearch.randomizedtesting.ThreadLeakControl$StatementRunner.run(ThreadLeakControl.java:368)
	at java.base/java.lang.Thread.run(Thread.java:844)


FAILED:  org.apache.solr.cloud.autoscaling.sim.TestSimTriggerIntegration.testEventQueue

Error Message:
action did not start

Stack Trace:
java.lang.AssertionError: action did not start
	at __randomizedtesting.SeedInfo.seed([8C762486BC0D9086:45C36628B56A5673]:0)
	at org.junit.Assert.fail(Assert.java:93)
	at org.junit.Assert.assertTrue(Assert.java:43)
	at org.apache.solr.cloud.autoscaling.sim.TestSimTriggerIntegration.testEventQueue(TestSimTriggerIntegration.java:663)
	at java.base/jdk.internal.reflect.NativeMethodAccessorImpl.invoke0(Native Method)
	at java.base/jdk.internal.reflect.NativeMethodAccessorImpl.invoke(NativeMethodAccessorImpl.java:62)
	at java.base/jdk.internal.reflect.DelegatingMethodAccessorImpl.invoke(DelegatingMethodAccessorImpl.java:43)
	at java.base/java.lang.reflect.Method.invoke(Method.java:564)
	at com.carrotsearch.randomizedtesting.RandomizedRunner.invoke(RandomizedRunner.java:1742)
	at com.carrotsearch.randomizedtesting.RandomizedRunner$8.evaluate(RandomizedRunner.java:935)
	at com.carrotsearch.randomizedtesting.RandomizedRunner$9.evaluate(RandomizedRunner.java:971)
	at com.carrotsearch.randomizedtesting.RandomizedRunner$10.evaluate(RandomizedRunner.java:985)
	at com.carrotsearch.randomizedtesting.rules.SystemPropertiesRestoreRule$1.evaluate(SystemPropertiesRestoreRule.java:57)
	at org.apache.lucene.util.TestRuleSetupTeardownChained$1.evaluate(TestRuleSetupTeardownChained.java:49)
	at org.apache.lucene.util.AbstractBeforeAfterRule$1.evaluate(AbstractBeforeAfterRule.java:45)
	at org.apache.lucene.util.TestRuleThreadAndTestName$1.evaluate(TestRuleThreadAndTestName.java:48)
	at org.apache.lucene.util.TestRuleIgnoreAfterMaxFailures$1.evaluate(TestRuleIgnoreAfterMaxFailures.java:64)
	at org.apache.lucene.util.TestRuleMarkFailure$1.evaluate(TestRuleMarkFailure.java:47)
	at com.carrotsearch.randomizedtesting.rules.StatementAdapter.evaluate(StatementAdapter.java:36)
	at com.carrotsearch.randomizedtesting.ThreadLeakControl$StatementRunner.run(ThreadLeakControl.java:368)
	at com.carrotsearch.randomizedtesting.ThreadLeakControl.forkTimeoutingTask(ThreadLeakControl.java:817)
	at com.carrotsearch.randomizedtesting.ThreadLeakControl$3.evaluate(ThreadLeakControl.java:468)
	at com.carrotsearch.randomizedtesting.RandomizedRunner.runSingleTest(RandomizedRunner.java:944)
	at com.carrotsearch.randomizedtesting.RandomizedRunner$5.evaluate(RandomizedRunner.java:830)
	at com.carrotsearch.randomizedtesting.RandomizedRunner$6.evaluate(RandomizedRunner.java:880)
	at com.carrotsearch.randomizedtesting.RandomizedRunner$7.evaluate(RandomizedRunner.java:891)
	at com.carrotsearch.randomizedtesting.rules.StatementAdapter.evaluate(StatementAdapter.java:36)
	at com.carrotsearch.randomizedtesting.rules.SystemPropertiesRestoreRule$1.evaluate(SystemPropertiesRestoreRule.java:57)
	at org.apache.lucene.util.AbstractBeforeAfterRule$1.evaluate(AbstractBeforeAfterRule.java:45)
	at com.carrotsearch.randomizedtesting.rules.StatementAdapter.evaluate(StatementAdapter.java:36)
	at org.apache.lucene.util.TestRuleStoreClassName$1.evaluate(TestRuleStoreClassName.java:41)
	at com.carrotsearch.randomizedtesting.rules.NoShadowingOrOverridesOnMethodsRule$1.evaluate(NoShadowingOrOverridesOnMethodsRule.java:40)
	at com.carrotsearch.randomizedtesting.rules.NoShadowingOrOverridesOnMethodsRule$1.evaluate(NoShadowingOrOverridesOnMethodsRule.java:40)
	at com.carrotsearch.randomizedtesting.rules.StatementAdapter.evaluate(StatementAdapter.java:36)
	at com.carrotsearch.randomizedtesting.rules.StatementAdapter.evaluate(StatementAdapter.java:36)
	at org.apache.lucene.util.TestRuleAssertionsRequired$1.evaluate(TestRuleAssertionsRequired.java:53)
	at org.apache.lucene.util.TestRuleMarkFailure$1.evaluate(TestRuleMarkFailure.java:47)
	at org.apache.lucene.util.TestRuleIgnoreAfterMaxFailures$1.evaluate(TestRuleIgnoreAfterMaxFailures.java:64)
	at org.apache.lucene.util.TestRuleIgnoreTestSuites$1.evaluate(TestRuleIgnoreTestSuites.java:54)
	at com.carrotsearch.randomizedtesting.rules.StatementAdapter.evaluate(StatementAdapter.java:36)
	at com.carrotsearch.randomizedtesting.ThreadLeakControl$StatementRunner.run(ThreadLeakControl.java:368)
	at java.base/java.lang.Thread.run(Thread.java:844)




Build Log:
[...truncated 1944 lines...]
   [junit4] JVM J1: stderr was not empty, see: C:\Users\jenkins\workspace\Lucene-Solr-7.x-Windows\lucene\build\core\test\temp\junit4-J1-20180915_070047_6392313781389148336701.syserr
   [junit4] >>> JVM J1 emitted unexpected output (verbatim) ----
   [junit4] OpenJDK 64-Bit Server VM warning: Option UseConcMarkSweepGC was deprecated in version 9.0 and will likely be removed in a future release.
   [junit4] <<< JVM J1: EOF ----

[...truncated 3 lines...]
   [junit4] JVM J0: stderr was not empty, see: C:\Users\jenkins\workspace\Lucene-Solr-7.x-Windows\lucene\build\core\test\temp\junit4-J0-20180915_070047_63814924460727089643236.syserr
   [junit4] >>> JVM J0 emitted unexpected output (verbatim) ----
   [junit4] OpenJDK 64-Bit Server VM warning: Option UseConcMarkSweepGC was deprecated in version 9.0 and will likely be removed in a future release.
   [junit4] <<< JVM J0: EOF ----

[...truncated 316 lines...]
   [junit4] JVM J0: stderr was not empty, see: C:\Users\jenkins\workspace\Lucene-Solr-7.x-Windows\lucene\build\test-framework\test\temp\junit4-J0-20180915_070619_6279237020397481607332.syserr
   [junit4] >>> JVM J0 emitted unexpected output (verbatim) ----
   [junit4] OpenJDK 64-Bit Server VM warning: Option UseConcMarkSweepGC was deprecated in version 9.0 and will likely be removed in a future release.
   [junit4] <<< JVM J0: EOF ----

[...truncated 3 lines...]
   [junit4] JVM J1: stderr was not empty, see: C:\Users\jenkins\workspace\Lucene-Solr-7.x-Windows\lucene\build\test-framework\test\temp\junit4-J1-20180915_070619_62714939071795216038673.syserr
   [junit4] >>> JVM J1 emitted unexpected output (verbatim) ----
   [junit4] OpenJDK 64-Bit Server VM warning: Option UseConcMarkSweepGC was deprecated in version 9.0 and will likely be removed in a future release.
   [junit4] <<< JVM J1: EOF ----

[...truncated 1081 lines...]
   [junit4] JVM J1: stderr was not empty, see: C:\Users\jenkins\workspace\Lucene-Solr-7.x-Windows\lucene\build\analysis\common\test\temp\junit4-J1-20180915_070721_51010679354238705237602.syserr
   [junit4] >>> JVM J1 emitted unexpected output (verbatim) ----
   [junit4] OpenJDK 64-Bit Server VM warning: Option UseConcMarkSweepGC was deprecated in version 9.0 and will likely be removed in a future release.
   [junit4] <<< JVM J1: EOF ----

[...truncated 3 lines...]
   [junit4] JVM J0: stderr was not empty, see: C:\Users\jenkins\workspace\Lucene-Solr-7.x-Windows\lucene\build\analysis\common\test\temp\junit4-J0-20180915_070721_51015450857051436572151.syserr
   [junit4] >>> JVM J0 emitted unexpected output (verbatim) ----
   [junit4] OpenJDK 64-Bit Server VM warning: Option UseConcMarkSweepGC was deprecated in version 9.0 and will likely be removed in a future release.
   [junit4] <<< JVM J0: EOF ----

[...truncated 260 lines...]
   [junit4] JVM J0: stderr was not empty, see: C:\Users\jenkins\workspace\Lucene-Solr-7.x-Windows\lucene\build\analysis\icu\test\temp\junit4-J0-20180915_070930_14615474413017479885919.syserr
   [junit4] >>> JVM J0 emitted unexpected output (verbatim) ----
   [junit4] OpenJDK 64-Bit Server VM warning: Option UseConcMarkSweepGC was deprecated in version 9.0 and will likely be removed in a future release.
   [junit4] <<< JVM J0: EOF ----

   [junit4] JVM J1: stderr was not empty, see: C:\Users\jenkins\workspace\Lucene-Solr-7.x-Windows\lucene\build\analysis\icu\test\temp\junit4-J1-20180915_070930_1462088131817551763898.syserr
   [junit4] >>> JVM J1 emitted unexpected output (verbatim) ----
   [junit4] OpenJDK 64-Bit Server VM warning: Option UseConcMarkSweepGC was deprecated in version 9.0 and will likely be removed in a future release.
   [junit4] <<< JVM J1: EOF ----

[...truncated 254 lines...]
   [junit4] JVM J0: stderr was not empty, see: C:\Users\jenkins\workspace\Lucene-Solr-7.x-Windows\lucene\build\analysis\kuromoji\test\temp\junit4-J0-20180915_070941_14117677432309916132353.syserr
   [junit4] >>> JVM J0 emitted unexpected output (verbatim) ----
   [junit4] OpenJDK 64-Bit Server VM warning: Option UseConcMarkSweepGC was deprecated in version 9.0 and will likely be removed in a future release.
   [junit4] <<< JVM J0: EOF ----

[...truncated 3 lines...]
   [junit4] JVM J1: stderr was not empty, see: C:\Users\jenkins\workspace\Lucene-Solr-7.x-Windows\lucene\build\analysis\kuromoji\test\temp\junit4-J1-20180915_070941_14115589049941956689644.syserr
   [junit4] >>> JVM J1 emitted unexpected output (verbatim) ----
   [junit4] OpenJDK 64-Bit Server VM warning: Option UseConcMarkSweepGC was deprecated in version 9.0 and will likely be removed in a future release.
   [junit4] <<< JVM J1: EOF ----

[...truncated 163 lines...]
   [junit4] JVM J1: stderr was not empty, see: C:\Users\jenkins\workspace\Lucene-Solr-7.x-Windows\lucene\build\analysis\morfologik\test\temp\junit4-J1-20180915_071011_5931412785278819379971.syserr
   [junit4] >>> JVM J1 emitted unexpected output (verbatim) ----
   [junit4] OpenJDK 64-Bit Server VM warning: Option UseConcMarkSweepGC was deprecated in version 9.0 and will likely be removed in a future release.
   [junit4] <<< JVM J1: EOF ----

[...truncated 3 lines...]
   [junit4] JVM J0: stderr was not empty, see: C:\Users\jenkins\workspace\Lucene-Solr-7.x-Windows\lucene\build\analysis\morfologik\test\temp\junit4-J0-20180915_071011_59315758068176178406841.syserr
   [junit4] >>> JVM J0 emitted unexpected output (verbatim) ----
   [junit4] OpenJDK 64-Bit Server VM warning: Option UseConcMarkSweepGC was deprecated in version 9.0 and will likely be removed in a future release.
   [junit4] <<< JVM J0: EOF ----

[...truncated 208 lines...]
   [junit4] JVM J0: stderr was not empty, see: C:\Users\jenkins\workspace\Lucene-Solr-7.x-Windows\lucene\build\analysis\nori\test\temp\junit4-J0-20180915_071016_6367100618405930416729.syserr
   [junit4] >>> JVM J0 emitted unexpected output (verbatim) ----
   [junit4] OpenJDK 64-Bit Server VM warning: Option UseConcMarkSweepGC was deprecated in version 9.0 and will likely be removed in a future release.
   [junit4] <<< JVM J0: EOF ----

[...truncated 3 lines...]
   [junit4] JVM J1: stderr was not empty, see: C:\Users\jenkins\workspace\Lucene-Solr-7.x-Windows\lucene\build\analysis\nori\test\temp\junit4-J1-20180915_071016_63615426849704750943568.syserr
   [junit4] >>> JVM J1 emitted unexpected output (verbatim) ----
   [junit4] OpenJDK 64-Bit Server VM warning: Option UseConcMarkSweepGC was deprecated in version 9.0 and will likely be removed in a future release.
   [junit4] <<< JVM J1: EOF ----

[...truncated 172 lines...]
   [junit4] JVM J1: stderr was not empty, see: C:\Users\jenkins\workspace\Lucene-Solr-7.x-Windows\lucene\build\analysis\opennlp\test\temp\junit4-J1-20180915_071024_8253970181671114386102.syserr
   [junit4] >>> JVM J1 emitted unexpected output (verbatim) ----
   [junit4] OpenJDK 64-Bit Server VM warning: Option UseConcMarkSweepGC was deprecated in version 9.0 and will likely be removed in a future release.
   [junit4] <<< JVM J1: EOF ----

   [junit4] JVM J0: stderr was not empty, see: C:\Users\jenkins\workspace\Lucene-Solr-7.x-Windows\lucene\build\analysis\opennlp\test\temp\junit4-J0-20180915_071024_8259419853755170091439.syserr
   [junit4] >>> JVM J0 emitted unexpected output (verbatim) ----
   [junit4] OpenJDK 64-Bit Server VM warning: Option UseConcMarkSweepGC was deprecated in version 9.0 and will likely be removed in a future release.
   [junit4] <<< JVM J0: EOF ----

[...truncated 177 lines...]
   [junit4] JVM J1: stderr was not empty, see: C:\Users\jenkins\workspace\Lucene-Solr-7.x-Windows\lucene\build\analysis\phonetic\test\temp\junit4-J1-20180915_071028_56013573811919523404557.syserr
   [junit4] >>> JVM J1 emitted unexpected output (verbatim) ----
   [junit4] OpenJDK 64-Bit Server VM warning: Option UseConcMarkSweepGC was deprecated in version 9.0 and will likely be removed in a future release.
   [junit4] <<< JVM J1: EOF ----

[...truncated 3 lines...]
   [junit4] JVM J0: stderr was not empty, see: C:\Users\jenkins\workspace\Lucene-Solr-7.x-Windows\lucene\build\analysis\phonetic\test\temp\junit4-J0-20180915_071028_56016326512802795024403.syserr
   [junit4] >>> JVM J0 emitted unexpected output (verbatim) ----
   [junit4] OpenJDK 64-Bit Server VM warning: Option UseConcMarkSweepGC was deprecated in version 9.0 and will likely be removed in a future release.
   [junit4] <<< JVM J0: EOF ----

[...truncated 160 lines...]
   [junit4] JVM J0: stderr was not empty, see: C:\Users\jenkins\workspace\Lucene-Solr-7.x-Windows\lucene\build\analysis\smartcn\test\temp\junit4-J0-20180915_071037_70412243109484572537723.syserr
   [junit4] >>> JVM J0 emitted unexpected output (verbatim) ----
   [junit4] OpenJDK 64-Bit Server VM warning: Option UseConcMarkSweepGC was deprecated in version 9.0 and will likely be removed in a future release.
   [junit4] <<< JVM J0: EOF ----

[...truncated 3 lines...]
   [junit4] JVM J1: stderr was not empty, see: C:\Users\jenkins\workspace\Lucene-Solr-7.x-Windows\lucene\build\analysis\smartcn\test\temp\junit4-J1-20180915_071037_70413426121545324376442.syserr
   [junit4] >>> JVM J1 emitted unexpected output (verbatim) ----
   [junit4] OpenJDK 64-Bit Server VM warning: Option UseConcMarkSweepGC was deprecated in version 9.0 and will likely be removed in a future release.
   [junit4] <<< JVM J1: EOF ----

[...truncated 168 lines...]
   [junit4] JVM J0: stderr was not empty, see: C:\Users\jenkins\workspace\Lucene-Solr-7.x-Windows\lucene\build\analysis\stempel\test\temp\junit4-J0-20180915_071046_49810408117369250099417.syserr
   [junit4] >>> JVM J0 emitted unexpected output (verbatim) ----
   [junit4] OpenJDK 64-Bit Server VM warning: Option UseConcMarkSweepGC was deprecated in version 9.0 and will likely be removed in a future release.
   [junit4] <<< JVM J0: EOF ----

   [junit4] JVM J1: stderr was not empty, see: C:\Users\jenkins\workspace\Lucene-Solr-7.x-Windows\lucene\build\analysis\stempel\test\temp\junit4-J1-20180915_071046_4986844410135871662355.syserr
   [junit4] >>> JVM J1 emitted unexpected output (verbatim) ----
   [junit4] OpenJDK 64-Bit Server VM warning: Option UseConcMarkSweepGC was deprecated in version 9.0 and will likely be removed in a future release.
   [junit4] <<< JVM J1: EOF ----

[...truncated 213 lines...]
   [junit4] JVM J0: stderr was not empty, see: C:\Users\jenkins\workspace\Lucene-Solr-7.x-Windows\lucene\build\backward-codecs\test\temp\junit4-J0-20180915_071050_8108022600347361993632.syserr
   [junit4] >>> JVM J0 emitted unexpected output (verbatim) ----
   [junit4] OpenJDK 64-Bit Server VM warning: Option UseConcMarkSweepGC was deprecated in version 9.0 and will likely be removed in a future release.
   [junit4] <<< JVM J0: EOF ----

[...truncated 19 lines...]
   [junit4] JVM J1: stderr was not empty, see: C:\Users\jenkins\workspace\Lucene-Solr-7.x-Windows\lucene\build\backward-codecs\test\temp\junit4-J1-20180915_071050_8101283613646551904914.syserr
   [junit4] >>> JVM J1 emitted unexpected output (verbatim) ----
   [junit4] OpenJDK 64-Bit Server VM warning: Option UseConcMarkSweepGC was deprecated in version 9.0 and will likely be removed in a future release.
   [junit4] <<< JVM J1: EOF ----

[...truncated 1424 lines...]
   [junit4] JVM J1: stderr was not empty, see: C:\Users\jenkins\workspace\Lucene-Solr-7.x-Windows\lucene\build\benchmark\test\temp\junit4-J1-20180915_071153_0684751844900131680520.syserr
   [junit4] >>> JVM J1 emitted unexpected output (verbatim) ----
   [junit4] OpenJDK 64-Bit Server VM warning: Option UseConcMarkSweepGC was deprecated in version 9.0 and will likely be removed in a future release.
   [junit4] <<< JVM J1: EOF ----

[...truncated 3 lines...]
   [junit4] JVM J0: stderr was not empty, see: C:\Users\jenkins\workspace\Lucene-Solr-7.x-Windows\lucene\build\benchmark\test\temp\junit4-J0-20180915_071153_0685342648715212956573.syserr
   [junit4] >>> JVM J0 emitted unexpected output (verbatim) ----
   [junit4] OpenJDK 64-Bit Server VM warning: Option UseConcMarkSweepGC was deprecated in version 9.0 and will likely be removed in a future release.
   [junit4] <<< JVM J0: EOF ----

[...truncated 252 lines...]
   [junit4] JVM J1: stderr was not empty, see: C:\Users\jenkins\workspace\Lucene-Solr-7.x-Windows\lucene\build\classification\test\temp\junit4-J1-20180915_071204_42111117561367832176747.syserr
   [junit4] >>> JVM J1 emitted unexpected output (verbatim) ----
   [junit4] OpenJDK 64-Bit Server VM warning: Option UseConcMarkSweepGC was deprecated in version 9.0 and will likely be removed in a future release.
   [junit4] <<< JVM J1: EOF ----

[...truncated 3 lines...]
   [junit4] JVM J0: stderr was not empty, see: C:\Users\jenkins\workspace\Lucene-Solr-7.x-Windows\lucene\build\classification\test\temp\junit4-J0-20180915_071204_42117756388075648210106.syserr
   [junit4] >>> JVM J0 emitted unexpected output (verbatim) ----
   [junit4] OpenJDK 64-Bit Server VM warning: Option UseConcMarkSweepGC was deprecated in version 9.0 and will likely be removed in a future release.
   [junit4] <<< JVM J0: EOF ----

[...truncated 264 lines...]
   [junit4] JVM J0: stderr was not empty, see: C:\Users\jenkins\workspace\Lucene-Solr-7.x-Windows\lucene\build\codecs\test\temp\junit4-J0-20180915_071219_15310884030363161355717.syserr
   [junit4] >>> JVM J0 emitted unexpected output (verbatim) ----
   [junit4] OpenJDK 64-Bit Server VM warning: Option UseConcMarkSweepGC was deprecated in version 9.0 and will likely be removed in a future release.
   [junit4] <<< JVM J0: EOF ----

[...truncated 7 lines...]
   [junit4] JVM J1: stderr was not empty, see: C:\Users\jenkins\workspace\Lucene-Solr-7.x-Windows\lucene\build\codecs\test\temp\junit4-J1-20180915_071219_1537931943979541667703.syserr
   [junit4] >>> JVM J1 emitted unexpected output (verbatim) ----
   [junit4] OpenJDK 64-Bit Server VM warning: Option UseConcMarkSweepGC was deprecated in version 9.0 and will likely be removed in a future release.
   [junit4] <<< JVM J1: EOF ----

[...truncated 232 lines...]
   [junit4] JVM J0: stderr was not empty, see: C:\Users\jenkins\workspace\Lucene-Solr-7.x-Windows\lucene\build\demo\test\temp\junit4-J0-20180915_071349_5462448302949622811158.syserr
   [junit4] >>> JVM J0 emitted unexpected output (verbatim) ----
   [junit4] OpenJDK 64-Bit Server VM warning: Option UseConcMarkSweepGC was deprecated in version 9.0 and will likely be removed in a future release.
   [junit4] <<< JVM J0: EOF ----

[...truncated 3 lines...]
   [junit4] JVM J1: stderr was not empty, see: C:\Users\jenkins\workspace\Lucene-Solr-7.x-Windows\lucene\build\demo\test\temp\junit4-J1-20180915_071349_5466820187487980220960.syserr
   [junit4] >>> JVM J1 emitted unexpected output (verbatim) ----
   [junit4] OpenJDK 64-Bit Server VM warning: Option UseConcMarkSweepGC was deprecated in version 9.0 and will likely be removed in a future release.
   [junit4] <<< JVM J1: EOF ----

[...truncated 171 lines...]
   [junit4] JVM J0: stderr was not empty, see: C:\Users\jenkins\workspace\Lucene-Solr-7.x-Windows\lucene\build\expressions\test\temp\junit4-J0-20180915_071353_85416681922400079501468.syserr
   [junit4] >>> JVM J0 emitted unexpected output (verbatim) ----
   [junit4] OpenJDK 64-Bit Server VM warning: Option UseConcMarkSweepGC was deprecated in version 9.0 and will likely be removed in a future release.
   [junit4] <<< JVM J0: EOF ----

[...truncated 6 lines...]
   [junit4] JVM J1: stderr was not empty, see: C:\Users\jenkins\workspace\Lucene-Solr-7.x-Windows\lucene\build\expressions\test\temp\junit4-J1-20180915_071353_8547778550264499723470.syserr
   [junit4] >>> JVM J1 emitted unexpected output (verbatim) ----
   [junit4] OpenJDK 64-Bit Server VM warning: Option UseConcMarkSweepGC was deprecated in version 9.0 and will likely be removed in a future release.
   [junit4] <<< JVM J1: EOF ----

[...truncated 235 lines...]
   [junit4] JVM J1: stderr was not empty, see: C:\Users\jenkins\workspace\Lucene-Solr-7.x-Windows\lucene\build\facet\test\temp\junit4-J1-20180915_071400_3681661679158989370603.syserr
   [junit4] >>> JVM J1 emitted unexpected output (verbatim) ----
   [junit4] OpenJDK 64-Bit Server VM warning: Option UseConcMarkSweepGC was deprecated in version 9.0 and will likely be removed in a future release.
   [junit4] <<< JVM J1: EOF ----

[...truncated 3 lines...]
   [junit4] JVM J0: stderr was not empty, see: C:\Users\jenkins\workspace\Lucene-Solr-7.x-Windows\lucene\build\facet\test\temp\junit4-J0-20180915_071400_36913895840046637483917.syserr
   [junit4] >>> JVM J0 emitted unexpected output (verbatim) ----
   [junit4] OpenJDK 64-Bit Server VM warning: Option UseConcMarkSweepGC was deprecated in version 9.0 and will likely be removed in a future release.
   [junit4] <<< JVM J0: EOF ----

[...truncated 183 lines...]
   [junit4] JVM J0: stderr was not empty, see: C:\Users\jenkins\workspace\Lucene-Solr-7.x-Windows\lucene\build\grouping\test\temp\junit4-J0-20180915_071426_8715564723472835035471.syserr
   [junit4] >>> JVM J0 emitted unexpected output (verbatim) ----
   [junit4] OpenJDK 64-Bit Server VM warning: Option UseConcMarkSweepGC was deprecated in version 9.0 and will likely be removed in a future release.
   [junit4] <<< JVM J0: EOF ----

[...truncated 3 lines...]
   [junit4] JVM J1: stderr was not empty, see: C:\Users\jenkins\workspace\Lucene-Solr-7.x-Windows\lucene\build\grouping\test\temp\junit4-J1-20180915_071426_87116036541960237731339.syserr
   [junit4] >>> JVM J1 emitted unexpected output (verbatim) ----
   [junit4] OpenJDK 64-Bit Server VM warning: Option UseConcMarkSweepGC was deprecated in version 9.0 and will likely be removed in a future release.
   [junit4] <<< JVM J1: EOF ----

[...truncated 252 lines...]
   [junit4] JVM J1: stderr was not empty, see: C:\Users\jenkins\workspace\Lucene-Solr-7.x-Windows\lucene\build\highlighter\test\temp\junit4-J1-20180915_071434_02614733637929824937983.syserr
   [junit4] >>> JVM J1 emitted unexpected output (verbatim) ----
   [junit4] OpenJDK 64-Bit Server VM warning: Option UseConcMarkSweepGC was deprecated in version 9.0 and will likely be removed in a future release.
   [junit4] <<< JVM J1: EOF ----

   [junit4] JVM J0: stderr was not empty, see: C:\Users\jenkins\workspace\Lucene-Solr-7.x-Windows\lucene\build\highlighter\test\temp\junit4-J0-20180915_071434_0262087442827733144862.syserr
   [junit4] >>> JVM J0 emitted unexpected output (verbatim) ----
   [junit4] OpenJDK 64-Bit Server VM warning: Option UseConcMarkSweepGC was deprecated in version 9.0 and will likely be removed in a future release.
   [junit4] <<< JVM J0: EOF ----

[...truncated 164 lines...]
   [junit4] JVM J0: stderr was not empty, see: C:\Users\jenkins\workspace\Lucene-Solr-7.x-Windows\lucene\build\join\test\temp\junit4-J0-20180915_071450_80612522225372165854593.syserr
   [junit4] >>> JVM J0 emitted unexpected output (verbatim) ----
   [junit4] OpenJDK 64-Bit Server VM warning: Option UseConcMarkSweepGC was deprecated in version 9.0 and will likely be removed in a future release.
   [junit4] <<< JVM J0: EOF ----

[...truncated 6 lines...]
   [junit4] JVM J1: stderr was not empty, see: C:\Users\jenkins\workspace\Lucene-Solr-7.x-Windows\lucene\build\join\test\temp\junit4-J1-20180915_071450_8068462703855090163320.syserr
   [junit4] >>> JVM J1 emitted unexpected output (verbatim) ----
   [junit4] OpenJDK 64-Bit Server VM warning: Option UseConcMarkSweepGC was deprecated in version 9.0 and will likely be removed in a future release.
   [junit4] <<< JVM J1: EOF ----

[...truncated 156 lines...]
   [junit4] JVM J0: stderr was not empty, see: C:\Users\jenkins\workspace\Lucene-Solr-7.x-Windows\lucene\build\memory\test\temp\junit4-J0-20180915_071500_39011277278870887986183.syserr
   [junit4] >>> JVM J0 emitted unexpected output (verbatim) ----
   [junit4] OpenJDK 64-Bit Server VM warning: Option UseConcMarkSweepGC was deprecated in version 9.0 and will likely be removed in a future release.
   [junit4] <<< JVM J0: EOF ----

[...truncated 3 lines...]
   [junit4] JVM J1: stderr was not empty, see: C:\Users\jenkins\workspace\Lucene-Solr-7.x-Windows\lucene\build\memory\test\temp\junit4-J1-20180915_071500_39015739223086415392847.syserr
   [junit4] >>> JVM J1 emitted unexpected output (verbatim) ----
   [junit4] OpenJDK 64-Bit Server VM warning: Option UseConcMarkSweepGC was deprecated in version 9.0 and will likely be removed in a future release.
   [junit4] <<< JVM J1: EOF ----

[...truncated 196 lines...]
   [junit4] JVM J0: stderr was not empty, see: C:\Users\jenkins\workspace\Lucene-Solr-7.x-Windows\lucene\build\misc\test\temp\junit4-J0-20180915_071507_36217546635512181677953.syserr
   [junit4] >>> JVM J0 emitted unexpected output (verbatim) ----
   [junit4] OpenJDK 64-Bit Server VM warning: Option UseConcMarkSweepGC was deprecated in version 9.0 and will likely be removed in a future release.
   [junit4] <<< JVM J0: EOF ----

[...truncated 3 lines...]
   [junit4] JVM J1: stderr was not empty, see: C:\Users\jenkins\workspace\Lucene-Solr-7.x-Windows\lucene\build\misc\test\temp\junit4-J1-20180915_071507_36214348353228381821607.syserr
   [junit4] >>> JVM J1 emitted unexpected output (verbatim) ----
   [junit4] OpenJDK 64-Bit Server VM warning: Option UseConcMarkSweepGC was deprecated in version 9.0 and will likely be removed in a future release.
   [junit4] <<< JVM J1: EOF ----

[...truncated 342 lines...]
   [junit4] JVM J1: stderr was not empty, see: C:\Users\jenkins\workspace\Lucene-Solr-7.x-Windows\lucene\build\queries\test\temp\junit4-J1-20180915_071526_8801607384524725728484.syserr
   [junit4] >>> JVM J1 emitted unexpected output (verbatim) ----
   [junit4] OpenJDK 64-Bit Server VM warning: Option UseConcMarkSweepGC was deprecated in version 9.0 and will likely be removed in a future release.
   [junit4] <<< JVM J1: EOF ----

   [junit4] JVM J0: stderr was not empty, see: C:\Users\jenkins\workspace\Lucene-Solr-7.x-Windows\lucene\build\queries\test\temp\junit4-J0-20180915_071526_8802336119951282410275.syserr
   [junit4] >>> JVM J0 emitted unexpected output (verbatim) ----
   [junit4] OpenJDK 64-Bit Server VM warning: Option UseConcMarkSweepGC was deprecated in version 9.0 and will likely be removed in a future release.
   [junit4] <<< JVM J0: EOF ----

[...truncated 235 lines...]
   [junit4] JVM J0: stderr was not empty, see: C:\Users\jenkins\workspace\Lucene-Solr-7.x-Windows\lucene\build\queryparser\test\temp\junit4-J0-20180915_071536_91916777698783427200077.syserr
   [junit4] >>> JVM J0 emitted unexpected output (verbatim) ----
   [junit4] OpenJDK 64-Bit Server VM warning: Option UseConcMarkSweepGC was deprecated in version 9.0 and will likely be removed in a future release.
   [junit4] <<< JVM J0: EOF ----

   [junit4] JVM J1: stderr was not empty, see: C:\Users\jenkins\workspace\Lucene-Solr-7.x-Windows\lucene\build\queryparser\test\temp\junit4-J1-20180915_071536_9199270539320343064162.syserr
   [junit4] >>> JVM J1 emitted unexpected output (verbatim) ----
   [junit4] OpenJDK 64-Bit Server VM warning: Option UseConcMarkSweepGC was deprecated in version 9.0 and will likely be removed in a future release.
   [junit4] <<< JVM J1: EOF ----

[...truncated 217 lines...]
   [junit4] JVM J1: stderr was not empty, see: C:\Users\jenkins\workspace\Lucene-Solr-7.x-Windows\lucene\build\replicator\test\temp\junit4-J1-20180915_071546_33211558908446418362159.syserr
   [junit4] >>> JVM J1 emitted unexpected output (verbatim) ----
   [junit4] OpenJDK 64-Bit Server VM warning: Option UseConcMarkSweepGC was deprecated in version 9.0 and will likely be removed in a future release.
   [junit4] <<< JVM J1: EOF ----

[...truncated 3 lines...]
   [junit4] JVM J0: stderr was not empty, see: C:\Users\jenkins\workspace\Lucene-Solr-7.x-Windows\lucene\build\replicator\test\temp\junit4-J0-20180915_071546_33214355832177864312391.syserr
   [junit4] >>> JVM J0 emitted unexpected output (verbatim) ----
   [junit4] OpenJDK 64-Bit Server VM warning: Option UseConcMarkSweepGC was deprecated in version 9.0 and will likely be removed in a future release.
   [junit4] <<< JVM J0: EOF ----

[...truncated 220 lines...]
   [junit4] JVM J0: stderr was not empty, see: C:\Users\jenkins\workspace\Lucene-Solr-7.x-Windows\lucene\build\sandbox\test\temp\junit4-J0-20180915_071602_3086331010359069532881.syserr
   [junit4] >>> JVM J0 emitted unexpected output (verbatim) ----
   [junit4] OpenJDK 64-Bit Server VM warning: Option UseConcMarkSweepGC was deprecated in version 9.0 and will likely be removed in a future release.
   [junit4] <<< JVM J0: EOF ----

[...truncated 3 lines...]
   [junit4] JVM J1: stderr was not empty, see: C:\Users\jenkins\workspace\Lucene-Solr-7.x-Windows\lucene\build\sandbox\test\temp\junit4-J1-20180915_071602_30814201724706291230976.syserr
   [junit4] >>> JVM J1 emitted unexpected output (verbatim) ----
   [junit4] OpenJDK 64-Bit Server VM warning: Option UseConcMarkSweepGC was deprecated in version 9.0 and will likely be removed in a future release.
   [junit4] <<< JVM J1: EOF ----

[...truncated 297 lines...]
   [junit4] JVM J0: stderr was not empty, see: C:\Users\jenkins\workspace\Lucene-Solr-7.x-Windows\lucene\build\spatial-extras\test\temp\junit4-J0-20180915_071635_31318205570303775247265.syserr
   [junit4] >>> JVM J0 emitted unexpected output (verbatim) ----
   [junit4] OpenJDK 64-Bit Server VM warning: Option UseConcMarkSweepGC was deprecated in version 9.0 and will likely be removed in a future release.
   [junit4] <<< JVM J0: EOF ----

[...truncated 3 lines...]
   [junit4] JVM J1: stderr was not empty, see: C:\Users\jenkins\workspace\Lucene-Solr-7.x-Windows\lucene\build\spatial-extras\test\temp\junit4-J1-20180915_071635_31314420058454052995009.syserr
   [junit4] >>> JVM J1 emitted unexpected output (verbatim) ----
   [junit4] OpenJDK 64-Bit Server VM warning: Option UseConcMarkSweepGC was deprecated in version 9.0 and will likely be removed in a future release.
   [junit4] <<< JVM J1: EOF ----

[...truncated 193 lines...]
   [junit4] JVM J1: stderr was not empty, see: C:\Users\jenkins\workspace\Lucene-Solr-7.x-Windows\lucene\build\spatial3d\test\temp\junit4-J1-20180915_071659_33412201762256476558231.syserr
   [junit4] >>> JVM J1 emitted unexpected output (verbatim) ----
   [junit4] OpenJDK 64-Bit Server VM warning: Option UseConcMarkSweepGC was deprecated in version 9.0 and will likely be removed in a future release.
   [junit4] <<< JVM J1: EOF ----

[...truncated 5 lines...]
   [junit4] JVM J0: stderr was not empty, see: C:\Users\jenkins\workspace\Lucene-Solr-7.x-Windows\lucene\build\spatial3d\test\temp\junit4-J0-20180915_071659_33417187923863769604883.syserr
   [junit4] >>> JVM J0 emitted unexpected output (verbatim) ----
   [junit4] OpenJDK 64-Bit Server VM warning: Option UseConcMarkSweepGC was deprecated in version 9.0 and will likely be removed in a future release.
   [junit4] <<< JVM J0: EOF ----

[...truncated 152 lines...]
   [junit4] JVM J0: stderr was not empty, see: C:\Users\jenkins\workspace\Lucene-Solr-7.x-Windows\lucene\build\spatial\test\temp\junit4-J0-20180915_071715_69115101014205428453641.syserr
   [junit4] >>> JVM J0 emitted unexpected output (verbatim) ----
   [junit4] OpenJDK 64-Bit Server VM warning: Option UseConcMarkSweepGC was deprecated in version 9.0 and will likely be removed in a future release.
   [junit4] <<< JVM J0: EOF ----

[...truncated 259 lines...]
   [junit4] JVM J0: stderr was not empty, see: C:\Users\jenkins\workspace\Lucene-Solr-7.x-Windows\lucene\build\suggest\test\temp\junit4-J0-20180915_071719_9059014622936340826395.syserr
   [junit4] >>> JVM J0 emitted unexpected output (verbatim) ----
   [junit4] OpenJDK 64-Bit Server VM warning: Option UseConcMarkSweepGC was deprecated in version 9.0 and will likely be removed in a future release.
   [junit4] <<< JVM J0: EOF ----

   [junit4] JVM J1: stderr was not empty, see: C:\Users\jenkins\workspace\Lucene-Solr-7.x-Windows\lucene\build\suggest\test\temp\junit4-J1-20180915_071719_9053820100857867661611.syserr
   [junit4] >>> JVM J1 emitted unexpected output (verbatim) ----
   [junit4] OpenJDK 64-Bit Server VM warning: Option UseConcMarkSweepGC was deprecated in version 9.0 and will likely be removed in a future release.
   [junit4] <<< JVM J1: EOF ----

[...truncated 3759 lines...]
   [junit4] Suite: org.apache.solr.cloud.autoscaling.ScheduledTriggerTest
   [junit4]   2> Creating dataDir: C:\Users\jenkins\workspace\Lucene-Solr-7.x-Windows\solr\build\solr-core\test\J0\temp\solr.cloud.autoscaling.ScheduledTriggerTest_8C762486BC0D9086-001\init-core-data-001
   [junit4]   2> 3842561 INFO  (SUITE-ScheduledTriggerTest-seed#[8C762486BC0D9086]-worker) [    ] o.a.s.SolrTestCaseJ4 Using PointFields (NUMERIC_POINTS_SYSPROP=true) w/NUMERIC_DOCVALUES_SYSPROP=true
   [junit4]   2> 3842562 INFO  (SUITE-ScheduledTriggerTest-seed#[8C762486BC0D9086]-worker) [    ] o.a.s.SolrTestCaseJ4 Randomized ssl (true) and clientAuth (true) via: @org.apache.solr.util.RandomizeSSL(reason="", value=0.0/0.0, ssl=0.0/0.0, clientAuth=0.0/0.0)
   [junit4]   2> 3842563 INFO  (SUITE-ScheduledTriggerTest-seed#[8C762486BC0D9086]-worker) [    ] o.a.s.SolrTestCaseJ4 SecureRandom sanity checks: test.solr.allowed.securerandom=null & java.security.egd=file:/dev/./urandom
   [junit4]   2> 3842564 INFO  (SUITE-ScheduledTriggerTest-seed#[8C762486BC0D9086]-worker) [    ] o.a.s.c.MiniSolrCloudCluster Starting cluster of 1 servers in C:\Users\jenkins\workspace\Lucene-Solr-7.x-Windows\solr\build\solr-core\test\J0\temp\solr.cloud.autoscaling.ScheduledTriggerTest_8C762486BC0D9086-001\tempDir-001
   [junit4]   2> 3842564 INFO  (SUITE-ScheduledTriggerTest-seed#[8C762486BC0D9086]-worker) [    ] o.a.s.c.ZkTestServer STARTING ZK TEST SERVER
   [junit4]   2> 3842564 INFO  (Thread-5009) [    ] o.a.s.c.ZkTestServer client port:0.0.0.0/0.0.0.0:0
   [junit4]   2> 3842564 INFO  (Thread-5009) [    ] o.a.s.c.ZkTestServer Starting server
   [junit4]   2> 3842568 ERROR (Thread-5009) [    ] o.a.z.s.ZooKeeperServer ZKShutdownHandler is not registered, so ZooKeeper server won't take any action on ERROR or SHUTDOWN server state changes
   [junit4]   2> 3842665 INFO  (SUITE-ScheduledTriggerTest-seed#[8C762486BC0D9086]-worker) [    ] o.a.s.c.ZkTestServer start zk server on port:63909
   [junit4]   2> 3842668 INFO  (zkConnectionManagerCallback-13788-thread-1) [    ] o.a.s.c.c.ConnectionManager zkClient has connected
   [junit4]   2> 3842674 INFO  (jetty-launcher-13785-thread-1) [    ] o.e.j.s.Server jetty-9.4.11.v20180605; built: 2018-06-05T18:24:03.829Z; git: d5fc0523cfa96bfebfbda19606cad384d772f04c; jvm 10+46
   [junit4]   2> 3842674 INFO  (jetty-launcher-13785-thread-1) [    ] o.e.j.s.session DefaultSessionIdManager workerName=node0
   [junit4]   2> 3842674 INFO  (jetty-launcher-13785-thread-1) [    ] o.e.j.s.session No SessionScavenger set, using defaults
   [junit4]   2> 3842674 INFO  (jetty-launcher-13785-thread-1) [    ] o.e.j.s.session node0 Scavenging every 600000ms
   [junit4]   2> 3842675 INFO  (jetty-launcher-13785-thread-1) [    ] o.e.j.s.h.ContextHandler Started o.e.j.s.ServletContextHandler@41545bd6{/solr,null,AVAILABLE}
   [junit4]   2> 3842676 INFO  (jetty-launcher-13785-thread-1) [    ] o.e.j.s.AbstractConnector Started ServerConnector@1a5eedc2{SSL,[ssl, http/1.1]}{127.0.0.1:?????}
   [junit4]   2> 3842676 INFO  (jetty-launcher-13785-thread-1) [    ] o.e.j.s.Server Started @???????ms
   [junit4]   2> 3842676 INFO  (jetty-launcher-13785-thread-1) [    ] o.a.s.c.s.e.JettySolrRunner Jetty properties: {hostContext=/solr, hostPort=63913}
   [junit4]   2> 3842676 ERROR (jetty-launcher-13785-thread-1) [    ] o.a.s.u.StartupLoggingUtils Missing Java Option solr.log.dir. Logging may be missing or incomplete.
   [junit4]   2> 3842676 INFO  (jetty-launcher-13785-thread-1) [    ] o.a.s.s.SolrDispatchFilter Using logger factory org.apache.logging.slf4j.Log4jLoggerFactory
   [junit4]   2> 3842676 INFO  (jetty-launcher-13785-thread-1) [    ] o.a.s.s.SolrDispatchFilter  ___      _       Welcome to Apache Solr? version 7.6.0
   [junit4]   2> 3842676 INFO  (jetty-launcher-13785-thread-1) [    ] o.a.s.s.SolrDispatchFilter / __| ___| |_ _   Starting in cloud mode on port null
   [junit4]   2> 3842676 INFO  (jetty-launcher-13785-thread-1) [    ] o.a.s.s.SolrDispatchFilter \__ \/ _ \ | '_|  Install dir: null
   [junit4]   2> 3842676 INFO  (jetty-launcher-13785-thread-1) [    ] o.a.s.s.SolrDispatchFilter |___/\___/_|_|    Start time: 2018-09-15T08:22:45.453447300Z
   [junit4]   2> 3842679 INFO  (zkConnectionManagerCallback-13790-thread-1) [    ] o.a.s.c.c.ConnectionManager zkClient has connected
   [junit4]   2> 3842679 INFO  (jetty-launcher-13785-thread-1) [    ] o.a.s.s.SolrDispatchFilter solr.xml found in ZooKeeper. Loading...
   [junit4]   2> 3842746 INFO  (jetty-launcher-13785-thread-1) [    ] o.a.s.c.ZkContainer Zookeeper client=127.0.0.1:63909/solr
   [junit4]   2> 3842748 INFO  (zkConnectionManagerCallback-13794-thread-1) [    ] o.a.s.c.c.ConnectionManager zkClient has connected
   [junit4]   2> 3842751 INFO  (zkConnectionManagerCallback-13796-thread-1) [    ] o.a.s.c.c.ConnectionManager zkClient has connected
   [junit4]   2> 3842842 INFO  (jetty-launcher-13785-thread-1) [n:127.0.0.1:63913_solr    ] o.a.s.c.OverseerElectionContext I am going to be the leader 127.0.0.1:63913_solr
   [junit4]   2> 3842842 INFO  (jetty-launcher-13785-thread-1) [n:127.0.0.1:63913_solr    ] o.a.s.c.Overseer Overseer (id=72066749178380291-127.0.0.1:63913_solr-n_0000000000) starting
   [junit4]   2> 3842850 INFO  (zkConnectionManagerCallback-13803-thread-1) [    ] o.a.s.c.c.ConnectionManager zkClient has connected
   [junit4]   2> 3842852 INFO  (jetty-launcher-13785-thread-1) [n:127.0.0.1:63913_solr    ] o.a.s.c.s.i.ZkClientClusterStateProvider Cluster at 127.0.0.1:63909/solr ready
   [junit4]   2> 3842853 INFO  (OverseerStateUpdate-72066749178380291-127.0.0.1:63913_solr-n_0000000000) [n:127.0.0.1:63913_solr    ] o.a.s.c.Overseer Starting to work on the main queue : 127.0.0.1:63913_solr
   [junit4]   2> 3842853 INFO  (jetty-launcher-13785-thread-1) [n:127.0.0.1:63913_solr    ] o.a.s.c.ZkController Register node as live in ZooKeeper:/live_nodes/127.0.0.1:63913_solr
   [junit4]   2> 3842853 DEBUG (OverseerAutoScalingTriggerThread-72066749178380291-127.0.0.1:63913_solr-n_0000000000) [    ] o.a.s.c.a.OverseerTriggerThread Adding .auto_add_replicas and .scheduled_maintenance triggers
   [junit4]   2> 3842857 DEBUG (OverseerAutoScalingTriggerThread-72066749178380291-127.0.0.1:63913_solr-n_0000000000) [    ] o.a.s.c.a.OverseerTriggerThread Refreshing /autoscaling.json with znode version 1
   [junit4]   2> 3842857 DEBUG (OverseerAutoScalingTriggerThread-72066749178380291-127.0.0.1:63913_solr-n_0000000000) [    ] o.a.s.c.a.OverseerTriggerThread Current znodeVersion 1, lastZnodeVersion -1
   [junit4]   2> 3842857 DEBUG (OverseerAutoScalingTriggerThread-72066749178380291-127.0.0.1:63913_solr-n_0000000000) [    ] o.a.s.c.a.OverseerTriggerThread Processed trigger updates upto znodeVersion 1
   [junit4]   2> 3842857 INFO  (OverseerStateUpdate-72066749178380291-127.0.0.1:63913_solr-n_0000000000) [n:127.0.0.1:63913_solr    ] o.a.s.c.c.ZkStateReader Updated live nodes from ZooKeeper... (0) -> (1)
   [junit4]   2> 3842859 INFO  (zkCallback-13802-thread-1) [    ] o.a.s.c.c.ZkStateReader Updated live nodes from ZooKeeper... (0) -> (1)
   [junit4]   2> 3842861 DEBUG (OverseerAutoScalingTriggerThread-72066749178380291-127.0.0.1:63913_solr-n_0000000000) [    ] o.a.s.c.a.NodeLostTrigger NodeLostTrigger .auto_add_replicas - Initial livenodes: [127.0.0.1:63913_solr]
   [junit4]   2> 3842861 DEBUG (OverseerAutoScalingTriggerThread-72066749178380291-127.0.0.1:63913_solr-n_0000000000) [    ] o.a.s.c.a.OverseerTriggerThread -- clean old nodeAdded markers
   [junit4]   2> 3842861 DEBUG (OverseerAutoScalingTriggerThread-72066749178380291-127.0.0.1:63913_solr-n_0000000000) [    ] o.a.s.c.a.OverseerTriggerThread Current znodeVersion 1, lastZnodeVersion 1
   [junit4]   2> 3842861 DEBUG (ScheduledTrigger-10922-thread-1) [    ] o.a.s.c.a.NodeLostTrigger Running NodeLostTrigger: .auto_add_replicas with currently live nodes: 1
   [junit4]   2> 3842875 INFO  (jetty-launcher-13785-thread-1) [n:127.0.0.1:63913_solr    ] o.a.s.h.a.MetricsHistoryHandler No .system collection, keeping metrics history in memory.
   [junit4]   2> 3842891 INFO  (jetty-launcher-13785-thread-1) [n:127.0.0.1:63913_solr    ] o.a.s.m.r.SolrJmxReporter JMX monitoring for 'solr_63913.solr.node' (registry 'solr.node') enabled at server: com.sun.jmx.mbeanserver.JmxMBeanServer@4443ceb6
   [junit4]   2> 3842896 INFO  (jetty-launcher-13785-thread-1) [n:127.0.0.1:63913_solr    ] o.a.s.m.r.SolrJmxReporter JMX monitoring for 'solr_63913.solr.jvm' (registry 'solr.jvm') enabled at server: com.sun.jmx.mbeanserver.JmxMBeanServer@4443ceb6
   [junit4]   2> 3842896 INFO  (jetty-launcher-13785-thread-1) [n:127.0.0.1:63913_solr    ] o.a.s.m.r.SolrJmxReporter JMX monitoring for 'solr_63913.solr.jetty' (registry 'solr.jetty') enabled at server: com.sun.jmx.mbeanserver.JmxMBeanServer@4443ceb6
   [junit4]   2> 3842897 INFO  (jetty-launcher-13785-thread-1) [n:127.0.0.1:63913_solr    ] o.a.s.c.CorePropertiesLocator Found 0 core definitions underneath C:\Users\jenkins\workspace\Lucene-Solr-7.x-Windows\solr\build\solr-core\test\J0\temp\solr.cloud.autoscaling.ScheduledTriggerTest_8C762486BC0D9086-001\tempDir-001\node1\.
   [junit4]   2> 3842911 INFO  (zkConnectionManagerCallback-13806-thread-1) [    ] o.a.s.c.c.ConnectionManager zkClient has connected
   [junit4]   2> 3842915 INFO  (zkConnectionManagerCallback-13811-thread-1) [    ] o.a.s.c.c.ConnectionManager zkClient has connected
   [junit4]   2> 3842917 INFO  (SUITE-ScheduledTriggerTest-seed#[8C762486BC0D9086]-worker) [    ] o.a.s.c.c.ZkStateReader Updated live nodes from ZooKeeper... (0) -> (1)
   [junit4]   2> 3842918 INFO  (SUITE-ScheduledTriggerTest-seed#[8C762486BC0D9086]-worker) [    ] o.a.s.c.s.i.ZkClientClusterStateProvider Cluster at 127.0.0.1:63909/solr ready
   [junit4]   2> 3842927 INFO  (TEST-ScheduledTriggerTest.testIgnoredEvent-seed#[8C762486BC0D9086]) [    ] o.a.s.SolrTestCaseJ4 ###Starting testIgnoredEvent
   [junit4]   2> 3842928 WARN  (TEST-ScheduledTriggerTest.testIgnoredEvent-seed#[8C762486BC0D9086]) [    ] o.a.s.c.a.ScheduledTrigger ScheduledTrigger was not able to run event at scheduled time: 2018-09-14T08:22:45.705Z. Now: 2018-09-15T08:22:45.705Z
   [junit4]   2> 3842929 INFO  (TEST-ScheduledTriggerTest.testIgnoredEvent-seed#[8C762486BC0D9086]) [    ] o.a.s.SolrTestCaseJ4 ###Ending testIgnoredEvent
   [junit4]   2> 3842936 INFO  (TEST-ScheduledTriggerTest.testTrigger-seed#[8C762486BC0D9086]) [    ] o.a.s.SolrTestCaseJ4 ###Starting testTrigger
   [junit4]   2> 3843863 DEBUG (ScheduledTrigger-10922-thread-2) [    ] o.a.s.c.a.NodeLostTrigger Running NodeLostTrigger: .auto_add_replicas with currently live nodes: 1
   [junit4]   2> 3844863 DEBUG (ScheduledTrigger-10922-thread-1) [    ] o.a.s.c.a.NodeLostTrigger Running NodeLostTrigger: .auto_add_replicas with currently live nodes: 1
   [junit4]   2> 3845864 DEBUG (ScheduledTrigger-10922-thread-2) [    ] o.a.s.c.a.NodeLostTrigger Running NodeLostTrigger: .auto_add_replicas with currently live nodes: 1
   [junit4]   2> 3846864 DEBUG (ScheduledTrigger-10922-thread-3) [    ] o.a.s.c.a.NodeLostTrigger Running NodeLostTrigger: .auto_add_replicas with currently live nodes: 1
   [junit4]   2> 3847864 DEBUG (ScheduledTrigger-10922-thread-2) [    ] o.a.s.c.a.NodeLostTrigger Running NodeLostTrigger: .auto_add_replicas with currently live nodes: 1
   [junit4]   2> 3848865 DEBUG (ScheduledTrigger-10922-thread-3) [    ] o.a.s.c.a.NodeLostTrigger Running NodeLostTrigger: .auto_add_replicas with currently live nodes: 1
   [junit4]   2> 3848937 WARN  (TEST-ScheduledTriggerTest.testTrigger-seed#[8C762486BC0D9086]) [    ] o.a.s.c.a.ScheduledTrigger ScheduledTrigger was not able to run event at scheduled time: 2018-09-15T08:22:48.713Z. Now: 2018-09-15T08:22:51.713Z
   [junit4]   2> 3849867 DEBUG (ScheduledTrigger-10922-thread-2) [    ] o.a.s.c.a.NodeLostTrigger Running NodeLostTrigger: .auto_add_replicas with currently live nodes: 1
   [junit4]   2> 3850867 DEBUG (ScheduledTrigger-10922-thread-2) [    ] o.a.s.c.a.NodeLostTrigger Running NodeLostTrigger: .auto_add_replicas with currently live nodes: 1
   [junit4]   2> 3851868 DEBUG (ScheduledTrigger-10922-thread-1) [    ] o.a.s.c.a.NodeLostTrigger Running NodeLostTrigger: .auto_add_replicas with currently live nodes: 1
   [junit4]   2> 3851938 WARN  (TEST-ScheduledTriggerTest.testTrigger-seed#[8C762486BC0D9086]) [    ] o.a.s.c.a.ScheduledTrigger ScheduledTrigger was not able to run event at scheduled time: 2018-09-15T08:22:51.713Z. Now: 2018-09-15T08:22:54.713Z
   [junit4]   2> 3851939 INFO  (TEST-ScheduledTriggerTest.testTrigger-seed#[8C762486BC0D9086]) [    ] o.a.s.SolrTestCaseJ4 ###Ending testTrigger
   [junit4]   2> NOTE: reproduce with: ant test  -Dtestcase=ScheduledTriggerTest -Dtests.method=testTrigger -Dtests.seed=8C762486BC0D9086 -Dtests.slow=true -Dtests.locale=as -Dtests.timezone=Etc/GMT-4 -Dtests.asserts=true -Dtests.file.encoding=ISO-8859-1
   [junit4] FAILURE 9.01s J0 | ScheduledTriggerTest.testTrigger <<<
   [junit4]    > Throwable #1: java.lang.AssertionError: expected:<3> but was:<2>
   [junit4]    > 	at __randomizedtesting.SeedInfo.seed([8C762486BC0D9086:EFBD120425C2E3AB]:0)
   [junit4]    > 	at org.apache.solr.cloud.autoscaling.ScheduledTriggerTest.scheduledTriggerTest(ScheduledTriggerTest.java:113)
   [junit4]    > 	at org.apache.solr.cloud.autoscaling.ScheduledTriggerTest.testTrigger(ScheduledTriggerTest.java:66)
   [junit4]    > 	at java.base/jdk.internal.reflect.NativeMethodAccessorImpl.invoke0(Native Method)
   [junit4]    > 	at java.base/jdk.internal.reflect.NativeMethodAccessorImpl.invoke(NativeMethodAccessorImpl.java:62)
   [junit4]    > 	at java.base/jdk.internal.reflect.DelegatingMethodAccessorImpl.invoke(DelegatingMethodAccessorImpl.java:43)
   [junit4]    > 	at java.base/java.lang.reflect.Method.invoke(Method.java:564)
   [junit4]    > 	at java.base/java.lang.Thread.run(Thread.java:844)
   [junit4]   2> 3851942 INFO  (jetty-closer-13786-thread-1) [    ] o.e.j.s.AbstractConnector Stopped ServerConnector@1a5eedc2{SSL,[ssl, http/1.1]}{127.0.0.1:?}
   [junit4]   2> 3851943 INFO  (jetty-closer-13786-thread-1) [    ] o.a.s.c.CoreContainer Shutting down CoreContainer instance=248422907
   [junit4]   2> 3851943 INFO  (jetty-closer-13786-thread-1) [    ] o.a.s.m.SolrMetricManager Closing metric reporters for registry=solr.node, tag=null
   [junit4]   2> 3851943 INFO  (jetty-closer-13786-thread-1) [    ] o.a.s.m.r.SolrJmxReporter Closing reporter [org.apache.solr.metrics.reporters.SolrJmxReporter@52c9d976: rootName = solr_63913, domain = solr.node, service url = null, agent id = null] for registry solr.node / com.codahale.metrics.MetricRegistry@1277df96
   [junit4]   2> 3851947 INFO  (jetty-closer-13786-thread-1) [    ] o.a.s.m.SolrMetricManager Closing metric reporters for registry=solr.jvm, tag=null
   [junit4]   2> 3851947 INFO  (jetty-closer-13786-thread-1) [    ] o.a.s.m.r.SolrJmxReporter Closing reporter [org.apache.solr.metrics.reporters.SolrJmxReporter@3d4f6c40: rootName = solr_63913, domain = solr.jvm, service url = null, agent id = null] for registry solr.jvm / com.codahale.metrics.MetricRegistry@2a03cbbc
   [junit4]   2> 3851949 INFO  (jetty-closer-13786-thread-1) [    ] o.a.s.m.SolrMetricManager Closing metric reporters for registry=solr.jetty, tag=null
   [junit4]   2> 3851949 INFO  (jetty-closer-13786-thread-1) [    ] o.a.s.m.r.SolrJmxReporter Closing reporter [org.apache.solr.metrics.reporters.SolrJmxReporter@639e35ee: rootName = solr_63913, domain = solr.jetty, service url = null, agent id = null] for registry solr.jetty / com.codahale.metrics.MetricRegistry@47a5849a
   [junit4]   2> 3851951 INFO  (jetty-closer-13786-thread-1) [    ] o.a.s.c.ZkController Remove node as live in ZooKeeper:/live_nodes/127.0.0.1:63913_solr
   [junit4]   2> 3851952 INFO  (jetty-closer-13786-thread-1) [    ] o.a.s.m.SolrMetricManager Closing metric reporters for registry=solr.cluster, tag=null
   [junit4]   2> 3851952 INFO  (jetty-closer-13786-thread-1) [    ] o.a.s.c.TransientSolrCoreCacheDefault Allocating transient cache for 2147483647 transient cores
   [junit4]   2> 3851952 INFO  (zkCallback-13795-thread-1) [    ] o.a.s.c.c.ZkStateReader Updated live nodes from ZooKeeper... (1) -> (0)
   [junit4]   2> 3851952 INFO  (jetty-closer-13786-thread-1) [    ] o.a.s.c.Overseer Overseer (id=72066749178380291-127.0.0.1:63913_solr-n_0000000000) closing
   [junit4]   2> 3851952 INFO  (OverseerStateUpdate-72066749178380291-127.0.0.1:63913_solr-n_0000000000) [n:127.0.0.1:63913_solr    ] o.a.s.c.Overseer Overseer Loop exiting : 127.0.0.1:63913_solr
   [junit4]   2> 3851952 INFO  (zkCallback-13802-thread-1) [    ] o.a.s.c.c.ZkStateReader Updated live nodes from ZooKeeper... (1) -> (0)
   [junit4]   2> 3851952 WARN  (OverseerAutoScalingTriggerThread-72066749178380291-127.0.0.1:63913_solr-n_0000000000) [    ] o.a.s.c.a.OverseerTriggerThread OverseerTriggerThread woken up but we are closed, exiting.
   [junit4]   2> 3851952 DEBUG (jetty-closer-13786-thread-1) [    ] o.a.s.c.a.ScheduledTriggers Shutting down scheduled thread pool executor now
   [junit4]   2> 3851952 DEBUG (jetty-closer-13786-thread-1) [    ] o.a.s.c.a.ScheduledTriggers Shutting down action executor now
   [junit4]   2> 3851952 DEBUG (jetty-closer-13786-thread-1) [    ] o.a.s.c.a.ScheduledTriggers Awaiting termination for action executor
   [junit4]   2> 3851952 DEBUG (jetty-closer-13786-thread-1) [    ] o.a.s.c.a.ScheduledTriggers Awaiting termination for scheduled thread pool executor
   [junit4]   2> 3851952 DEBUG (jetty-closer-13786-thread-1) [    ] o.a.s.c.a.ScheduledTriggers ScheduledTriggers closed completely
   [junit4]   2> 3851952 DEBUG (jetty-closer-13786-thread-1) [    ] o.a.s.c.a.OverseerTriggerThread OverseerTriggerThread has been closed explicitly
   [junit4]   2> 3851954 INFO  (jetty-closer-13786-thread-1) [    ] o.e.j.s.h.ContextHandler Stopped o.e.j.s.ServletContextHandler@41545bd6{/solr,null,UNAVAILABLE}
   [junit4]   2> 3851954 INFO  (jetty-closer-13786-thread-1) [    ] o.e.j.s.session node0 Stopped scavenging
   [junit4]   2> 3851955 ERROR (SUITE-ScheduledTriggerTest-seed#[8C762486BC0D9086]-worker) [    ] o.a.z.s.ZooKeeperServer ZKShutdownHandler is not registered, so ZooKeeper server won't take any action on ERROR or SHUTDOWN server state changes
   [junit4]   2> 3851955 INFO  (SUITE-ScheduledTriggerTest-seed#[8C762486BC0D9086]-worker) [    ] o.a.s.c.ZkTestServer connecting to 127.0.0.1:63909 63909
   [junit4]   2> 3851955 INFO  (Thread-5009) [    ] o.a.s.c.ZkTestServer connecting to 127.0.0.1:63909 63909
   [junit4]   2> 3851956 WARN  (Thread-5009) [    ] o.a.s.c.ZkTestServer Watch limit violations: 
   [junit4]   2> Maximum concurrent create/delete watches above limit:
   [junit4]   2> 
   [junit4]   2> 	3	/solr/aliases.json
   [junit4]   2> 
   [junit4]   2> Maximum concurrent data watches above limit:
   [junit4]   2> 
   [junit4]   2> 	3	/solr/clusterstate.json
   [junit4]   2> 	3	/solr/clusterprops.json
   [junit4]   2> 
   [junit4]   2> Maximum concurrent children watches above limit:
   [junit4]   2> 
   [junit4]   2> 	3	/solr/live_nodes
   [junit4]   2> 	3	/solr/collections
   [junit4]   2> 
   [junit4]   2> NOTE: leaving temporary files on disk at: C:\Users\jenkins\workspace\Lucene-Solr-7.x-Windows\solr\build\solr-core\test\J0\temp\solr.cloud.autoscaling.ScheduledTriggerTest_8C762486BC0D9086-001
   [junit4]   2> Sep 15, 2018 8:22:54 AM com.carrotsearch.randomizedtesting.ThreadLeakControl checkThreadLeaks
   [junit4]   2> WARNING: Will linger awaiting termination of 4 leaked thread(s).
   [junit4]   2> NOTE: test params are: codec=Asserting(Lucene70): {}, docValues:{}, maxPointsInLeafNode=311, maxMBSortInHeap=6.3320674905869545, sim=RandomSimilarity(queryNorm=false): {}, locale=as, timezone=Etc/GMT-4
   [junit4]   2> NOTE: Windows 10 10.0 amd64/Oracle Corporation 10 (64-bit)/cpus=3,threads=1,free=251369368,total=503562240
   [junit4]   2> NOTE: All tests run in this JVM: [LukeRequestHandlerTest, BlockCacheTest, TestCollationFieldDocValues, TestFreeTextSuggestions, TestReqParamsAPI, TestDelegationWithHadoopAuth, TestTrackingShardHandlerFactory, TestSolrCloudWithHadoopAuthPlugin, TestAddFieldRealTimeGet, PrimitiveFieldTypeTest, ResourceLoaderTest, ZkSolrClientTest, TestXIncludeConfig, DocExpirationUpdateProcessorFactoryTest, AnalysisErrorHandlingTest, TestDistributedStatsComponentCardinality, TestManagedResourceStorage, TestCollectionsAPIViaSolrCloudCluster, MigrateRouteKeyTest, ParsingFieldUpdateProcessorsTest, DeleteStatusTest, TestSolrQueryParser, TestSolr4Spatial2, CheckHdfsIndexTest, TestManagedSchemaThreadSafety, UUIDFieldTest, TestUpdate, TestDFISimilarityFactory, MoreLikeThisHandlerTest, TestManagedStopFilterFactory, TestTolerantUpdateProcessorCloud, QueryElevationComponentTest, RangeFacetCloudTest, TestFieldTypeCollectionResource, TestOnReconnectListenerSupport, HLLUtilTest, PluginInfoTest, AnalysisAfterCoreReloadTest, DeleteLastCustomShardedReplicaTest, TestRandomFaceting, TestInPlaceUpdatesDistrib, VMParamsZkACLAndCredentialsProvidersTest, HdfsDirectoryFactoryTest, DistributedFacetPivotSmallTest, TestLFUCache, DateMathParserTest, HttpSolrCallGetCoreTest, ChaosMonkeyNothingIsSafeTest, TestSimNodeLostTrigger, StatelessScriptUpdateProcessorFactoryTest, TestBM25SimilarityFactory, ZkStateWriterTest, CurrencyFieldTypeTest, TriggerIntegrationTest, CdcrOpsAndBoundariesTest, DistributedMLTComponentTest, ChangedSchemaMergeTest, TestPointFields, RegexBytesRefFilterTest, CacheHeaderTest, TestSimDistribStateManager, TestSolrConfigHandlerCloud, TestSearcherReuse, TestCoreBackup, TestFiltering, DataDrivenBlockJoinTest, OverseerRolesTest, TestMacroExpander, AlternateDirectoryTest, TestObjectReleaseTracker, ReplicationFactorTest, TestLuceneIndexBackCompat, VersionInfoTest, TestDistribDocBasedVersion, SyncSliceTest, TestSuggestSpellingConverter, SolrCmdDistributorTest, FullSolrCloudDistribCmdsTest, ResponseLogComponentTest, TestSubQueryTransformer, JavabinLoaderTest, HdfsWriteToMultipleCollectionsTest, TestAuthorizationFramework, ManagedSchemaRoundRobinCloudTest, PeerSyncWithLeaderTest, TestSortByMinMaxFunction, CustomHighlightComponentTest, ZkControllerTest, TestRuleBasedAuthorizationPlugin, EnumFieldTest, TestSimExecutePlanAction, TestUtils, CoreAdminHandlerTest, TestUnInvertedFieldException, TestSolrFieldCacheBean, TestPHPSerializedResponseWriter, URLClassifyProcessorTest, TestDynamicURP, TestSubQueryTransformerDistrib, SuggesterFSTTest, TestGraphTermsQParserPlugin, CollectionReloadTest, DateRangeFieldTest, DocumentBuilderTest, TestInfoStreamLogging, TestComplexPhraseLeadingWildcard, JvmMetricsTest, CollectionsAPIAsyncDistributedZkTest, NodeAddedTriggerTest, TestUninvertingReader, TestRawResponseWriter, TestJsonFacetRefinement, StatsComponentTest, TestShortCircuitedRequests, ComputePlanActionTest, DistributedQueryComponentOptimizationTest, InfoHandlerTest, TestConfigSetsAPIExclusivity, TestFieldCacheWithThreads, RegexBoostProcessorTest, TestHighFrequencyDictionaryFactory, TestLocalFSCloudBackupRestore, TestCloudSchemaless, DistributedDebugComponentTest, TestDynamicFieldCollectionResource, SolrCloudExampleTest, TestPerFieldSimilarity, TestSkipOverseerOperations, ScheduledTriggerIntegrationTest, TestDocTermOrdsUninvertLimit, TestNamedUpdateProcessors, MoveReplicaTest, TestIndexSearcher, MetricsHandlerTest, RecoveryZkTest, TestConfigSetProperties, SuggesterTest, UninvertDocValuesMergePolicyTest, FileUtilsTest, TestFieldCacheSortRandom, PeerSyncWithIndexFingerprintCachingTest, TestSimLargeCluster, TestFastOutputStream, SolrIndexMetricsTest, TimeRoutedAliasUpdateProcessorTest, HighlighterConfigTest, SubstringBytesRefFilterTest, FullHLLTest, SolrMetricReporterTest, SimplePostToolTest, TestSweetSpotSimilarityFactory, AutoAddReplicasPlanActionTest, SolrCoreMetricManagerTest, GraphQueryTest, OverseerTaskQueueTest, SearchRateTriggerIntegrationTest, ProtectedTermFilterFactoryTest, OverseerCollectionConfigSetProcessorTest, TestSystemIdResolver, CollectionStateFormat2Test, TestDistributedGrouping, SolrGangliaReporterTest, CdcrWithNodesRestartsTest, TestConfigsApi, TestJmxIntegration, TestNoOpRegenerator, CdcrRequestHandlerTest, LeaderElectionIntegrationTest, TriggerCooldownIntegrationTest, TestNumericRangeQuery32, ClassificationUpdateProcessorFactoryTest, TestGroupingSearch, SearchHandlerTest, TestCSVLoader, TestSerializedLuceneMatchVersion, SpellCheckCollatorTest, TestSimClusterStateProvider, TestExactSharedStatsCache, IndexSchemaRuntimeFieldTest, RuleEngineTest, TestSchemalessBufferedUpdates, TestNumericTerms32, CloudMLTQParserTest, TestBulkSchemaConcurrent, TestAnalyzeInfixSuggestions, TaggerTest, ChaosMonkeySafeLeaderTest, TestRecoveryHdfs, TestLegacyTerms, HttpPartitionTest, TestScoreJoinQPScore, TestJoin, SimpleCollectionCreateDeleteTest, TestHashPartitioner, TestStressCloudBlindAtomicUpdates, TestRebalanceLeaders, TestSolrDeletionPolicy1, DeleteReplicaTest, CdcrBidirectionalTest, UpdateLogTest, NodeLostTriggerTest, TestRealTimeGet, CSVRequestHandlerTest, TestPullReplicaErrorHandling, TestSizeLimitedDistributedMap, TestSolrCloudWithDelegationTokens, TestSolrCloudWithKerberosAlt, TestSolrCloudWithSecureImpersonation, TestStressLiveNodes, TestUtilizeNode, UnloadDistributedZkTest, ZkNodePropsTest, ZkShardTermsTest, AssignTest, CollectionsAPIDistributedZkTest, TestRequestStatusCollectionAPI, AutoAddReplicasIntegrationTest, HdfsAutoAddReplicasIntegrationTest, HttpTriggerListenerTest, IndexSizeTriggerTest, MetricTriggerTest, NodeLostTriggerIntegrationTest, NodeMarkersRegistrationTest, RestoreTriggerStateTest, ScheduledMaintenanceTriggerTest, ScheduledTriggerTest]
   [junit4] Completed [537/833 (1!)] on J0 in 9.91s, 2 tests, 1 failure <<< FAILURES!

[...truncated 24 lines...]
   [junit4] Suite: org.apache.solr.cloud.autoscaling.sim.TestSimTriggerIntegration
   [junit4]   2> Creating dataDir: C:\Users\jenkins\workspace\Lucene-Solr-7.x-Windows\solr\build\solr-core\test\J0\temp\solr.cloud.autoscaling.sim.TestSimTriggerIntegration_8C762486BC0D9086-001\init-core-data-001
   [junit4]   2> 3926447 INFO  (SUITE-TestSimTriggerIntegration-seed#[8C762486BC0D9086]-worker) [    ] o.a.s.SolrTestCaseJ4 Using PointFields (NUMERIC_POINTS_SYSPROP=true) w/NUMERIC_DOCVALUES_SYSPROP=true
   [junit4]   2> 3926449 INFO  (SUITE-TestSimTriggerIntegration-seed#[8C762486BC0D9086]-worker) [    ] o.a.s.SolrTestCaseJ4 Randomized ssl (false) and clientAuth (true) via: @org.apache.solr.util.RandomizeSSL(reason="", value=0.0/0.0, ssl=0.0/0.0, clientAuth=0.0/0.0)
   [junit4]   2> 3926449 INFO  (SUITE-TestSimTriggerIntegration-seed#[8C762486BC0D9086]-worker) [    ] o.a.s.SolrTestCaseJ4 SecureRandom sanity checks: test.solr.allowed.securerandom=null & java.security.egd=file:/dev/./urandom
   [junit4]   2> 3926455 DEBUG (SUITE-TestSimTriggerIntegration-seed#[8C762486BC0D9086]-worker) [    ] o.a.s.c.a.s.SimClusterStateProvider --- new Overseer leader: 127.0.0.1:10130_solr
   [junit4]   2> 3926455 INFO  (SUITE-TestSimTriggerIntegration-seed#[8C762486BC0D9086]-worker) [    ] o.a.s.h.a.MetricsHistoryHandler No .system collection, keeping metrics history in memory.
   [junit4]   2> 3926460 INFO  (TEST-TestSimTriggerIntegration.testSearchRate-seed#[8C762486BC0D9086]) [    ] o.a.s.SolrTestCaseJ4 ###Starting testSearchRate
   [junit4]   2> 3926460 DEBUG (Simulated OverseerAutoScalingTriggerThread) [    ] o.a.s.c.a.OverseerTriggerThread Adding .auto_add_replicas and .scheduled_maintenance triggers
   [junit4]   2> 3926460 INFO  (TEST-TestSimTriggerIntegration.testSearchRate-seed#[8C762486BC0D9086]) [    ] o.a.s.c.a.s.SimCloudManager === Restarting OverseerTriggerThread and clearing object cache...
   [junit4]   2> 3926460 DEBUG (TEST-TestSimTriggerIntegration.testSearchRate-seed#[8C762486BC0D9086]) [    ] o.a.s.c.a.ScheduledTriggers Shutting down scheduled thread pool executor now
   [junit4]   2> 3926460 DEBUG (TEST-TestSimTriggerIntegration.testSearchRate-seed#[8C762486BC0D9086]) [    ] o.a.s.c.a.ScheduledTriggers Shutting down action executor now
   [junit4]   2> 3926460 DEBUG (TEST-TestSimTriggerIntegration.testSearchRate-seed#[8C762486BC0D9086]) [    ] o.a.s.c.a.ScheduledTriggers Awaiting termination for action executor
   [junit4]   2> 3926460 DEBUG (TEST-TestSimTriggerIntegration.testSearchRate-seed#[8C762486BC0D9086]) [    ] o.a.s.c.a.ScheduledTriggers Awaiting termination for scheduled thread pool executor
   [junit4]   2> 3926460 DEBUG (TEST-TestSimTriggerIntegration.testSearchRate-seed#[8C762486BC0D9086]) [    ] o.a.s.c.a.ScheduledTriggers ScheduledTriggers closed completely
   [junit4]   2> 3926460 DEBUG (TEST-TestSimTriggerIntegration.testSearchRate-seed#[8C762486BC0D9086]) [    ] o.a.s.c.a.OverseerTriggerThread OverseerTriggerThread has been closed explicitly
   [junit4]   2> 3926461 DEBUG (Simulated OverseerAutoScalingTriggerThread) [    ] o.a.s.c.a.OverseerTriggerThread Refreshing /autoscaling.json with znode version 1
   [junit4]   2> 3926461 DEBUG (Simulated OverseerAutoScalingTriggerThread) [    ] o.a.s.c.a.OverseerTriggerThread Current znodeVersion 1, lastZnodeVersion -1
   [junit4]   2> 3926461 DEBUG (Simulated OverseerAutoScalingTriggerThread) [    ] o.a.s.c.a.OverseerTriggerThread Processed trigger updates upto znodeVersion 1
   [junit4]   2> 3926462 DEBUG (Simulated OverseerAutoScalingTriggerThread) [    ] o.a.s.c.a.NodeLostTrigger NodeLostTrigger .auto_add_replicas - Initial livenodes: [127.0.0.1:10130_solr, 127.0.0.1:10131_solr]
   [junit4]   2> 3926462 DEBUG (Simulated OverseerAutoScalingTriggerThread) [    ] o.a.s.c.a.OverseerTriggerThread -- clean old nodeAdded markers
   [junit4]   2> 3926462 DEBUG (Simulated OverseerAutoScalingTriggerThread) [    ] o.a.s.c.a.OverseerTriggerThread Current znodeVersion 1, lastZnodeVersion 1
   [junit4]   2> 3926462 DEBUG (ScheduledTrigger-11126-thread-2) [    ] o.a.s.c.a.NodeLostTrigger Running NodeLostTrigger: .auto_add_replicas with currently live nodes: 2
   [junit4]   2> 3926483 DEBUG (ScheduledTrigger-11126-thread-2) [    ] o.a.s.c.a.NodeLostTrigger Running NodeLostTrigger: .auto_add_replicas with currently live nodes: 2
   [junit4]   2> 3926504 DEBUG (ScheduledTrigger-11126-thread-4) [    ] o.a.s.c.a.NodeLostTrigger Running NodeLostTrigger: .auto_add_replicas with currently live nodes: 2
   [junit4]   2> 3926525 DEBUG (ScheduledTrigger-11126-thread-3) [    ] o.a.s.c.a.NodeLostTrigger Running NodeLostTrigger: .auto_add_replicas with currently live nodes: 2
   [junit4]   2> 3926546 DEBUG (ScheduledTrigger-11126-thread-4) [    ] o.a.s.c.a.NodeLostTrigger Running NodeLostTrigger: .auto_add_replicas with currently live nodes: 2
   [junit4]   2> 3926562 DEBUG (simCloudManagerPool-11125-thread-1) [    ] o.a.s.c.a.AutoScalingHandler Verified autoscaling configuration
   [junit4]   2> 3926562 DEBUG (simCloudManagerPool-11125-thread-1) [    ] o.a.s.c.a.OverseerTriggerThread Refreshing /autoscaling.json with znode version 2
   [junit4]   2> 3926562 DEBUG (Simulated OverseerAutoScalingTriggerThread) [    ] o.a.s.c.a.OverseerTriggerThread Processed trigger updates upto znodeVersion 2
   [junit4]   2> 3926562 DEBUG (Simulated OverseerAutoScalingTriggerThread) [    ] o.a.s.c.a.OverseerTriggerThread -- clean old nodeAdded markers
   [junit4]   2> 3926562 DEBUG (Simulated OverseerAutoScalingTriggerThread) [    ] o.a.s.c.a.OverseerTriggerThread Current znodeVersion 2, lastZnodeVersion 2
   [junit4]   2> 3926567 DEBUG (ScheduledTrigger-11126-thread-2) [    ] o.a.s.c.a.NodeLostTrigger Running NodeLostTrigger: .auto_add_replicas with currently live nodes: 2
   [junit4]   2> 3926583 DEBUG (simCloudManagerPool-11125-thread-2) [    ] o.a.s.c.a.s.SimClusterStateProvider -- submit leader election for .system / shard1
   [junit4]   2> 3926583 DEBUG (simCloudManagerPool-11125-thread-3) [    ] o.a.s.c.a.s.SimClusterStateProvider Running leader election for .system / shard1
   [junit4]   2> 3926583 DEBUG (simCloudManagerPool-11125-thread-3) [    ] o.a.s.c.a.s.SimClusterStateProvider -- elected new leader for .system / shard1: core_node1
   [junit4]   2> 3926587 DEBUG (ScheduledTrigger-11126-thread-2) [    ] o.a.s.c.a.NodeLostTrigger Running NodeLostTrigger: .auto_add_replicas with currently live nodes: 2
   [junit4]   2> 3926607 DEBUG (simCloudManagerPool-11125-thread-5) [    ] o.a.s.c.a.s.SimClusterStateProvider -- submit leader election for collection1 / shard1
   [junit4]   2> 3926607 DEBUG (simCloudManagerPool-11125-thread-7) [    ] o.a.s.c.a.s.SimClusterStateProvider Running leader election for collection1 / shard1
   [junit4]   2> 3926607 DEBUG (simCloudManagerPool-11125-thread-7) [    ] o.a.s.c.a.s.SimClusterStateProvider -- elected new leader for collection1 / shard1: core_node1
   [junit4]   2> 3926608 DEBUG (ScheduledTrigger-11126-thread-2) [    ] o.a.s.c.a.NodeLostTrigger Running NodeLostTrigger: .auto_add_replicas with currently live nodes: 2
   [junit4]   2> 3926617 DEBUG (simCloudManagerPool-11125-thread-6) [    ] o.a.s.c.a.s.SimClusterStateProvider -- already has leader collection1 / shard1
   [junit4]   2> 3926619 DEBUG (simCloudManagerPool-11125-thread-8) [    ] o.a.s.c.a.AutoScalingHandler Verified autoscaling configuration
   [junit4]   2> 3926619 DEBUG (simCloudManagerPool-11125-thread-8) [    ] o.a.s.c.a.OverseerTriggerThread Refreshing /autoscaling.json with znode version 3
   [junit4]   2> 3926620 DEBUG (Simulated OverseerAutoScalingTriggerThread) [    ] o.a.s.c.a.OverseerTriggerThread Processed trigger updates upto znodeVersion 3
   [junit4]   2> 3926620 DEBUG (Simulated OverseerAutoScalingTriggerThread) [    ] o.a.s.c.a.OverseerTriggerThread -- clean old nodeAdded markers
   [junit4]   2> 3926620 DEBUG (Simulated OverseerAutoScalingTriggerThread) [    ] o.a.s.c.a.OverseerTriggerThread Current znodeVersion 3, lastZnodeVersion 3
   [junit4]   2> 3926620 DEBUG (ScheduledTrigger-11126-thread-3) [    ] o.a.s.c.a.SearchRateTrigger ### rates for node 127.0.0.1:10130_solr
   [junit4]   2> 3926620 DEBUG (ScheduledTrigger-11126-thread-3) [    ] o.a.s.c.a.SearchRateTrigger ### rates for node 127.0.0.1:10131_solr
   [junit4]   2> 3926620 DEBUG (simCloudManagerPool-11125-thread-9) [    ] o.a.s.c.a.AutoScalingHandler Verified autoscaling configuration
   [junit4]   2> 3926620 DEBUG (simCloudManagerPool-11125-thread-9) [    ] o.a.s.c.a.OverseerTriggerThread Refreshing /autoscaling.json with znode version 4
   [junit4]   2> 3926622 DEBUG (Simulated OverseerAutoScalingTriggerThread) [    ] o.a.s.c.a.OverseerTriggerThread Processed trigger updates upto znodeVersion 4
   [junit4]   2> 3926622 DEBUG (Simulated OverseerAutoScalingTriggerThread) [    ] o.a.s.c.a.OverseerTriggerThread -- clean old nodeAdded markers
   [junit4]   2> 3926622 DEBUG (Simulated OverseerAutoScalingTriggerThread) [    ] o.a.s.c.a.OverseerTriggerThread Current znodeVersion 4, lastZnodeVersion 4
   [junit4]   2> 3926629 DEBUG (ScheduledTrigger-11126-thread-1) [    ] o.a.s.c.a.NodeLostTrigger Running NodeLostTrigger: .auto_add_replicas with currently live nodes: 2
   [junit4]   2> 3926642 DEBUG (ScheduledTrigger-11126-thread-2) [    ] o.a.s.c.a.SearchRateTrigger ### rates for node 127.0.0.1:10130_solr
   [junit4]   2> 3926642 DEBUG (ScheduledTrigger-11126-thread-2) [    ] o.a.s.c.a.SearchRateTrigger ###  metrics:solr.core.collection1.shard1.replica_n2:QUERY./select.requestTimes:1minRate	250
   [junit4]   2> 3926642 DEBUG (ScheduledTrigger-11126-thread-2) [    ] o.a.s.c.a.SearchRateTrigger ### rates for node 127.0.0.1:10131_solr
   [junit4]   2> 3926642 DEBUG (ScheduledTrigger-11126-thread-2) [    ] o.a.s.c.a.SearchRateTrigger ###  metrics:solr.core.collection1.shard1.replica_n1:QUERY./select.requestTimes:1minRate	250
   [junit4]   2> 3926642 DEBUG (ScheduledTrigger-11126-thread-2) [    ] o.a.s.c.a.SearchRateTrigger ## Collection: collection1
   [junit4]   2> 3926642 DEBUG (ScheduledTrigger-11126-thread-2) [    ] o.a.s.c.a.SearchRateTrigger ##  - shard1
   [junit4]   2> 3926642 DEBUG (ScheduledTrigger-11126-thread-2) [    ] o.a.s.c.a.SearchRateTrigger ##     collection1_shard1_replica_n2  250.0
   [junit4]   2> 3926642 DEBUG (ScheduledTrigger-11126-thread-2) [    ] o.a.s.c.a.SearchRateTrigger ##     collection1_shard1_replica_n1  250.0
   [junit4]   2> 3926642 DEBUG (ScheduledTrigger-11126-thread-2) [    ] o.a.s.c.a.SearchRateTrigger -- collection1.shard1: totalShardRate=500.0, shardRate=250.0
   [junit4]   2> 3926650 DEBUG (ScheduledTrigger-11126-thread-4) [    ] o.a.s.c.a.NodeLostTrigger Running NodeLostTrigger: .auto_add_replicas with currently live nodes: 2
   [junit4]   2> 3926663 DEBUG (ScheduledTrigger-11126-thread-3) [    ] o.a.s.c.a.SearchRateTrigger ### rates for node 127.0.0.1:10130_solr
   [junit4]   2> 3926663 DEBUG (ScheduledTrigger-11126-thread-3) [    ] o.a.s.c.a.SearchRateTrigger ###  metrics:solr.core.collection1.shard1.replica_n2:QUERY./select.requestTimes:1minRate	250
   [junit4]   2> 3926663 DEBUG (ScheduledTrigger-11126-thread-3) [    ] o.a.s.c.a.SearchRateTrigger ### rates for node 127.0.0.1:10131_solr
   [junit4]   2> 3926663 DEBUG (ScheduledTrigger-11126-thread-3) [    ] o.a.s.c.a.SearchRateTrigger ###  metrics:solr.core.collection1.shard1.replica_n1:QUERY./select.requestTimes:1minRate	250
   [junit4]   2> 3926663 DEBUG (ScheduledTrigger-11126-thread-3) [    ] o.a.s.c.a.SearchRateTrigger ## Collection: collection1
   [junit4]   2> 3926663 DEBUG (ScheduledTrigger-11126-thread-3) [    ] o.a.s.c.a.SearchRateTrigger ##  - shard1
   [junit4]   2> 3926663 DEBUG (ScheduledTrigger-11126-thread-3) [    ] o.a.s.c.a.SearchRateTrigger ##     collection1_shard1_replica_n2  250.0
   [junit4]   2> 3926663 DEBUG (ScheduledTrigger-11126-thread-3) [    ] o.a.s.c.a.SearchRateTrigger ##     collection1_shard1_replica_n1  250.0
   [junit4]   2> 3926663 DEBUG (ScheduledTrigger-11126-thread-3) [    ] o.a.s.c.a.SearchRateTrigger -- collection1.shard1: totalShardRate=500.0, shardRate=250.0
   [junit4]   2> 3926670 DEBUG (ScheduledTrigger-11126-thread-1) [    ] o.a.s.c.a.NodeLostTrigger Running NodeLostTrigger: .auto_add_replicas with currently live nodes: 2
   [junit4]   2> 3926684 DEBUG (ScheduledTrigger-11126-thread-2) [    ] o.a.s.c.a.SearchRateTrigger ### rates for node 127.0.0.1:10130_solr
   [junit4]   2> 3926684 DEBUG (ScheduledTrigger-11126-thread-2) [    ] o.a.s.c.a.SearchRateTrigger ###  metrics:solr.core.collection1.shard1.replica_n2:QUERY./select.requestTimes:1minRate	250
   [junit4]   2> 3926684 DEBUG (ScheduledTrigger-11126-thread-2) [    ] o.a.s.c.a.SearchRateTrigger ### rates for node 127.0.0.1:10131_solr
   [junit4]   2> 3926684 DEBUG (ScheduledTrigger-11126-thread-2) [    ] o.a.s.c.a.SearchRateTrigger ###  metrics:solr.core.collection1.shard1.replica_n1:QUERY./select.requestTimes:1minRate	250
   [junit4]   2> 3926684 DEBUG (ScheduledTrigger-11126-thread-2) [    ] o.a.s.c.a.SearchRateTrigger ## Collection: collection1
   [junit4]   2> 3926684 DEBUG (ScheduledTrigger-11126-thread-2) [    ] o.a.s.c.a.SearchRateTrigger ##  - shard1
   [junit4]   2> 3926684 DEBUG (ScheduledTrigger-11126-thread-2) [    ] o.a.s.c.a.SearchRateTrigger ##     collection1_shard1_replica_n2  250.0
   [junit4]   2> 3926684 DEBUG (ScheduledTrigger-11126-thread-2) [    ] o.a.s.c.a.SearchRateTrigger ##     collection1_shard1_replica_n1  250.0
   [junit4]   2> 3926684 DEBUG (ScheduledTrigger-11126-thread-2) [    ] o.a.s.c.a.SearchRateTrigger -- collection1.shard1: totalShardRate=500.0, shardRate=250.0
   [junit4]   2> 3926691 DEBUG (ScheduledTrigger-11126-thread-4) [    ] o.a.s.c.a.NodeLostTrigger Running NodeLostTrigger: .auto_add_replicas with currently live nodes: 2
   [junit4]   2> 3926705 DEBUG (ScheduledTrigger-11126-thread-3) [    ] o.a.s.c.a.SearchRateTrigger ### rates for node 127.0.0.1:10130_solr
   [junit4]   2> 3926705 DEBUG (ScheduledTrigger-11126-thread-3) [    ] o.a.s.c.a.SearchRateTrigger ###  metrics:solr.core.collection1.shard1.replica_n2:QUERY./select.requestTimes:1minRate	250
   [junit4]   2> 3926705 DEBUG (ScheduledTrigger-11126-thread-3) [    ] o.a.s.c.a.SearchRateTrigger ### rates for node 127.0.0.1:10131_solr
   [junit4]   2> 3926705 DEBUG (ScheduledTrigger-11126-thread-3) [    ] o.a.s.c.a.SearchRateTrigger ###  metrics:solr.core.collection1.shard1.replica_n1:QUERY./select.requestTimes:1minRate	250
   [junit4]   2> 3926705 DEBUG (ScheduledTrigger-11126-thread-3) [    ] o.a.s.c.a.SearchRateTrigger ## Collection: collection1
   [junit4]   2> 3926705 DEBUG (ScheduledTrigger-11126-thread-3) [    ] o.a.s.c.a.SearchRateTrigger ##  - shard1
   [junit4]   2> 3926705 DEBUG (ScheduledTrigger-11126-thread-3) [    ] o.a.s.c.a.SearchRateTrigger ##     collection1_shard1_replica_n2  250.0
   [junit4]   2> 3926705 DEBUG (ScheduledTrigger-11126-thread-3) [    ] o.a.s.c.a.SearchRateTrigger ##     collection1_shard1_replica_n1  250.0
   [junit4]   2> 3926705 DEBUG (ScheduledTrigger-11126-thread-3) [    ] o.a.s.c.a.SearchRateTrigger -- collection1.shard1: totalShardRate=500.0, shardRate=250.0
   [junit4]   2> 3926705 DEBUG (ScheduledTrigger-11126-thread-3) [    ] o.a.s.c.a.ScheduledTriggers ++++++++ Cooldown inactive - processing event: {
   [junit4]   2>   "id":"1182d7e6f80a9T7zonplmieaul7h2y62mpxmfh1",
   [junit4]   2>   "source":"search_rate_trigger",
   [junit4]   2>   "eventTime":308058650542249,
   [junit4]   2>   "eventType":"SEARCHRATE",
   [junit4]   2>   "properties":{
   [junit4]   2>     "hotReplicas":[
   [junit4]   2>       {"core_node2":{
   [junit4]   2>           "core":"collection1_shard1_replica_n2",
   [junit4]   2>           "shard":"shard1",
   [junit4]   2>           "collection":"collection1",
   [junit4]   2>           "node_name":"127.0.0.1:10130_solr",
   [junit4]   2>           "type":"NRT",
   [junit4]   2>           "SEARCHER.searcher.maxDoc":0,
   [junit4]   2>           "SEARCHER.searcher.deletedDocs":0,
   [junit4]   2>           "INDEX.sizeInBytes":10240,
   [junit4]   2>           "rate":250.0,
   [junit4]   2>           "state":"active",
   [junit4]   2>           "QUERY./select.requestTimes:1minRate":250,
   [junit4]   2>           "INDEX.sizeInGB":9.5367431640625E-6,
   [junit4]   2>           "SEARCHER.searcher.numDocs":0}},
   [junit4]   2>       {"core_node1":{
   [junit4]   2>           "core":"collection1_shard1_replica_n1",
   [junit4]   2>           "shard":"shard1",
   [junit4]   2>           "collection":"collection1",
   [junit4]   2>           "node_name":"127.0.0.1:10131_solr",
   [junit4]   2>           "type":"NRT",
   [junit4]   2>           "leader":"true",
   [junit4]   2>           "SEARCHER.searcher.maxDoc":0,
   [junit4]   2>           "SEARCHER.searcher.deletedDocs":0,
   [junit4]   2>           "INDEX.sizeInBytes":10240,
   [junit4]   2>           "rate":250.0,
   [junit4]   2>           "state":"active",
   [junit4]   2>           "QUERY./select.requestTimes:1minRate":250,
   [junit4]   2>           "INDEX.sizeInGB":9.5367431640625E-6,
   [junit4]   2>           "SEARCHER.searcher.numDocs":0}}],
   [junit4]   2>     "coldNodes":{},
   [junit4]   2>     "coldShards":{},
   [junit4]   2>     "coldReplicas":[],
   [junit4]   2>     "violationType":["hotShards"],
   [junit4]   2>     "coldCollections":{},
   [junit4]   2>     "hotShards":{"collection1":{"shard1":250.0}},
   [junit4]   2>     "hotCollections":{"collection1":500.0},
   [junit4]   2>     "hotNodes":{
   [junit4]   2>       "127.0.0.1:10130_solr":250.0,
   [junit4]   2>       "127.0.0.1:10131_solr":250.0},
   [junit4]   2>     "requestedOps":[
   [junit4]   2>       {
   [junit4]   2>         "action":"ADDREPLICA",
   [junit4]   2>         "hints":{"COLL_SHARD":[{
   [junit4]   2>               "first":"collection1",
   [junit4]   2>               "second":"shard1"}]}},
   [junit4]   2>       {
   [junit4]   

[...truncated too long message...]

ctConnector Stopped ServerConnector@605a6b14{SSL,[ssl, http/1.1]}{127.0.0.1:0}
   [junit4]   2> 56314 INFO  (jetty-closer-29-thread-1) [    ] o.a.s.c.CoreContainer Shutting down CoreContainer instance=552846591
   [junit4]   2> 56314 INFO  (jetty-closer-29-thread-1) [    ] o.a.s.m.SolrMetricManager Closing metric reporters for registry=solr.node, tag=null
   [junit4]   2> 56315 INFO  (jetty-closer-29-thread-1) [    ] o.a.s.m.r.SolrJmxReporter Closing reporter [org.apache.solr.metrics.reporters.SolrJmxReporter@1a13fce0: rootName = solr_59354, domain = solr.node, service url = null, agent id = null] for registry solr.node / com.codahale.metrics.MetricRegistry@302f8c65
   [junit4]   2> 56329 INFO  (jetty-closer-29-thread-1) [    ] o.a.s.m.SolrMetricManager Closing metric reporters for registry=solr.jvm, tag=null
   [junit4]   2> 56329 INFO  (jetty-closer-29-thread-1) [    ] o.a.s.m.r.SolrJmxReporter Closing reporter [org.apache.solr.metrics.reporters.SolrJmxReporter@5c4fc594: rootName = solr_59354, domain = solr.jvm, service url = null, agent id = null] for registry solr.jvm / com.codahale.metrics.MetricRegistry@74f13f87
   [junit4]   2> 56335 INFO  (jetty-closer-29-thread-1) [    ] o.a.s.m.SolrMetricManager Closing metric reporters for registry=solr.jetty, tag=null
   [junit4]   2> 56336 INFO  (jetty-closer-29-thread-1) [    ] o.a.s.m.r.SolrJmxReporter Closing reporter [org.apache.solr.metrics.reporters.SolrJmxReporter@4f5c3cc3: rootName = solr_59354, domain = solr.jetty, service url = null, agent id = null] for registry solr.jetty / com.codahale.metrics.MetricRegistry@35fc69a6
   [junit4]   2> 56339 INFO  (jetty-closer-29-thread-1) [    ] o.a.s.c.ZkController Remove node as live in ZooKeeper:/live_nodes/127.0.0.1:59354_solr
   [junit4]   2> 56342 INFO  (jetty-closer-29-thread-1) [    ] o.a.s.m.SolrMetricManager Closing metric reporters for registry=solr.cluster, tag=null
   [junit4]   2> 56342 INFO  (jetty-closer-29-thread-1) [    ] o.a.s.c.TransientSolrCoreCacheDefault Allocating transient cache for 2147483647 transient cores
   [junit4]   2> 56342 INFO  (jetty-closer-29-thread-1) [    ] o.a.s.c.Overseer Overseer (id=72066878140317699-127.0.0.1:59354_solr-n_0000000000) closing
   [junit4]   2> 56343 INFO  (OverseerStateUpdate-72066878140317699-127.0.0.1:59354_solr-n_0000000000) [n:127.0.0.1:59354_solr    ] o.a.s.c.Overseer Overseer Loop exiting : 127.0.0.1:59354_solr
   [junit4]   2> 56343 INFO  (zkCallback-45-thread-1) [    ] o.a.s.c.c.ZkStateReader Updated live nodes from ZooKeeper... (1) -> (0)
   [junit4]   2> 56343 WARN  (OverseerAutoScalingTriggerThread-72066878140317699-127.0.0.1:59354_solr-n_0000000000) [    ] o.a.s.c.a.OverseerTriggerThread OverseerTriggerThread woken up but we are closed, exiting.
   [junit4]   2> 56343 DEBUG (jetty-closer-29-thread-1) [    ] o.a.s.c.a.ScheduledTriggers Shutting down scheduled thread pool executor now
   [junit4]   2> 56344 INFO  (zkCallback-38-thread-1) [    ] o.a.s.c.c.ZkStateReader Updated live nodes from ZooKeeper... (1) -> (0)
   [junit4]   2> 56344 DEBUG (jetty-closer-29-thread-1) [    ] o.a.s.c.a.ScheduledTriggers Shutting down action executor now
   [junit4]   2> 56344 DEBUG (jetty-closer-29-thread-1) [    ] o.a.s.c.a.ScheduledTriggers Awaiting termination for action executor
   [junit4]   2> 56344 DEBUG (jetty-closer-29-thread-1) [    ] o.a.s.c.a.ScheduledTriggers Awaiting termination for scheduled thread pool executor
   [junit4]   2> 56345 DEBUG (jetty-closer-29-thread-1) [    ] o.a.s.c.a.ScheduledTriggers ScheduledTriggers closed completely
   [junit4]   2> 56345 DEBUG (jetty-closer-29-thread-1) [    ] o.a.s.c.a.OverseerTriggerThread OverseerTriggerThread has been closed explicitly
   [junit4]   2> 56346 WARN  (NIOServerCxn.Factory:0.0.0.0/0.0.0.0:0) [    ] o.a.z.s.NIOServerCnxn Unable to read additional data from client sessionid 0x10008719fa00004, likely client has closed socket
   [junit4]   2> 56348 WARN  (NIOServerCxn.Factory:0.0.0.0/0.0.0.0:0) [    ] o.a.z.s.NIOServerCnxn Unable to read additional data from client sessionid 0x10008719fa00003, likely client has closed socket
   [junit4]   2> 56349 INFO  (jetty-closer-29-thread-1) [    ] o.e.j.s.h.ContextHandler Stopped o.e.j.s.ServletContextHandler@4c64429e{/solr,null,UNAVAILABLE}
   [junit4]   2> 56350 INFO  (jetty-closer-29-thread-1) [    ] o.e.j.s.session node0 Stopped scavenging
   [junit4]   2> 56351 ERROR (SUITE-ScheduledTriggerTest-seed#[8C762486BC0D9086]-worker) [    ] o.a.z.s.ZooKeeperServer ZKShutdownHandler is not registered, so ZooKeeper server won't take any action on ERROR or SHUTDOWN server state changes
   [junit4]   2> 56351 INFO  (SUITE-ScheduledTriggerTest-seed#[8C762486BC0D9086]-worker) [    ] o.a.s.c.ZkTestServer connecting to 127.0.0.1:59350 59350
   [junit4]   2> 56352 INFO  (Thread-11) [    ] o.a.s.c.ZkTestServer connecting to 127.0.0.1:59350 59350
   [junit4]   2> 56354 WARN  (Thread-11) [    ] o.a.s.c.ZkTestServer Watch limit violations: 
   [junit4]   2> Maximum concurrent create/delete watches above limit:
   [junit4]   2> 
   [junit4]   2> 	3	/solr/aliases.json
   [junit4]   2> 
   [junit4]   2> Maximum concurrent data watches above limit:
   [junit4]   2> 
   [junit4]   2> 	3	/solr/clusterstate.json
   [junit4]   2> 	3	/solr/clusterprops.json
   [junit4]   2> 
   [junit4]   2> Maximum concurrent children watches above limit:
   [junit4]   2> 
   [junit4]   2> 	3	/solr/live_nodes
   [junit4]   2> 	3	/solr/collections
   [junit4]   2> 
   [junit4]   2> NOTE: leaving temporary files on disk at: C:\Users\jenkins\workspace\Lucene-Solr-7.x-Windows\solr\build\solr-core\test\J1\temp\solr.cloud.autoscaling.ScheduledTriggerTest_8C762486BC0D9086-001
   [junit4]   2> Sep 15, 2018 8:55:43 AM com.carrotsearch.randomizedtesting.ThreadLeakControl checkThreadLeaks
   [junit4]   2> WARNING: Will linger awaiting termination of 4 leaked thread(s).
   [junit4]   2> NOTE: test params are: codec=Asserting(Lucene70): {}, docValues:{}, maxPointsInLeafNode=311, maxMBSortInHeap=6.3320674905869545, sim=RandomSimilarity(queryNorm=false): {}, locale=fr-YT, timezone=Atlantic/St_Helena
   [junit4]   2> NOTE: Windows 10 10.0 amd64/Oracle Corporation 10 (64-bit)/cpus=3,threads=1,free=55143744,total=97320960
   [junit4]   2> NOTE: All tests run in this JVM: [TestSimTriggerIntegration, ScheduledTriggerTest, TestSimTriggerIntegration, ScheduledTriggerTest]
   [junit4] Completed [6/10 (2!)] on J1 in 11.05s, 2 tests, 1 failure <<< FAILURES!

[...truncated 43 lines...]
   [junit4] JVM J1: stderr was not empty, see: C:\Users\jenkins\workspace\Lucene-Solr-7.x-Windows\solr\build\solr-core\test\temp\junit4-J1-20180915_085446_6378281535989304614587.syserr
   [junit4] >>> JVM J1 emitted unexpected output (verbatim) ----
   [junit4] OpenJDK 64-Bit Server VM warning: Option UseConcMarkSweepGC was deprecated in version 9.0 and will likely be removed in a future release.
   [junit4] <<< JVM J1: EOF ----

[...truncated 5 lines...]
   [junit4] JVM J0: stderr was not empty, see: C:\Users\jenkins\workspace\Lucene-Solr-7.x-Windows\solr\build\solr-core\test\temp\junit4-J0-20180915_085446_63817369814312601730710.syserr
   [junit4] >>> JVM J0 emitted unexpected output (verbatim) ----
   [junit4] OpenJDK 64-Bit Server VM warning: Option UseConcMarkSweepGC was deprecated in version 9.0 and will likely be removed in a future release.
   [junit4] <<< JVM J0: EOF ----

[...truncated 10 lines...]
BUILD FAILED
C:\Users\jenkins\workspace\Lucene-Solr-7.x-Windows\lucene\common-build.xml:1567: The following error occurred while executing this line:
C:\Users\jenkins\workspace\Lucene-Solr-7.x-Windows\lucene\common-build.xml:1092: There were test failures: 10 suites, 65 tests, 2 failures [seed: 8C762486BC0D9086]

Total time: 1 minute 15 seconds

[repro] Setting last failure code to 1

[repro] Failures:
[repro]   1/5 failed: org.apache.solr.cloud.autoscaling.ScheduledTriggerTest
[repro]   1/5 failed: org.apache.solr.cloud.autoscaling.sim.TestSimTriggerIntegration
[repro] Exiting with code 1

C:\Users\jenkins\workspace\Lucene-Solr-7.x-Windows>IF EXIST lucene\build move /y lucene\build lucene\build.repro 
        1 dir(s) moved.

C:\Users\jenkins\workspace\Lucene-Solr-7.x-Windows>IF EXIST solr\build move /y solr\build solr\build.repro 
        1 dir(s) moved.

C:\Users\jenkins\workspace\Lucene-Solr-7.x-Windows>IF EXIST lucene\build.orig move /y lucene\build.orig lucene\build 
        1 dir(s) moved.

C:\Users\jenkins\workspace\Lucene-Solr-7.x-Windows>IF EXIST solr\build.orig move /y solr\build.orig solr\build 
        1 dir(s) moved.

C:\Users\jenkins\workspace\Lucene-Solr-7.x-Windows>exit 0 
Archiving artifacts
Setting ANT_1_8_2_HOME=C:\Users\jenkins\tools\hudson.tasks.Ant_AntInstallation\ANT_1.8.2
[WARNINGS] Parsing warnings in console log with parser Java Compiler (javac)
Setting ANT_1_8_2_HOME=C:\Users\jenkins\tools\hudson.tasks.Ant_AntInstallation\ANT_1.8.2
Setting ANT_1_8_2_HOME=C:\Users\jenkins\tools\hudson.tasks.Ant_AntInstallation\ANT_1.8.2
<Git Blamer> Using GitBlamer to create author and commit information for all warnings.
<Git Blamer> GIT_COMMIT=4febf778369d7db708ac07fe42a46b194b495c8a, workspace=C:\Users\jenkins\workspace\Lucene-Solr-7.x-Windows
[WARNINGS] Computing warning deltas based on reference build #791
Recording test results
Setting ANT_1_8_2_HOME=C:\Users\jenkins\tools\hudson.tasks.Ant_AntInstallation\ANT_1.8.2
Build step 'Publish JUnit test result report' changed build result to UNSTABLE
Email was triggered for: Unstable (Test Failures)
Sending email for trigger: Unstable (Test Failures)
Setting ANT_1_8_2_HOME=C:\Users\jenkins\tools\hudson.tasks.Ant_AntInstallation\ANT_1.8.2
Setting ANT_1_8_2_HOME=C:\Users\jenkins\tools\hudson.tasks.Ant_AntInstallation\ANT_1.8.2
Setting ANT_1_8_2_HOME=C:\Users\jenkins\tools\hudson.tasks.Ant_AntInstallation\ANT_1.8.2
Setting ANT_1_8_2_HOME=C:\Users\jenkins\tools\hudson.tasks.Ant_AntInstallation\ANT_1.8.2

Mime
View raw message