lucene-dev mailing list archives

Site index · List index
Message view « Date » · « Thread »
Top « Date » · « Thread »
From Policeman Jenkins Server <jenk...@thetaphi.de>
Subject [JENKINS] Lucene-Solr-master-Linux (64bit/jdk1.8.0_172) - Build # 22852 - Still Unstable!
Date Thu, 13 Sep 2018 17:37:37 GMT
Build: https://jenkins.thetaphi.de/job/Lucene-Solr-master-Linux/22852/
Java: 64bit/jdk1.8.0_172 -XX:+UseCompressedOops -XX:+UseSerialGC

4 tests failed.
FAILED:  org.apache.solr.cloud.TestPullReplicaErrorHandling.testCantConnectToLeader

Error Message:
Error from server at http://127.0.0.1:36395/solr: Could not find collection : pull_replica_error_handling_test_cant_connect_to_leader

Stack Trace:
org.apache.solr.client.solrj.impl.HttpSolrClient$RemoteSolrException: Error from server at http://127.0.0.1:36395/solr: Could not find collection : pull_replica_error_handling_test_cant_connect_to_leader
	at __randomizedtesting.SeedInfo.seed([4DC797584DF48098:C3CBF72838EC04B2]:0)
	at org.apache.solr.client.solrj.impl.HttpSolrClient.executeMethod(HttpSolrClient.java:643)
	at org.apache.solr.client.solrj.impl.HttpSolrClient.request(HttpSolrClient.java:255)
	at org.apache.solr.client.solrj.impl.HttpSolrClient.request(HttpSolrClient.java:244)
	at org.apache.solr.client.solrj.impl.LBHttpSolrClient.doRequest(LBHttpSolrClient.java:483)
	at org.apache.solr.client.solrj.impl.LBHttpSolrClient.request(LBHttpSolrClient.java:413)
	at org.apache.solr.client.solrj.impl.CloudSolrClient.sendRequest(CloudSolrClient.java:1107)
	at org.apache.solr.client.solrj.impl.CloudSolrClient.requestWithRetryOnStaleState(CloudSolrClient.java:884)
	at org.apache.solr.client.solrj.impl.CloudSolrClient.request(CloudSolrClient.java:817)
	at org.apache.solr.client.solrj.SolrRequest.process(SolrRequest.java:194)
	at org.apache.solr.client.solrj.SolrRequest.process(SolrRequest.java:211)
	at org.apache.solr.cloud.TestPullReplicaErrorHandling.tearDown(TestPullReplicaErrorHandling.java:128)
	at sun.reflect.NativeMethodAccessorImpl.invoke0(Native Method)
	at sun.reflect.NativeMethodAccessorImpl.invoke(NativeMethodAccessorImpl.java:62)
	at sun.reflect.DelegatingMethodAccessorImpl.invoke(DelegatingMethodAccessorImpl.java:43)
	at java.lang.reflect.Method.invoke(Method.java:498)
	at com.carrotsearch.randomizedtesting.RandomizedRunner.invoke(RandomizedRunner.java:1742)
	at com.carrotsearch.randomizedtesting.RandomizedRunner$10.evaluate(RandomizedRunner.java:993)
	at com.carrotsearch.randomizedtesting.rules.SystemPropertiesRestoreRule$1.evaluate(SystemPropertiesRestoreRule.java:57)
	at org.apache.lucene.util.TestRuleSetupTeardownChained$1.evaluate(TestRuleSetupTeardownChained.java:49)
	at org.apache.lucene.util.AbstractBeforeAfterRule$1.evaluate(AbstractBeforeAfterRule.java:45)
	at org.apache.lucene.util.TestRuleThreadAndTestName$1.evaluate(TestRuleThreadAndTestName.java:48)
	at org.apache.lucene.util.TestRuleIgnoreAfterMaxFailures$1.evaluate(TestRuleIgnoreAfterMaxFailures.java:64)
	at org.apache.lucene.util.TestRuleMarkFailure$1.evaluate(TestRuleMarkFailure.java:47)
	at com.carrotsearch.randomizedtesting.rules.StatementAdapter.evaluate(StatementAdapter.java:36)
	at com.carrotsearch.randomizedtesting.ThreadLeakControl$StatementRunner.run(ThreadLeakControl.java:368)
	at com.carrotsearch.randomizedtesting.ThreadLeakControl.forkTimeoutingTask(ThreadLeakControl.java:817)
	at com.carrotsearch.randomizedtesting.ThreadLeakControl$3.evaluate(ThreadLeakControl.java:468)
	at com.carrotsearch.randomizedtesting.RandomizedRunner.runSingleTest(RandomizedRunner.java:944)
	at com.carrotsearch.randomizedtesting.RandomizedRunner$5.evaluate(RandomizedRunner.java:830)
	at com.carrotsearch.randomizedtesting.RandomizedRunner$6.evaluate(RandomizedRunner.java:880)
	at com.carrotsearch.randomizedtesting.RandomizedRunner$7.evaluate(RandomizedRunner.java:891)
	at com.carrotsearch.randomizedtesting.rules.StatementAdapter.evaluate(StatementAdapter.java:36)
	at com.carrotsearch.randomizedtesting.rules.SystemPropertiesRestoreRule$1.evaluate(SystemPropertiesRestoreRule.java:57)
	at org.apache.lucene.util.AbstractBeforeAfterRule$1.evaluate(AbstractBeforeAfterRule.java:45)
	at com.carrotsearch.randomizedtesting.rules.StatementAdapter.evaluate(StatementAdapter.java:36)
	at org.apache.lucene.util.TestRuleStoreClassName$1.evaluate(TestRuleStoreClassName.java:41)
	at com.carrotsearch.randomizedtesting.rules.NoShadowingOrOverridesOnMethodsRule$1.evaluate(NoShadowingOrOverridesOnMethodsRule.java:40)
	at com.carrotsearch.randomizedtesting.rules.NoShadowingOrOverridesOnMethodsRule$1.evaluate(NoShadowingOrOverridesOnMethodsRule.java:40)
	at com.carrotsearch.randomizedtesting.rules.StatementAdapter.evaluate(StatementAdapter.java:36)
	at com.carrotsearch.randomizedtesting.rules.StatementAdapter.evaluate(StatementAdapter.java:36)
	at com.carrotsearch.randomizedtesting.rules.StatementAdapter.evaluate(StatementAdapter.java:36)
	at org.apache.lucene.util.TestRuleAssertionsRequired$1.evaluate(TestRuleAssertionsRequired.java:53)
	at org.apache.lucene.util.TestRuleMarkFailure$1.evaluate(TestRuleMarkFailure.java:47)
	at org.apache.lucene.util.TestRuleIgnoreAfterMaxFailures$1.evaluate(TestRuleIgnoreAfterMaxFailures.java:64)
	at org.apache.lucene.util.TestRuleIgnoreTestSuites$1.evaluate(TestRuleIgnoreTestSuites.java:54)
	at com.carrotsearch.randomizedtesting.rules.StatementAdapter.evaluate(StatementAdapter.java:36)
	at com.carrotsearch.randomizedtesting.ThreadLeakControl$StatementRunner.run(ThreadLeakControl.java:368)
	at java.lang.Thread.run(Thread.java:748)


FAILED:  org.apache.solr.cloud.TestPullReplicaErrorHandling.testCantConnectToLeader

Error Message:
Error from server at http://127.0.0.1:45279/solr: Could not find collection : pull_replica_error_handling_test_cant_connect_to_leader

Stack Trace:
org.apache.solr.client.solrj.impl.HttpSolrClient$RemoteSolrException: Error from server at http://127.0.0.1:45279/solr: Could not find collection : pull_replica_error_handling_test_cant_connect_to_leader
	at __randomizedtesting.SeedInfo.seed([4DC797584DF48098:C3CBF72838EC04B2]:0)
	at org.apache.solr.client.solrj.impl.HttpSolrClient.executeMethod(HttpSolrClient.java:643)
	at org.apache.solr.client.solrj.impl.HttpSolrClient.request(HttpSolrClient.java:255)
	at org.apache.solr.client.solrj.impl.HttpSolrClient.request(HttpSolrClient.java:244)
	at org.apache.solr.client.solrj.impl.LBHttpSolrClient.doRequest(LBHttpSolrClient.java:483)
	at org.apache.solr.client.solrj.impl.LBHttpSolrClient.request(LBHttpSolrClient.java:413)
	at org.apache.solr.client.solrj.impl.CloudSolrClient.sendRequest(CloudSolrClient.java:1107)
	at org.apache.solr.client.solrj.impl.CloudSolrClient.requestWithRetryOnStaleState(CloudSolrClient.java:884)
	at org.apache.solr.client.solrj.impl.CloudSolrClient.request(CloudSolrClient.java:817)
	at org.apache.solr.client.solrj.SolrRequest.process(SolrRequest.java:194)
	at org.apache.solr.client.solrj.SolrRequest.process(SolrRequest.java:211)
	at org.apache.solr.cloud.TestPullReplicaErrorHandling.tearDown(TestPullReplicaErrorHandling.java:128)
	at sun.reflect.NativeMethodAccessorImpl.invoke0(Native Method)
	at sun.reflect.NativeMethodAccessorImpl.invoke(NativeMethodAccessorImpl.java:62)
	at sun.reflect.DelegatingMethodAccessorImpl.invoke(DelegatingMethodAccessorImpl.java:43)
	at java.lang.reflect.Method.invoke(Method.java:498)
	at com.carrotsearch.randomizedtesting.RandomizedRunner.invoke(RandomizedRunner.java:1742)
	at com.carrotsearch.randomizedtesting.RandomizedRunner$10.evaluate(RandomizedRunner.java:993)
	at com.carrotsearch.randomizedtesting.rules.SystemPropertiesRestoreRule$1.evaluate(SystemPropertiesRestoreRule.java:57)
	at org.apache.lucene.util.TestRuleSetupTeardownChained$1.evaluate(TestRuleSetupTeardownChained.java:49)
	at org.apache.lucene.util.AbstractBeforeAfterRule$1.evaluate(AbstractBeforeAfterRule.java:45)
	at org.apache.lucene.util.TestRuleThreadAndTestName$1.evaluate(TestRuleThreadAndTestName.java:48)
	at org.apache.lucene.util.TestRuleIgnoreAfterMaxFailures$1.evaluate(TestRuleIgnoreAfterMaxFailures.java:64)
	at org.apache.lucene.util.TestRuleMarkFailure$1.evaluate(TestRuleMarkFailure.java:47)
	at com.carrotsearch.randomizedtesting.rules.StatementAdapter.evaluate(StatementAdapter.java:36)
	at com.carrotsearch.randomizedtesting.ThreadLeakControl$StatementRunner.run(ThreadLeakControl.java:368)
	at com.carrotsearch.randomizedtesting.ThreadLeakControl.forkTimeoutingTask(ThreadLeakControl.java:817)
	at com.carrotsearch.randomizedtesting.ThreadLeakControl$3.evaluate(ThreadLeakControl.java:468)
	at com.carrotsearch.randomizedtesting.RandomizedRunner.runSingleTest(RandomizedRunner.java:944)
	at com.carrotsearch.randomizedtesting.RandomizedRunner$5.evaluate(RandomizedRunner.java:830)
	at com.carrotsearch.randomizedtesting.RandomizedRunner$6.evaluate(RandomizedRunner.java:880)
	at com.carrotsearch.randomizedtesting.RandomizedRunner$7.evaluate(RandomizedRunner.java:891)
	at com.carrotsearch.randomizedtesting.rules.StatementAdapter.evaluate(StatementAdapter.java:36)
	at com.carrotsearch.randomizedtesting.rules.SystemPropertiesRestoreRule$1.evaluate(SystemPropertiesRestoreRule.java:57)
	at org.apache.lucene.util.AbstractBeforeAfterRule$1.evaluate(AbstractBeforeAfterRule.java:45)
	at com.carrotsearch.randomizedtesting.rules.StatementAdapter.evaluate(StatementAdapter.java:36)
	at org.apache.lucene.util.TestRuleStoreClassName$1.evaluate(TestRuleStoreClassName.java:41)
	at com.carrotsearch.randomizedtesting.rules.NoShadowingOrOverridesOnMethodsRule$1.evaluate(NoShadowingOrOverridesOnMethodsRule.java:40)
	at com.carrotsearch.randomizedtesting.rules.NoShadowingOrOverridesOnMethodsRule$1.evaluate(NoShadowingOrOverridesOnMethodsRule.java:40)
	at com.carrotsearch.randomizedtesting.rules.StatementAdapter.evaluate(StatementAdapter.java:36)
	at com.carrotsearch.randomizedtesting.rules.StatementAdapter.evaluate(StatementAdapter.java:36)
	at com.carrotsearch.randomizedtesting.rules.StatementAdapter.evaluate(StatementAdapter.java:36)
	at org.apache.lucene.util.TestRuleAssertionsRequired$1.evaluate(TestRuleAssertionsRequired.java:53)
	at org.apache.lucene.util.TestRuleMarkFailure$1.evaluate(TestRuleMarkFailure.java:47)
	at org.apache.lucene.util.TestRuleIgnoreAfterMaxFailures$1.evaluate(TestRuleIgnoreAfterMaxFailures.java:64)
	at org.apache.lucene.util.TestRuleIgnoreTestSuites$1.evaluate(TestRuleIgnoreTestSuites.java:54)
	at com.carrotsearch.randomizedtesting.rules.StatementAdapter.evaluate(StatementAdapter.java:36)
	at com.carrotsearch.randomizedtesting.ThreadLeakControl$StatementRunner.run(ThreadLeakControl.java:368)
	at java.lang.Thread.run(Thread.java:748)


FAILED:  org.apache.solr.cloud.TestPullReplicaErrorHandling.testCantConnectToLeader

Error Message:
Error from server at http://127.0.0.1:35455/solr: Could not find collection : pull_replica_error_handling_test_cant_connect_to_leader

Stack Trace:
org.apache.solr.client.solrj.impl.HttpSolrClient$RemoteSolrException: Error from server at http://127.0.0.1:35455/solr: Could not find collection : pull_replica_error_handling_test_cant_connect_to_leader
	at __randomizedtesting.SeedInfo.seed([4DC797584DF48098:C3CBF72838EC04B2]:0)
	at org.apache.solr.client.solrj.impl.HttpSolrClient.executeMethod(HttpSolrClient.java:643)
	at org.apache.solr.client.solrj.impl.HttpSolrClient.request(HttpSolrClient.java:255)
	at org.apache.solr.client.solrj.impl.HttpSolrClient.request(HttpSolrClient.java:244)
	at org.apache.solr.client.solrj.impl.LBHttpSolrClient.doRequest(LBHttpSolrClient.java:483)
	at org.apache.solr.client.solrj.impl.LBHttpSolrClient.request(LBHttpSolrClient.java:413)
	at org.apache.solr.client.solrj.impl.CloudSolrClient.sendRequest(CloudSolrClient.java:1107)
	at org.apache.solr.client.solrj.impl.CloudSolrClient.requestWithRetryOnStaleState(CloudSolrClient.java:884)
	at org.apache.solr.client.solrj.impl.CloudSolrClient.request(CloudSolrClient.java:817)
	at org.apache.solr.client.solrj.SolrRequest.process(SolrRequest.java:194)
	at org.apache.solr.client.solrj.SolrRequest.process(SolrRequest.java:211)
	at org.apache.solr.cloud.TestPullReplicaErrorHandling.tearDown(TestPullReplicaErrorHandling.java:128)
	at sun.reflect.NativeMethodAccessorImpl.invoke0(Native Method)
	at sun.reflect.NativeMethodAccessorImpl.invoke(NativeMethodAccessorImpl.java:62)
	at sun.reflect.DelegatingMethodAccessorImpl.invoke(DelegatingMethodAccessorImpl.java:43)
	at java.lang.reflect.Method.invoke(Method.java:498)
	at com.carrotsearch.randomizedtesting.RandomizedRunner.invoke(RandomizedRunner.java:1742)
	at com.carrotsearch.randomizedtesting.RandomizedRunner$10.evaluate(RandomizedRunner.java:993)
	at com.carrotsearch.randomizedtesting.rules.SystemPropertiesRestoreRule$1.evaluate(SystemPropertiesRestoreRule.java:57)
	at org.apache.lucene.util.TestRuleSetupTeardownChained$1.evaluate(TestRuleSetupTeardownChained.java:49)
	at org.apache.lucene.util.AbstractBeforeAfterRule$1.evaluate(AbstractBeforeAfterRule.java:45)
	at org.apache.lucene.util.TestRuleThreadAndTestName$1.evaluate(TestRuleThreadAndTestName.java:48)
	at org.apache.lucene.util.TestRuleIgnoreAfterMaxFailures$1.evaluate(TestRuleIgnoreAfterMaxFailures.java:64)
	at org.apache.lucene.util.TestRuleMarkFailure$1.evaluate(TestRuleMarkFailure.java:47)
	at com.carrotsearch.randomizedtesting.rules.StatementAdapter.evaluate(StatementAdapter.java:36)
	at com.carrotsearch.randomizedtesting.ThreadLeakControl$StatementRunner.run(ThreadLeakControl.java:368)
	at com.carrotsearch.randomizedtesting.ThreadLeakControl.forkTimeoutingTask(ThreadLeakControl.java:817)
	at com.carrotsearch.randomizedtesting.ThreadLeakControl$3.evaluate(ThreadLeakControl.java:468)
	at com.carrotsearch.randomizedtesting.RandomizedRunner.runSingleTest(RandomizedRunner.java:944)
	at com.carrotsearch.randomizedtesting.RandomizedRunner$5.evaluate(RandomizedRunner.java:830)
	at com.carrotsearch.randomizedtesting.RandomizedRunner$6.evaluate(RandomizedRunner.java:880)
	at com.carrotsearch.randomizedtesting.RandomizedRunner$7.evaluate(RandomizedRunner.java:891)
	at com.carrotsearch.randomizedtesting.rules.StatementAdapter.evaluate(StatementAdapter.java:36)
	at com.carrotsearch.randomizedtesting.rules.SystemPropertiesRestoreRule$1.evaluate(SystemPropertiesRestoreRule.java:57)
	at org.apache.lucene.util.AbstractBeforeAfterRule$1.evaluate(AbstractBeforeAfterRule.java:45)
	at com.carrotsearch.randomizedtesting.rules.StatementAdapter.evaluate(StatementAdapter.java:36)
	at org.apache.lucene.util.TestRuleStoreClassName$1.evaluate(TestRuleStoreClassName.java:41)
	at com.carrotsearch.randomizedtesting.rules.NoShadowingOrOverridesOnMethodsRule$1.evaluate(NoShadowingOrOverridesOnMethodsRule.java:40)
	at com.carrotsearch.randomizedtesting.rules.NoShadowingOrOverridesOnMethodsRule$1.evaluate(NoShadowingOrOverridesOnMethodsRule.java:40)
	at com.carrotsearch.randomizedtesting.rules.StatementAdapter.evaluate(StatementAdapter.java:36)
	at com.carrotsearch.randomizedtesting.rules.StatementAdapter.evaluate(StatementAdapter.java:36)
	at com.carrotsearch.randomizedtesting.rules.StatementAdapter.evaluate(StatementAdapter.java:36)
	at org.apache.lucene.util.TestRuleAssertionsRequired$1.evaluate(TestRuleAssertionsRequired.java:53)
	at org.apache.lucene.util.TestRuleMarkFailure$1.evaluate(TestRuleMarkFailure.java:47)
	at org.apache.lucene.util.TestRuleIgnoreAfterMaxFailures$1.evaluate(TestRuleIgnoreAfterMaxFailures.java:64)
	at org.apache.lucene.util.TestRuleIgnoreTestSuites$1.evaluate(TestRuleIgnoreTestSuites.java:54)
	at com.carrotsearch.randomizedtesting.rules.StatementAdapter.evaluate(StatementAdapter.java:36)
	at com.carrotsearch.randomizedtesting.ThreadLeakControl$StatementRunner.run(ThreadLeakControl.java:368)
	at java.lang.Thread.run(Thread.java:748)


FAILED:  org.apache.solr.cloud.TestPullReplicaErrorHandling.testCantConnectToLeader

Error Message:
Error from server at http://127.0.0.1:41869/solr: Could not find collection : pull_replica_error_handling_test_cant_connect_to_leader

Stack Trace:
org.apache.solr.client.solrj.impl.HttpSolrClient$RemoteSolrException: Error from server at http://127.0.0.1:41869/solr: Could not find collection : pull_replica_error_handling_test_cant_connect_to_leader
	at __randomizedtesting.SeedInfo.seed([4DC797584DF48098:C3CBF72838EC04B2]:0)
	at org.apache.solr.client.solrj.impl.HttpSolrClient.executeMethod(HttpSolrClient.java:643)
	at org.apache.solr.client.solrj.impl.HttpSolrClient.request(HttpSolrClient.java:255)
	at org.apache.solr.client.solrj.impl.HttpSolrClient.request(HttpSolrClient.java:244)
	at org.apache.solr.client.solrj.impl.LBHttpSolrClient.doRequest(LBHttpSolrClient.java:483)
	at org.apache.solr.client.solrj.impl.LBHttpSolrClient.request(LBHttpSolrClient.java:413)
	at org.apache.solr.client.solrj.impl.CloudSolrClient.sendRequest(CloudSolrClient.java:1107)
	at org.apache.solr.client.solrj.impl.CloudSolrClient.requestWithRetryOnStaleState(CloudSolrClient.java:884)
	at org.apache.solr.client.solrj.impl.CloudSolrClient.request(CloudSolrClient.java:817)
	at org.apache.solr.client.solrj.SolrRequest.process(SolrRequest.java:194)
	at org.apache.solr.client.solrj.SolrRequest.process(SolrRequest.java:211)
	at org.apache.solr.cloud.TestPullReplicaErrorHandling.tearDown(TestPullReplicaErrorHandling.java:128)
	at sun.reflect.GeneratedMethodAccessor30.invoke(Unknown Source)
	at sun.reflect.DelegatingMethodAccessorImpl.invoke(DelegatingMethodAccessorImpl.java:43)
	at java.lang.reflect.Method.invoke(Method.java:498)
	at com.carrotsearch.randomizedtesting.RandomizedRunner.invoke(RandomizedRunner.java:1742)
	at com.carrotsearch.randomizedtesting.RandomizedRunner$10.evaluate(RandomizedRunner.java:993)
	at com.carrotsearch.randomizedtesting.rules.SystemPropertiesRestoreRule$1.evaluate(SystemPropertiesRestoreRule.java:57)
	at org.apache.lucene.util.TestRuleSetupTeardownChained$1.evaluate(TestRuleSetupTeardownChained.java:49)
	at org.apache.lucene.util.AbstractBeforeAfterRule$1.evaluate(AbstractBeforeAfterRule.java:45)
	at org.apache.lucene.util.TestRuleThreadAndTestName$1.evaluate(TestRuleThreadAndTestName.java:48)
	at org.apache.lucene.util.TestRuleIgnoreAfterMaxFailures$1.evaluate(TestRuleIgnoreAfterMaxFailures.java:64)
	at org.apache.lucene.util.TestRuleMarkFailure$1.evaluate(TestRuleMarkFailure.java:47)
	at com.carrotsearch.randomizedtesting.rules.StatementAdapter.evaluate(StatementAdapter.java:36)
	at com.carrotsearch.randomizedtesting.ThreadLeakControl$StatementRunner.run(ThreadLeakControl.java:368)
	at com.carrotsearch.randomizedtesting.ThreadLeakControl.forkTimeoutingTask(ThreadLeakControl.java:817)
	at com.carrotsearch.randomizedtesting.ThreadLeakControl$3.evaluate(ThreadLeakControl.java:468)
	at com.carrotsearch.randomizedtesting.RandomizedRunner.runSingleTest(RandomizedRunner.java:944)
	at com.carrotsearch.randomizedtesting.RandomizedRunner$5.evaluate(RandomizedRunner.java:830)
	at com.carrotsearch.randomizedtesting.RandomizedRunner$6.evaluate(RandomizedRunner.java:880)
	at com.carrotsearch.randomizedtesting.RandomizedRunner$7.evaluate(RandomizedRunner.java:891)
	at com.carrotsearch.randomizedtesting.rules.StatementAdapter.evaluate(StatementAdapter.java:36)
	at com.carrotsearch.randomizedtesting.rules.SystemPropertiesRestoreRule$1.evaluate(SystemPropertiesRestoreRule.java:57)
	at org.apache.lucene.util.AbstractBeforeAfterRule$1.evaluate(AbstractBeforeAfterRule.java:45)
	at com.carrotsearch.randomizedtesting.rules.StatementAdapter.evaluate(StatementAdapter.java:36)
	at org.apache.lucene.util.TestRuleStoreClassName$1.evaluate(TestRuleStoreClassName.java:41)
	at com.carrotsearch.randomizedtesting.rules.NoShadowingOrOverridesOnMethodsRule$1.evaluate(NoShadowingOrOverridesOnMethodsRule.java:40)
	at com.carrotsearch.randomizedtesting.rules.NoShadowingOrOverridesOnMethodsRule$1.evaluate(NoShadowingOrOverridesOnMethodsRule.java:40)
	at com.carrotsearch.randomizedtesting.rules.StatementAdapter.evaluate(StatementAdapter.java:36)
	at com.carrotsearch.randomizedtesting.rules.StatementAdapter.evaluate(StatementAdapter.java:36)
	at com.carrotsearch.randomizedtesting.rules.StatementAdapter.evaluate(StatementAdapter.java:36)
	at org.apache.lucene.util.TestRuleAssertionsRequired$1.evaluate(TestRuleAssertionsRequired.java:53)
	at org.apache.lucene.util.TestRuleMarkFailure$1.evaluate(TestRuleMarkFailure.java:47)
	at org.apache.lucene.util.TestRuleIgnoreAfterMaxFailures$1.evaluate(TestRuleIgnoreAfterMaxFailures.java:64)
	at org.apache.lucene.util.TestRuleIgnoreTestSuites$1.evaluate(TestRuleIgnoreTestSuites.java:54)
	at com.carrotsearch.randomizedtesting.rules.StatementAdapter.evaluate(StatementAdapter.java:36)
	at com.carrotsearch.randomizedtesting.ThreadLeakControl$StatementRunner.run(ThreadLeakControl.java:368)
	at java.lang.Thread.run(Thread.java:748)




Build Log:
[...truncated 12989 lines...]
   [junit4] Suite: org.apache.solr.cloud.TestPullReplicaErrorHandling
   [junit4]   2> Creating dataDir: /home/jenkins/workspace/Lucene-Solr-master-Linux/solr/build/solr-core/test/J2/temp/solr.cloud.TestPullReplicaErrorHandling_4DC797584DF48098-001/init-core-data-001
   [junit4]   2> 211328 INFO  (SUITE-TestPullReplicaErrorHandling-seed#[4DC797584DF48098]-worker) [    ] o.a.s.c.MiniSolrCloudCluster Starting cluster of 4 servers in /home/jenkins/workspace/Lucene-Solr-master-Linux/solr/build/solr-core/test/J2/temp/solr.cloud.TestPullReplicaErrorHandling_4DC797584DF48098-001/tempDir-001
   [junit4]   2> 211328 INFO  (SUITE-TestPullReplicaErrorHandling-seed#[4DC797584DF48098]-worker) [    ] o.a.s.c.ZkTestServer STARTING ZK TEST SERVER
   [junit4]   2> 211328 INFO  (Thread-457) [    ] o.a.s.c.ZkTestServer client port:0.0.0.0/0.0.0.0:0
   [junit4]   2> 211328 INFO  (Thread-457) [    ] o.a.s.c.ZkTestServer Starting server
   [junit4]   2> 211329 ERROR (Thread-457) [    ] o.a.z.s.ZooKeeperServer ZKShutdownHandler is not registered, so ZooKeeper server won't take any action on ERROR or SHUTDOWN server state changes
   [junit4]   2> 211428 INFO  (SUITE-TestPullReplicaErrorHandling-seed#[4DC797584DF48098]-worker) [    ] o.a.s.c.ZkTestServer start zk server on port:44373
   [junit4]   2> 211430 INFO  (zkConnectionManagerCallback-694-thread-1) [    ] o.a.s.c.c.ConnectionManager zkClient has connected
   [junit4]   2> 211433 INFO  (jetty-launcher-691-thread-4) [    ] o.e.j.s.Server jetty-9.4.11.v20180605; built: 2018-06-05T18:24:03.829Z; git: d5fc0523cfa96bfebfbda19606cad384d772f04c; jvm 1.8.0_172-b11
   [junit4]   2> 211433 INFO  (jetty-launcher-691-thread-2) [    ] o.e.j.s.Server jetty-9.4.11.v20180605; built: 2018-06-05T18:24:03.829Z; git: d5fc0523cfa96bfebfbda19606cad384d772f04c; jvm 1.8.0_172-b11
   [junit4]   2> 211434 INFO  (jetty-launcher-691-thread-1) [    ] o.e.j.s.Server jetty-9.4.11.v20180605; built: 2018-06-05T18:24:03.829Z; git: d5fc0523cfa96bfebfbda19606cad384d772f04c; jvm 1.8.0_172-b11
   [junit4]   2> 211434 INFO  (jetty-launcher-691-thread-3) [    ] o.e.j.s.Server jetty-9.4.11.v20180605; built: 2018-06-05T18:24:03.829Z; git: d5fc0523cfa96bfebfbda19606cad384d772f04c; jvm 1.8.0_172-b11
   [junit4]   2> 211436 INFO  (jetty-launcher-691-thread-1) [    ] o.e.j.s.session DefaultSessionIdManager workerName=node0
   [junit4]   2> 211436 INFO  (jetty-launcher-691-thread-1) [    ] o.e.j.s.session No SessionScavenger set, using defaults
   [junit4]   2> 211436 INFO  (jetty-launcher-691-thread-1) [    ] o.e.j.s.session node0 Scavenging every 660000ms
   [junit4]   2> 211436 INFO  (jetty-launcher-691-thread-1) [    ] o.e.j.s.h.ContextHandler Started o.e.j.s.ServletContextHandler@79e0e72c{/solr,null,AVAILABLE}
   [junit4]   2> 211436 INFO  (jetty-launcher-691-thread-4) [    ] o.e.j.s.session DefaultSessionIdManager workerName=node0
   [junit4]   2> 211436 INFO  (jetty-launcher-691-thread-4) [    ] o.e.j.s.session No SessionScavenger set, using defaults
   [junit4]   2> 211436 INFO  (jetty-launcher-691-thread-3) [    ] o.e.j.s.session DefaultSessionIdManager workerName=node0
   [junit4]   2> 211436 INFO  (jetty-launcher-691-thread-3) [    ] o.e.j.s.session No SessionScavenger set, using defaults
   [junit4]   2> 211436 INFO  (jetty-launcher-691-thread-4) [    ] o.e.j.s.session node0 Scavenging every 660000ms
   [junit4]   2> 211436 INFO  (jetty-launcher-691-thread-3) [    ] o.e.j.s.session node0 Scavenging every 660000ms
   [junit4]   2> 211436 INFO  (jetty-launcher-691-thread-2) [    ] o.e.j.s.session DefaultSessionIdManager workerName=node0
   [junit4]   2> 211436 INFO  (jetty-launcher-691-thread-2) [    ] o.e.j.s.session No SessionScavenger set, using defaults
   [junit4]   2> 211436 INFO  (jetty-launcher-691-thread-2) [    ] o.e.j.s.session node0 Scavenging every 660000ms
   [junit4]   2> 211437 INFO  (jetty-launcher-691-thread-4) [    ] o.e.j.s.h.ContextHandler Started o.e.j.s.ServletContextHandler@3f4b6219{/solr,null,AVAILABLE}
   [junit4]   2> 211437 INFO  (jetty-launcher-691-thread-3) [    ] o.e.j.s.h.ContextHandler Started o.e.j.s.ServletContextHandler@67806987{/solr,null,AVAILABLE}
   [junit4]   2> 211437 INFO  (jetty-launcher-691-thread-2) [    ] o.e.j.s.h.ContextHandler Started o.e.j.s.ServletContextHandler@2d119162{/solr,null,AVAILABLE}
   [junit4]   2> 211437 INFO  (jetty-launcher-691-thread-1) [    ] o.e.j.s.AbstractConnector Started ServerConnector@55e7672c{HTTP/1.1,[http/1.1]}{127.0.0.1:41811}
   [junit4]   2> 211437 INFO  (jetty-launcher-691-thread-1) [    ] o.e.j.s.Server Started @211478ms
   [junit4]   2> 211437 INFO  (jetty-launcher-691-thread-1) [    ] o.a.s.c.s.e.JettySolrRunner Jetty properties: {hostContext=/solr, hostPort=41811}
   [junit4]   2> 211437 INFO  (jetty-launcher-691-thread-3) [    ] o.e.j.s.AbstractConnector Started ServerConnector@230f84df{HTTP/1.1,[http/1.1]}{127.0.0.1:40667}
   [junit4]   2> 211437 INFO  (jetty-launcher-691-thread-4) [    ] o.e.j.s.AbstractConnector Started ServerConnector@1c687b39{HTTP/1.1,[http/1.1]}{127.0.0.1:43405}
   [junit4]   2> 211437 INFO  (jetty-launcher-691-thread-3) [    ] o.e.j.s.Server Started @211478ms
   [junit4]   2> 211437 INFO  (jetty-launcher-691-thread-4) [    ] o.e.j.s.Server Started @211478ms
   [junit4]   2> 211437 INFO  (jetty-launcher-691-thread-2) [    ] o.e.j.s.AbstractConnector Started ServerConnector@1d8dac70{HTTP/1.1,[http/1.1]}{127.0.0.1:46055}
   [junit4]   2> 211437 INFO  (jetty-launcher-691-thread-3) [    ] o.a.s.c.s.e.JettySolrRunner Jetty properties: {hostContext=/solr, hostPort=40667}
   [junit4]   2> 211437 INFO  (jetty-launcher-691-thread-4) [    ] o.a.s.c.s.e.JettySolrRunner Jetty properties: {hostContext=/solr, hostPort=43405}
   [junit4]   2> 211437 INFO  (jetty-launcher-691-thread-2) [    ] o.e.j.s.Server Started @211478ms
   [junit4]   2> 211437 INFO  (jetty-launcher-691-thread-2) [    ] o.a.s.c.s.e.JettySolrRunner Jetty properties: {hostContext=/solr, hostPort=46055}
   [junit4]   2> 211437 ERROR (jetty-launcher-691-thread-1) [    ] o.a.s.u.StartupLoggingUtils Missing Java Option solr.log.dir. Logging may be missing or incomplete.
   [junit4]   2> 211437 INFO  (jetty-launcher-691-thread-1) [    ] o.a.s.s.SolrDispatchFilter Using logger factory org.apache.logging.slf4j.Log4jLoggerFactory
   [junit4]   2> 211437 ERROR (jetty-launcher-691-thread-3) [    ] o.a.s.u.StartupLoggingUtils Missing Java Option solr.log.dir. Logging may be missing or incomplete.
   [junit4]   2> 211437 INFO  (jetty-launcher-691-thread-1) [    ] o.a.s.s.SolrDispatchFilter  ___      _       Welcome to Apache Solr? version 8.0.0
   [junit4]   2> 211437 INFO  (jetty-launcher-691-thread-3) [    ] o.a.s.s.SolrDispatchFilter Using logger factory org.apache.logging.slf4j.Log4jLoggerFactory
   [junit4]   2> 211437 ERROR (jetty-launcher-691-thread-2) [    ] o.a.s.u.StartupLoggingUtils Missing Java Option solr.log.dir. Logging may be missing or incomplete.
   [junit4]   2> 211437 ERROR (jetty-launcher-691-thread-4) [    ] o.a.s.u.StartupLoggingUtils Missing Java Option solr.log.dir. Logging may be missing or incomplete.
   [junit4]   2> 211437 INFO  (jetty-launcher-691-thread-3) [    ] o.a.s.s.SolrDispatchFilter  ___      _       Welcome to Apache Solr? version 8.0.0
   [junit4]   2> 211437 INFO  (jetty-launcher-691-thread-4) [    ] o.a.s.s.SolrDispatchFilter Using logger factory org.apache.logging.slf4j.Log4jLoggerFactory
   [junit4]   2> 211437 INFO  (jetty-launcher-691-thread-1) [    ] o.a.s.s.SolrDispatchFilter / __| ___| |_ _   Starting in cloud mode on port null
   [junit4]   2> 211437 INFO  (jetty-launcher-691-thread-2) [    ] o.a.s.s.SolrDispatchFilter Using logger factory org.apache.logging.slf4j.Log4jLoggerFactory
   [junit4]   2> 211437 INFO  (jetty-launcher-691-thread-4) [    ] o.a.s.s.SolrDispatchFilter  ___      _       Welcome to Apache Solr? version 8.0.0
   [junit4]   2> 211437 INFO  (jetty-launcher-691-thread-1) [    ] o.a.s.s.SolrDispatchFilter \__ \/ _ \ | '_|  Install dir: null
   [junit4]   2> 211437 INFO  (jetty-launcher-691-thread-2) [    ] o.a.s.s.SolrDispatchFilter  ___      _       Welcome to Apache Solr? version 8.0.0
   [junit4]   2> 211437 INFO  (jetty-launcher-691-thread-4) [    ] o.a.s.s.SolrDispatchFilter / __| ___| |_ _   Starting in cloud mode on port null
   [junit4]   2> 211437 INFO  (jetty-launcher-691-thread-3) [    ] o.a.s.s.SolrDispatchFilter / __| ___| |_ _   Starting in cloud mode on port null
   [junit4]   2> 211437 INFO  (jetty-launcher-691-thread-2) [    ] o.a.s.s.SolrDispatchFilter / __| ___| |_ _   Starting in cloud mode on port null
   [junit4]   2> 211437 INFO  (jetty-launcher-691-thread-1) [    ] o.a.s.s.SolrDispatchFilter |___/\___/_|_|    Start time: 2018-09-13T16:00:44.729Z
   [junit4]   2> 211437 INFO  (jetty-launcher-691-thread-2) [    ] o.a.s.s.SolrDispatchFilter \__ \/ _ \ | '_|  Install dir: null
   [junit4]   2> 211437 INFO  (jetty-launcher-691-thread-4) [    ] o.a.s.s.SolrDispatchFilter \__ \/ _ \ | '_|  Install dir: null
   [junit4]   2> 211437 INFO  (jetty-launcher-691-thread-2) [    ] o.a.s.s.SolrDispatchFilter |___/\___/_|_|    Start time: 2018-09-13T16:00:44.729Z
   [junit4]   2> 211437 INFO  (jetty-launcher-691-thread-3) [    ] o.a.s.s.SolrDispatchFilter \__ \/ _ \ | '_|  Install dir: null
   [junit4]   2> 211437 INFO  (jetty-launcher-691-thread-4) [    ] o.a.s.s.SolrDispatchFilter |___/\___/_|_|    Start time: 2018-09-13T16:00:44.729Z
   [junit4]   2> 211437 INFO  (jetty-launcher-691-thread-3) [    ] o.a.s.s.SolrDispatchFilter |___/\___/_|_|    Start time: 2018-09-13T16:00:44.729Z
   [junit4]   2> 211439 INFO  (zkConnectionManagerCallback-698-thread-1) [    ] o.a.s.c.c.ConnectionManager zkClient has connected
   [junit4]   2> 211439 INFO  (zkConnectionManagerCallback-696-thread-1) [    ] o.a.s.c.c.ConnectionManager zkClient has connected
   [junit4]   2> 211439 INFO  (jetty-launcher-691-thread-3) [    ] o.a.s.s.SolrDispatchFilter solr.xml found in ZooKeeper. Loading...
   [junit4]   2> 211439 INFO  (jetty-launcher-691-thread-2) [    ] o.a.s.s.SolrDispatchFilter solr.xml found in ZooKeeper. Loading...
   [junit4]   2> 211439 INFO  (zkConnectionManagerCallback-701-thread-1) [    ] o.a.s.c.c.ConnectionManager zkClient has connected
   [junit4]   2> 211440 INFO  (zkConnectionManagerCallback-702-thread-1) [    ] o.a.s.c.c.ConnectionManager zkClient has connected
   [junit4]   2> 211440 INFO  (jetty-launcher-691-thread-1) [    ] o.a.s.s.SolrDispatchFilter solr.xml found in ZooKeeper. Loading...
   [junit4]   2> 211440 INFO  (jetty-launcher-691-thread-4) [    ] o.a.s.s.SolrDispatchFilter solr.xml found in ZooKeeper. Loading...
   [junit4]   2> 211456 WARN  (NIOServerCxn.Factory:0.0.0.0/0.0.0.0:0) [    ] o.a.z.s.NIOServerCnxn Unable to read additional data from client sessionid 0x1009209e6090004, likely client has closed socket
   [junit4]   2> 211528 INFO  (jetty-launcher-691-thread-3) [    ] o.a.s.c.ZkContainer Zookeeper client=127.0.0.1:44373/solr
   [junit4]   2> 211528 INFO  (jetty-launcher-691-thread-2) [    ] o.a.s.c.ZkContainer Zookeeper client=127.0.0.1:44373/solr
   [junit4]   2> 211535 INFO  (zkConnectionManagerCallback-709-thread-1) [    ] o.a.s.c.c.ConnectionManager zkClient has connected
   [junit4]   2> 211539 INFO  (zkConnectionManagerCallback-710-thread-1) [    ] o.a.s.c.c.ConnectionManager zkClient has connected
   [junit4]   2> 211547 INFO  (zkConnectionManagerCallback-714-thread-1) [    ] o.a.s.c.c.ConnectionManager zkClient has connected
   [junit4]   2> 211548 INFO  (zkConnectionManagerCallback-713-thread-1) [    ] o.a.s.c.c.ConnectionManager zkClient has connected
   [junit4]   2> 211565 INFO  (jetty-launcher-691-thread-1) [    ] o.a.s.c.ZkContainer Zookeeper client=127.0.0.1:44373/solr
   [junit4]   2> 211570 INFO  (zkConnectionManagerCallback-722-thread-1) [    ] o.a.s.c.c.ConnectionManager zkClient has connected
   [junit4]   2> 211581 INFO  (zkConnectionManagerCallback-724-thread-1) [    ] o.a.s.c.c.ConnectionManager zkClient has connected
   [junit4]   2> 211588 INFO  (jetty-launcher-691-thread-1) [n:127.0.0.1:41811_solr    ] o.a.s.c.OverseerElectionContext I am going to be the leader 127.0.0.1:41811_solr
   [junit4]   2> 211588 INFO  (jetty-launcher-691-thread-1) [n:127.0.0.1:41811_solr    ] o.a.s.c.Overseer Overseer (id=72218165249638410-127.0.0.1:41811_solr-n_0000000000) starting
   [junit4]   2> 211595 INFO  (zkConnectionManagerCallback-731-thread-1) [    ] o.a.s.c.c.ConnectionManager zkClient has connected
   [junit4]   2> 211596 INFO  (jetty-launcher-691-thread-1) [n:127.0.0.1:41811_solr    ] o.a.s.c.s.i.ZkClientClusterStateProvider Cluster at 127.0.0.1:44373/solr ready
   [junit4]   2> 211599 INFO  (jetty-launcher-691-thread-3) [n:127.0.0.1:40667_solr    ] o.a.s.c.ZkController Register node as live in ZooKeeper:/live_nodes/127.0.0.1:40667_solr
   [junit4]   2> 211599 INFO  (OverseerStateUpdate-72218165249638410-127.0.0.1:41811_solr-n_0000000000) [n:127.0.0.1:41811_solr    ] o.a.s.c.Overseer Starting to work on the main queue : 127.0.0.1:41811_solr
   [junit4]   2> 211601 INFO  (jetty-launcher-691-thread-2) [n:127.0.0.1:46055_solr    ] o.a.s.c.c.ZkStateReader Updated live nodes from ZooKeeper... (0) -> (1)
   [junit4]   2> 211602 INFO  (jetty-launcher-691-thread-2) [n:127.0.0.1:46055_solr    ] o.a.s.c.TransientSolrCoreCacheDefault Allocating transient cache for 2147483647 transient cores
   [junit4]   2> 211602 INFO  (jetty-launcher-691-thread-2) [n:127.0.0.1:46055_solr    ] o.a.s.c.ZkController Register node as live in ZooKeeper:/live_nodes/127.0.0.1:46055_solr
   [junit4]   2> 211608 INFO  (zkCallback-730-thread-1) [    ] o.a.s.c.c.ZkStateReader Updated live nodes from ZooKeeper... (0) -> (2)
   [junit4]   2> 211608 INFO  (zkCallback-712-thread-1) [    ] o.a.s.c.c.ZkStateReader Updated live nodes from ZooKeeper... (0) -> (2)
   [junit4]   2> 211608 INFO  (OverseerStateUpdate-72218165249638410-127.0.0.1:41811_solr-n_0000000000) [n:127.0.0.1:41811_solr    ] o.a.s.c.c.ZkStateReader Updated live nodes from ZooKeeper... (0) -> (2)
   [junit4]   2> 211609 INFO  (jetty-launcher-691-thread-1) [n:127.0.0.1:41811_solr    ] o.a.s.c.TransientSolrCoreCacheDefault Allocating transient cache for 2147483647 transient cores
   [junit4]   2> 211609 INFO  (jetty-launcher-691-thread-1) [n:127.0.0.1:41811_solr    ] o.a.s.c.ZkController Register node as live in ZooKeeper:/live_nodes/127.0.0.1:41811_solr
   [junit4]   2> 211612 INFO  (zkCallback-723-thread-2) [    ] o.a.s.c.c.ZkStateReader Updated live nodes from ZooKeeper... (2) -> (3)
   [junit4]   2> 211616 INFO  (zkCallback-711-thread-1) [    ] o.a.s.c.c.ZkStateReader Updated live nodes from ZooKeeper... (1) -> (2)
   [junit4]   2> 211616 INFO  (zkCallback-712-thread-1) [    ] o.a.s.c.c.ZkStateReader Updated live nodes from ZooKeeper... (2) -> (3)
   [junit4]   2> 211616 INFO  (zkCallback-730-thread-1) [    ] o.a.s.c.c.ZkStateReader Updated live nodes from ZooKeeper... (2) -> (3)
   [junit4]   2> 211618 INFO  (jetty-launcher-691-thread-1) [n:127.0.0.1:41811_solr    ] o.a.s.h.a.MetricsHistoryHandler No .system collection, keeping metrics history in memory.
   [junit4]   2> 211616 INFO  (zkCallback-711-thread-2) [    ] o.a.s.c.c.ZkStateReader Updated live nodes from ZooKeeper... (2) -> (3)
   [junit4]   2> 211623 INFO  (zkConnectionManagerCallback-738-thread-1) [    ] o.a.s.c.c.ConnectionManager zkClient has connected
   [junit4]   2> 211624 INFO  (jetty-launcher-691-thread-4) [    ] o.a.s.c.ZkContainer Zookeeper client=127.0.0.1:44373/solr
   [junit4]   2> 211624 INFO  (jetty-launcher-691-thread-3) [n:127.0.0.1:40667_solr    ] o.a.s.c.c.ZkStateReader Updated live nodes from ZooKeeper... (0) -> (3)
   [junit4]   2> 211624 INFO  (jetty-launcher-691-thread-3) [n:127.0.0.1:40667_solr    ] o.a.s.c.s.i.ZkClientClusterStateProvider Cluster at 127.0.0.1:44373/solr ready
   [junit4]   2> 211625 INFO  (zkConnectionManagerCallback-743-thread-1) [    ] o.a.s.c.c.ConnectionManager zkClient has connected
   [junit4]   2> 211625 INFO  (jetty-launcher-691-thread-3) [n:127.0.0.1:40667_solr    ] o.a.s.h.a.MetricsHistoryHandler No .system collection, keeping metrics history in memory.
   [junit4]   2> 211627 INFO  (zkConnectionManagerCallback-746-thread-1) [    ] o.a.s.c.c.ConnectionManager zkClient has connected
   [junit4]   2> 211627 INFO  (jetty-launcher-691-thread-2) [n:127.0.0.1:46055_solr    ] o.a.s.c.c.ZkStateReader Updated live nodes from ZooKeeper... (0) -> (3)
   [junit4]   2> 211629 INFO  (jetty-launcher-691-thread-2) [n:127.0.0.1:46055_solr    ] o.a.s.c.s.i.ZkClientClusterStateProvider Cluster at 127.0.0.1:44373/solr ready
   [junit4]   2> 211629 INFO  (jetty-launcher-691-thread-2) [n:127.0.0.1:46055_solr    ] o.a.s.h.a.MetricsHistoryHandler No .system collection, keeping metrics history in memory.
   [junit4]   2> 211629 INFO  (zkConnectionManagerCallback-749-thread-1) [    ] o.a.s.c.c.ConnectionManager zkClient has connected
   [junit4]   2> 211634 INFO  (jetty-launcher-691-thread-4) [n:127.0.0.1:43405_solr    ] o.a.s.c.c.ZkStateReader Updated live nodes from ZooKeeper... (0) -> (3)
   [junit4]   2> 211638 INFO  (jetty-launcher-691-thread-4) [n:127.0.0.1:43405_solr    ] o.a.s.c.TransientSolrCoreCacheDefault Allocating transient cache for 2147483647 transient cores
   [junit4]   2> 211638 INFO  (jetty-launcher-691-thread-4) [n:127.0.0.1:43405_solr    ] o.a.s.c.ZkController Register node as live in ZooKeeper:/live_nodes/127.0.0.1:43405_solr
   [junit4]   2> 211639 INFO  (zkCallback-730-thread-1) [    ] o.a.s.c.c.ZkStateReader Updated live nodes from ZooKeeper... (3) -> (4)
   [junit4]   2> 211639 INFO  (zkCallback-712-thread-1) [    ] o.a.s.c.c.ZkStateReader Updated live nodes from ZooKeeper... (3) -> (4)
   [junit4]   2> 211639 INFO  (zkCallback-723-thread-1) [    ] o.a.s.c.c.ZkStateReader Updated live nodes from ZooKeeper... (3) -> (4)
   [junit4]   2> 211639 INFO  (zkCallback-711-thread-2) [    ] o.a.s.c.c.ZkStateReader Updated live nodes from ZooKeeper... (3) -> (4)
   [junit4]   2> 211661 INFO  (zkCallback-748-thread-1) [    ] o.a.s.c.c.ZkStateReader Updated live nodes from ZooKeeper... (3) -> (4)
   [junit4]   2> 211662 INFO  (zkCallback-742-thread-1) [    ] o.a.s.c.c.ZkStateReader Updated live nodes from ZooKeeper... (3) -> (4)
   [junit4]   2> 211662 INFO  (zkCallback-737-thread-1) [    ] o.a.s.c.c.ZkStateReader Updated live nodes from ZooKeeper... (3) -> (4)
   [junit4]   2> 211667 INFO  (jetty-launcher-691-thread-2) [n:127.0.0.1:46055_solr    ] o.a.s.m.r.SolrJmxReporter JMX monitoring for 'solr_46055.solr.node' (registry 'solr.node') enabled at server: com.sun.jmx.mbeanserver.JmxMBeanServer@27ae1d2a
   [junit4]   2> 211668 INFO  (jetty-launcher-691-thread-3) [n:127.0.0.1:40667_solr    ] o.a.s.m.r.SolrJmxReporter JMX monitoring for 'solr_40667.solr.node' (registry 'solr.node') enabled at server: com.sun.jmx.mbeanserver.JmxMBeanServer@27ae1d2a
   [junit4]   2> 211668 INFO  (jetty-launcher-691-thread-1) [n:127.0.0.1:41811_solr    ] o.a.s.m.r.SolrJmxReporter JMX monitoring for 'solr_41811.solr.node' (registry 'solr.node') enabled at server: com.sun.jmx.mbeanserver.JmxMBeanServer@27ae1d2a
   [junit4]   2> 211673 INFO  (zkConnectionManagerCallback-757-thread-1) [    ] o.a.s.c.c.ConnectionManager zkClient has connected
   [junit4]   2> 211674 INFO  (jetty-launcher-691-thread-4) [n:127.0.0.1:43405_solr    ] o.a.s.c.c.ZkStateReader Updated live nodes from ZooKeeper... (0) -> (4)
   [junit4]   2> 211674 INFO  (jetty-launcher-691-thread-4) [n:127.0.0.1:43405_solr    ] o.a.s.c.s.i.ZkClientClusterStateProvider Cluster at 127.0.0.1:44373/solr ready
   [junit4]   2> 211674 INFO  (jetty-launcher-691-thread-2) [n:127.0.0.1:46055_solr    ] o.a.s.m.r.SolrJmxReporter JMX monitoring for 'solr_46055.solr.jvm' (registry 'solr.jvm') enabled at server: com.sun.jmx.mbeanserver.JmxMBeanServer@27ae1d2a
   [junit4]   2> 211675 INFO  (jetty-launcher-691-thread-2) [n:127.0.0.1:46055_solr    ] o.a.s.m.r.SolrJmxReporter JMX monitoring for 'solr_46055.solr.jetty' (registry 'solr.jetty') enabled at server: com.sun.jmx.mbeanserver.JmxMBeanServer@27ae1d2a
   [junit4]   2> 211675 INFO  (jetty-launcher-691-thread-4) [n:127.0.0.1:43405_solr    ] o.a.s.h.a.MetricsHistoryHandler No .system collection, keeping metrics history in memory.
   [junit4]   2> 211675 INFO  (jetty-launcher-691-thread-3) [n:127.0.0.1:40667_solr    ] o.a.s.m.r.SolrJmxReporter JMX monitoring for 'solr_40667.solr.jvm' (registry 'solr.jvm') enabled at server: com.sun.jmx.mbeanserver.JmxMBeanServer@27ae1d2a
   [junit4]   2> 211675 INFO  (jetty-launcher-691-thread-2) [n:127.0.0.1:46055_solr    ] o.a.s.c.CorePropertiesLocator Found 0 core definitions underneath /home/jenkins/workspace/Lucene-Solr-master-Linux/solr/build/solr-core/test/J2/temp/solr.cloud.TestPullReplicaErrorHandling_4DC797584DF48098-001/tempDir-001/node2/.
   [junit4]   2> 211675 INFO  (jetty-launcher-691-thread-3) [n:127.0.0.1:40667_solr    ] o.a.s.m.r.SolrJmxReporter JMX monitoring for 'solr_40667.solr.jetty' (registry 'solr.jetty') enabled at server: com.sun.jmx.mbeanserver.JmxMBeanServer@27ae1d2a
   [junit4]   2> 211676 INFO  (jetty-launcher-691-thread-3) [n:127.0.0.1:40667_solr    ] o.a.s.c.CorePropertiesLocator Found 0 core definitions underneath /home/jenkins/workspace/Lucene-Solr-master-Linux/solr/build/solr-core/test/J2/temp/solr.cloud.TestPullReplicaErrorHandling_4DC797584DF48098-001/tempDir-001/node3/.
   [junit4]   2> 211676 INFO  (jetty-launcher-691-thread-1) [n:127.0.0.1:41811_solr    ] o.a.s.m.r.SolrJmxReporter JMX monitoring for 'solr_41811.solr.jvm' (registry 'solr.jvm') enabled at server: com.sun.jmx.mbeanserver.JmxMBeanServer@27ae1d2a
   [junit4]   2> 211676 INFO  (jetty-launcher-691-thread-1) [n:127.0.0.1:41811_solr    ] o.a.s.m.r.SolrJmxReporter JMX monitoring for 'solr_41811.solr.jetty' (registry 'solr.jetty') enabled at server: com.sun.jmx.mbeanserver.JmxMBeanServer@27ae1d2a
   [junit4]   2> 211677 INFO  (jetty-launcher-691-thread-1) [n:127.0.0.1:41811_solr    ] o.a.s.c.CorePropertiesLocator Found 0 core definitions underneath /home/jenkins/workspace/Lucene-Solr-master-Linux/solr/build/solr-core/test/J2/temp/solr.cloud.TestPullReplicaErrorHandling_4DC797584DF48098-001/tempDir-001/node1/.
   [junit4]   2> 211689 INFO  (jetty-launcher-691-thread-4) [n:127.0.0.1:43405_solr    ] o.a.s.m.r.SolrJmxReporter JMX monitoring for 'solr_43405.solr.node' (registry 'solr.node') enabled at server: com.sun.jmx.mbeanserver.JmxMBeanServer@27ae1d2a
   [junit4]   2> 211693 INFO  (jetty-launcher-691-thread-4) [n:127.0.0.1:43405_solr    ] o.a.s.m.r.SolrJmxReporter JMX monitoring for 'solr_43405.solr.jvm' (registry 'solr.jvm') enabled at server: com.sun.jmx.mbeanserver.JmxMBeanServer@27ae1d2a
   [junit4]   2> 211693 INFO  (jetty-launcher-691-thread-4) [n:127.0.0.1:43405_solr    ] o.a.s.m.r.SolrJmxReporter JMX monitoring for 'solr_43405.solr.jetty' (registry 'solr.jetty') enabled at server: com.sun.jmx.mbeanserver.JmxMBeanServer@27ae1d2a
   [junit4]   2> 211694 INFO  (jetty-launcher-691-thread-4) [n:127.0.0.1:43405_solr    ] o.a.s.c.CorePropertiesLocator Found 0 core definitions underneath /home/jenkins/workspace/Lucene-Solr-master-Linux/solr/build/solr-core/test/J2/temp/solr.cloud.TestPullReplicaErrorHandling_4DC797584DF48098-001/tempDir-001/node4/.
   [junit4]   2> 211759 INFO  (zkConnectionManagerCallback-760-thread-1) [    ] o.a.s.c.c.ConnectionManager zkClient has connected
   [junit4]   2> 211763 INFO  (zkConnectionManagerCallback-765-thread-1) [    ] o.a.s.c.c.ConnectionManager zkClient has connected
   [junit4]   2> 211764 INFO  (SUITE-TestPullReplicaErrorHandling-seed#[4DC797584DF48098]-worker) [    ] o.a.s.c.c.ZkStateReader Updated live nodes from ZooKeeper... (0) -> (4)
   [junit4]   2> 211765 INFO  (SUITE-TestPullReplicaErrorHandling-seed#[4DC797584DF48098]-worker) [    ] o.a.s.c.s.i.ZkClientClusterStateProvider Cluster at 127.0.0.1:44373/solr ready
   [junit4]   2> 211767 INFO  (SUITE-TestPullReplicaErrorHandling-seed#[4DC797584DF48098]-worker) [    ] o.e.j.s.AbstractConnector Stopped ServerConnector@55e7672c{HTTP/1.1,[http/1.1]}{127.0.0.1:0}
   [junit4]   2> 211767 INFO  (SUITE-TestPullReplicaErrorHandling-seed#[4DC797584DF48098]-worker) [    ] o.a.s.c.CoreContainer Shutting down CoreContainer instance=543554466
   [junit4]   2> 211767 INFO  (SUITE-TestPullReplicaErrorHandling-seed#[4DC797584DF48098]-worker) [    ] o.a.s.m.SolrMetricManager Closing metric reporters for registry=solr.node, tag=null
   [junit4]   2> 211768 INFO  (SUITE-TestPullReplicaErrorHandling-seed#[4DC797584DF48098]-worker) [    ] o.a.s.m.r.SolrJmxReporter Closing reporter [org.apache.solr.metrics.reporters.SolrJmxReporter@2f41b3fd: rootName = solr_41811, domain = solr.node, service url = null, agent id = null] for registry solr.node / com.codahale.metrics.MetricRegistry@52fb854a
   [junit4]   2> 211772 INFO  (SUITE-TestPullReplicaErrorHandling-seed#[4DC797584DF48098]-worker) [    ] o.a.s.m.SolrMetricManager Closing metric reporters for registry=solr.jvm, tag=null
   [junit4]   2> 211772 INFO  (SUITE-TestPullReplicaErrorHandling-seed#[4DC797584DF48098]-worker) [    ] o.a.s.m.r.SolrJmxReporter Closing reporter [org.apache.solr.metrics.reporters.SolrJmxReporter@5c4ced64: rootName = solr_41811, domain = solr.jvm, service url = null, agent id = null] for registry solr.jvm / com.codahale.metrics.MetricRegistry@2ad4affc
   [junit4]   2> 211774 INFO  (SUITE-TestPullReplicaErrorHandling-seed#[4DC797584DF48098]-worker) [    ] o.a.s.m.SolrMetricManager Closing metric reporters for registry=solr.jetty, tag=null
   [junit4]   2> 211774 INFO  (SUITE-TestPullReplicaErrorHandling-seed#[4DC797584DF48098]-worker) [    ] o.a.s.m.r.SolrJmxReporter Closing reporter [org.apache.solr.metrics.reporters.SolrJmxReporter@11398828: rootName = solr_41811, domain = solr.jetty, service url = null, agent id = null] for registry solr.jetty / com.codahale.metrics.MetricRegistry@2b994eac
   [junit4]   2> 211775 INFO  (SUITE-TestPullReplicaErrorHandling-seed#[4DC797584DF48098]-worker) [    ] o.a.s.c.ZkController Remove node as live in ZooKeeper:/live_nodes/127.0.0.1:41811_solr
   [junit4]   2> 211775 INFO  (SUITE-TestPullReplicaErrorHandling-seed#[4DC797584DF48098]-worker) [    ] o.a.s.m.SolrMetricManager Closing metric reporters for registry=solr.cluster, tag=null
   [junit4]   2> 211775 INFO  (zkCallback-730-thread-1) [    ] o.a.s.c.c.ZkStateReader Updated live nodes from ZooKeeper... (4) -> (3)
   [junit4]   2> 211775 INFO  (zkCallback-748-thread-1) [    ] o.a.s.c.c.ZkStateReader Updated live nodes from ZooKeeper... (4) -> (3)
   [junit4]   2> 211775 INFO  (zkCallback-711-thread-2) [    ] o.a.s.c.c.ZkStateReader Updated live nodes from ZooKeeper... (4) -> (3)
   [junit4]   2> 211775 INFO  (zkCallback-742-thread-1) [    ] o.a.s.c.c.ZkStateReader Updated live nodes from ZooKeeper... (4) -> (3)
   [junit4]   2> 211775 INFO  (zkCallback-723-thread-1) [    ] o.a.s.c.c.ZkStateReader Updated live nodes from ZooKeeper... (4) -> (3)
   [junit4]   2> 211775 INFO  (zkCallback-712-thread-1) [    ] o.a.s.c.c.ZkStateReader Updated live nodes from ZooKeeper... (4) -> (3)
   [junit4]   2> 211776 INFO  (zkCallback-737-thread-1) [    ] o.a.s.c.c.ZkStateReader Updated live nodes from ZooKeeper... (4) -> (3)
   [junit4]   2> 211776 INFO  (zkCallback-756-thread-1) [    ] o.a.s.c.c.ZkStateReader Updated live nodes from ZooKeeper... (4) -> (3)
   [junit4]   2> 211776 INFO  (zkCallback-764-thread-1) [    ] o.a.s.c.c.ZkStateReader Updated live nodes from ZooKeeper... (4) -> (3)
   [junit4]   2> 211776 INFO  (SUITE-TestPullReplicaErrorHandling-seed#[4DC797584DF48098]-worker) [    ] o.a.s.c.Overseer Overseer (id=72218165249638410-127.0.0.1:41811_solr-n_0000000000) closing
   [junit4]   2> 211776 INFO  (OverseerStateUpdate-72218165249638410-127.0.0.1:41811_solr-n_0000000000) [n:127.0.0.1:41811_solr    ] o.a.s.c.Overseer Overseer Loop exiting : 127.0.0.1:41811_solr
   [junit4]   2> 211776 WARN  (OverseerAutoScalingTriggerThread-72218165249638410-127.0.0.1:41811_solr-n_0000000000) [    ] o.a.s.c.a.OverseerTriggerThread OverseerTriggerThread woken up but we are closed, exiting.
   [junit4]   2> 211779 INFO  (zkCallback-712-thread-1) [    ] o.a.s.c.OverseerElectionContext I am going to be the leader 127.0.0.1:40667_solr
   [junit4]   2> 211779 INFO  (SUITE-TestPullReplicaErrorHandling-seed#[4DC797584DF48098]-worker) [    ] o.e.j.s.h.ContextHandler Stopped o.e.j.s.ServletContextHandler@79e0e72c{/solr,null,UNAVAILABLE}
   [junit4]   2> 211779 INFO  (SUITE-TestPullReplicaErrorHandling-seed#[4DC797584DF48098]-worker) [    ] o.e.j.s.session node0 Stopped scavenging
   [junit4]   2> 211780 INFO  (zkCallback-712-thread-1) [n:127.0.0.1:40667_solr    ] o.a.s.c.Overseer Overseer (id=72218165249638407-127.0.0.1:40667_solr-n_0000000001) starting
   [junit4]   2> 211780 INFO  (SUITE-TestPullReplicaErrorHandling-seed#[4DC797584DF48098]-worker) [    ] o.e.j.s.Server jetty-9.4.11.v20180605; built: 2018-06-05T18:24:03.829Z; git: d5fc0523cfa96bfebfbda19606cad384d772f04c; jvm 1.8.0_172-b11
   [junit4]   2> 211781 INFO  (SUITE-TestPullReplicaErrorHandling-seed#[4DC797584DF48098]-worker) [    ] o.e.j.s.session DefaultSessionIdManager workerName=node0
   [junit4]   2> 211781 INFO  (SUITE-TestPullReplicaErrorHandling-seed#[4DC797584DF48098]-worker) [    ] o.e.j.s.session No SessionScavenger set, using defaults
   [junit4]   2> 211781 INFO  (SUITE-TestPullReplicaErrorHandling-seed#[4DC797584DF48098]-worker) [    ] o.e.j.s.session node0 Scavenging every 600000ms
   [junit4]   2> 211781 INFO  (SUITE-TestPullReplicaErrorHandling-seed#[4DC797584DF48098]-worker) [    ] o.e.j.s.h.ContextHandler Started o.e.j.s.ServletContextHandler@7a0cdba8{/solr,null,AVAILABLE}
   [junit4]   2> 211781 INFO  (SUITE-TestPullReplicaErrorHandling-seed#[4DC797584DF48098]-worker) [    ] o.e.j.s.AbstractConnector Started ServerConnector@7afce27f{HTTP/1.1,[http/1.1]}{127.0.0.1:35255}
   [junit4]   2> 211781 INFO  (SUITE-TestPullReplicaErrorHandling-seed#[4DC797584DF48098]-worker) [    ] o.e.j.s.Server Started @211822ms
   [junit4]   2> 211781 INFO  (SUITE-TestPullReplicaErrorHandling-seed#[4DC797584DF48098]-worker) [    ] o.a.s.c.s.e.JettySolrRunner Jetty properties: {hostContext=/solr, hostPort=41869}
   [junit4]   2> 211781 ERROR (SUITE-TestPullReplicaErrorHandling-seed#[4DC797584DF48098]-worker) [    ] o.a.s.u.StartupLoggingUtils Missing Java Option solr.log.dir. Logging may be missing or incomplete.
   [junit4]   2> 211782 INFO  (SUITE-TestPullReplicaErrorHandling-seed#[4DC797584DF48098]-worker) [    ] o.a.s.s.SolrDispatchFilter Using logger factory org.apache.logging.slf4j.Log4jLoggerFactory
   [junit4]   2> 211782 INFO  (SUITE-TestPullReplicaErrorHandling-seed#[4DC797584DF48098]-worker) [    ] o.a.s.s.SolrDispatchFilter  ___      _       Welcome to Apache Solr? version 8.0.0
   [junit4]   2> 211782 INFO  (SUITE-TestPullReplicaErrorHandling-seed#[4DC797584DF48098]-worker) [    ] o.a.s.s.SolrDispatchFilter / __| ___| |_ _   Starting in cloud mode on port null
   [junit4]   2> 211782 INFO  (SUITE-TestPullReplicaErrorHandling-seed#[4DC797584DF48098]-worker) [    ] o.a.s.s.SolrDispatchFilter \__ \/ _ \ | '_|  Install dir: null
   [junit4]   2> 211782 INFO  (SUITE-TestPullReplicaErrorHandling-seed#[4DC797584DF48098]-worker) [    ] o.a.s.s.SolrDispatchFilter |___/\___/_|_|    Start time: 2018-09-13T16:00:45.074Z
   [junit4]   2> 211782 INFO  (OverseerStateUpdate-72218165249638407-127.0.0.1:40667_solr-n_0000000001) [n:127.0.0.1:40667_solr    ] o.a.s.c.Overseer Starting to work on the main queue : 127.0.0.1:40667_solr
   [junit4]   2> 211783 INFO  (zkConnectionManagerCallback-767-thread-1) [    ] o.a.s.c.c.ConnectionManager zkClient has connected
   [junit4]   2> 211784 INFO  (SUITE-TestPullReplicaErrorHandling-seed#[4DC797584DF48098]-worker) [    ] o.a.s.s.SolrDispatchFilter solr.xml found in ZooKeeper. Loading...
   [junit4]   2> 211830 INFO  (SUITE-TestPullReplicaErrorHandling-seed#[4DC797584DF48098]-worker) [    ] o.a.s.c.ZkContainer Zookeeper client=127.0.0.1:44373/solr
   [junit4]   2> 211832 INFO  (zkConnectionManagerCallback-771-thread-1) [    ] o.a.s.c.c.ConnectionManager zkClient has connected
   [junit4]   2> 211834 INFO  (zkConnectionManagerCallback-773-thread-1) [    ] o.a.s.c.c.ConnectionManager zkClient has connected
   [junit4]   2> 211837 INFO  (SUITE-TestPullReplicaErrorHandling-seed#[4DC797584DF48098]-worker) [n:127.0.0.1:41869_solr    ] o.a.s.c.c.ZkStateReader Updated live nodes from ZooKeeper... (0) -> (3)
   [junit4]   2> 211838 INFO  (SUITE-TestPullReplicaErrorHandling-seed#[4DC797584DF48098]-worker) [n:127.0.0.1:41869_solr    ] o.a.s.c.TransientSolrCoreCacheDefault Allocating transient cache for 2147483647 transient cores
   [junit4]   2> 211838 INFO  (SUITE-TestPullReplicaErrorHandling-seed#[4DC797584DF48098]-worker) [n:127.0.0.1:41869_solr    ] o.a.s.c.ZkController Register node as live in ZooKeeper:/live_nodes/127.0.0.1:41869_solr
   [junit4]   2> 211839 INFO  (zkCallback-748-thread-1) [    ] o.a.s.c.c.ZkStateReader Updated live nodes from ZooKeeper... (3) -> (4)
   [junit4]   2> 211839 INFO  (zkCallback-756-thread-1) [    ] o.a.s.c.c.ZkStateReader Updated live nodes from ZooKeeper... (3) -> (4)
   [junit4]   2> 211839 INFO  (zkCallback-712-thread-1) [    ] o.a.s.c.c.ZkStateReader Updated live nodes from ZooKeeper... (3) -> (4)
   [junit4]   2> 211839 INFO  (zkCallback-711-thread-2) [    ] o.a.s.c.c.ZkStateReader Updated live nodes from ZooKeeper... (3) -> (4)
   [junit4]   2> 211839 INFO  (zkCallback-737-thread-1) [    ] o.a.s.c.c.ZkStateReader Updated live nodes from ZooKeeper... (3) -> (4)
   [junit4]   2> 211839 INFO  (zkCallback-742-thread-1) [    ] o.a.s.c.c.ZkStateReader Updated live nodes from ZooKeeper... (3) -> (4)
   [junit4]   2> 211839 INFO  (zkCallback-764-thread-1) [    ] o.a.s.c.c.ZkStateReader Updated live nodes from ZooKeeper... (3) -> (4)
   [junit4]   2> 211839 INFO  (zkCallback-772-thread-1) [    ] o.a.s.c.c.ZkStateReader Updated live nodes from ZooKeeper... (3) -> (4)
   [junit4]   2> 211851 INFO  (zkConnectionManagerCallback-780-thread-1) [    ] o.a.s.c.c.ConnectionManager zkClient has connected
   [junit4]   2> 211853 INFO  (SUITE-TestPullReplicaErrorHandling-seed#[4DC797584DF48098]-worker) [n:127.0.0.1:41869_solr    ] o.a.s.c.c.ZkStateReader Updated live nodes from ZooKeeper... (0) -> (4)
   [junit4]   2> 211853 INFO  (SUITE-TestPullReplicaErrorHandling-seed#[4DC797584DF48098]-worker) [n:127.0.0.1:41869_solr    ] o.a.s.c.s.i.ZkClientClusterStateProvider Cluster at 127.0.0.1:44373/solr ready
   [junit4]   2> 211854 INFO  (SUITE-TestPullReplicaErrorHandling-seed#[4DC797584DF48098]-worker) [n:127.0.0.1:41869_solr    ] o.a.s.h.a.MetricsHistoryHandler No .system collection, keeping metrics history in memory.
   [junit4]   2> 211865 INFO  (SUITE-TestPullReplicaErrorHandling-seed#[4DC797584DF48098]-worker) [n:127.0.0.1:41869_solr    ] o.a.s.m.r.SolrJmxReporter JMX monitoring for 'solr_41869.solr.node' (registry 'solr.node') enabled at server: com.sun.jmx.mbeanserver.JmxMBeanServer@27ae1d2a
   [junit4]   2> 211870 INFO  (SUITE-TestPullReplicaErrorHandling-seed#[4DC797584DF48098]-worker) [n:127.0.0.1:41869_solr    ] o.a.s.m.r.SolrJmxReporter JMX monitoring for 'solr_41869.solr.jvm' (registry 'solr.jvm') enabled at server: com.sun.jmx.mbeanserver.JmxMBeanServer@27ae1d2a
   [junit4]   2> 211870 INFO  (SUITE-TestPullReplicaErrorHandling-seed#[4DC797584DF48098]-worker) [n:127.0.0.1:41869_solr    ] o.a.s.m.r.SolrJmxReporter JMX monitoring for 'solr_41869.solr.jetty' (registry 'solr.jetty') enabled at server: com.sun.jmx.mbeanserver.JmxMBeanServer@27ae1d2a
   [junit4]   2> 211871 INFO  (SUITE-TestPullReplicaErrorHandling-seed#[4DC797584DF48098]-worker) [n:127.0.0.1:41869_solr    ] o.a.s.c.CorePropertiesLocator Found 0 core definitions underneath /home/jenkins/workspace/Lucene-Solr-master-Linux/solr/build/solr-core/test/J2/temp/solr.cloud.TestPullReplicaErrorHandling_4DC797584DF48098-001/tempDir-001/node1/.
   [junit4]   2> 211924 INFO  (SUITE-TestPullReplicaErrorHandling-seed#[4DC797584DF48098]-worker) [    ] o.a.s.c.TestPullReplicaErrorHandling Adding proxy for URL: http://127.0.0.1:35255/solr. Proxy: http://127.0.0.1:41869/solr
   [junit4]   2> 211925 INFO  (SUITE-TestPullReplicaErrorHandling-seed#[4DC797584DF48098]-worker) [    ] o.e.j.s.AbstractConnector Stopped ServerConnector@230f84df{HTTP/1.1,[http/1.1]}{127.0.0.1:0}
   [junit4]   2> 211925 INFO  (SUITE-TestPullReplicaErrorHandling-seed#[4DC797584DF48098]-worker) [    ] o.a.s.c.CoreContainer Shutting down CoreContainer instance=79869363
   [junit4]   2> 211925 INFO  (SUITE-TestPullReplicaErrorHandling-seed#[4DC797584DF48098]-worker) [    ] o.a.s.m.SolrMetricManager Closing metric reporters for registry=solr.node, tag=null
   [junit4]   2> 211926 INFO  (SUITE-TestPullReplicaErrorHandling-seed#[4DC797584DF48098]-worker) [    ] o.a.s.m.r.SolrJmxReporter Closing reporter [org.apache.solr.metrics.reporters.SolrJmxReporter@166e6f3e: rootName = solr_40667, domain = solr.node, service url = null, agent id = null] for registry solr.node / com.codahale.metrics.MetricRegistry@33cc4f85
   [junit4]   2> 211931 INFO  (SUITE-TestPullReplicaErrorHandling-seed#[4DC797584DF48098]-worker) [    ] o.a.s.m.SolrMetricManager Closing metric reporters for registry=solr.jvm, tag=null
   [junit4]   2> 211931 INFO  (SUITE-TestPullReplicaErrorHandling-seed#[4DC797584DF48098]-worker) [    ] o.a.s.m.r.SolrJmxReporter Closing reporter [org.apache.solr.metrics.reporters.SolrJmxReporter@77f4cdf9: rootName = solr_40667, domain = solr.jvm, service url = null, agent id = null] for registry solr.jvm / com.codahale.metrics.MetricRegistry@2ad4affc
   [junit4]   2> 211934 INFO  (SUITE-TestPullReplicaErrorHandling-seed#[4DC797584DF48098]-worker) [    ] o.a.s.m.SolrMetricManager Closing metric reporters for registry=solr.jetty, tag=null
   [junit4]   2> 211934 INFO  (SUITE-TestPullReplicaErrorHandling-seed#[4DC797584DF48098]-worker) [    ] o.a.s.m.r.SolrJmxReporter Closing reporter [org.apache.solr.metrics.reporters.SolrJmxReporter@3ad33bb0: rootName = solr_40667, domain = solr.jetty, service url = null, agent id = null] for registry solr.jetty / com.codahale.metrics.MetricRegistry@2b994eac
   [junit4]   2> 211935 INFO  (SUITE-TestPullReplicaErrorHandling-seed#[4DC797584DF48098]-worker) [    ] o.a.s.c.ZkController Remove node as live in ZooKeeper:/live_nodes/127.0.0.1:40667_solr
   [junit4]   2> 211935 INFO  (SUITE-TestPullReplicaErrorHandling-seed#[4DC797584DF48098]-worker) [    ] o.a.s.m.SolrMetricManager Closing metric reporters for registry=solr.cluster, tag=null
   [junit4]   2> 211936 INFO  (SUITE-TestPullReplicaErrorHandling-seed#[4DC797584DF48098]-worker) [    ] o.a.s.c.TransientSolrCoreCacheDefault Allocating transient cache for 2147483647 transient cores
   [junit4]   2> 211936 INFO  (zkCallback-764-thread-1) [    ] o.a.s.c.c.ZkStateReader Updated live nodes from ZooKeeper... (4) -> (3)
   [junit4]   2> 211936 INFO  (zkCallback-742-thread-1) [    ] o.a.s.c.c.ZkStateReader Updated live nodes from ZooKeeper... (4) -> (3)
   [junit4]   2> 211936 INFO  (zkCallback-748-thread-1) [    ] o.a.s.c.c.ZkStateReader Updated live nodes from ZooKeeper... (4) -> (3)
   [junit4]   2> 211936 INFO  (zkCallback-737-thread-1) [    ] o.a.s.c.c.ZkStateReader Updated live nodes from ZooKeeper... (4) -> (3)
   [junit4]   2> 211936 INFO  (zkCallback-712-thread-1) [    ] o.a.s.c.c.ZkStateReader Updated live nodes from ZooKeeper... (4) -> (3)
   [junit4]   2> 211936 INFO  (zkCallback-711-thread-2) [    ] o.a.s.c.c.ZkStateReader Updated live nodes from ZooKeeper... (4) -> (3)
   [junit4]   2> 211936 INFO  (SUITE-TestPullReplicaErrorHandling-seed#[4DC797584DF48098]-worker) [    ] o.a.s.c.Overseer Overseer (id=72218165249638407-127.0.0.1:40667_solr-n_0000000001) closing
   [junit4]   2> 211936 INFO  (OverseerStateUpdate-72218165249638407-127.0.0.1:40667_solr-n_0000000001) [n:127.0.0.1:40667_solr    ] o.a.s.c.Overseer Overseer Loop exiting : 127.0.0.1:40667_solr
   [junit4]   2> 211936 WARN  (OverseerAutoScalingTriggerThread-72218165249638407-127.0.0.1:40667_solr-n_0000000001) [    ] o.a.s.c.a.OverseerTriggerThread OverseerTriggerThread woken up but we are closed, exiting.
   [junit4]   2> 211944 INFO  (zkCallback-772-thread-1) [    ] o.a.s.c.c.ZkStateReader Updated live nodes from ZooKeeper... (4) -> (3)
   [junit4]   2> 211944 INFO  (zkCallback-756-thread-1) [    ] o.a.s.c.c.ZkStateReader Updated live nodes from ZooKeeper... (4) -> (3)
   [junit4]   2> 211946 INFO  (zkCallback-779-thread-1) [    ] o.a.s.c.c.ZkStateReader Updated live nodes from ZooKeeper... (4) -> (3)
   [junit4]   2> 211948 INFO  (zkCallback-711-thread-2) [    ] o.a.s.c.OverseerElectionContext I am going to be the leader 127.0.0.1:46055_solr
   [junit4]   2> 211948 INFO  (SUITE-TestPullReplicaErrorHandling-seed#[4DC797584DF48098]-worker) [    ] o.e.j.s.h.ContextHandler Stopped o.e.j.s.ServletContextHandler@67806987{/solr,null,UNAVAILABLE}
   [junit4]   2> 211948 INFO  (SUITE-TestPullReplicaErrorHandling-seed#[4DC797584DF48098]-worker) [    ] o.e.j.s.session node0 Stopped scavenging
   [junit4]   2> 211949 INFO  (zkCallback-711-thread-2) [n:127.0.0.1:46055_solr    ] o.a.s.c.Overseer Overseer (id=72218165249638408-127.0.0.1:46055_solr-n_0000000002) starting
   [junit4]   2> 211949 INFO  (SUITE-TestPullReplicaErrorHandling-seed#[4DC797584DF48098]-worker) [    ] o.e.j.s.Server jetty-9.4.11.v20180605; built: 2018-06-05T18:24:03.829Z; git: d5fc0523cfa96bfebfbda19606cad384d772f04c; jvm 1.8.0_172-b11
   [junit4]   2> 211959 INFO  (SUITE-TestPullReplicaErrorHandling-seed#[4DC797584DF48098]-worker) [    ] o.e.j.s.session DefaultSessionIdManager workerName=node0
   [junit4]   2> 211959 INFO  (SUITE-TestPullReplicaErrorHandling-seed#[4DC797584DF48098]-worker) [    ] o.e.j.s.session No SessionScavenger set, using defaults
   [junit4]   2> 211959 INFO  (SUITE-TestPullReplicaErrorHandling-seed#[4DC797584DF48098]-worker) [    ] o.e.j.s.session node0 Scavenging every 600000ms
   [junit4]   2> 211960 INFO  (OverseerStateUpdate-72218165249638408-127.0.0.1:46055_solr-n_0000000002) [n:127.0.0.1:46055_solr    ] o.a.s.c.Overseer Starting to work on the main queue : 127.0.0.1:46055_solr
   [junit4]   2> 211964 INFO  (SUITE-TestPullReplicaErrorHandling-seed#[4DC797584DF48098]-worker) [    ] o.e.j.s.h.ContextHandler Started o.e.j.s.ServletContextHandler@71ebe83a{/solr,null,AVAILABLE}
   [junit4]   2> 211964 INFO  (SUITE-TestPullReplicaErrorHandling-seed#[4DC797584DF48098]-worker) [    ] o.e.j.s.AbstractConnector Started ServerConnector@209546ac{HTTP/1.1,[http/1.1]}{127.0.0.1:46757}
   [junit4]   2> 211964 INFO  (SUITE-TestPullReplicaErrorHandling-seed#[4DC797584DF48098]-worker) [    ] o.e.j.s.Server Started @212005ms
   [junit4]   2> 211964 INFO  (SUITE-TestPullReplicaErrorHandling-seed#[4DC797584DF48098]-worker) [    ] o.a.s.c.s.e.JettySolrRunner Jetty properties: {hostContext=/solr, hostPort=42679}
   [junit4]   2> 211965 ERROR (SUITE-TestPullReplicaErrorHandling-seed#[4DC797584DF48098]-worker) [    ] o.a.s.u.StartupLoggingUtils Missing Java Option solr.log.dir. Logging may be missing or incomplete.
   [junit4]   2> 211965 INFO  (SUITE-TestPullReplicaErrorHandling-seed#[4DC797584DF48098]-worker) [    ] o.a.s.s.SolrDispatchFilter Using logger factory org.apache.logging.slf4j.Log4jLoggerFactory
   [junit4]   2> 211965 INFO  (SUITE-TestPullReplicaErrorHandling-seed#[4DC797584DF48098]-worker) [    ] o.a.s.s.SolrDispatchFilter  ___      _       Welcome to Apache Solr? version 8.0.0
   [junit4]   2> 211965 INFO  (SUITE-TestPullReplicaErrorHandling-seed#[4DC797584DF48098]-worker) [    ] o.a.s.s.SolrDispatchFilter / __| ___| |_ _   Starting in cloud mode on port null
   [junit4]   2> 211965 INFO  (SUITE-TestPullReplicaErrorHandling-seed#[4DC797584DF48098]-worker) [    ] o.a.s.s.SolrDispatchFilter \__ \/ _ \ | '_|  Install dir: null
   [junit4]   2> 211965 INFO  (SUITE-TestPullReplicaErrorHandling-seed#[4DC797584DF48098]-worker) [    ] o.a.s.s.SolrDispatchFilter |___/\___/_|_|    Start time: 2018-09-13T16:00:45.257Z
   [junit4]   2> 211976 INFO  (zkConnectionManagerCallback-783-thread-1) [    ] o.a.s.c.c.ConnectionManager zkClient has connected
   [junit4]   2> 211977 INFO  (SUITE-TestPullReplicaErrorHandling-seed#[4DC797584DF48098]-worker) [    ] o.a.s.s.SolrDispatchFilter solr.xml found in ZooKeeper. Loading...
   [junit4]   2> 212043 INFO  (SUITE-TestPullReplicaErrorHandling-seed#[4DC797584DF48098]-worker) [    ] o.a.s.c.ZkContainer Zookeeper client=127.0.0.1:44373/solr
   [junit4]   2> 212045 INFO  (zkConnectionManagerCallback-787-thread-1) [    ] o.a.s.c.c.ConnectionManager zkClient has connected
   [junit4]   2> 212047 INFO  (zkConnectionManagerCallback-789-thread-1) [    ] o.a.s.c.c.ConnectionManager zkClient has connected
   [junit4]   2> 212050 INFO  (SUITE-TestPullReplicaErrorHandling-seed#[4DC797584DF48098]-worker) [    ] o.a.s.c.c.ZkStateReader Updated live nodes from ZooKeeper... (0) -> (3)
   [junit4]   2> 212052 INFO  (SUITE-TestPullReplicaErrorHandling-seed#[4DC797584DF48098]-worker) [    ] o.a.s.c.TransientSolrCoreCacheDefault Allocating transient cache for 2147483647 transient cores
   [junit4]   2> 212052 INFO  (SUITE-TestPullReplicaErrorHandling-seed#[4DC797584DF48098]-worker) [    ] o.a.s.c.ZkController Register node as live in ZooKeeper:/live_nodes/127.0.0.1:42679_solr
   [junit4]   2> 212053 INFO  (zkCallback-764-thread-1) [    ] o.a.s.c.c.ZkStateReader Updated live nodes from ZooKeeper... (3) -> (4)
   [junit4]   2> 212053 INFO  (zkCallback-748-thread-1) [    ] o.a.s.c.c.ZkStateReader Updated live nodes from ZooKeeper... (3) -> (4)
   [junit4]   2> 212053 INFO  (zkCallback-711-thread-2) [    ] o.a.s.c.c.ZkStateReader Updated live nodes from ZooKeeper... (3) -> (4)
   [junit4]   2> 212053 INFO  (zkCallback-788-thread-1) [    ] o.a.s.c.c.ZkStateReader Updated live nodes from ZooKeeper... (3) -> (4)
   [junit4]   2> 212053 INFO  (zkCallback-772-thread-1) [    ] o.a.s.c.c.ZkStateReader Updated live nodes from ZooKeeper... (3) -> (4)
   [junit4]   2> 212053 INFO  (zkCallback-742-thread-1) [    ] o.a.s.c.c.ZkStateReader Updated live nodes from ZooKeeper... (3) -> (4)
   [junit4]   2> 212055 INFO  (zkCallback-779-thread-1) [    ] o.a.s.c.c.ZkStateReader Updated live nodes from ZooKeeper... (3) -> (4)
   [junit4]   2> 212055 INFO  (zkCallback-756-thread-1) [    ] o.a.s.c.c.ZkStateReader Updated live nodes from ZooKeeper... (3) -> (4)
   [junit4]   2> 212065 INFO  (zkConnectionManagerCallback-796-thread-1) [    ] o.a.s.c.c.ConnectionManager zkClient has connected
   [junit4]   2> 212066 INFO  (SUITE-TestPullReplicaErrorHandling-seed#[4DC797584DF48098]-worker) [    ] o.a.s.c.c.ZkStateReader Updated live nodes from ZooKeeper... (0) -> (4)
   [junit4]   2> 212066 INFO  (SUITE-TestPullReplicaErrorHandling-seed#[4DC797584DF48098]-worker) [    ] o.a.s.c.s.i.ZkClientClusterStateProvider Cluster at 127.0.0.1:44373/solr ready
   [junit4]   2> 212067 INFO  (SUITE-TestPullReplicaErrorHandling-seed#[4DC797584DF48098]-worker) [    ] o.a.s.h.a.MetricsHistoryHandler No .system collection, keeping metrics history in memory.
   [junit4]   2> 212082 INFO  (SUITE-TestPullReplicaErrorHandling-seed#[4DC797584DF48098]-worker) [    ] o.a.s.m.r.SolrJmxReporter JMX monitoring for 'solr_42679.solr.node' (registry 'solr.node') enabled at server: com.sun.jmx.mbeanserver.JmxMBeanServer@27ae1d2a
   [junit4]   2> 212089 INFO  (SUITE-TestPullReplicaErrorHandling-seed#[4DC797584DF48098]-worker) [    ] o.a.s.m.r.SolrJmxReporter JMX monitoring for 'solr_42679.solr.jvm' (registry 'solr.jvm') enabled at server: com.sun.jmx.mbeanserver.JmxMBeanServer@27ae1d2a
   [junit4]   2> 212090 INFO  (SUITE-TestPullReplicaErrorHandling-seed#[4DC797584DF48098]-worker) [    ] o.a.s.m.r.SolrJmxReporter JMX monitoring for 'solr_42679.solr.jetty' (registry 'solr.jetty') enabled at server: com.sun.jmx.mbeanserver.JmxMBeanServer@27ae1d2a
   [junit4]   2> 212091 INFO  (SUITE-TestPullReplicaErrorHandling-seed#[4DC797584DF48098]-worker) [    ] o.a.s.c.CorePropertiesLocator Found 0 core definitions underneath /home/jenkins/workspace/Lucene-Solr-master-Linux/solr/build/solr-core/test/J2/temp/solr.cloud.TestPullReplicaErrorHandling_4DC797584DF48098-001/tempDir-001/node3/.
   [junit4]   2> 212127 INFO  (SUITE-TestPullReplicaErrorHandling-seed#[4DC797584DF48098]-worker) [    ] o.a.s.c.TestPullReplicaErrorHandling Adding proxy for URL: http://127.0.0.1:46757/solr. Proxy: http://127.0.0.1:42679/solr
   [junit4]   2> 212128 INFO  (SUITE-TestPullReplicaErrorHandling-seed#[4DC797584DF48098]-worker) [    ] o.e.j.s.AbstractConnector Stopped ServerConnector@1d8dac70{HTTP/1.1,[http/1.1]}{127.0.0.1:0}
   [junit4]   2> 212128 INFO  (SUITE-TestPullReplicaErrorHandling-seed#[4DC797584DF48098]-worker) [    ] o.a.s.c.CoreContainer Shutting down CoreContainer instance=1933925672
   [junit4]   2> 212128 INFO  (SUITE-TestPullReplicaErrorHandling-seed#[4DC797584DF48098]-worker) [    ] o.a.s.m.SolrMetricManager Closing metric reporters for registry=solr.node, tag=null
   [junit4]   2> 212129 INFO  (SUITE-TestPullReplicaErrorHandling-seed#[4DC797584DF48098]-worker) [    ] o.a.s.m.r.SolrJmxReporter Closing reporter [org.apache.solr.metrics.reporters.SolrJmxReporter@21efe0f6: rootName = solr_46055, domain = solr.node, service url = null, agent id = null] for registry solr.node / com.codahale.metrics.MetricRegistry@4e5b4bd5
   [junit4]   2> 212133 INFO  (SUITE-TestPullReplicaErrorHandling-seed#[4DC797584DF48098]-worker) [    ] o.a.s.m.SolrMetricManager Closing metric reporters for registry=solr.jvm, tag=null
   [junit4]   2> 212133 INFO  (SUITE-TestPullReplicaErrorHandling-seed#[4DC797584DF48098]-worker) [    ] o.a.s.m.r.SolrJmxReporter Closing reporter [org.apache.solr.metrics.reporters.SolrJmxReporter@3340179f: rootName = solr_46055, domain = solr.jvm, service url = null, agent id = null] for registry solr.jvm / com.codahale.metrics.MetricRegistry@2ad4affc
   [junit4]   2> 212135 INFO  (SUITE-TestPullReplicaErrorHandling-seed#[4DC797584DF48098]-worker) [    ] o.a.s.m.SolrMetricManager Closing metric reporters for registry=solr.jetty, tag=null
   [junit4]   2> 212135 INFO  (SUITE-TestPullReplicaErrorHandling-seed#[4DC797584DF48098]-worker) [    ] o.a.s.m.r.SolrJmxReporter Closing reporter [org.apache.solr.metrics.reporters.SolrJmxReporter@1364149e: rootName = solr_46055, domain = solr.jetty, service url = null, agent id = null] for registry solr.jetty / com.codahale.metrics.MetricRegistry@2b994eac
   [junit4]   2> 212136 INFO  (SUITE-TestPullReplicaErrorHandling-seed#[4DC797584DF48098]-worker) [    ] o.a.s.c.ZkController Remove node as live in ZooKeeper:/live_nodes/127.0.0.1:46055_solr
   [junit4]   2> 212137 INFO  (zkCallback-748-thread-1) [    ] o.a.s.c.c.ZkStateReader Updated live nodes from ZooKeeper... (4) -> (3)
   [junit4]   2> 212137 INFO  (zkCallback-764-thread-1) [    ] o.a.s.c.c.ZkStateReader Updated live nodes from ZooKeeper... (4) -> (3)
   [junit4]   2> 212137 INFO  (SUITE-TestPullReplicaErrorHandling-seed#[4DC797584DF48098]-worker) [    ] o.a.s.m.SolrMetricManager Closing metric reporters for registry=solr.cluster, tag=null
   [junit4]   2> 212137 INFO  (zkCallback-711-thread-2) [    ] o.a.s.c.c.ZkStateReader Updated live nodes from ZooKeeper... (4) -> (3)
   [junit4]   2> 212143 INFO  (zkCallback-788-thread-1) [    ] o.a.s.c.c.ZkStateReader Updated live nodes from ZooKeeper... (4) -> (3)
   [junit4]   2> 212143 INFO  (zkCallback-779-thread-1) [    ] o.a.s.c.c.ZkStateReader Updated live nodes from ZooKeeper... (4) -> (3)
   [junit4]   2> 212143 INFO  (zkCallback-772-thread-1) [    ] o.a.s.c.c.ZkStateReader Updated live nodes from ZooKeeper... (4) -> (3)
   [junit4]   2> 212143 INFO  (zkCallback-742-thread-1) [    ] o.a.s.c.c.ZkStateReader Updated live nodes from ZooKeeper... (4) -> (3)
   [junit4]   2> 212143 INFO  (zkCallback-756-thread-1) [    ] o.a.s.c.c.ZkStateReader Updated live nodes from ZooKeeper... (4) -> (3)
   [junit4]   2> 212144 INFO  (zkCallback-795-thread-1) [    ] o.a.s.c.c.ZkStateReader Updated live nodes from ZooKeeper... (4) -> (3)
   [junit4]   2> 212148 INFO  (SUITE-TestPullReplicaErrorHandling-seed#[4DC797584DF48098]-worker) [    ] o.a.s.c.Overseer Overseer (id=72218165249638408-127.0.0.1:46055_solr-n_0000000002) closing
   [junit4]   2> 212148 INFO  (OverseerStateUpdate-72218165249638408-127.0.0.1:46055_solr-n_0000000002) [n:127.0.0.1:46055_solr    ] o.a.s.c.Overseer Overseer Loop exiting : 127.0.0.1:46055_solr
   [junit4]   2> 212148 WARN  (OverseerAutoScalingTriggerThread-72218165249638408-127.0.0.1:46055_solr-n_0000000002) [    ] o.a.s.c.a.OverseerTriggerThread OverseerTriggerThread woken up but we are closed, exiting.
   [junit4]   2> 212157 INFO  (zkCallback-748-thread-1) [    ] o.a.s.c.OverseerElectionContext I am going to be the leader 127.0.0.1:43405_solr
   [junit4]   2> 212158 INFO  (SUITE-TestPullReplicaErrorHandling-seed#[4DC797584DF48098]-worker) [    ] o.e.j.s.h.ContextHandler Stopped o.e.j.s.ServletContextHandler@2d119162{/solr,null,UNAVAILABLE}
   [junit4]   2> 212158 INFO  (SUITE-TestPullReplicaErrorHandling-seed#[4DC797584DF48098]-worker) [    ] o.e.j.s.session node0 Stopped scavenging
   [junit4]   2> 212159 INFO  (SUITE-TestPullReplicaErrorHandling-seed#[4DC797584DF48098]-worker) [    ] o.e.j.s.Server jetty-9.4.11.v20180605; built: 2018-06-05T18:24:03.829Z; git: d5fc0523cfa96bfebfbda19606cad384d772f04c; jvm 1.8.0_172-b11
   [junit4]   2> 212160 INFO  (zkCallback-748-thread-1) [n:127.0.0.1:43405_solr    ] o.a.s.c.Overseer Overseer (id=72218165249638415-127.0.0.1:43405_solr-n_0000000003) starting
   [junit4]   2> 212165 INFO  (OverseerStateUpdate-72218165249638415-127.0.0.1:43405_solr-n_0000000003) [n:127.0.0.1:43405_solr    ] o.a.s.c.Overseer Starting to work on the main queue : 127.0.0.1:43405_solr
   [junit4]   2> 212167 INFO  (SUITE-TestPullReplicaErrorHandling-seed#[4DC797584DF48098]-worker) [    ] o.e.j.s.session DefaultSessionIdManager workerName=node0
   [junit4]   2> 212167 INFO  (SUITE-TestPullReplicaErrorHandling-seed#[4DC797584DF48098]-worker) [    ] o.e.j.s.session No SessionScavenger set, using defaults
   [junit4]   2> 212167 INFO  (SUITE-TestPullReplicaErrorHandling-seed#[4DC797584DF48098]-worker) [    ] o.e.j.s.session node0 Scavenging every 600000ms
   [junit4]   2> 212168 INFO  (SUITE-TestPullReplicaErrorHandling-seed#[4DC797584DF48098]-worker) [    ] o.e.j.s.h.ContextHandler Started o.e.j.s.ServletContextHandler@afb0523{/solr,null,AVAILABLE}
   [junit4]   2> 212168 INFO  (SUITE-TestPullReplicaErrorHandling-seed#[4DC797584DF48098]-worker) [    ] o.e.j.s.AbstractConnector Started ServerConnector@3b8a63a6{HTTP/1.1,[http/1.1]}{127.0.0.1:42725}
   [junit4]   2> 212168 INFO  (SUITE-TestPullReplicaErrorHandling-seed#[4DC797584DF48098]-worker) [    ] o.e.j.s.Server Started @212209ms
   [junit4]   2> 212168 INFO  (SUITE-TestPullReplicaErrorHandling-seed#[4DC797584DF48098]-worker) [    ] o.a.s.c.s.e.JettySolrRunner Jetty properties: {hostContext=/solr, hostPort=42531}
   [junit4]   2> 212169 ERROR (SUITE-TestPullReplicaErrorHandling-seed#[4DC797584DF48098]-worker) [    ] o.a.s.u.StartupLoggingUtils Missing Java Option solr.log.dir. Logging may be missing or incomplete.
   [junit4]   2> 212169 INFO  (SUITE-TestPullReplicaErrorHandling-seed#[4DC797584DF48098]-worker) [    ] o.a.s.s.SolrDispatchFilter Using logger factory org.apache.logging.slf4j.Log4jLoggerFactory
   [junit4]   2> 212169 INFO  (SUITE-TestPullReplicaErrorHandling-seed#[4DC797584DF48098]-worker) [    ] o.a.s.s.SolrDispatchFilter  ___      _       Welcome to Apache Solr? version 8.0.0
   [junit4]   2> 212169 INFO  (SUITE-TestPullReplicaErrorHandling-seed#[4DC797584DF48098]-worker) [    ] o.a.s.s.SolrDispatchFilter / __| ___| |_ _   Starting in cloud mode on port null
   [junit4]   2> 212169 INFO  (SUITE-TestPullReplicaErrorHandling-seed#[4DC797584DF48098]-worker) [    ] o.a.s.s.SolrDispatchFilter \__ \/ _ \ | '_|  Install dir: null
   [junit4]   2> 212169 INFO  (SUITE-TestPullReplicaErrorHandling-seed#[4DC797584DF48098]-worker) [    ] o.a.s.s.SolrDispatchFilter |___/\___/_|_|    Start time: 2018-09-13T16:00:45.461Z
   [junit4]   2> 212174 INFO  (zkConnectionManagerCallback-799-thread-1) [    ] o.a.s.c.c.ConnectionManager zkClient has connected
   [junit4]   2> 212175 INFO  (SUITE-TestPullReplicaErrorHandling-seed#[4DC797584DF48098]-worker) [    ] o.a.s.s.SolrDispatchFilter solr.xml found in ZooKeeper. Loading...
   [junit4]   2> 212273 INFO  (SUITE-TestPullReplicaErrorHandling-seed#[4DC797584DF48098]-worker) [    ] o.a.s.c.ZkContainer Zookeeper client=127.0.0.1:44373/solr
   [junit4]   2> 212276 INFO  (zkConnectionManagerCallback-803-thread-1) [    ] o.a.s.c.c.ConnectionManager zkClient has connected
   [junit4]   2> 212285 INFO  (zkConnectionManagerCallback-805-thread-1) [    ] o.a.s.c.c.ConnectionManager zkClient has connected
   [junit4]   2> 212289 INFO  (SUITE-TestPullReplicaErrorHandling-seed#[4DC797584DF48098]-worker) [    ] o.a.s.c.c.ZkStateReader Updated live nodes from ZooKeeper... (0) -> (3)
   [junit4]   2> 212292 INFO  (SUITE-TestPullReplicaErrorHandling-seed#[4DC797584DF48098]-worker) [    ] o.a.s.c.TransientSolrCoreCacheDefault Allocating transient cache for 2147483647 transient cores
   [junit4]   2> 212292 INFO  (SUITE-TestPullReplicaErrorHandling-seed#[4DC797584DF48098]-worker) [    ] o.a.s.c.ZkController Register node as live in ZooKeeper:/live_nodes/127.0.0.1:42531_solr
   [junit4]   2> 212293 INFO  (zkCallback-748-thread-1) [    ] o.a.s.c.c.ZkStateReader Updated live nodes from ZooKeeper... (3) -> (4)
   [junit4]   2> 212293 INFO  (zkCallback-788-thread-1) [    ] o.a.s.c.c.ZkStateReader Updated live nodes from ZooKeeper... (3) -> (4)
   [junit4]   2> 212293 INFO  (zkCallback-795-thread-1) [    ] o.a.s.c.c.ZkStateReader Updated live nodes from ZooKeeper... (3) -> (4)
   [junit4]   2> 212293 INFO  (zkCallback-772-thread-1) [    ] o.a.s.c.c.ZkStateReader Updated live nodes from ZooKeeper... (3) -> (4)
   [junit4]   2> 212293 INFO  (zkCallback-764-thread-1) [    ] o.a.s.c.c.ZkStateReader Updated live nodes from ZooKeeper... (3) -> (4)
   [junit4]   2> 212293 INFO  (zkCallback-756-thread-1) [    ] o.a.s.c.c.ZkStateReader Updated live nodes from ZooKeeper... (3) -> (4)
   [junit4]   2> 212295 INFO  (zkCallback-779-thread-1) [    ] o.a.s.c.c.ZkStateReader Updated live nodes from ZooKeeper... (3) -> (4)
   [junit4]   2> 212296 INFO  (zkCallback-804-thread-1) [    ] o.a.s.c.c.ZkStateReader Updated live nodes from ZooKeeper... (3) -> (4)
   [junit4]   2> 212315 INFO  (zkConnectionManagerCallback-812-thread-1) [    ] o.a.s.c.c.ConnectionManager zkClient has connected
   [junit4]   2> 212317 INFO  (SUITE-TestPullReplicaErrorHandling-seed#[4DC797584DF48098]-worker) [    ] o.a.s.c.c.ZkStateReader Updated live nodes from ZooKeeper... (0) -> (4)
   [junit4]   2> 212317 INFO  (SUITE-TestPullReplicaErrorHandling-seed#[4DC797584DF48098]-worker) [    ] o.a.s.c.s.i.ZkClientClusterStateProvider Cluster at 127.0.0.1:44373/solr ready
   [junit4]   2> 212317 INFO  (SUITE-TestPullReplicaErrorHandling-seed#[4DC797584DF48098]-worker) [    ] o.a.s.h.a.MetricsHistoryHandler No .system collection, keeping metrics history in memory.
   [junit4]   2> 212332 INFO  (SUITE-TestPullReplicaErrorHandling-seed#[4DC797584DF48098]-worker) [    ] o.a.s.m.r.SolrJmxReporter JMX monitoring for 'solr_42531.solr.node' (registry 'solr.node') enabled at server: com.sun.jmx.mbeanserver.JmxMBeanServer@27ae1d2a
   [junit4]   2> 212340 INFO  (SUITE-TestPullReplicaErrorHandling-seed#[4DC797584DF48098]-worker) [    ] o.a.s.m.r.SolrJmxReporter JMX monitoring for 'solr_42531.solr.jvm' (registry 'solr.jvm') enabled at server: com.sun.jmx.mbeanserver.JmxMBeanServer@27ae1d2a
   [junit4]   2> 212340 INFO  (SUITE-TestPullReplicaErrorHandling-seed#[4DC797584DF48098]-worker) [    ] o.a.s.m.r.SolrJmxReporter JMX monitoring for 'solr_42531.solr.jetty' (registry 'solr.jetty') enabled at server: com.sun.jmx.mbeanserver.JmxMBeanServer@27ae1d2a
   [junit4]   2> 212341 INFO  (SUITE-TestPullReplicaErrorHandling-seed#[4DC797584DF48098]-worker) [    ] o.a.s.c.CorePropertiesLocator Found 0 core definitions underneath /home/jenkins/workspace/Lucene-Solr-master-Linux/solr/build/solr-core/test/J2/temp/solr.cloud.TestPullReplicaErrorHandling_4DC797584DF48098-001/tempDir-001/node2/.
   [junit4]   2> 212376 INFO  (SUITE-TestPullReplicaErrorHandling-seed#[4DC797584DF48098]-worker) [    ] o.a.s.c.TestPullReplicaErrorHandling Adding proxy for URL: http://127.0.0.1:42725/solr. Proxy: http://127.0.0.1:42531/solr
   [junit4]   2> 212376 INFO  (SUITE-TestPullReplicaErrorHandling-seed#[4DC797584DF48098]-worker) [    ] o.e.j.s.AbstractConnector Stopped ServerConnector@1c687b39{HTTP/1.1,[http/1.1]}{127.0.0.1:0}
   [junit4]   2> 212377 INFO  (SUITE-TestPullReplicaErrorHandling-seed#[4DC797584DF48098]-worker) [    ] o.a.s.c.CoreContainer Shutting down CoreContainer instance=1626546183
   [junit4]   2> 212377 INFO  (SUITE-TestPullReplicaErrorHandling-seed#[4DC797584DF48098]-worker) [    ] o.a.s.m.SolrMetricManager Closing metric reporters for registry=solr.node, tag=null
   [junit4]   2> 212378 INFO  (SUITE-TestPullReplicaErrorHandling-seed#[4DC797584DF48098]-worker) [    ] o.a.s.m.r.SolrJmxReporter Closing reporter [org.apache.solr.metrics.reporters.SolrJmxReporter@486d0beb: rootName = solr_43405, domain = solr.node, service url = null, agent id = null] for registry solr.node / com.codahale.metrics.MetricRegistry@2627e4a1
   [junit4]   2> 212385 INFO  (SUITE-TestPullReplicaErrorHandling-seed#[4DC797584DF48098]-worker) [    ] o.a.s.m.SolrMetricManager Closing metric reporters for registry=solr.jvm, tag=null
   [junit4]   2> 212385 INFO  (SUITE-TestPullReplicaErrorHandling-seed#[4DC797584DF48098]-worker) [    ] o.a.s.m.r.SolrJmxReporter Closing reporter [org.apache.solr.metrics.reporters.SolrJmxReporter@516fe651: rootName = solr_43405, domain = solr.jvm, service url = null, agent id = null] for registry solr.jvm / com.codahale.metrics.MetricRegistry@2ad4affc
   [junit4]   2> 212389 INFO  (SUITE-TestPullReplicaErrorHandling-seed#[4DC797584DF48098]-worker) [    ] o.a.s.m.SolrMetricManager Closing metric reporters for registry=solr.jetty, tag=null
   [junit4]   2> 212389 INFO  (SUITE-TestPullReplicaErrorHandling-seed#[4DC797584DF48098]-worker) [    ] o.a.s.m.r.SolrJmxReporter Closing reporter [org.apache.solr.metrics.reporters.SolrJmxReporter@1a9a97bf: rootName = solr_43405, domain = solr.jetty, service url = null, agent id = null] for registry solr.jetty / com.codahale.metrics.MetricRegistry@2b994eac
   [junit4]   2> 212390 INFO  (SUITE-TestPullReplicaErrorHandling-seed#[4DC797584DF48098]-worker) [    ] o.a.s.c.ZkController Remove node as live in ZooKeeper:/live_nodes/127.0.0.1:43405_solr
   [junit4]   2> 212391 INFO  (SUITE-TestPullReplicaErrorHandling-seed#[4DC797584DF48098]-worker) [    ] o.a.s.m.SolrMetricManager Closing metric reporters for registry=solr.cluster, tag=null
   [junit4]   2> 212391 INFO  (zkCallback-756-thread-1) [    ] o.a.s.c.c.ZkStateReader Updated live nodes from ZooKeeper... (4) -> (3)
   [junit4]   2> 212391 INFO  (zkCallback-804-thread-1) [    ] o.a.s.c.c.ZkStateReader Updated live nodes from ZooKeeper... (4) -> (3)
   [junit4]   2> 212391 INFO  (zkCallback-788-thread-1) [    ] o.a.s.c.c.ZkStateReader Updated live nodes from ZooKeeper... (4) -> (3)
   [junit4]   2> 212391 INFO  (zkCallback-772-thread-1) [    ] o.a.s.c.c.ZkStateReader Updated live nodes from ZooKeeper... (4) -> (3)
   [junit4]   2> 212391 INFO  (zkCallback-795-thread-1) [    ] o.a.s.c.c.ZkStateReader Updated live nodes from ZooKeeper... (4) -> (3)
   [junit4]   2> 212391 INFO  (zkCallback-779-thread-1) [    ] o.a.s.c.c.ZkStateReader Updated live nodes from ZooKeeper... (4) -> (3)
   [junit4]   2> 212391 INFO  (zkCallback-764-thread-1) [    ] o.a.s.c.c.ZkStateReader Updated live nodes from ZooKeeper... (4) -> (3)
   [junit4]   2> 212391 INFO  (zkCallback-748-thread-1) [    ] o.a.s.c.c.ZkStateReader Updated live nodes from ZooKeeper... (4) -> (3)
   [junit4]   2> 212392 INFO  (SUITE-TestPullReplicaErrorHandling-seed#[4DC797584DF48098]-worker) [    ] o.a.s.c.Overseer Overseer (id=72218165249638415-127.0.0.1:43405_solr-n_0000000003) closing
   [junit4]   2> 212392 INFO  (OverseerStateUpdate-72218165249638415-127.0.0.1:43405_solr-n_0000000003) [n:127.0.0.1:43405_solr    ] o.a.s.c.Overseer Overseer Loop exiting : 127.0.0.1:43405_solr
   [junit4]   2> 212392 WARN  (OverseerAutoScalingTriggerThread-72218165249638415-127.0.0.1:43405_solr-n_0000000003) [    ] o.a.s.c.a.OverseerTriggerThread OverseerTriggerThread woken up but we are closed, exiting.
   [junit4]   2> 212393 INFO  (zkCallback-811-thread-1) [    ] o.a.s.c.c.ZkStateReader Updated live nodes from ZooKeeper... (4) -> (3)
   [junit4]   2> 212397 INFO  (zkCallback-772-thread-1) [    ] o.a.s.c.OverseerElectionContext I am going to be the leader 127.0.0.1:41869_solr
   [junit4]   2> 212398 INFO  (SUITE-TestPullReplicaErrorHandling-seed#[4DC797584DF48098]-worker) [    ] o.e.j.s.h.ContextHandler Stopped o.e.j.s.ServletContextHandler@3f4b6219{/solr,null,UNAVAILABLE}
   [junit4]   2> 212398 INFO  (SUITE-TestPullReplicaErrorHandling-seed#[4DC797584DF48098]-worker) [    ] o.e.j.s.session node0 Stopped scavenging
   [junit4]   2> 212398 INFO  (zkCallback-772-thread-1) [n:127.0.0.1:41869_solr    ] o.a.s.c.Overseer Overseer (id=72218165249638421-127.0.0.1:41869_solr-n_0000000004) starting
   [junit4]   2> 212399 INFO  (SUITE-TestPullReplicaErrorHandling-seed#[4DC797584DF48098]-worker) [    ] o.e.j.s.Server jetty-9.4.11.v20180605; built: 2018-06-05T18:24:03.829Z; git: d5fc0523cfa96bfebfbda19606cad384d772f04c; jvm 1.8.0_172-b11
   [junit4]   2> 212407 INFO  (OverseerStateUpdate-72218165249638421-127.0.0.1:41869_solr-n_0000000004) [n:127.0.0.1:41869_solr    ] o.a.s.c.Overseer Starting to work on the main queue : 127.0.0.1:41869_solr
   [junit4]   2> 212419 INFO  (SUITE-TestPullReplicaErrorHandling-seed#[4DC797584DF48098]-worker) [    ] o.e.j.s.session DefaultSessionIdManager workerName=node0
   [junit4]   2> 212419 INFO  (SUITE-TestPullReplicaErrorHandling-seed#[4DC797584DF48098]-worker) [    ] o.e.j.s.session No SessionScavenger set, using defaults
   [junit4]   2> 212419 INFO  (SUITE-TestPullReplicaErrorHandling-seed#[4DC797584DF48098]-worker) [    ] o.e.j.s.session node0 Scavenging every 600000ms
   [junit4]   2> 212424 INFO  (SUITE-TestPullReplicaErrorHandling-seed#[4DC797584DF48098]-worker) [    ] o.e.j.s.h.ContextHandler Started o.e.j.s.ServletContextHandler@63d6ae80{/solr,null,AVAILABLE}
   [junit4]   2> 212425 INFO  (SUITE-TestPullReplicaErrorHandling-seed#[4DC797584DF48098]-worker) [    ] o.e.j.s.AbstractConnector Started ServerConnector@47b4436f{HTTP/1.1,[http/1.1]}{127.0.0.1:44625}
   [junit4]   2> 212425 INFO  (SUITE-TestPullReplicaErrorHandling-seed#[4DC797584DF48098]-worker) [    ] o.e.j.s.Server Started @212466ms
   [junit4]   2> 212425 INFO  (SUITE-TestPullReplicaErrorHandling-seed#[4DC797584DF48098]-worker) [    ] o.a.s.c.s.e.JettySolrRunner Jetty properties: {hostContext=/solr, hostPort=42073}
   [junit4]   2> 212425 ERROR (SUITE-TestPullReplicaErrorHandling-seed#[4DC797584DF48098]-worker) [    ] o.a.s.u.StartupLoggingUtils Missing Java Option solr.log.dir. Logging may be missing or incomplete.
   [junit4]   2> 212425 INFO  (SUITE-TestPullReplicaErrorHandling-seed#[4DC797584DF48098]-worker) [    ] o.a.s.s.SolrDispatchFilter Using logger factory org.apache.logging.slf4j.Log4jLoggerFactory
   [junit4]   2> 212425 INFO  (SUITE-TestPullReplicaErrorHandling-seed#[4DC797584DF48098]-worker) [    ] o.a.s.s.SolrDispatchFilter  ___      _       Welcome to Apache Solr? version 8.0.0
   [junit4]   2> 212425 INFO  (SUITE-TestPullReplicaErrorHandling-seed#[4DC797584DF48098]-worker) [    ] o.a.s.s.SolrDispatchFilter / __| ___| |_ _   Starting in cloud mode on port null
   [junit4]   2> 212425 INFO  (SUITE-TestPullReplicaErrorHandling-seed#[4DC797584DF48098]-worker) [    ] o.a.s.s.SolrDispatchFilter \__ \/ _ \ | '_|  Install dir: null
   [junit4]   2> 212426 INFO  (SUITE-TestPullReplicaErrorHandling-seed#[4DC797584DF48098]-worker) [    ] o.a.s.s.SolrDispatchFilter |___/\___/_|_|    Start time: 2018-09-13T16:00:45.718Z
   [junit4]   2> 212435 INFO  (zkConnectionManagerCallback-815-thread-1) [    ] o.a.s.c.c.ConnectionManager zkClient has connected
   [junit4]   2> 212436 INFO  (SUITE-TestPullReplicaErrorHandling-seed#[4DC797584DF48098]-worker) [    ] o.a.s.s.SolrDispatchFilter solr.xml found in ZooKeeper. Loading...
   [junit4]   2> 212572 INFO  (SUITE-TestPullReplicaErrorHandling-seed#[4DC797584DF48098]-worker) [    ] o.a.s.c.ZkContainer Zookeeper client=127.0.0.1:44373/solr
   [junit4]   2> 212576 INFO  (zkConnectionManagerCallback-819-thread-1) [    ] o.a.s.c.c.ConnectionManager zkClient has connected
   [junit4]   2> 212587 INFO  (zkConnectionManagerCallback-821-thread-1) [    ] o.a.s.c.c.ConnectionManager zkClient has connected
   [junit4]   2> 212590 INFO  (SUITE-TestPullReplicaErrorHandling-seed#[4DC797584DF48098]-worker) [    ] o.a.s.c.c.ZkStateReader Updated live nodes from ZooKeeper... (0) -> (3)
   [junit4]   2> 212601 INFO  (SUITE-TestPullReplicaErrorHandling-seed#[4DC797584DF48098]-worker) [    ] o.a.s.c.TransientSolrCoreCacheDefault Allocating transient cache for 2147483647 transient cores
   [junit4]   2> 212601 INFO  (SUITE-TestPullReplicaErrorHandling-seed#[4DC797584DF48098]-worker) [    ] o.a.s.c.ZkCont

[...truncated too long message...]

 	at org.eclipse.jetty.servlet.ServletHandler$CachedChain.doFilter(ServletHandler.java:1642)
   [junit4]   2> 	at org.eclipse.jetty.servlet.ServletHandler.doHandle(ServletHandler.java:533)
   [junit4]   2> 	at org.eclipse.jetty.server.handler.ScopedHandler.nextHandle(ScopedHandler.java:255)
   [junit4]   2> 	at org.eclipse.jetty.server.session.SessionHandler.doHandle(SessionHandler.java:1595)
   [junit4]   2> 	at org.eclipse.jetty.server.handler.ScopedHandler.nextHandle(ScopedHandler.java:255)
   [junit4]   2> 	at org.eclipse.jetty.server.handler.ContextHandler.doHandle(ContextHandler.java:1317)
   [junit4]   2> 	at org.eclipse.jetty.server.handler.ScopedHandler.nextScope(ScopedHandler.java:203)
   [junit4]   2> 	at org.eclipse.jetty.servlet.ServletHandler.doScope(ServletHandler.java:473)
   [junit4]   2> 	at org.eclipse.jetty.server.session.SessionHandler.doScope(SessionHandler.java:1564)
   [junit4]   2> 	at org.eclipse.jetty.server.handler.ScopedHandler.nextScope(ScopedHandler.java:201)
   [junit4]   2> 	at org.eclipse.jetty.server.handler.ContextHandler.doScope(ContextHandler.java:1219)
   [junit4]   2> 	at org.eclipse.jetty.server.handler.ScopedHandler.handle(ScopedHandler.java:144)
   [junit4]   2> 	at org.eclipse.jetty.server.handler.gzip.GzipHandler.handle(GzipHandler.java:674)
   [junit4]   2> 	at org.eclipse.jetty.server.handler.HandlerWrapper.handle(HandlerWrapper.java:132)
   [junit4]   2> 	at org.eclipse.jetty.server.Server.handle(Server.java:531)
   [junit4]   2> 	at org.eclipse.jetty.server.HttpChannel.handle(HttpChannel.java:352)
   [junit4]   2> 	at org.eclipse.jetty.server.HttpConnection.onFillable(HttpConnection.java:260)
   [junit4]   2> 	at org.eclipse.jetty.io.AbstractConnection$ReadCallback.succeeded(AbstractConnection.java:281)
   [junit4]   2> 	at org.eclipse.jetty.io.FillInterest.fillable(FillInterest.java:102)
   [junit4]   2> 	at org.eclipse.jetty.io.ChannelEndPoint$2.run(ChannelEndPoint.java:118)
   [junit4]   2> 	at org.eclipse.jetty.util.thread.strategy.EatWhatYouKill.runTask(EatWhatYouKill.java:333)
   [junit4]   2> 	at org.eclipse.jetty.util.thread.strategy.EatWhatYouKill.doProduce(EatWhatYouKill.java:310)
   [junit4]   2> 	at org.eclipse.jetty.util.thread.strategy.EatWhatYouKill.tryProduce(EatWhatYouKill.java:168)
   [junit4]   2> 	at org.eclipse.jetty.util.thread.strategy.EatWhatYouKill.run(EatWhatYouKill.java:126)
   [junit4]   2> 	at org.eclipse.jetty.util.thread.ReservedThreadExecutor$ReservedThread.run(ReservedThreadExecutor.java:366)
   [junit4]   2> 	at org.eclipse.jetty.util.thread.QueuedThreadPool.runJob(QueuedThreadPool.java:762)
   [junit4]   2> 	at org.eclipse.jetty.util.thread.QueuedThreadPool$2.run(QueuedThreadPool.java:680)
   [junit4]   2> 	at java.lang.Thread.run(Thread.java:748)
   [junit4]   2> Caused by: org.apache.zookeeper.KeeperException$SessionExpiredException: KeeperErrorCode = Session expired for /overseer/queue/qn-
   [junit4]   2> 	at org.apache.zookeeper.KeeperException.create(KeeperException.java:130)
   [junit4]   2> 	at org.apache.zookeeper.KeeperException.create(KeeperException.java:54)
   [junit4]   2> 	at org.apache.zookeeper.ZooKeeper.create(ZooKeeper.java:786)
   [junit4]   2> 	at org.apache.solr.common.cloud.SolrZkClient.lambda$create$7(SolrZkClient.java:398)
   [junit4]   2> 	at org.apache.solr.common.cloud.ZkCmdExecutor.retryOperation(ZkCmdExecutor.java:60)
   [junit4]   2> 	at org.apache.solr.common.cloud.SolrZkClient.create(SolrZkClient.java:398)
   [junit4]   2> 	at org.apache.solr.cloud.ZkDistributedQueue.offer(ZkDistributedQueue.java:321)
   [junit4]   2> 	at org.apache.solr.cloud.ZkController.unregister(ZkController.java:1605)
   [junit4]   2> 	at org.apache.solr.cloud.ZkController.unregister(ZkController.java:1573)
   [junit4]   2> 	at org.apache.solr.core.CoreContainer.unload(CoreContainer.java:1524)
   [junit4]   2> 	... 40 more
   [junit4]   2> 
   [junit4]   2> 1276234 ERROR (SUITE-TestPullReplicaErrorHandling-seed#[4DC797584DF48098]-worker) [    ] o.a.z.s.ZooKeeperServer ZKShutdownHandler is not registered, so ZooKeeper server won't take any action on ERROR or SHUTDOWN server state changes
   [junit4]   2> 1276235 INFO  (SUITE-TestPullReplicaErrorHandling-seed#[4DC797584DF48098]-worker) [    ] o.a.s.c.ZkTestServer connecting to 127.0.0.1:36375 36375
   [junit4]   2> 1277096 INFO  (Thread-101) [    ] o.a.s.c.ZkTestServer connecting to 127.0.0.1:36375 36375
   [junit4]   2> 1277097 WARN  (Thread-101) [    ] o.a.s.c.ZkTestServer Watch limit violations: 
   [junit4]   2> Maximum concurrent create/delete watches above limit:
   [junit4]   2> 
   [junit4]   2> 	18	/solr/aliases.json
   [junit4]   2> 	17	/solr/clusterprops.json
   [junit4]   2> 	9	/solr/security.json
   [junit4]   2> 	9	/solr/configs/conf
   [junit4]   2> 	8	/solr/collections/pull_replica_error_handling_test_pull_replica_disconnects_from_zoo_keeper/terms/shard1
   [junit4]   2> 	8	/solr/collections/pull_replica_error_handling_test_cant_connect_to_pull_replica/terms/shard1
   [junit4]   2> 	7	/solr/collections/pull_replica_error_handling_test_cant_connect_to_leader/terms/shard1
   [junit4]   2> 	7	/solr/collections/pull_replica_error_handling_test_cant_connect_to_pull_replica/terms/shard2
   [junit4]   2> 
   [junit4]   2> Maximum concurrent data watches above limit:
   [junit4]   2> 
   [junit4]   2> 	18	/solr/clusterstate.json
   [junit4]   2> 	10	/solr/clusterprops.json
   [junit4]   2> 	7	/solr/collections/pull_replica_error_handling_test_pull_replica_disconnects_from_zoo_keeper/state.json
   [junit4]   2> 	5	/solr/autoscaling.json
   [junit4]   2> 	4	/solr/collections/pull_replica_error_handling_test_cant_connect_to_pull_replica/state.json
   [junit4]   2> 	2	/solr/overseer_elect/election/72218480227385369-127.0.0.1:36481_solr-n_0000000005
   [junit4]   2> 	2	/solr/collections/pull_replica_error_handling_test_cant_connect_to_leader/state.json
   [junit4]   2> 
   [junit4]   2> Maximum concurrent children watches above limit:
   [junit4]   2> 
   [junit4]   2> 	18	/solr/collections
   [junit4]   2> 	17	/solr/live_nodes
   [junit4]   2> 	5	/solr/overseer/queue
   [junit4]   2> 	5	/solr/autoscaling/events/.scheduled_maintenance
   [junit4]   2> 	5	/solr/autoscaling/events/.auto_add_replicas
   [junit4]   2> 	5	/solr/overseer/collection-queue-work
   [junit4]   2> 	5	/solr/overseer/queue-work
   [junit4]   2> 
   [junit4]   2> NOTE: leaving temporary files on disk at: /home/jenkins/workspace/Lucene-Solr-master-Linux/solr/build/solr-core/test/J0/temp/solr.cloud.TestPullReplicaErrorHandling_4DC797584DF48098-002
   [junit4]   2> NOTE: test params are: codec=Asserting(Lucene80): {fieldName_s=PostingsFormat(name=MockRandom), id=FST50}, docValues:{}, maxPointsInLeafNode=659, maxMBSortInHeap=5.939204798488952, sim=Asserting(org.apache.lucene.search.similarities.AssertingSimilarity@3bc5c137), locale=sr, timezone=Europe/Minsk
   [junit4]   2> NOTE: Linux 4.15.0-32-generic amd64/Oracle Corporation 1.8.0_172 (64-bit)/cpus=8,threads=1,free=415269024,total=518979584
   [junit4]   2> NOTE: All tests run in this JVM: [TestPullReplicaErrorHandling, TestPullReplicaErrorHandling]
   [junit4] Completed [5/5 (5!)] on J0 in 631.97s, 3 tests, 1 error <<< FAILURES!
   [junit4] 
   [junit4] 
   [junit4] Tests with failures [seed: 4DC797584DF48098]:
   [junit4]   - org.apache.solr.cloud.TestPullReplicaErrorHandling.testCantConnectToLeader
   [junit4]   - org.apache.solr.cloud.TestPullReplicaErrorHandling.testCantConnectToLeader
   [junit4]   - org.apache.solr.cloud.TestPullReplicaErrorHandling.testCantConnectToLeader
   [junit4]   - org.apache.solr.cloud.TestPullReplicaErrorHandling.testCantConnectToLeader
   [junit4]   - org.apache.solr.cloud.TestPullReplicaErrorHandling.testCantConnectToLeader
   [junit4] 
   [junit4] 
   [junit4] JVM J0:     0.67 ..  1277.90 =  1277.22s
   [junit4] JVM J1:     0.63 ..  1273.17 =  1272.54s
   [junit4] JVM J2:     0.70 ..   647.64 =   646.93s
   [junit4] Execution time total: 21 minutes 17 seconds
   [junit4] Tests summary: 5 suites, 15 tests, 5 errors

BUILD FAILED
/home/jenkins/workspace/Lucene-Solr-master-Linux/lucene/common-build.xml:1567: The following error occurred while executing this line:
/home/jenkins/workspace/Lucene-Solr-master-Linux/lucene/common-build.xml:1092: There were test failures: 5 suites, 15 tests, 5 errors [seed: 4DC797584DF48098]

Total time: 21 minutes 19 seconds

[repro] Setting last failure code to 256

[repro] Failures:
[repro]   5/5 failed: org.apache.solr.cloud.TestPullReplicaErrorHandling
[repro] Exiting with code 256
+ mv lucene/build lucene/build.repro
+ mv solr/build solr/build.repro
+ mv lucene/build.orig lucene/build
+ mv solr/build.orig solr/build
Archiving artifacts
Setting ANT_1_8_2_HOME=/var/lib/jenkins/tools/hudson.tasks.Ant_AntInstallation/ANT_1.8.2
[WARNINGS] Parsing warnings in console log with parser Java Compiler (javac)
Setting ANT_1_8_2_HOME=/var/lib/jenkins/tools/hudson.tasks.Ant_AntInstallation/ANT_1.8.2
Setting ANT_1_8_2_HOME=/var/lib/jenkins/tools/hudson.tasks.Ant_AntInstallation/ANT_1.8.2
<Git Blamer> Using GitBlamer to create author and commit information for all warnings.
<Git Blamer> GIT_COMMIT=dea3d69f95b5521aea5a04a82f9d8536284ed741, workspace=/var/lib/jenkins/workspace/Lucene-Solr-master-Linux
[WARNINGS] Computing warning deltas based on reference build #22851
Recording test results
Setting ANT_1_8_2_HOME=/var/lib/jenkins/tools/hudson.tasks.Ant_AntInstallation/ANT_1.8.2
Build step 'Publish JUnit test result report' changed build result to UNSTABLE
Email was triggered for: Unstable (Test Failures)
Sending email for trigger: Unstable (Test Failures)
Setting ANT_1_8_2_HOME=/var/lib/jenkins/tools/hudson.tasks.Ant_AntInstallation/ANT_1.8.2
Setting ANT_1_8_2_HOME=/var/lib/jenkins/tools/hudson.tasks.Ant_AntInstallation/ANT_1.8.2
Setting ANT_1_8_2_HOME=/var/lib/jenkins/tools/hudson.tasks.Ant_AntInstallation/ANT_1.8.2
Setting ANT_1_8_2_HOME=/var/lib/jenkins/tools/hudson.tasks.Ant_AntInstallation/ANT_1.8.2

Mime
View raw message