lucene-dev mailing list archives

Site index · List index
Message view « Date » · « Thread »
Top « Date » · « Thread »
From Policeman Jenkins Server <jenk...@thetaphi.de>
Subject [JENKINS-EA] Lucene-Solr-7.x-Linux (64bit/jdk-11-ea+28) - Build # 2740 - Still Unstable!
Date Fri, 14 Sep 2018 05:56:03 GMT
Build: https://jenkins.thetaphi.de/job/Lucene-Solr-7.x-Linux/2740/
Java: 64bit/jdk-11-ea+28 -XX:-UseCompressedOops -XX:+UseG1GC

16 tests failed.
FAILED:  org.apache.solr.cloud.DeleteNodeTest.test

Error Message:
Could not find collection : deletenodetest_coll

Stack Trace:
org.apache.solr.common.SolrException: Could not find collection : deletenodetest_coll
	at __randomizedtesting.SeedInfo.seed([46B26282BF0A1176:CEE65D5811F67C8E]:0)
	at org.apache.solr.common.cloud.ClusterState.getCollection(ClusterState.java:118)
	at org.apache.solr.cloud.DeleteNodeTest.test(DeleteNodeTest.java:78)
	at java.base/jdk.internal.reflect.NativeMethodAccessorImpl.invoke0(Native Method)
	at java.base/jdk.internal.reflect.NativeMethodAccessorImpl.invoke(NativeMethodAccessorImpl.java:62)
	at java.base/jdk.internal.reflect.DelegatingMethodAccessorImpl.invoke(DelegatingMethodAccessorImpl.java:43)
	at java.base/java.lang.reflect.Method.invoke(Method.java:566)
	at com.carrotsearch.randomizedtesting.RandomizedRunner.invoke(RandomizedRunner.java:1742)
	at com.carrotsearch.randomizedtesting.RandomizedRunner$8.evaluate(RandomizedRunner.java:935)
	at com.carrotsearch.randomizedtesting.RandomizedRunner$9.evaluate(RandomizedRunner.java:971)
	at com.carrotsearch.randomizedtesting.RandomizedRunner$10.evaluate(RandomizedRunner.java:985)
	at com.carrotsearch.randomizedtesting.rules.SystemPropertiesRestoreRule$1.evaluate(SystemPropertiesRestoreRule.java:57)
	at org.apache.lucene.util.TestRuleSetupTeardownChained$1.evaluate(TestRuleSetupTeardownChained.java:49)
	at org.apache.lucene.util.AbstractBeforeAfterRule$1.evaluate(AbstractBeforeAfterRule.java:45)
	at org.apache.lucene.util.TestRuleThreadAndTestName$1.evaluate(TestRuleThreadAndTestName.java:48)
	at org.apache.lucene.util.TestRuleIgnoreAfterMaxFailures$1.evaluate(TestRuleIgnoreAfterMaxFailures.java:64)
	at org.apache.lucene.util.TestRuleMarkFailure$1.evaluate(TestRuleMarkFailure.java:47)
	at com.carrotsearch.randomizedtesting.rules.StatementAdapter.evaluate(StatementAdapter.java:36)
	at com.carrotsearch.randomizedtesting.ThreadLeakControl$StatementRunner.run(ThreadLeakControl.java:368)
	at com.carrotsearch.randomizedtesting.ThreadLeakControl.forkTimeoutingTask(ThreadLeakControl.java:817)
	at com.carrotsearch.randomizedtesting.ThreadLeakControl$3.evaluate(ThreadLeakControl.java:468)
	at com.carrotsearch.randomizedtesting.RandomizedRunner.runSingleTest(RandomizedRunner.java:944)
	at com.carrotsearch.randomizedtesting.RandomizedRunner$5.evaluate(RandomizedRunner.java:830)
	at com.carrotsearch.randomizedtesting.RandomizedRunner$6.evaluate(RandomizedRunner.java:880)
	at com.carrotsearch.randomizedtesting.RandomizedRunner$7.evaluate(RandomizedRunner.java:891)
	at com.carrotsearch.randomizedtesting.rules.StatementAdapter.evaluate(StatementAdapter.java:36)
	at com.carrotsearch.randomizedtesting.rules.SystemPropertiesRestoreRule$1.evaluate(SystemPropertiesRestoreRule.java:57)
	at org.apache.lucene.util.AbstractBeforeAfterRule$1.evaluate(AbstractBeforeAfterRule.java:45)
	at com.carrotsearch.randomizedtesting.rules.StatementAdapter.evaluate(StatementAdapter.java:36)
	at org.apache.lucene.util.TestRuleStoreClassName$1.evaluate(TestRuleStoreClassName.java:41)
	at com.carrotsearch.randomizedtesting.rules.NoShadowingOrOverridesOnMethodsRule$1.evaluate(NoShadowingOrOverridesOnMethodsRule.java:40)
	at com.carrotsearch.randomizedtesting.rules.NoShadowingOrOverridesOnMethodsRule$1.evaluate(NoShadowingOrOverridesOnMethodsRule.java:40)
	at com.carrotsearch.randomizedtesting.rules.StatementAdapter.evaluate(StatementAdapter.java:36)
	at com.carrotsearch.randomizedtesting.rules.StatementAdapter.evaluate(StatementAdapter.java:36)
	at org.apache.lucene.util.TestRuleAssertionsRequired$1.evaluate(TestRuleAssertionsRequired.java:53)
	at org.apache.lucene.util.TestRuleMarkFailure$1.evaluate(TestRuleMarkFailure.java:47)
	at org.apache.lucene.util.TestRuleIgnoreAfterMaxFailures$1.evaluate(TestRuleIgnoreAfterMaxFailures.java:64)
	at org.apache.lucene.util.TestRuleIgnoreTestSuites$1.evaluate(TestRuleIgnoreTestSuites.java:54)
	at com.carrotsearch.randomizedtesting.rules.StatementAdapter.evaluate(StatementAdapter.java:36)
	at com.carrotsearch.randomizedtesting.ThreadLeakControl$StatementRunner.run(ThreadLeakControl.java:368)
	at java.base/java.lang.Thread.run(Thread.java:834)


FAILED:  org.apache.solr.cloud.DeleteNodeTest.test

Error Message:
Could not find collection : deletenodetest_coll

Stack Trace:
org.apache.solr.common.SolrException: Could not find collection : deletenodetest_coll
	at __randomizedtesting.SeedInfo.seed([46B26282BF0A1176:CEE65D5811F67C8E]:0)
	at org.apache.solr.common.cloud.ClusterState.getCollection(ClusterState.java:118)
	at org.apache.solr.cloud.DeleteNodeTest.test(DeleteNodeTest.java:78)
	at java.base/jdk.internal.reflect.NativeMethodAccessorImpl.invoke0(Native Method)
	at java.base/jdk.internal.reflect.NativeMethodAccessorImpl.invoke(NativeMethodAccessorImpl.java:62)
	at java.base/jdk.internal.reflect.DelegatingMethodAccessorImpl.invoke(DelegatingMethodAccessorImpl.java:43)
	at java.base/java.lang.reflect.Method.invoke(Method.java:566)
	at com.carrotsearch.randomizedtesting.RandomizedRunner.invoke(RandomizedRunner.java:1742)
	at com.carrotsearch.randomizedtesting.RandomizedRunner$8.evaluate(RandomizedRunner.java:935)
	at com.carrotsearch.randomizedtesting.RandomizedRunner$9.evaluate(RandomizedRunner.java:971)
	at com.carrotsearch.randomizedtesting.RandomizedRunner$10.evaluate(RandomizedRunner.java:985)
	at com.carrotsearch.randomizedtesting.rules.SystemPropertiesRestoreRule$1.evaluate(SystemPropertiesRestoreRule.java:57)
	at org.apache.lucene.util.TestRuleSetupTeardownChained$1.evaluate(TestRuleSetupTeardownChained.java:49)
	at org.apache.lucene.util.AbstractBeforeAfterRule$1.evaluate(AbstractBeforeAfterRule.java:45)
	at org.apache.lucene.util.TestRuleThreadAndTestName$1.evaluate(TestRuleThreadAndTestName.java:48)
	at org.apache.lucene.util.TestRuleIgnoreAfterMaxFailures$1.evaluate(TestRuleIgnoreAfterMaxFailures.java:64)
	at org.apache.lucene.util.TestRuleMarkFailure$1.evaluate(TestRuleMarkFailure.java:47)
	at com.carrotsearch.randomizedtesting.rules.StatementAdapter.evaluate(StatementAdapter.java:36)
	at com.carrotsearch.randomizedtesting.ThreadLeakControl$StatementRunner.run(ThreadLeakControl.java:368)
	at com.carrotsearch.randomizedtesting.ThreadLeakControl.forkTimeoutingTask(ThreadLeakControl.java:817)
	at com.carrotsearch.randomizedtesting.ThreadLeakControl$3.evaluate(ThreadLeakControl.java:468)
	at com.carrotsearch.randomizedtesting.RandomizedRunner.runSingleTest(RandomizedRunner.java:944)
	at com.carrotsearch.randomizedtesting.RandomizedRunner$5.evaluate(RandomizedRunner.java:830)
	at com.carrotsearch.randomizedtesting.RandomizedRunner$6.evaluate(RandomizedRunner.java:880)
	at com.carrotsearch.randomizedtesting.RandomizedRunner$7.evaluate(RandomizedRunner.java:891)
	at com.carrotsearch.randomizedtesting.rules.StatementAdapter.evaluate(StatementAdapter.java:36)
	at com.carrotsearch.randomizedtesting.rules.SystemPropertiesRestoreRule$1.evaluate(SystemPropertiesRestoreRule.java:57)
	at org.apache.lucene.util.AbstractBeforeAfterRule$1.evaluate(AbstractBeforeAfterRule.java:45)
	at com.carrotsearch.randomizedtesting.rules.StatementAdapter.evaluate(StatementAdapter.java:36)
	at org.apache.lucene.util.TestRuleStoreClassName$1.evaluate(TestRuleStoreClassName.java:41)
	at com.carrotsearch.randomizedtesting.rules.NoShadowingOrOverridesOnMethodsRule$1.evaluate(NoShadowingOrOverridesOnMethodsRule.java:40)
	at com.carrotsearch.randomizedtesting.rules.NoShadowingOrOverridesOnMethodsRule$1.evaluate(NoShadowingOrOverridesOnMethodsRule.java:40)
	at com.carrotsearch.randomizedtesting.rules.StatementAdapter.evaluate(StatementAdapter.java:36)
	at com.carrotsearch.randomizedtesting.rules.StatementAdapter.evaluate(StatementAdapter.java:36)
	at org.apache.lucene.util.TestRuleAssertionsRequired$1.evaluate(TestRuleAssertionsRequired.java:53)
	at org.apache.lucene.util.TestRuleMarkFailure$1.evaluate(TestRuleMarkFailure.java:47)
	at org.apache.lucene.util.TestRuleIgnoreAfterMaxFailures$1.evaluate(TestRuleIgnoreAfterMaxFailures.java:64)
	at org.apache.lucene.util.TestRuleIgnoreTestSuites$1.evaluate(TestRuleIgnoreTestSuites.java:54)
	at com.carrotsearch.randomizedtesting.rules.StatementAdapter.evaluate(StatementAdapter.java:36)
	at com.carrotsearch.randomizedtesting.ThreadLeakControl$StatementRunner.run(ThreadLeakControl.java:368)
	at java.base/java.lang.Thread.run(Thread.java:834)


FAILED:  org.apache.solr.cloud.autoscaling.MetricTriggerIntegrationTest.testMetricTrigger

Error Message:
{srt=[CapturedEvent{timestamp=1536903783469000000, stage=AFTER_ACTION, actionName='compute', event={   "id":"8e13df5e3c3d6T51k6das88b4e98e42vqopac07",   "source":"metric_trigger",   "eventTime":2499456048284630,   "eventType":"METRIC",   "properties":{     "node":{"127.0.0.1:40865_solr":14672},     "__start__":1,     "metric":"metrics:solr.core.testMetricTrigger.shard1.replica_n2:INDEX.sizeInBytes",     "collection":"testMetricTrigger",     "shard":"shard1",     "preferredOperation":"addreplica",     "_enqueue_time_":2499461075895741,     "requestedOps":[{         "action":"ADDREPLICA",         "hints":{           "COLL_SHARD":[{               "first":"testMetricTrigger",               "second":"shard1"}],           "SRC_NODE":["127.0.0.1:40865_solr"]}}]}}, context={properties.operations=[{class=org.apache.solr.client.solrj.request.CollectionAdminRequest$AddReplica, method=GET, params.action=ADDREPLICA, params.collection=testMetricTrigger, params.shard=shard1, params.node=127.0.0.1:37381_solr, params.type=NRT}], properties.BEFORE_ACTION=[compute], source=metric_trigger, properties.AFTER_ACTION=[compute]}, config={   "beforeAction":[],   "trigger":"metric_trigger",   "stage":[     "FAILED",     "SUCCEEDED"],   "afterAction":[     "compute",     "execute",     "test"],   "class":"org.apache.solr.cloud.autoscaling.MetricTriggerIntegrationTest$TestTriggerListener"}, message='null'}, CapturedEvent{timestamp=1536903788485000000, stage=AFTER_ACTION, actionName='execute', event={   "id":"8e13df5e3c3d6T51k6das88b4e98e42vqopac07",   "source":"metric_trigger",   "eventTime":2499456048284630,   "eventType":"METRIC",   "properties":{     "node":{"127.0.0.1:40865_solr":14672},     "__start__":1,     "metric":"metrics:solr.core.testMetricTrigger.shard1.replica_n2:INDEX.sizeInBytes",     "collection":"testMetricTrigger",     "shard":"shard1",     "preferredOperation":"addreplica",     "_enqueue_time_":2499461075895741,     "requestedOps":[{         "action":"ADDREPLICA",         "hints":{           "COLL_SHARD":[{               "first":"testMetricTrigger",               "second":"shard1"}],           "SRC_NODE":["127.0.0.1:40865_solr"]}}]}}, context={properties.operations=[{class=org.apache.solr.client.solrj.request.CollectionAdminRequest$AddReplica, method=GET, params.action=ADDREPLICA, params.async=metric_trigger/8e13df5e3c3d6T51k6das88b4e98e42vqopac07/0, params.waitForFinalState=true, params.collection=testMetricTrigger, params.shard=shard1, params.node=127.0.0.1:37381_solr, params.type=NRT}], properties.BEFORE_ACTION=[compute, execute], properties.responses=[{responseHeader={status=0,QTime=2},success={127.0.0.1:37381_solr={responseHeader={status=0,QTime=1}}},metric_trigger/8e13df5e3c3d6T51k6das88b4e98e42vqopac07/02499461209361374={responseHeader={status=0,QTime=0},STATUS=completed,Response=TaskId: metric_trigger/8e13df5e3c3d6T51k6das88b4e98e42vqopac07/02499461209361374 webapp=null path=/admin/cores params={async=metric_trigger/8e13df5e3c3d6T51k6das88b4e98e42vqopac07/02499461209361374&qt=/admin/cores&coreNodeName=core_node12&collection.configName=conf&name=testMetricTrigger_shard1_replica_n11&action=CREATE&collection=testMetricTrigger&shard=shard1&wt=javabin&version=2&replicaType=NRT} status=0 QTime=1},status={state=completed,msg=found [metric_trigger/8e13df5e3c3d6T51k6das88b4e98e42vqopac07/0] in completed tasks}}], source=metric_trigger, properties.AFTER_ACTION=[compute, execute]}, config={   "beforeAction":[],   "trigger":"metric_trigger",   "stage":[     "FAILED",     "SUCCEEDED"],   "afterAction":[     "compute",     "execute",     "test"],   "class":"org.apache.solr.cloud.autoscaling.MetricTriggerIntegrationTest$TestTriggerListener"}, message='null'}, CapturedEvent{timestamp=1536903788485000000, stage=AFTER_ACTION, actionName='test', event={   "id":"8e13df5e3c3d6T51k6das88b4e98e42vqopac07",   "source":"metric_trigger",   "eventTime":2499456048284630,   "eventType":"METRIC",   "properties":{     "node":{"127.0.0.1:40865_solr":14672},     "__start__":1,     "metric":"metrics:solr.core.testMetricTrigger.shard1.replica_n2:INDEX.sizeInBytes",     "collection":"testMetricTrigger",     "shard":"shard1",     "preferredOperation":"addreplica",     "_enqueue_time_":2499461075895741,     "requestedOps":[{         "action":"ADDREPLICA",         "hints":{           "COLL_SHARD":[{               "first":"testMetricTrigger",               "second":"shard1"}],           "SRC_NODE":["127.0.0.1:40865_solr"]}}]}}, context={properties.operations=[{class=org.apache.solr.client.solrj.request.CollectionAdminRequest$AddReplica, method=GET, params.action=ADDREPLICA, params.async=metric_trigger/8e13df5e3c3d6T51k6das88b4e98e42vqopac07/0, params.waitForFinalState=true, params.collection=testMetricTrigger, params.shard=shard1, params.node=127.0.0.1:37381_solr, params.type=NRT}], properties.BEFORE_ACTION=[compute, execute, test], properties.responses=[{responseHeader={status=0,QTime=2},success={127.0.0.1:37381_solr={responseHeader={status=0,QTime=1}}},metric_trigger/8e13df5e3c3d6T51k6das88b4e98e42vqopac07/02499461209361374={responseHeader={status=0,QTime=0},STATUS=completed,Response=TaskId: metric_trigger/8e13df5e3c3d6T51k6das88b4e98e42vqopac07/02499461209361374 webapp=null path=/admin/cores params={async=metric_trigger/8e13df5e3c3d6T51k6das88b4e98e42vqopac07/02499461209361374&qt=/admin/cores&coreNodeName=core_node12&collection.configName=conf&name=testMetricTrigger_shard1_replica_n11&action=CREATE&collection=testMetricTrigger&shard=shard1&wt=javabin&version=2&replicaType=NRT} status=0 QTime=1},status={state=completed,msg=found [metric_trigger/8e13df5e3c3d6T51k6das88b4e98e42vqopac07/0] in completed tasks}}], source=metric_trigger, properties.AFTER_ACTION=[compute, execute, test]}, config={   "beforeAction":[],   "trigger":"metric_trigger",   "stage":[     "FAILED",     "SUCCEEDED"],   "afterAction":[     "compute",     "execute",     "test"],   "class":"org.apache.solr.cloud.autoscaling.MetricTriggerIntegrationTest$TestTriggerListener"}, message='null'}, CapturedEvent{timestamp=1536903788486000000, stage=SUCCEEDED, actionName='null', event={   "id":"8e13df5e3c3d6T51k6das88b4e98e42vqopac07",   "source":"metric_trigger",   "eventTime":2499456048284630,   "eventType":"METRIC",   "properties":{     "node":{"127.0.0.1:40865_solr":14672},     "__start__":1,     "metric":"metrics:solr.core.testMetricTrigger.shard1.replica_n2:INDEX.sizeInBytes",     "collection":"testMetricTrigger",     "shard":"shard1",     "preferredOperation":"addreplica",     "_enqueue_time_":2499461075895741,     "requestedOps":[{         "action":"ADDREPLICA",         "hints":{           "COLL_SHARD":[{               "first":"testMetricTrigger",               "second":"shard1"}],           "SRC_NODE":["127.0.0.1:40865_solr"]}}]}}, context={}, config={   "beforeAction":[],   "trigger":"metric_trigger",   "stage":[     "FAILED",     "SUCCEEDED"],   "afterAction":[     "compute",     "execute",     "test"],   "class":"org.apache.solr.cloud.autoscaling.MetricTriggerIntegrationTest$TestTriggerListener"}, message='null'}, CapturedEvent{timestamp=1536903935263000000, stage=AFTER_ACTION, actionName='compute', event={   "id":"8e1614d0506caT51k6das88b4e98e42vqopac0p",   "source":"metric_trigger",   "eventTime":2499607833937610,   "eventType":"METRIC",   "properties":{     "node":{"127.0.0.1:37039_solr":14641},     "__start__":1,     "metric":"metrics:solr.core.testMetricTrigger.shard1.replica_n1:INDEX.sizeInBytes",     "collection":"testMetricTrigger",     "shard":"shard1",     "preferredOperation":"movereplica",     "_enqueue_time_":2499612859545189,     "requestedOps":[{         "action":"MOVEREPLICA",         "hints":{           "COLL_SHARD":[{               "first":"testMetricTrigger",               "second":"shard1"}],           "SRC_NODE":["127.0.0.1:37039_solr"]}}]}}, context={properties.operations=[{class=org.apache.solr.client.solrj.request.CollectionAdminRequest$MoveReplica, method=GET, params.action=MOVEREPLICA, params.collection=testMetricTrigger, params.targetNode=127.0.0.1:41077_solr, params.inPlaceMove=true, params.replica=core_node3}], properties.BEFORE_ACTION=[compute], source=metric_trigger, properties.AFTER_ACTION=[compute]}, config={   "beforeAction":[],   "trigger":"metric_trigger",   "stage":[     "FAILED",     "SUCCEEDED"],   "afterAction":[     "compute",     "execute",     "test"],   "class":"org.apache.solr.cloud.autoscaling.MetricTriggerIntegrationTest$TestTriggerListener"}, message='null'}, CapturedEvent{timestamp=1536903940275000000, stage=AFTER_ACTION, actionName='execute', event={   "id":"8e1614d0506caT51k6das88b4e98e42vqopac0p",   "source":"metric_trigger",   "eventTime":2499607833937610,   "eventType":"METRIC",   "properties":{     "node":{"127.0.0.1:37039_solr":14641},     "__start__":1,     "metric":"metrics:solr.core.testMetricTrigger.shard1.replica_n1:INDEX.sizeInBytes",     "collection":"testMetricTrigger",     "shard":"shard1",     "preferredOperation":"movereplica",     "_enqueue_time_":2499612859545189,     "requestedOps":[{         "action":"MOVEREPLICA",         "hints":{           "COLL_SHARD":[{               "first":"testMetricTrigger",               "second":"shard1"}],           "SRC_NODE":["127.0.0.1:37039_solr"]}}]}}, context={properties.operations=[{class=org.apache.solr.client.solrj.request.CollectionAdminRequest$MoveReplica, method=GET, params.action=MOVEREPLICA, params.async=metric_trigger/8e1614d0506caT51k6das88b4e98e42vqopac0p/0, params.waitForFinalState=true, params.collection=testMetricTrigger, params.targetNode=127.0.0.1:41077_solr, params.inPlaceMove=true, params.replica=core_node3}], properties.BEFORE_ACTION=[compute, execute], properties.responses=[{responseHeader={status=0,QTime=1},success=MOVEREPLICA action completed successfully, moved replica=testMetricTrigger_shard1_replica_n1 at node=127.0.0.1:37039_solr to replica=testMetricTrigger_shard1_replica_n9 at node=127.0.0.1:41077_solr,status={state=completed,msg=found [metric_trigger/8e1614d0506caT51k6das88b4e98e42vqopac0p/0] in completed tasks}}], source=metric_trigger, properties.AFTER_ACTION=[compute, execute]}, config={   "beforeAction":[],   "trigger":"metric_trigger",   "stage":[     "FAILED",     "SUCCEEDED"],   "afterAction":[     "compute",     "execute",     "test"],   "class":"org.apache.solr.cloud.autoscaling.MetricTriggerIntegrationTest$TestTriggerListener"}, message='null'}, CapturedEvent{timestamp=1536903940275000000, stage=AFTER_ACTION, actionName='test', event={   "id":"8e1614d0506caT51k6das88b4e98e42vqopac0p",   "source":"metric_trigger",   "eventTime":2499607833937610,   "eventType":"METRIC",   "properties":{     "node":{"127.0.0.1:37039_solr":14641},     "__start__":1,     "metric":"metrics:solr.core.testMetricTrigger.shard1.replica_n1:INDEX.sizeInBytes",     "collection":"testMetricTrigger",     "shard":"shard1",     "preferredOperation":"movereplica",     "_enqueue_time_":2499612859545189,     "requestedOps":[{         "action":"MOVEREPLICA",         "hints":{           "COLL_SHARD":[{               "first":"testMetricTrigger",               "second":"shard1"}],           "SRC_NODE":["127.0.0.1:37039_solr"]}}]}}, context={properties.operations=[{class=org.apache.solr.client.solrj.request.CollectionAdminRequest$MoveReplica, method=GET, params.action=MOVEREPLICA, params.async=metric_trigger/8e1614d0506caT51k6das88b4e98e42vqopac0p/0, params.waitForFinalState=true, params.collection=testMetricTrigger, params.targetNode=127.0.0.1:41077_solr, params.inPlaceMove=true, params.replica=core_node3}], properties.BEFORE_ACTION=[compute, execute, test], properties.responses=[{responseHeader={status=0,QTime=1},success=MOVEREPLICA action completed successfully, moved replica=testMetricTrigger_shard1_replica_n1 at node=127.0.0.1:37039_solr to replica=testMetricTrigger_shard1_replica_n9 at node=127.0.0.1:41077_solr,status={state=completed,msg=found [metric_trigger/8e1614d0506caT51k6das88b4e98e42vqopac0p/0] in completed tasks}}], source=metric_trigger, properties.AFTER_ACTION=[compute, execute, test]}, config={   "beforeAction":[],   "trigger":"metric_trigger",   "stage":[     "FAILED",     "SUCCEEDED"],   "afterAction":[     "compute",     "execute",     "test"],   "class":"org.apache.solr.cloud.autoscaling.MetricTriggerIntegrationTest$TestTriggerListener"}, message='null'}, CapturedEvent{timestamp=1536903940276000000, stage=SUCCEEDED, actionName='null', event={   "id":"8e1614d0506caT51k6das88b4e98e42vqopac0p",   "source":"metric_trigger",   "eventTime":2499607833937610,   "eventType":"METRIC",   "properties":{     "node":{"127.0.0.1:37039_solr":14641},     "__start__":1,     "metric":"metrics:solr.core.testMetricTrigger.shard1.replica_n1:INDEX.sizeInBytes",     "collection":"testMetricTrigger",     "shard":"shard1",     "preferredOperation":"movereplica",     "_enqueue_time_":2499612859545189,     "requestedOps":[{         "action":"MOVEREPLICA",         "hints":{           "COLL_SHARD":[{               "first":"testMetricTrigger",               "second":"shard1"}],           "SRC_NODE":["127.0.0.1:37039_solr"]}}]}}, context={}, config={   "beforeAction":[],   "trigger":"metric_trigger",   "stage":[     "FAILED",     "SUCCEEDED"],   "afterAction":[     "compute",     "execute",     "test"],   "class":"org.apache.solr.cloud.autoscaling.MetricTriggerIntegrationTest$TestTriggerListener"}, message='null'}]} expected:<4> but was:<8>

Stack Trace:
java.lang.AssertionError: {srt=[CapturedEvent{timestamp=1536903783469000000, stage=AFTER_ACTION, actionName='compute', event={
  "id":"8e13df5e3c3d6T51k6das88b4e98e42vqopac07",
  "source":"metric_trigger",
  "eventTime":2499456048284630,
  "eventType":"METRIC",
  "properties":{
    "node":{"127.0.0.1:40865_solr":14672},
    "__start__":1,
    "metric":"metrics:solr.core.testMetricTrigger.shard1.replica_n2:INDEX.sizeInBytes",
    "collection":"testMetricTrigger",
    "shard":"shard1",
    "preferredOperation":"addreplica",
    "_enqueue_time_":2499461075895741,
    "requestedOps":[{
        "action":"ADDREPLICA",
        "hints":{
          "COLL_SHARD":[{
              "first":"testMetricTrigger",
              "second":"shard1"}],
          "SRC_NODE":["127.0.0.1:40865_solr"]}}]}}, context={properties.operations=[{class=org.apache.solr.client.solrj.request.CollectionAdminRequest$AddReplica, method=GET, params.action=ADDREPLICA, params.collection=testMetricTrigger, params.shard=shard1, params.node=127.0.0.1:37381_solr, params.type=NRT}], properties.BEFORE_ACTION=[compute], source=metric_trigger, properties.AFTER_ACTION=[compute]}, config={
  "beforeAction":[],
  "trigger":"metric_trigger",
  "stage":[
    "FAILED",
    "SUCCEEDED"],
  "afterAction":[
    "compute",
    "execute",
    "test"],
  "class":"org.apache.solr.cloud.autoscaling.MetricTriggerIntegrationTest$TestTriggerListener"}, message='null'}, CapturedEvent{timestamp=1536903788485000000, stage=AFTER_ACTION, actionName='execute', event={
  "id":"8e13df5e3c3d6T51k6das88b4e98e42vqopac07",
  "source":"metric_trigger",
  "eventTime":2499456048284630,
  "eventType":"METRIC",
  "properties":{
    "node":{"127.0.0.1:40865_solr":14672},
    "__start__":1,
    "metric":"metrics:solr.core.testMetricTrigger.shard1.replica_n2:INDEX.sizeInBytes",
    "collection":"testMetricTrigger",
    "shard":"shard1",
    "preferredOperation":"addreplica",
    "_enqueue_time_":2499461075895741,
    "requestedOps":[{
        "action":"ADDREPLICA",
        "hints":{
          "COLL_SHARD":[{
              "first":"testMetricTrigger",
              "second":"shard1"}],
          "SRC_NODE":["127.0.0.1:40865_solr"]}}]}}, context={properties.operations=[{class=org.apache.solr.client.solrj.request.CollectionAdminRequest$AddReplica, method=GET, params.action=ADDREPLICA, params.async=metric_trigger/8e13df5e3c3d6T51k6das88b4e98e42vqopac07/0, params.waitForFinalState=true, params.collection=testMetricTrigger, params.shard=shard1, params.node=127.0.0.1:37381_solr, params.type=NRT}], properties.BEFORE_ACTION=[compute, execute], properties.responses=[{responseHeader={status=0,QTime=2},success={127.0.0.1:37381_solr={responseHeader={status=0,QTime=1}}},metric_trigger/8e13df5e3c3d6T51k6das88b4e98e42vqopac07/02499461209361374={responseHeader={status=0,QTime=0},STATUS=completed,Response=TaskId: metric_trigger/8e13df5e3c3d6T51k6das88b4e98e42vqopac07/02499461209361374 webapp=null path=/admin/cores params={async=metric_trigger/8e13df5e3c3d6T51k6das88b4e98e42vqopac07/02499461209361374&qt=/admin/cores&coreNodeName=core_node12&collection.configName=conf&name=testMetricTrigger_shard1_replica_n11&action=CREATE&collection=testMetricTrigger&shard=shard1&wt=javabin&version=2&replicaType=NRT} status=0 QTime=1},status={state=completed,msg=found [metric_trigger/8e13df5e3c3d6T51k6das88b4e98e42vqopac07/0] in completed tasks}}], source=metric_trigger, properties.AFTER_ACTION=[compute, execute]}, config={
  "beforeAction":[],
  "trigger":"metric_trigger",
  "stage":[
    "FAILED",
    "SUCCEEDED"],
  "afterAction":[
    "compute",
    "execute",
    "test"],
  "class":"org.apache.solr.cloud.autoscaling.MetricTriggerIntegrationTest$TestTriggerListener"}, message='null'}, CapturedEvent{timestamp=1536903788485000000, stage=AFTER_ACTION, actionName='test', event={
  "id":"8e13df5e3c3d6T51k6das88b4e98e42vqopac07",
  "source":"metric_trigger",
  "eventTime":2499456048284630,
  "eventType":"METRIC",
  "properties":{
    "node":{"127.0.0.1:40865_solr":14672},
    "__start__":1,
    "metric":"metrics:solr.core.testMetricTrigger.shard1.replica_n2:INDEX.sizeInBytes",
    "collection":"testMetricTrigger",
    "shard":"shard1",
    "preferredOperation":"addreplica",
    "_enqueue_time_":2499461075895741,
    "requestedOps":[{
        "action":"ADDREPLICA",
        "hints":{
          "COLL_SHARD":[{
              "first":"testMetricTrigger",
              "second":"shard1"}],
          "SRC_NODE":["127.0.0.1:40865_solr"]}}]}}, context={properties.operations=[{class=org.apache.solr.client.solrj.request.CollectionAdminRequest$AddReplica, method=GET, params.action=ADDREPLICA, params.async=metric_trigger/8e13df5e3c3d6T51k6das88b4e98e42vqopac07/0, params.waitForFinalState=true, params.collection=testMetricTrigger, params.shard=shard1, params.node=127.0.0.1:37381_solr, params.type=NRT}], properties.BEFORE_ACTION=[compute, execute, test], properties.responses=[{responseHeader={status=0,QTime=2},success={127.0.0.1:37381_solr={responseHeader={status=0,QTime=1}}},metric_trigger/8e13df5e3c3d6T51k6das88b4e98e42vqopac07/02499461209361374={responseHeader={status=0,QTime=0},STATUS=completed,Response=TaskId: metric_trigger/8e13df5e3c3d6T51k6das88b4e98e42vqopac07/02499461209361374 webapp=null path=/admin/cores params={async=metric_trigger/8e13df5e3c3d6T51k6das88b4e98e42vqopac07/02499461209361374&qt=/admin/cores&coreNodeName=core_node12&collection.configName=conf&name=testMetricTrigger_shard1_replica_n11&action=CREATE&collection=testMetricTrigger&shard=shard1&wt=javabin&version=2&replicaType=NRT} status=0 QTime=1},status={state=completed,msg=found [metric_trigger/8e13df5e3c3d6T51k6das88b4e98e42vqopac07/0] in completed tasks}}], source=metric_trigger, properties.AFTER_ACTION=[compute, execute, test]}, config={
  "beforeAction":[],
  "trigger":"metric_trigger",
  "stage":[
    "FAILED",
    "SUCCEEDED"],
  "afterAction":[
    "compute",
    "execute",
    "test"],
  "class":"org.apache.solr.cloud.autoscaling.MetricTriggerIntegrationTest$TestTriggerListener"}, message='null'}, CapturedEvent{timestamp=1536903788486000000, stage=SUCCEEDED, actionName='null', event={
  "id":"8e13df5e3c3d6T51k6das88b4e98e42vqopac07",
  "source":"metric_trigger",
  "eventTime":2499456048284630,
  "eventType":"METRIC",
  "properties":{
    "node":{"127.0.0.1:40865_solr":14672},
    "__start__":1,
    "metric":"metrics:solr.core.testMetricTrigger.shard1.replica_n2:INDEX.sizeInBytes",
    "collection":"testMetricTrigger",
    "shard":"shard1",
    "preferredOperation":"addreplica",
    "_enqueue_time_":2499461075895741,
    "requestedOps":[{
        "action":"ADDREPLICA",
        "hints":{
          "COLL_SHARD":[{
              "first":"testMetricTrigger",
              "second":"shard1"}],
          "SRC_NODE":["127.0.0.1:40865_solr"]}}]}}, context={}, config={
  "beforeAction":[],
  "trigger":"metric_trigger",
  "stage":[
    "FAILED",
    "SUCCEEDED"],
  "afterAction":[
    "compute",
    "execute",
    "test"],
  "class":"org.apache.solr.cloud.autoscaling.MetricTriggerIntegrationTest$TestTriggerListener"}, message='null'}, CapturedEvent{timestamp=1536903935263000000, stage=AFTER_ACTION, actionName='compute', event={
  "id":"8e1614d0506caT51k6das88b4e98e42vqopac0p",
  "source":"metric_trigger",
  "eventTime":2499607833937610,
  "eventType":"METRIC",
  "properties":{
    "node":{"127.0.0.1:37039_solr":14641},
    "__start__":1,
    "metric":"metrics:solr.core.testMetricTrigger.shard1.replica_n1:INDEX.sizeInBytes",
    "collection":"testMetricTrigger",
    "shard":"shard1",
    "preferredOperation":"movereplica",
    "_enqueue_time_":2499612859545189,
    "requestedOps":[{
        "action":"MOVEREPLICA",
        "hints":{
          "COLL_SHARD":[{
              "first":"testMetricTrigger",
              "second":"shard1"}],
          "SRC_NODE":["127.0.0.1:37039_solr"]}}]}}, context={properties.operations=[{class=org.apache.solr.client.solrj.request.CollectionAdminRequest$MoveReplica, method=GET, params.action=MOVEREPLICA, params.collection=testMetricTrigger, params.targetNode=127.0.0.1:41077_solr, params.inPlaceMove=true, params.replica=core_node3}], properties.BEFORE_ACTION=[compute], source=metric_trigger, properties.AFTER_ACTION=[compute]}, config={
  "beforeAction":[],
  "trigger":"metric_trigger",
  "stage":[
    "FAILED",
    "SUCCEEDED"],
  "afterAction":[
    "compute",
    "execute",
    "test"],
  "class":"org.apache.solr.cloud.autoscaling.MetricTriggerIntegrationTest$TestTriggerListener"}, message='null'}, CapturedEvent{timestamp=1536903940275000000, stage=AFTER_ACTION, actionName='execute', event={
  "id":"8e1614d0506caT51k6das88b4e98e42vqopac0p",
  "source":"metric_trigger",
  "eventTime":2499607833937610,
  "eventType":"METRIC",
  "properties":{
    "node":{"127.0.0.1:37039_solr":14641},
    "__start__":1,
    "metric":"metrics:solr.core.testMetricTrigger.shard1.replica_n1:INDEX.sizeInBytes",
    "collection":"testMetricTrigger",
    "shard":"shard1",
    "preferredOperation":"movereplica",
    "_enqueue_time_":2499612859545189,
    "requestedOps":[{
        "action":"MOVEREPLICA",
        "hints":{
          "COLL_SHARD":[{
              "first":"testMetricTrigger",
              "second":"shard1"}],
          "SRC_NODE":["127.0.0.1:37039_solr"]}}]}}, context={properties.operations=[{class=org.apache.solr.client.solrj.request.CollectionAdminRequest$MoveReplica, method=GET, params.action=MOVEREPLICA, params.async=metric_trigger/8e1614d0506caT51k6das88b4e98e42vqopac0p/0, params.waitForFinalState=true, params.collection=testMetricTrigger, params.targetNode=127.0.0.1:41077_solr, params.inPlaceMove=true, params.replica=core_node3}], properties.BEFORE_ACTION=[compute, execute], properties.responses=[{responseHeader={status=0,QTime=1},success=MOVEREPLICA action completed successfully, moved replica=testMetricTrigger_shard1_replica_n1 at node=127.0.0.1:37039_solr to replica=testMetricTrigger_shard1_replica_n9 at node=127.0.0.1:41077_solr,status={state=completed,msg=found [metric_trigger/8e1614d0506caT51k6das88b4e98e42vqopac0p/0] in completed tasks}}], source=metric_trigger, properties.AFTER_ACTION=[compute, execute]}, config={
  "beforeAction":[],
  "trigger":"metric_trigger",
  "stage":[
    "FAILED",
    "SUCCEEDED"],
  "afterAction":[
    "compute",
    "execute",
    "test"],
  "class":"org.apache.solr.cloud.autoscaling.MetricTriggerIntegrationTest$TestTriggerListener"}, message='null'}, CapturedEvent{timestamp=1536903940275000000, stage=AFTER_ACTION, actionName='test', event={
  "id":"8e1614d0506caT51k6das88b4e98e42vqopac0p",
  "source":"metric_trigger",
  "eventTime":2499607833937610,
  "eventType":"METRIC",
  "properties":{
    "node":{"127.0.0.1:37039_solr":14641},
    "__start__":1,
    "metric":"metrics:solr.core.testMetricTrigger.shard1.replica_n1:INDEX.sizeInBytes",
    "collection":"testMetricTrigger",
    "shard":"shard1",
    "preferredOperation":"movereplica",
    "_enqueue_time_":2499612859545189,
    "requestedOps":[{
        "action":"MOVEREPLICA",
        "hints":{
          "COLL_SHARD":[{
              "first":"testMetricTrigger",
              "second":"shard1"}],
          "SRC_NODE":["127.0.0.1:37039_solr"]}}]}}, context={properties.operations=[{class=org.apache.solr.client.solrj.request.CollectionAdminRequest$MoveReplica, method=GET, params.action=MOVEREPLICA, params.async=metric_trigger/8e1614d0506caT51k6das88b4e98e42vqopac0p/0, params.waitForFinalState=true, params.collection=testMetricTrigger, params.targetNode=127.0.0.1:41077_solr, params.inPlaceMove=true, params.replica=core_node3}], properties.BEFORE_ACTION=[compute, execute, test], properties.responses=[{responseHeader={status=0,QTime=1},success=MOVEREPLICA action completed successfully, moved replica=testMetricTrigger_shard1_replica_n1 at node=127.0.0.1:37039_solr to replica=testMetricTrigger_shard1_replica_n9 at node=127.0.0.1:41077_solr,status={state=completed,msg=found [metric_trigger/8e1614d0506caT51k6das88b4e98e42vqopac0p/0] in completed tasks}}], source=metric_trigger, properties.AFTER_ACTION=[compute, execute, test]}, config={
  "beforeAction":[],
  "trigger":"metric_trigger",
  "stage":[
    "FAILED",
    "SUCCEEDED"],
  "afterAction":[
    "compute",
    "execute",
    "test"],
  "class":"org.apache.solr.cloud.autoscaling.MetricTriggerIntegrationTest$TestTriggerListener"}, message='null'}, CapturedEvent{timestamp=1536903940276000000, stage=SUCCEEDED, actionName='null', event={
  "id":"8e1614d0506caT51k6das88b4e98e42vqopac0p",
  "source":"metric_trigger",
  "eventTime":2499607833937610,
  "eventType":"METRIC",
  "properties":{
    "node":{"127.0.0.1:37039_solr":14641},
    "__start__":1,
    "metric":"metrics:solr.core.testMetricTrigger.shard1.replica_n1:INDEX.sizeInBytes",
    "collection":"testMetricTrigger",
    "shard":"shard1",
    "preferredOperation":"movereplica",
    "_enqueue_time_":2499612859545189,
    "requestedOps":[{
        "action":"MOVEREPLICA",
        "hints":{
          "COLL_SHARD":[{
              "first":"testMetricTrigger",
              "second":"shard1"}],
          "SRC_NODE":["127.0.0.1:37039_solr"]}}]}}, context={}, config={
  "beforeAction":[],
  "trigger":"metric_trigger",
  "stage":[
    "FAILED",
    "SUCCEEDED"],
  "afterAction":[
    "compute",
    "execute",
    "test"],
  "class":"org.apache.solr.cloud.autoscaling.MetricTriggerIntegrationTest$TestTriggerListener"}, message='null'}]} expected:<4> but was:<8>
	at __randomizedtesting.SeedInfo.seed([46B26282BF0A1176:FCBE550DE0E2C739]:0)
	at org.junit.Assert.fail(Assert.java:93)
	at org.junit.Assert.failNotEquals(Assert.java:647)
	at org.junit.Assert.assertEquals(Assert.java:128)
	at org.junit.Assert.assertEquals(Assert.java:472)
	at org.apache.solr.cloud.autoscaling.MetricTriggerIntegrationTest.testMetricTrigger(MetricTriggerIntegrationTest.java:157)
	at java.base/jdk.internal.reflect.NativeMethodAccessorImpl.invoke0(Native Method)
	at java.base/jdk.internal.reflect.NativeMethodAccessorImpl.invoke(NativeMethodAccessorImpl.java:62)
	at java.base/jdk.internal.reflect.DelegatingMethodAccessorImpl.invoke(DelegatingMethodAccessorImpl.java:43)
	at java.base/java.lang.reflect.Method.invoke(Method.java:566)
	at com.carrotsearch.randomizedtesting.RandomizedRunner.invoke(RandomizedRunner.java:1742)
	at com.carrotsearch.randomizedtesting.RandomizedRunner$8.evaluate(RandomizedRunner.java:935)
	at com.carrotsearch.randomizedtesting.RandomizedRunner$9.evaluate(RandomizedRunner.java:971)
	at com.carrotsearch.randomizedtesting.RandomizedRunner$10.evaluate(RandomizedRunner.java:985)
	at com.carrotsearch.randomizedtesting.rules.SystemPropertiesRestoreRule$1.evaluate(SystemPropertiesRestoreRule.java:57)
	at org.apache.lucene.util.TestRuleSetupTeardownChained$1.evaluate(TestRuleSetupTeardownChained.java:49)
	at org.apache.lucene.util.AbstractBeforeAfterRule$1.evaluate(AbstractBeforeAfterRule.java:45)
	at org.apache.lucene.util.TestRuleThreadAndTestName$1.evaluate(TestRuleThreadAndTestName.java:48)
	at org.apache.lucene.util.TestRuleIgnoreAfterMaxFailures$1.evaluate(TestRuleIgnoreAfterMaxFailures.java:64)
	at org.apache.lucene.util.TestRuleMarkFailure$1.evaluate(TestRuleMarkFailure.java:47)
	at com.carrotsearch.randomizedtesting.rules.StatementAdapter.evaluate(StatementAdapter.java:36)
	at com.carrotsearch.randomizedtesting.ThreadLeakControl$StatementRunner.run(ThreadLeakControl.java:368)
	at com.carrotsearch.randomizedtesting.ThreadLeakControl.forkTimeoutingTask(ThreadLeakControl.java:817)
	at com.carrotsearch.randomizedtesting.ThreadLeakControl$3.evaluate(ThreadLeakControl.java:468)
	at com.carrotsearch.randomizedtesting.RandomizedRunner.runSingleTest(RandomizedRunner.java:944)
	at com.carrotsearch.randomizedtesting.RandomizedRunner$5.evaluate(RandomizedRunner.java:830)
	at com.carrotsearch.randomizedtesting.RandomizedRunner$6.evaluate(RandomizedRunner.java:880)
	at com.carrotsearch.randomizedtesting.RandomizedRunner$7.evaluate(RandomizedRunner.java:891)
	at com.carrotsearch.randomizedtesting.rules.StatementAdapter.evaluate(StatementAdapter.java:36)
	at com.carrotsearch.randomizedtesting.rules.SystemPropertiesRestoreRule$1.evaluate(SystemPropertiesRestoreRule.java:57)
	at org.apache.lucene.util.AbstractBeforeAfterRule$1.evaluate(AbstractBeforeAfterRule.java:45)
	at com.carrotsearch.randomizedtesting.rules.StatementAdapter.evaluate(StatementAdapter.java:36)
	at org.apache.lucene.util.TestRuleStoreClassName$1.evaluate(TestRuleStoreClassName.java:41)
	at com.carrotsearch.randomizedtesting.rules.NoShadowingOrOverridesOnMethodsRule$1.evaluate(NoShadowingOrOverridesOnMethodsRule.java:40)
	at com.carrotsearch.randomizedtesting.rules.NoShadowingOrOverridesOnMethodsRule$1.evaluate(NoShadowingOrOverridesOnMethodsRule.java:40)
	at com.carrotsearch.randomizedtesting.rules.StatementAdapter.evaluate(StatementAdapter.java:36)
	at com.carrotsearch.randomizedtesting.rules.StatementAdapter.evaluate(StatementAdapter.java:36)
	at org.apache.lucene.util.TestRuleAssertionsRequired$1.evaluate(TestRuleAssertionsRequired.java:53)
	at org.apache.lucene.util.TestRuleMarkFailure$1.evaluate(TestRuleMarkFailure.java:47)
	at org.apache.lucene.util.TestRuleIgnoreAfterMaxFailures$1.evaluate(TestRuleIgnoreAfterMaxFailures.java:64)
	at org.apache.lucene.util.TestRuleIgnoreTestSuites$1.evaluate(TestRuleIgnoreTestSuites.java:54)
	at com.carrotsearch.randomizedtesting.rules.StatementAdapter.evaluate(StatementAdapter.java:36)
	at com.carrotsearch.randomizedtesting.ThreadLeakControl$StatementRunner.run(ThreadLeakControl.java:368)
	at java.base/java.lang.Thread.run(Thread.java:834)


FAILED:  org.apache.solr.cloud.autoscaling.MetricTriggerIntegrationTest.testMetricTrigger

Error Message:
Timed out waiting for collection:testMetricTrigger to become active null Live Nodes: [127.0.0.1:42993_solr, 127.0.0.1:45701_solr] Last available state: null

Stack Trace:
java.lang.AssertionError: Timed out waiting for collection:testMetricTrigger to become active
null
Live Nodes: [127.0.0.1:42993_solr, 127.0.0.1:45701_solr]
Last available state: null
	at __randomizedtesting.SeedInfo.seed([46B26282BF0A1176:FCBE550DE0E2C739]:0)
	at org.junit.Assert.fail(Assert.java:93)
	at org.apache.solr.cloud.SolrCloudTestCase.waitForState(SolrCloudTestCase.java:280)
	at org.apache.solr.cloud.autoscaling.MetricTriggerIntegrationTest.testMetricTrigger(MetricTriggerIntegrationTest.java:95)
	at java.base/jdk.internal.reflect.NativeMethodAccessorImpl.invoke0(Native Method)
	at java.base/jdk.internal.reflect.NativeMethodAccessorImpl.invoke(NativeMethodAccessorImpl.java:62)
	at java.base/jdk.internal.reflect.DelegatingMethodAccessorImpl.invoke(DelegatingMethodAccessorImpl.java:43)
	at java.base/java.lang.reflect.Method.invoke(Method.java:566)
	at com.carrotsearch.randomizedtesting.RandomizedRunner.invoke(RandomizedRunner.java:1742)
	at com.carrotsearch.randomizedtesting.RandomizedRunner$8.evaluate(RandomizedRunner.java:935)
	at com.carrotsearch.randomizedtesting.RandomizedRunner$9.evaluate(RandomizedRunner.java:971)
	at com.carrotsearch.randomizedtesting.RandomizedRunner$10.evaluate(RandomizedRunner.java:985)
	at com.carrotsearch.randomizedtesting.rules.SystemPropertiesRestoreRule$1.evaluate(SystemPropertiesRestoreRule.java:57)
	at org.apache.lucene.util.TestRuleSetupTeardownChained$1.evaluate(TestRuleSetupTeardownChained.java:49)
	at org.apache.lucene.util.AbstractBeforeAfterRule$1.evaluate(AbstractBeforeAfterRule.java:45)
	at org.apache.lucene.util.TestRuleThreadAndTestName$1.evaluate(TestRuleThreadAndTestName.java:48)
	at org.apache.lucene.util.TestRuleIgnoreAfterMaxFailures$1.evaluate(TestRuleIgnoreAfterMaxFailures.java:64)
	at org.apache.lucene.util.TestRuleMarkFailure$1.evaluate(TestRuleMarkFailure.java:47)
	at com.carrotsearch.randomizedtesting.rules.StatementAdapter.evaluate(StatementAdapter.java:36)
	at com.carrotsearch.randomizedtesting.ThreadLeakControl$StatementRunner.run(ThreadLeakControl.java:368)
	at com.carrotsearch.randomizedtesting.ThreadLeakControl.forkTimeoutingTask(ThreadLeakControl.java:817)
	at com.carrotsearch.randomizedtesting.ThreadLeakControl$3.evaluate(ThreadLeakControl.java:468)
	at com.carrotsearch.randomizedtesting.RandomizedRunner.runSingleTest(RandomizedRunner.java:944)
	at com.carrotsearch.randomizedtesting.RandomizedRunner$5.evaluate(RandomizedRunner.java:830)
	at com.carrotsearch.randomizedtesting.RandomizedRunner$6.evaluate(RandomizedRunner.java:880)
	at com.carrotsearch.randomizedtesting.RandomizedRunner$7.evaluate(RandomizedRunner.java:891)
	at com.carrotsearch.randomizedtesting.rules.StatementAdapter.evaluate(StatementAdapter.java:36)
	at com.carrotsearch.randomizedtesting.rules.SystemPropertiesRestoreRule$1.evaluate(SystemPropertiesRestoreRule.java:57)
	at org.apache.lucene.util.AbstractBeforeAfterRule$1.evaluate(AbstractBeforeAfterRule.java:45)
	at com.carrotsearch.randomizedtesting.rules.StatementAdapter.evaluate(StatementAdapter.java:36)
	at org.apache.lucene.util.TestRuleStoreClassName$1.evaluate(TestRuleStoreClassName.java:41)
	at com.carrotsearch.randomizedtesting.rules.NoShadowingOrOverridesOnMethodsRule$1.evaluate(NoShadowingOrOverridesOnMethodsRule.java:40)
	at com.carrotsearch.randomizedtesting.rules.NoShadowingOrOverridesOnMethodsRule$1.evaluate(NoShadowingOrOverridesOnMethodsRule.java:40)
	at com.carrotsearch.randomizedtesting.rules.StatementAdapter.evaluate(StatementAdapter.java:36)
	at com.carrotsearch.randomizedtesting.rules.StatementAdapter.evaluate(StatementAdapter.java:36)
	at org.apache.lucene.util.TestRuleAssertionsRequired$1.evaluate(TestRuleAssertionsRequired.java:53)
	at org.apache.lucene.util.TestRuleMarkFailure$1.evaluate(TestRuleMarkFailure.java:47)
	at org.apache.lucene.util.TestRuleIgnoreAfterMaxFailures$1.evaluate(TestRuleIgnoreAfterMaxFailures.java:64)
	at org.apache.lucene.util.TestRuleIgnoreTestSuites$1.evaluate(TestRuleIgnoreTestSuites.java:54)
	at com.carrotsearch.randomizedtesting.rules.StatementAdapter.evaluate(StatementAdapter.java:36)
	at com.carrotsearch.randomizedtesting.ThreadLeakControl$StatementRunner.run(ThreadLeakControl.java:368)
	at java.base/java.lang.Thread.run(Thread.java:834)


FAILED:  org.apache.solr.cloud.autoscaling.MetricTriggerIntegrationTest.testMetricTrigger

Error Message:
Timed out waiting for collection:testMetricTrigger to become active null Live Nodes: [127.0.0.1:35133_solr, 127.0.0.1:44959_solr] Last available state: null

Stack Trace:
java.lang.AssertionError: Timed out waiting for collection:testMetricTrigger to become active
null
Live Nodes: [127.0.0.1:35133_solr, 127.0.0.1:44959_solr]
Last available state: null
	at __randomizedtesting.SeedInfo.seed([46B26282BF0A1176:FCBE550DE0E2C739]:0)
	at org.junit.Assert.fail(Assert.java:93)
	at org.apache.solr.cloud.SolrCloudTestCase.waitForState(SolrCloudTestCase.java:280)
	at org.apache.solr.cloud.autoscaling.MetricTriggerIntegrationTest.testMetricTrigger(MetricTriggerIntegrationTest.java:95)
	at java.base/jdk.internal.reflect.NativeMethodAccessorImpl.invoke0(Native Method)
	at java.base/jdk.internal.reflect.NativeMethodAccessorImpl.invoke(NativeMethodAccessorImpl.java:62)
	at java.base/jdk.internal.reflect.DelegatingMethodAccessorImpl.invoke(DelegatingMethodAccessorImpl.java:43)
	at java.base/java.lang.reflect.Method.invoke(Method.java:566)
	at com.carrotsearch.randomizedtesting.RandomizedRunner.invoke(RandomizedRunner.java:1742)
	at com.carrotsearch.randomizedtesting.RandomizedRunner$8.evaluate(RandomizedRunner.java:935)
	at com.carrotsearch.randomizedtesting.RandomizedRunner$9.evaluate(RandomizedRunner.java:971)
	at com.carrotsearch.randomizedtesting.RandomizedRunner$10.evaluate(RandomizedRunner.java:985)
	at com.carrotsearch.randomizedtesting.rules.SystemPropertiesRestoreRule$1.evaluate(SystemPropertiesRestoreRule.java:57)
	at org.apache.lucene.util.TestRuleSetupTeardownChained$1.evaluate(TestRuleSetupTeardownChained.java:49)
	at org.apache.lucene.util.AbstractBeforeAfterRule$1.evaluate(AbstractBeforeAfterRule.java:45)
	at org.apache.lucene.util.TestRuleThreadAndTestName$1.evaluate(TestRuleThreadAndTestName.java:48)
	at org.apache.lucene.util.TestRuleIgnoreAfterMaxFailures$1.evaluate(TestRuleIgnoreAfterMaxFailures.java:64)
	at org.apache.lucene.util.TestRuleMarkFailure$1.evaluate(TestRuleMarkFailure.java:47)
	at com.carrotsearch.randomizedtesting.rules.StatementAdapter.evaluate(StatementAdapter.java:36)
	at com.carrotsearch.randomizedtesting.ThreadLeakControl$StatementRunner.run(ThreadLeakControl.java:368)
	at com.carrotsearch.randomizedtesting.ThreadLeakControl.forkTimeoutingTask(ThreadLeakControl.java:817)
	at com.carrotsearch.randomizedtesting.ThreadLeakControl$3.evaluate(ThreadLeakControl.java:468)
	at com.carrotsearch.randomizedtesting.RandomizedRunner.runSingleTest(RandomizedRunner.java:944)
	at com.carrotsearch.randomizedtesting.RandomizedRunner$5.evaluate(RandomizedRunner.java:830)
	at com.carrotsearch.randomizedtesting.RandomizedRunner$6.evaluate(RandomizedRunner.java:880)
	at com.carrotsearch.randomizedtesting.RandomizedRunner$7.evaluate(RandomizedRunner.java:891)
	at com.carrotsearch.randomizedtesting.rules.StatementAdapter.evaluate(StatementAdapter.java:36)
	at com.carrotsearch.randomizedtesting.rules.SystemPropertiesRestoreRule$1.evaluate(SystemPropertiesRestoreRule.java:57)
	at org.apache.lucene.util.AbstractBeforeAfterRule$1.evaluate(AbstractBeforeAfterRule.java:45)
	at com.carrotsearch.randomizedtesting.rules.StatementAdapter.evaluate(StatementAdapter.java:36)
	at org.apache.lucene.util.TestRuleStoreClassName$1.evaluate(TestRuleStoreClassName.java:41)
	at com.carrotsearch.randomizedtesting.rules.NoShadowingOrOverridesOnMethodsRule$1.evaluate(NoShadowingOrOverridesOnMethodsRule.java:40)
	at com.carrotsearch.randomizedtesting.rules.NoShadowingOrOverridesOnMethodsRule$1.evaluate(NoShadowingOrOverridesOnMethodsRule.java:40)
	at com.carrotsearch.randomizedtesting.rules.StatementAdapter.evaluate(StatementAdapter.java:36)
	at com.carrotsearch.randomizedtesting.rules.StatementAdapter.evaluate(StatementAdapter.java:36)
	at org.apache.lucene.util.TestRuleAssertionsRequired$1.evaluate(TestRuleAssertionsRequired.java:53)
	at org.apache.lucene.util.TestRuleMarkFailure$1.evaluate(TestRuleMarkFailure.java:47)
	at org.apache.lucene.util.TestRuleIgnoreAfterMaxFailures$1.evaluate(TestRuleIgnoreAfterMaxFailures.java:64)
	at org.apache.lucene.util.TestRuleIgnoreTestSuites$1.evaluate(TestRuleIgnoreTestSuites.java:54)
	at com.carrotsearch.randomizedtesting.rules.StatementAdapter.evaluate(StatementAdapter.java:36)
	at com.carrotsearch.randomizedtesting.ThreadLeakControl$StatementRunner.run(ThreadLeakControl.java:368)
	at java.base/java.lang.Thread.run(Thread.java:834)


FAILED:  org.apache.solr.cloud.autoscaling.MetricTriggerIntegrationTest.testMetricTrigger

Error Message:
Timed out waiting for collection:testMetricTrigger to become active null Live Nodes: [127.0.0.1:33725_solr, 127.0.0.1:34261_solr] Last available state: null

Stack Trace:
java.lang.AssertionError: Timed out waiting for collection:testMetricTrigger to become active
null
Live Nodes: [127.0.0.1:33725_solr, 127.0.0.1:34261_solr]
Last available state: null
	at __randomizedtesting.SeedInfo.seed([46B26282BF0A1176:FCBE550DE0E2C739]:0)
	at org.junit.Assert.fail(Assert.java:93)
	at org.apache.solr.cloud.SolrCloudTestCase.waitForState(SolrCloudTestCase.java:280)
	at org.apache.solr.cloud.autoscaling.MetricTriggerIntegrationTest.testMetricTrigger(MetricTriggerIntegrationTest.java:95)
	at java.base/jdk.internal.reflect.NativeMethodAccessorImpl.invoke0(Native Method)
	at java.base/jdk.internal.reflect.NativeMethodAccessorImpl.invoke(NativeMethodAccessorImpl.java:62)
	at java.base/jdk.internal.reflect.DelegatingMethodAccessorImpl.invoke(DelegatingMethodAccessorImpl.java:43)
	at java.base/java.lang.reflect.Method.invoke(Method.java:566)
	at com.carrotsearch.randomizedtesting.RandomizedRunner.invoke(RandomizedRunner.java:1742)
	at com.carrotsearch.randomizedtesting.RandomizedRunner$8.evaluate(RandomizedRunner.java:935)
	at com.carrotsearch.randomizedtesting.RandomizedRunner$9.evaluate(RandomizedRunner.java:971)
	at com.carrotsearch.randomizedtesting.RandomizedRunner$10.evaluate(RandomizedRunner.java:985)
	at com.carrotsearch.randomizedtesting.rules.SystemPropertiesRestoreRule$1.evaluate(SystemPropertiesRestoreRule.java:57)
	at org.apache.lucene.util.TestRuleSetupTeardownChained$1.evaluate(TestRuleSetupTeardownChained.java:49)
	at org.apache.lucene.util.AbstractBeforeAfterRule$1.evaluate(AbstractBeforeAfterRule.java:45)
	at org.apache.lucene.util.TestRuleThreadAndTestName$1.evaluate(TestRuleThreadAndTestName.java:48)
	at org.apache.lucene.util.TestRuleIgnoreAfterMaxFailures$1.evaluate(TestRuleIgnoreAfterMaxFailures.java:64)
	at org.apache.lucene.util.TestRuleMarkFailure$1.evaluate(TestRuleMarkFailure.java:47)
	at com.carrotsearch.randomizedtesting.rules.StatementAdapter.evaluate(StatementAdapter.java:36)
	at com.carrotsearch.randomizedtesting.ThreadLeakControl$StatementRunner.run(ThreadLeakControl.java:368)
	at com.carrotsearch.randomizedtesting.ThreadLeakControl.forkTimeoutingTask(ThreadLeakControl.java:817)
	at com.carrotsearch.randomizedtesting.ThreadLeakControl$3.evaluate(ThreadLeakControl.java:468)
	at com.carrotsearch.randomizedtesting.RandomizedRunner.runSingleTest(RandomizedRunner.java:944)
	at com.carrotsearch.randomizedtesting.RandomizedRunner$5.evaluate(RandomizedRunner.java:830)
	at com.carrotsearch.randomizedtesting.RandomizedRunner$6.evaluate(RandomizedRunner.java:880)
	at com.carrotsearch.randomizedtesting.RandomizedRunner$7.evaluate(RandomizedRunner.java:891)
	at com.carrotsearch.randomizedtesting.rules.StatementAdapter.evaluate(StatementAdapter.java:36)
	at com.carrotsearch.randomizedtesting.rules.SystemPropertiesRestoreRule$1.evaluate(SystemPropertiesRestoreRule.java:57)
	at org.apache.lucene.util.AbstractBeforeAfterRule$1.evaluate(AbstractBeforeAfterRule.java:45)
	at com.carrotsearch.randomizedtesting.rules.StatementAdapter.evaluate(StatementAdapter.java:36)
	at org.apache.lucene.util.TestRuleStoreClassName$1.evaluate(TestRuleStoreClassName.java:41)
	at com.carrotsearch.randomizedtesting.rules.NoShadowingOrOverridesOnMethodsRule$1.evaluate(NoShadowingOrOverridesOnMethodsRule.java:40)
	at com.carrotsearch.randomizedtesting.rules.NoShadowingOrOverridesOnMethodsRule$1.evaluate(NoShadowingOrOverridesOnMethodsRule.java:40)
	at com.carrotsearch.randomizedtesting.rules.StatementAdapter.evaluate(StatementAdapter.java:36)
	at com.carrotsearch.randomizedtesting.rules.StatementAdapter.evaluate(StatementAdapter.java:36)
	at org.apache.lucene.util.TestRuleAssertionsRequired$1.evaluate(TestRuleAssertionsRequired.java:53)
	at org.apache.lucene.util.TestRuleMarkFailure$1.evaluate(TestRuleMarkFailure.java:47)
	at org.apache.lucene.util.TestRuleIgnoreAfterMaxFailures$1.evaluate(TestRuleIgnoreAfterMaxFailures.java:64)
	at org.apache.lucene.util.TestRuleIgnoreTestSuites$1.evaluate(TestRuleIgnoreTestSuites.java:54)
	at com.carrotsearch.randomizedtesting.rules.StatementAdapter.evaluate(StatementAdapter.java:36)
	at com.carrotsearch.randomizedtesting.ThreadLeakControl$StatementRunner.run(ThreadLeakControl.java:368)
	at java.base/java.lang.Thread.run(Thread.java:834)


FAILED:  org.apache.solr.cloud.autoscaling.TestPolicyCloud.testCreateCollectionAddShardUsingPolicy

Error Message:
Could not find collection : policiesTest

Stack Trace:
org.apache.solr.common.SolrException: Could not find collection : policiesTest
	at __randomizedtesting.SeedInfo.seed([46B26282BF0A1176:872E502B7E32ECB5]:0)
	at org.apache.solr.common.cloud.ClusterState.getCollection(ClusterState.java:118)
	at org.apache.solr.cloud.SolrCloudTestCase.getCollectionState(SolrCloudTestCase.java:258)
	at org.apache.solr.cloud.autoscaling.TestPolicyCloud.testCreateCollectionAddShardUsingPolicy(TestPolicyCloud.java:372)
	at java.base/jdk.internal.reflect.NativeMethodAccessorImpl.invoke0(Native Method)
	at java.base/jdk.internal.reflect.NativeMethodAccessorImpl.invoke(NativeMethodAccessorImpl.java:62)
	at java.base/jdk.internal.reflect.DelegatingMethodAccessorImpl.invoke(DelegatingMethodAccessorImpl.java:43)
	at java.base/java.lang.reflect.Method.invoke(Method.java:566)
	at com.carrotsearch.randomizedtesting.RandomizedRunner.invoke(RandomizedRunner.java:1742)
	at com.carrotsearch.randomizedtesting.RandomizedRunner$8.evaluate(RandomizedRunner.java:935)
	at com.carrotsearch.randomizedtesting.RandomizedRunner$9.evaluate(RandomizedRunner.java:971)
	at com.carrotsearch.randomizedtesting.RandomizedRunner$10.evaluate(RandomizedRunner.java:985)
	at org.junit.rules.ExpectedException$ExpectedExceptionStatement.evaluate(ExpectedException.java:110)
	at com.carrotsearch.randomizedtesting.rules.SystemPropertiesRestoreRule$1.evaluate(SystemPropertiesRestoreRule.java:57)
	at org.apache.lucene.util.TestRuleSetupTeardownChained$1.evaluate(TestRuleSetupTeardownChained.java:49)
	at org.apache.lucene.util.AbstractBeforeAfterRule$1.evaluate(AbstractBeforeAfterRule.java:45)
	at org.apache.lucene.util.TestRuleThreadAndTestName$1.evaluate(TestRuleThreadAndTestName.java:48)
	at org.apache.lucene.util.TestRuleIgnoreAfterMaxFailures$1.evaluate(TestRuleIgnoreAfterMaxFailures.java:64)
	at org.apache.lucene.util.TestRuleMarkFailure$1.evaluate(TestRuleMarkFailure.java:47)
	at com.carrotsearch.randomizedtesting.rules.StatementAdapter.evaluate(StatementAdapter.java:36)
	at com.carrotsearch.randomizedtesting.ThreadLeakControl$StatementRunner.run(ThreadLeakControl.java:368)
	at com.carrotsearch.randomizedtesting.ThreadLeakControl.forkTimeoutingTask(ThreadLeakControl.java:817)
	at com.carrotsearch.randomizedtesting.ThreadLeakControl$3.evaluate(ThreadLeakControl.java:468)
	at com.carrotsearch.randomizedtesting.RandomizedRunner.runSingleTest(RandomizedRunner.java:944)
	at com.carrotsearch.randomizedtesting.RandomizedRunner$5.evaluate(RandomizedRunner.java:830)
	at com.carrotsearch.randomizedtesting.RandomizedRunner$6.evaluate(RandomizedRunner.java:880)
	at com.carrotsearch.randomizedtesting.RandomizedRunner$7.evaluate(RandomizedRunner.java:891)
	at com.carrotsearch.randomizedtesting.rules.StatementAdapter.evaluate(StatementAdapter.java:36)
	at com.carrotsearch.randomizedtesting.rules.SystemPropertiesRestoreRule$1.evaluate(SystemPropertiesRestoreRule.java:57)
	at org.apache.lucene.util.AbstractBeforeAfterRule$1.evaluate(AbstractBeforeAfterRule.java:45)
	at com.carrotsearch.randomizedtesting.rules.StatementAdapter.evaluate(StatementAdapter.java:36)
	at org.apache.lucene.util.TestRuleStoreClassName$1.evaluate(TestRuleStoreClassName.java:41)
	at com.carrotsearch.randomizedtesting.rules.NoShadowingOrOverridesOnMethodsRule$1.evaluate(NoShadowingOrOverridesOnMethodsRule.java:40)
	at com.carrotsearch.randomizedtesting.rules.NoShadowingOrOverridesOnMethodsRule$1.evaluate(NoShadowingOrOverridesOnMethodsRule.java:40)
	at com.carrotsearch.randomizedtesting.rules.StatementAdapter.evaluate(StatementAdapter.java:36)
	at com.carrotsearch.randomizedtesting.rules.StatementAdapter.evaluate(StatementAdapter.java:36)
	at org.apache.lucene.util.TestRuleAssertionsRequired$1.evaluate(TestRuleAssertionsRequired.java:53)
	at org.apache.lucene.util.TestRuleMarkFailure$1.evaluate(TestRuleMarkFailure.java:47)
	at org.apache.lucene.util.TestRuleIgnoreAfterMaxFailures$1.evaluate(TestRuleIgnoreAfterMaxFailures.java:64)
	at org.apache.lucene.util.TestRuleIgnoreTestSuites$1.evaluate(TestRuleIgnoreTestSuites.java:54)
	at com.carrotsearch.randomizedtesting.rules.StatementAdapter.evaluate(StatementAdapter.java:36)
	at com.carrotsearch.randomizedtesting.ThreadLeakControl$StatementRunner.run(ThreadLeakControl.java:368)
	at java.base/java.lang.Thread.run(Thread.java:834)


FAILED:  org.apache.solr.cloud.autoscaling.TestPolicyCloud.testCreateCollectionAddShardUsingPolicy

Error Message:
Could not find collection : policiesTest

Stack Trace:
org.apache.solr.common.SolrException: Could not find collection : policiesTest
	at __randomizedtesting.SeedInfo.seed([46B26282BF0A1176:872E502B7E32ECB5]:0)
	at org.apache.solr.common.cloud.ClusterState.getCollection(ClusterState.java:118)
	at org.apache.solr.cloud.SolrCloudTestCase.getCollectionState(SolrCloudTestCase.java:258)
	at org.apache.solr.cloud.autoscaling.TestPolicyCloud.testCreateCollectionAddShardUsingPolicy(TestPolicyCloud.java:372)
	at java.base/jdk.internal.reflect.NativeMethodAccessorImpl.invoke0(Native Method)
	at java.base/jdk.internal.reflect.NativeMethodAccessorImpl.invoke(NativeMethodAccessorImpl.java:62)
	at java.base/jdk.internal.reflect.DelegatingMethodAccessorImpl.invoke(DelegatingMethodAccessorImpl.java:43)
	at java.base/java.lang.reflect.Method.invoke(Method.java:566)
	at com.carrotsearch.randomizedtesting.RandomizedRunner.invoke(RandomizedRunner.java:1742)
	at com.carrotsearch.randomizedtesting.RandomizedRunner$8.evaluate(RandomizedRunner.java:935)
	at com.carrotsearch.randomizedtesting.RandomizedRunner$9.evaluate(RandomizedRunner.java:971)
	at com.carrotsearch.randomizedtesting.RandomizedRunner$10.evaluate(RandomizedRunner.java:985)
	at org.junit.rules.ExpectedException$ExpectedExceptionStatement.evaluate(ExpectedException.java:110)
	at com.carrotsearch.randomizedtesting.rules.SystemPropertiesRestoreRule$1.evaluate(SystemPropertiesRestoreRule.java:57)
	at org.apache.lucene.util.TestRuleSetupTeardownChained$1.evaluate(TestRuleSetupTeardownChained.java:49)
	at org.apache.lucene.util.AbstractBeforeAfterRule$1.evaluate(AbstractBeforeAfterRule.java:45)
	at org.apache.lucene.util.TestRuleThreadAndTestName$1.evaluate(TestRuleThreadAndTestName.java:48)
	at org.apache.lucene.util.TestRuleIgnoreAfterMaxFailures$1.evaluate(TestRuleIgnoreAfterMaxFailures.java:64)
	at org.apache.lucene.util.TestRuleMarkFailure$1.evaluate(TestRuleMarkFailure.java:47)
	at com.carrotsearch.randomizedtesting.rules.StatementAdapter.evaluate(StatementAdapter.java:36)
	at com.carrotsearch.randomizedtesting.ThreadLeakControl$StatementRunner.run(ThreadLeakControl.java:368)
	at com.carrotsearch.randomizedtesting.ThreadLeakControl.forkTimeoutingTask(ThreadLeakControl.java:817)
	at com.carrotsearch.randomizedtesting.ThreadLeakControl$3.evaluate(ThreadLeakControl.java:468)
	at com.carrotsearch.randomizedtesting.RandomizedRunner.runSingleTest(RandomizedRunner.java:944)
	at com.carrotsearch.randomizedtesting.RandomizedRunner$5.evaluate(RandomizedRunner.java:830)
	at com.carrotsearch.randomizedtesting.RandomizedRunner$6.evaluate(RandomizedRunner.java:880)
	at com.carrotsearch.randomizedtesting.RandomizedRunner$7.evaluate(RandomizedRunner.java:891)
	at com.carrotsearch.randomizedtesting.rules.StatementAdapter.evaluate(StatementAdapter.java:36)
	at com.carrotsearch.randomizedtesting.rules.SystemPropertiesRestoreRule$1.evaluate(SystemPropertiesRestoreRule.java:57)
	at org.apache.lucene.util.AbstractBeforeAfterRule$1.evaluate(AbstractBeforeAfterRule.java:45)
	at com.carrotsearch.randomizedtesting.rules.StatementAdapter.evaluate(StatementAdapter.java:36)
	at org.apache.lucene.util.TestRuleStoreClassName$1.evaluate(TestRuleStoreClassName.java:41)
	at com.carrotsearch.randomizedtesting.rules.NoShadowingOrOverridesOnMethodsRule$1.evaluate(NoShadowingOrOverridesOnMethodsRule.java:40)
	at com.carrotsearch.randomizedtesting.rules.NoShadowingOrOverridesOnMethodsRule$1.evaluate(NoShadowingOrOverridesOnMethodsRule.java:40)
	at com.carrotsearch.randomizedtesting.rules.StatementAdapter.evaluate(StatementAdapter.java:36)
	at com.carrotsearch.randomizedtesting.rules.StatementAdapter.evaluate(StatementAdapter.java:36)
	at org.apache.lucene.util.TestRuleAssertionsRequired$1.evaluate(TestRuleAssertionsRequired.java:53)
	at org.apache.lucene.util.TestRuleMarkFailure$1.evaluate(TestRuleMarkFailure.java:47)
	at org.apache.lucene.util.TestRuleIgnoreAfterMaxFailures$1.evaluate(TestRuleIgnoreAfterMaxFailures.java:64)
	at org.apache.lucene.util.TestRuleIgnoreTestSuites$1.evaluate(TestRuleIgnoreTestSuites.java:54)
	at com.carrotsearch.randomizedtesting.rules.StatementAdapter.evaluate(StatementAdapter.java:36)
	at com.carrotsearch.randomizedtesting.ThreadLeakControl$StatementRunner.run(ThreadLeakControl.java:368)
	at java.base/java.lang.Thread.run(Thread.java:834)


FAILED:  org.apache.solr.cloud.autoscaling.TestPolicyCloud.testCreateCollectionAddShardUsingPolicy

Error Message:
Could not find collection : policiesTest

Stack Trace:
org.apache.solr.common.SolrException: Could not find collection : policiesTest
	at __randomizedtesting.SeedInfo.seed([46B26282BF0A1176:872E502B7E32ECB5]:0)
	at org.apache.solr.common.cloud.ClusterState.getCollection(ClusterState.java:118)
	at org.apache.solr.cloud.SolrCloudTestCase.getCollectionState(SolrCloudTestCase.java:258)
	at org.apache.solr.cloud.autoscaling.TestPolicyCloud.testCreateCollectionAddShardUsingPolicy(TestPolicyCloud.java:372)
	at java.base/jdk.internal.reflect.NativeMethodAccessorImpl.invoke0(Native Method)
	at java.base/jdk.internal.reflect.NativeMethodAccessorImpl.invoke(NativeMethodAccessorImpl.java:62)
	at java.base/jdk.internal.reflect.DelegatingMethodAccessorImpl.invoke(DelegatingMethodAccessorImpl.java:43)
	at java.base/java.lang.reflect.Method.invoke(Method.java:566)
	at com.carrotsearch.randomizedtesting.RandomizedRunner.invoke(RandomizedRunner.java:1742)
	at com.carrotsearch.randomizedtesting.RandomizedRunner$8.evaluate(RandomizedRunner.java:935)
	at com.carrotsearch.randomizedtesting.RandomizedRunner$9.evaluate(RandomizedRunner.java:971)
	at com.carrotsearch.randomizedtesting.RandomizedRunner$10.evaluate(RandomizedRunner.java:985)
	at org.junit.rules.ExpectedException$ExpectedExceptionStatement.evaluate(ExpectedException.java:110)
	at com.carrotsearch.randomizedtesting.rules.SystemPropertiesRestoreRule$1.evaluate(SystemPropertiesRestoreRule.java:57)
	at org.apache.lucene.util.TestRuleSetupTeardownChained$1.evaluate(TestRuleSetupTeardownChained.java:49)
	at org.apache.lucene.util.AbstractBeforeAfterRule$1.evaluate(AbstractBeforeAfterRule.java:45)
	at org.apache.lucene.util.TestRuleThreadAndTestName$1.evaluate(TestRuleThreadAndTestName.java:48)
	at org.apache.lucene.util.TestRuleIgnoreAfterMaxFailures$1.evaluate(TestRuleIgnoreAfterMaxFailures.java:64)
	at org.apache.lucene.util.TestRuleMarkFailure$1.evaluate(TestRuleMarkFailure.java:47)
	at com.carrotsearch.randomizedtesting.rules.StatementAdapter.evaluate(StatementAdapter.java:36)
	at com.carrotsearch.randomizedtesting.ThreadLeakControl$StatementRunner.run(ThreadLeakControl.java:368)
	at com.carrotsearch.randomizedtesting.ThreadLeakControl.forkTimeoutingTask(ThreadLeakControl.java:817)
	at com.carrotsearch.randomizedtesting.ThreadLeakControl$3.evaluate(ThreadLeakControl.java:468)
	at com.carrotsearch.randomizedtesting.RandomizedRunner.runSingleTest(RandomizedRunner.java:944)
	at com.carrotsearch.randomizedtesting.RandomizedRunner$5.evaluate(RandomizedRunner.java:830)
	at com.carrotsearch.randomizedtesting.RandomizedRunner$6.evaluate(RandomizedRunner.java:880)
	at com.carrotsearch.randomizedtesting.RandomizedRunner$7.evaluate(RandomizedRunner.java:891)
	at com.carrotsearch.randomizedtesting.rules.StatementAdapter.evaluate(StatementAdapter.java:36)
	at com.carrotsearch.randomizedtesting.rules.SystemPropertiesRestoreRule$1.evaluate(SystemPropertiesRestoreRule.java:57)
	at org.apache.lucene.util.AbstractBeforeAfterRule$1.evaluate(AbstractBeforeAfterRule.java:45)
	at com.carrotsearch.randomizedtesting.rules.StatementAdapter.evaluate(StatementAdapter.java:36)
	at org.apache.lucene.util.TestRuleStoreClassName$1.evaluate(TestRuleStoreClassName.java:41)
	at com.carrotsearch.randomizedtesting.rules.NoShadowingOrOverridesOnMethodsRule$1.evaluate(NoShadowingOrOverridesOnMethodsRule.java:40)
	at com.carrotsearch.randomizedtesting.rules.NoShadowingOrOverridesOnMethodsRule$1.evaluate(NoShadowingOrOverridesOnMethodsRule.java:40)
	at com.carrotsearch.randomizedtesting.rules.StatementAdapter.evaluate(StatementAdapter.java:36)
	at com.carrotsearch.randomizedtesting.rules.StatementAdapter.evaluate(StatementAdapter.java:36)
	at org.apache.lucene.util.TestRuleAssertionsRequired$1.evaluate(TestRuleAssertionsRequired.java:53)
	at org.apache.lucene.util.TestRuleMarkFailure$1.evaluate(TestRuleMarkFailure.java:47)
	at org.apache.lucene.util.TestRuleIgnoreAfterMaxFailures$1.evaluate(TestRuleIgnoreAfterMaxFailures.java:64)
	at org.apache.lucene.util.TestRuleIgnoreTestSuites$1.evaluate(TestRuleIgnoreTestSuites.java:54)
	at com.carrotsearch.randomizedtesting.rules.StatementAdapter.evaluate(StatementAdapter.java:36)
	at com.carrotsearch.randomizedtesting.ThreadLeakControl$StatementRunner.run(ThreadLeakControl.java:368)
	at java.base/java.lang.Thread.run(Thread.java:834)


FAILED:  org.apache.solr.cloud.rule.RulesTest.testPortRuleInPresenceOfClusterPolicy

Error Message:
Could not find collection : portRuleColl2

Stack Trace:
org.apache.solr.common.SolrException: Could not find collection : portRuleColl2
	at __randomizedtesting.SeedInfo.seed([46B26282BF0A1176:FF9AEE0208D35B3E]:0)
	at org.apache.solr.common.cloud.ClusterState.getCollection(ClusterState.java:118)
	at org.apache.solr.cloud.SolrCloudTestCase.getCollectionState(SolrCloudTestCase.java:258)
	at org.apache.solr.cloud.rule.RulesTest.testPortRuleInPresenceOfClusterPolicy(RulesTest.java:119)
	at java.base/jdk.internal.reflect.NativeMethodAccessorImpl.invoke0(Native Method)
	at java.base/jdk.internal.reflect.NativeMethodAccessorImpl.invoke(NativeMethodAccessorImpl.java:62)
	at java.base/jdk.internal.reflect.DelegatingMethodAccessorImpl.invoke(DelegatingMethodAccessorImpl.java:43)
	at java.base/java.lang.reflect.Method.invoke(Method.java:566)
	at com.carrotsearch.randomizedtesting.RandomizedRunner.invoke(RandomizedRunner.java:1742)
	at com.carrotsearch.randomizedtesting.RandomizedRunner$8.evaluate(RandomizedRunner.java:935)
	at com.carrotsearch.randomizedtesting.RandomizedRunner$9.evaluate(RandomizedRunner.java:971)
	at com.carrotsearch.randomizedtesting.RandomizedRunner$10.evaluate(RandomizedRunner.java:985)
	at org.junit.rules.ExpectedException$ExpectedExceptionStatement.evaluate(ExpectedException.java:110)
	at com.carrotsearch.randomizedtesting.rules.SystemPropertiesRestoreRule$1.evaluate(SystemPropertiesRestoreRule.java:57)
	at org.apache.lucene.util.TestRuleSetupTeardownChained$1.evaluate(TestRuleSetupTeardownChained.java:49)
	at org.apache.lucene.util.AbstractBeforeAfterRule$1.evaluate(AbstractBeforeAfterRule.java:45)
	at org.apache.lucene.util.TestRuleThreadAndTestName$1.evaluate(TestRuleThreadAndTestName.java:48)
	at org.apache.lucene.util.TestRuleIgnoreAfterMaxFailures$1.evaluate(TestRuleIgnoreAfterMaxFailures.java:64)
	at org.apache.lucene.util.TestRuleMarkFailure$1.evaluate(TestRuleMarkFailure.java:47)
	at com.carrotsearch.randomizedtesting.rules.StatementAdapter.evaluate(StatementAdapter.java:36)
	at com.carrotsearch.randomizedtesting.ThreadLeakControl$StatementRunner.run(ThreadLeakControl.java:368)
	at com.carrotsearch.randomizedtesting.ThreadLeakControl.forkTimeoutingTask(ThreadLeakControl.java:817)
	at com.carrotsearch.randomizedtesting.ThreadLeakControl$3.evaluate(ThreadLeakControl.java:468)
	at com.carrotsearch.randomizedtesting.RandomizedRunner.runSingleTest(RandomizedRunner.java:944)
	at com.carrotsearch.randomizedtesting.RandomizedRunner$5.evaluate(RandomizedRunner.java:830)
	at com.carrotsearch.randomizedtesting.RandomizedRunner$6.evaluate(RandomizedRunner.java:880)
	at com.carrotsearch.randomizedtesting.RandomizedRunner$7.evaluate(RandomizedRunner.java:891)
	at com.carrotsearch.randomizedtesting.rules.StatementAdapter.evaluate(StatementAdapter.java:36)
	at com.carrotsearch.randomizedtesting.rules.SystemPropertiesRestoreRule$1.evaluate(SystemPropertiesRestoreRule.java:57)
	at org.apache.lucene.util.AbstractBeforeAfterRule$1.evaluate(AbstractBeforeAfterRule.java:45)
	at com.carrotsearch.randomizedtesting.rules.StatementAdapter.evaluate(StatementAdapter.java:36)
	at org.apache.lucene.util.TestRuleStoreClassName$1.evaluate(TestRuleStoreClassName.java:41)
	at com.carrotsearch.randomizedtesting.rules.NoShadowingOrOverridesOnMethodsRule$1.evaluate(NoShadowingOrOverridesOnMethodsRule.java:40)
	at com.carrotsearch.randomizedtesting.rules.NoShadowingOrOverridesOnMethodsRule$1.evaluate(NoShadowingOrOverridesOnMethodsRule.java:40)
	at com.carrotsearch.randomizedtesting.rules.StatementAdapter.evaluate(StatementAdapter.java:36)
	at com.carrotsearch.randomizedtesting.rules.StatementAdapter.evaluate(StatementAdapter.java:36)
	at org.apache.lucene.util.TestRuleAssertionsRequired$1.evaluate(TestRuleAssertionsRequired.java:53)
	at org.apache.lucene.util.TestRuleMarkFailure$1.evaluate(TestRuleMarkFailure.java:47)
	at org.apache.lucene.util.TestRuleIgnoreAfterMaxFailures$1.evaluate(TestRuleIgnoreAfterMaxFailures.java:64)
	at org.apache.lucene.util.TestRuleIgnoreTestSuites$1.evaluate(TestRuleIgnoreTestSuites.java:54)
	at com.carrotsearch.randomizedtesting.rules.StatementAdapter.evaluate(StatementAdapter.java:36)
	at com.carrotsearch.randomizedtesting.ThreadLeakControl$StatementRunner.run(ThreadLeakControl.java:368)
	at java.base/java.lang.Thread.run(Thread.java:834)


FAILED:  org.apache.solr.cloud.cdcr.CdcrBidirectionalTest.testBiDir

Error Message:
Collection not found: cdcr-cluster1

Stack Trace:
org.apache.solr.common.SolrException: Collection not found: cdcr-cluster1
	at __randomizedtesting.SeedInfo.seed([46B26282BF0A1176:3699260A7245D34]:0)
	at org.apache.solr.client.solrj.impl.CloudSolrClient.requestWithRetryOnStaleState(CloudSolrClient.java:851)
	at org.apache.solr.client.solrj.impl.CloudSolrClient.request(CloudSolrClient.java:817)
	at org.apache.solr.client.solrj.SolrRequest.process(SolrRequest.java:194)
	at org.apache.solr.client.solrj.SolrClient.query(SolrClient.java:942)
	at org.apache.solr.client.solrj.SolrClient.query(SolrClient.java:957)
	at org.apache.solr.cloud.cdcr.CdcrTestsUtil.invokeCdcrAction(CdcrTestsUtil.java:83)
	at org.apache.solr.cloud.cdcr.CdcrTestsUtil.cdcrStart(CdcrTestsUtil.java:60)
	at org.apache.solr.cloud.cdcr.CdcrBidirectionalTest.testBiDir(CdcrBidirectionalTest.java:78)
	at java.base/jdk.internal.reflect.NativeMethodAccessorImpl.invoke0(Native Method)
	at java.base/jdk.internal.reflect.NativeMethodAccessorImpl.invoke(NativeMethodAccessorImpl.java:62)
	at java.base/jdk.internal.reflect.DelegatingMethodAccessorImpl.invoke(DelegatingMethodAccessorImpl.java:43)
	at java.base/java.lang.reflect.Method.invoke(Method.java:566)
	at com.carrotsearch.randomizedtesting.RandomizedRunner.invoke(RandomizedRunner.java:1742)
	at com.carrotsearch.randomizedtesting.RandomizedRunner$8.evaluate(RandomizedRunner.java:935)
	at com.carrotsearch.randomizedtesting.RandomizedRunner$9.evaluate(RandomizedRunner.java:971)
	at com.carrotsearch.randomizedtesting.RandomizedRunner$10.evaluate(RandomizedRunner.java:985)
	at com.carrotsearch.randomizedtesting.rules.SystemPropertiesRestoreRule$1.evaluate(SystemPropertiesRestoreRule.java:57)
	at org.apache.lucene.util.TestRuleSetupTeardownChained$1.evaluate(TestRuleSetupTeardownChained.java:49)
	at org.apache.lucene.util.AbstractBeforeAfterRule$1.evaluate(AbstractBeforeAfterRule.java:45)
	at org.apache.lucene.util.TestRuleThreadAndTestName$1.evaluate(TestRuleThreadAndTestName.java:48)
	at org.apache.lucene.util.TestRuleIgnoreAfterMaxFailures$1.evaluate(TestRuleIgnoreAfterMaxFailures.java:64)
	at org.apache.lucene.util.TestRuleMarkFailure$1.evaluate(TestRuleMarkFailure.java:47)
	at com.carrotsearch.randomizedtesting.rules.StatementAdapter.evaluate(StatementAdapter.java:36)
	at com.carrotsearch.randomizedtesting.ThreadLeakControl$StatementRunner.run(ThreadLeakControl.java:368)
	at com.carrotsearch.randomizedtesting.ThreadLeakControl.forkTimeoutingTask(ThreadLeakControl.java:817)
	at com.carrotsearch.randomizedtesting.ThreadLeakControl$3.evaluate(ThreadLeakControl.java:468)
	at com.carrotsearch.randomizedtesting.RandomizedRunner.runSingleTest(RandomizedRunner.java:944)
	at com.carrotsearch.randomizedtesting.RandomizedRunner$5.evaluate(RandomizedRunner.java:830)
	at com.carrotsearch.randomizedtesting.RandomizedRunner$6.evaluate(RandomizedRunner.java:880)
	at com.carrotsearch.randomizedtesting.RandomizedRunner$7.evaluate(RandomizedRunner.java:891)
	at com.carrotsearch.randomizedtesting.rules.StatementAdapter.evaluate(StatementAdapter.java:36)
	at com.carrotsearch.randomizedtesting.rules.SystemPropertiesRestoreRule$1.evaluate(SystemPropertiesRestoreRule.java:57)
	at org.apache.lucene.util.AbstractBeforeAfterRule$1.evaluate(AbstractBeforeAfterRule.java:45)
	at com.carrotsearch.randomizedtesting.rules.StatementAdapter.evaluate(StatementAdapter.java:36)
	at org.apache.lucene.util.TestRuleStoreClassName$1.evaluate(TestRuleStoreClassName.java:41)
	at com.carrotsearch.randomizedtesting.rules.NoShadowingOrOverridesOnMethodsRule$1.evaluate(NoShadowingOrOverridesOnMethodsRule.java:40)
	at com.carrotsearch.randomizedtesting.rules.NoShadowingOrOverridesOnMethodsRule$1.evaluate(NoShadowingOrOverridesOnMethodsRule.java:40)
	at com.carrotsearch.randomizedtesting.rules.StatementAdapter.evaluate(StatementAdapter.java:36)
	at com.carrotsearch.randomizedtesting.rules.StatementAdapter.evaluate(StatementAdapter.java:36)
	at org.apache.lucene.util.TestRuleAssertionsRequired$1.evaluate(TestRuleAssertionsRequired.java:53)
	at org.apache.lucene.util.TestRuleMarkFailure$1.evaluate(TestRuleMarkFailure.java:47)
	at org.apache.lucene.util.TestRuleIgnoreAfterMaxFailures$1.evaluate(TestRuleIgnoreAfterMaxFailures.java:64)
	at org.apache.lucene.util.TestRuleIgnoreTestSuites$1.evaluate(TestRuleIgnoreTestSuites.java:54)
	at com.carrotsearch.randomizedtesting.rules.StatementAdapter.evaluate(StatementAdapter.java:36)
	at com.carrotsearch.randomizedtesting.ThreadLeakControl$StatementRunner.run(ThreadLeakControl.java:368)
	at java.base/java.lang.Thread.run(Thread.java:834)


FAILED:  org.apache.solr.cloud.cdcr.CdcrBidirectionalTest.testBiDir

Error Message:
Collection not found: cdcr-cluster1

Stack Trace:
org.apache.solr.common.SolrException: Collection not found: cdcr-cluster1
	at __randomizedtesting.SeedInfo.seed([46B26282BF0A1176:3699260A7245D34]:0)
	at org.apache.solr.client.solrj.impl.CloudSolrClient.requestWithRetryOnStaleState(CloudSolrClient.java:851)
	at org.apache.solr.client.solrj.impl.CloudSolrClient.request(CloudSolrClient.java:817)
	at org.apache.solr.client.solrj.SolrRequest.process(SolrRequest.java:194)
	at org.apache.solr.client.solrj.SolrClient.query(SolrClient.java:942)
	at org.apache.solr.client.solrj.SolrClient.query(SolrClient.java:957)
	at org.apache.solr.cloud.cdcr.CdcrTestsUtil.invokeCdcrAction(CdcrTestsUtil.java:83)
	at org.apache.solr.cloud.cdcr.CdcrTestsUtil.cdcrStart(CdcrTestsUtil.java:60)
	at org.apache.solr.cloud.cdcr.CdcrBidirectionalTest.testBiDir(CdcrBidirectionalTest.java:78)
	at java.base/jdk.internal.reflect.NativeMethodAccessorImpl.invoke0(Native Method)
	at java.base/jdk.internal.reflect.NativeMethodAccessorImpl.invoke(NativeMethodAccessorImpl.java:62)
	at java.base/jdk.internal.reflect.DelegatingMethodAccessorImpl.invoke(DelegatingMethodAccessorImpl.java:43)
	at java.base/java.lang.reflect.Method.invoke(Method.java:566)
	at com.carrotsearch.randomizedtesting.RandomizedRunner.invoke(RandomizedRunner.java:1742)
	at com.carrotsearch.randomizedtesting.RandomizedRunner$8.evaluate(RandomizedRunner.java:935)
	at com.carrotsearch.randomizedtesting.RandomizedRunner$9.evaluate(RandomizedRunner.java:971)
	at com.carrotsearch.randomizedtesting.RandomizedRunner$10.evaluate(RandomizedRunner.java:985)
	at com.carrotsearch.randomizedtesting.rules.SystemPropertiesRestoreRule$1.evaluate(SystemPropertiesRestoreRule.java:57)
	at org.apache.lucene.util.TestRuleSetupTeardownChained$1.evaluate(TestRuleSetupTeardownChained.java:49)
	at org.apache.lucene.util.AbstractBeforeAfterRule$1.evaluate(AbstractBeforeAfterRule.java:45)
	at org.apache.lucene.util.TestRuleThreadAndTestName$1.evaluate(TestRuleThreadAndTestName.java:48)
	at org.apache.lucene.util.TestRuleIgnoreAfterMaxFailures$1.evaluate(TestRuleIgnoreAfterMaxFailures.java:64)
	at org.apache.lucene.util.TestRuleMarkFailure$1.evaluate(TestRuleMarkFailure.java:47)
	at com.carrotsearch.randomizedtesting.rules.StatementAdapter.evaluate(StatementAdapter.java:36)
	at com.carrotsearch.randomizedtesting.ThreadLeakControl$StatementRunner.run(ThreadLeakControl.java:368)
	at com.carrotsearch.randomizedtesting.ThreadLeakControl.forkTimeoutingTask(ThreadLeakControl.java:817)
	at com.carrotsearch.randomizedtesting.ThreadLeakControl$3.evaluate(ThreadLeakControl.java:468)
	at com.carrotsearch.randomizedtesting.RandomizedRunner.runSingleTest(RandomizedRunner.java:944)
	at com.carrotsearch.randomizedtesting.RandomizedRunner$5.evaluate(RandomizedRunner.java:830)
	at com.carrotsearch.randomizedtesting.RandomizedRunner$6.evaluate(RandomizedRunner.java:880)
	at com.carrotsearch.randomizedtesting.RandomizedRunner$7.evaluate(RandomizedRunner.java:891)
	at com.carrotsearch.randomizedtesting.rules.StatementAdapter.evaluate(StatementAdapter.java:36)
	at com.carrotsearch.randomizedtesting.rules.SystemPropertiesRestoreRule$1.evaluate(SystemPropertiesRestoreRule.java:57)
	at org.apache.lucene.util.AbstractBeforeAfterRule$1.evaluate(AbstractBeforeAfterRule.java:45)
	at com.carrotsearch.randomizedtesting.rules.StatementAdapter.evaluate(StatementAdapter.java:36)
	at org.apache.lucene.util.TestRuleStoreClassName$1.evaluate(TestRuleStoreClassName.java:41)
	at com.carrotsearch.randomizedtesting.rules.NoShadowingOrOverridesOnMethodsRule$1.evaluate(NoShadowingOrOverridesOnMethodsRule.java:40)
	at com.carrotsearch.randomizedtesting.rules.NoShadowingOrOverridesOnMethodsRule$1.evaluate(NoShadowingOrOverridesOnMethodsRule.java:40)
	at com.carrotsearch.randomizedtesting.rules.StatementAdapter.evaluate(StatementAdapter.java:36)
	at com.carrotsearch.randomizedtesting.rules.StatementAdapter.evaluate(StatementAdapter.java:36)
	at org.apache.lucene.util.TestRuleAssertionsRequired$1.evaluate(TestRuleAssertionsRequired.java:53)
	at org.apache.lucene.util.TestRuleMarkFailure$1.evaluate(TestRuleMarkFailure.java:47)
	at org.apache.lucene.util.TestRuleIgnoreAfterMaxFailures$1.evaluate(TestRuleIgnoreAfterMaxFailures.java:64)
	at org.apache.lucene.util.TestRuleIgnoreTestSuites$1.evaluate(TestRuleIgnoreTestSuites.java:54)
	at com.carrotsearch.randomizedtesting.rules.StatementAdapter.evaluate(StatementAdapter.java:36)
	at com.carrotsearch.randomizedtesting.ThreadLeakControl$StatementRunner.run(ThreadLeakControl.java:368)
	at java.base/java.lang.Thread.run(Thread.java:834)


FAILED:  org.apache.solr.cloud.cdcr.CdcrBidirectionalTest.testBiDir

Error Message:
Collection not found: cdcr-cluster1

Stack Trace:
org.apache.solr.common.SolrException: Collection not found: cdcr-cluster1
	at __randomizedtesting.SeedInfo.seed([46B26282BF0A1176:3699260A7245D34]:0)
	at org.apache.solr.client.solrj.impl.CloudSolrClient.requestWithRetryOnStaleState(CloudSolrClient.java:851)
	at org.apache.solr.client.solrj.impl.CloudSolrClient.request(CloudSolrClient.java:817)
	at org.apache.solr.client.solrj.SolrRequest.process(SolrRequest.java:194)
	at org.apache.solr.client.solrj.SolrClient.query(SolrClient.java:942)
	at org.apache.solr.client.solrj.SolrClient.query(SolrClient.java:957)
	at org.apache.solr.cloud.cdcr.CdcrTestsUtil.invokeCdcrAction(CdcrTestsUtil.java:83)
	at org.apache.solr.cloud.cdcr.CdcrTestsUtil.cdcrStart(CdcrTestsUtil.java:60)
	at org.apache.solr.cloud.cdcr.CdcrBidirectionalTest.testBiDir(CdcrBidirectionalTest.java:78)
	at java.base/jdk.internal.reflect.NativeMethodAccessorImpl.invoke0(Native Method)
	at java.base/jdk.internal.reflect.NativeMethodAccessorImpl.invoke(NativeMethodAccessorImpl.java:62)
	at java.base/jdk.internal.reflect.DelegatingMethodAccessorImpl.invoke(DelegatingMethodAccessorImpl.java:43)
	at java.base/java.lang.reflect.Method.invoke(Method.java:566)
	at com.carrotsearch.randomizedtesting.RandomizedRunner.invoke(RandomizedRunner.java:1742)
	at com.carrotsearch.randomizedtesting.RandomizedRunner$8.evaluate(RandomizedRunner.java:935)
	at com.carrotsearch.randomizedtesting.RandomizedRunner$9.evaluate(RandomizedRunner.java:971)
	at com.carrotsearch.randomizedtesting.RandomizedRunner$10.evaluate(RandomizedRunner.java:985)
	at com.carrotsearch.randomizedtesting.rules.SystemPropertiesRestoreRule$1.evaluate(SystemPropertiesRestoreRule.java:57)
	at org.apache.lucene.util.TestRuleSetupTeardownChained$1.evaluate(TestRuleSetupTeardownChained.java:49)
	at org.apache.lucene.util.AbstractBeforeAfterRule$1.evaluate(AbstractBeforeAfterRule.java:45)
	at org.apache.lucene.util.TestRuleThreadAndTestName$1.evaluate(TestRuleThreadAndTestName.java:48)
	at org.apache.lucene.util.TestRuleIgnoreAfterMaxFailures$1.evaluate(TestRuleIgnoreAfterMaxFailures.java:64)
	at org.apache.lucene.util.TestRuleMarkFailure$1.evaluate(TestRuleMarkFailure.java:47)
	at com.carrotsearch.randomizedtesting.rules.StatementAdapter.evaluate(StatementAdapter.java:36)
	at com.carrotsearch.randomizedtesting.ThreadLeakControl$StatementRunner.run(ThreadLeakControl.java:368)
	at com.carrotsearch.randomizedtesting.ThreadLeakControl.forkTimeoutingTask(ThreadLeakControl.java:817)
	at com.carrotsearch.randomizedtesting.ThreadLeakControl$3.evaluate(ThreadLeakControl.java:468)
	at com.carrotsearch.randomizedtesting.RandomizedRunner.runSingleTest(RandomizedRunner.java:944)
	at com.carrotsearch.randomizedtesting.RandomizedRunner$5.evaluate(RandomizedRunner.java:830)
	at com.carrotsearch.randomizedtesting.RandomizedRunner$6.evaluate(RandomizedRunner.java:880)
	at com.carrotsearch.randomizedtesting.RandomizedRunner$7.evaluate(RandomizedRunner.java:891)
	at com.carrotsearch.randomizedtesting.rules.StatementAdapter.evaluate(StatementAdapter.java:36)
	at com.carrotsearch.randomizedtesting.rules.SystemPropertiesRestoreRule$1.evaluate(SystemPropertiesRestoreRule.java:57)
	at org.apache.lucene.util.AbstractBeforeAfterRule$1.evaluate(AbstractBeforeAfterRule.java:45)
	at com.carrotsearch.randomizedtesting.rules.StatementAdapter.evaluate(StatementAdapter.java:36)
	at org.apache.lucene.util.TestRuleStoreClassName$1.evaluate(TestRuleStoreClassName.java:41)
	at com.carrotsearch.randomizedtesting.rules.NoShadowingOrOverridesOnMethodsRule$1.evaluate(NoShadowingOrOverridesOnMethodsRule.java:40)
	at com.carrotsearch.randomizedtesting.rules.NoShadowingOrOverridesOnMethodsRule$1.evaluate(NoShadowingOrOverridesOnMethodsRule.java:40)
	at com.carrotsearch.randomizedtesting.rules.StatementAdapter.evaluate(StatementAdapter.java:36)
	at com.carrotsearch.randomizedtesting.rules.StatementAdapter.evaluate(StatementAdapter.java:36)
	at org.apache.lucene.util.TestRuleAssertionsRequired$1.evaluate(TestRuleAssertionsRequired.java:53)
	at org.apache.lucene.util.TestRuleMarkFailure$1.evaluate(TestRuleMarkFailure.java:47)
	at org.apache.lucene.util.TestRuleIgnoreAfterMaxFailures$1.evaluate(TestRuleIgnoreAfterMaxFailures.java:64)
	at org.apache.lucene.util.TestRuleIgnoreTestSuites$1.evaluate(TestRuleIgnoreTestSuites.java:54)
	at com.carrotsearch.randomizedtesting.rules.StatementAdapter.evaluate(StatementAdapter.java:36)
	at com.carrotsearch.randomizedtesting.ThreadLeakControl$StatementRunner.run(ThreadLeakControl.java:368)
	at java.base/java.lang.Thread.run(Thread.java:834)


FAILED:  org.apache.solr.cloud.cdcr.CdcrBidirectionalTest.testBiDir

Error Message:
Collection not found: cdcr-cluster1

Stack Trace:
org.apache.solr.common.SolrException: Collection not found: cdcr-cluster1
	at __randomizedtesting.SeedInfo.seed([46B26282BF0A1176:3699260A7245D34]:0)
	at org.apache.solr.client.solrj.impl.CloudSolrClient.requestWithRetryOnStaleState(CloudSolrClient.java:851)
	at org.apache.solr.client.solrj.impl.CloudSolrClient.request(CloudSolrClient.java:817)
	at org.apache.solr.client.solrj.SolrRequest.process(SolrRequest.java:194)
	at org.apache.solr.client.solrj.SolrClient.query(SolrClient.java:942)
	at org.apache.solr.client.solrj.SolrClient.query(SolrClient.java:957)
	at org.apache.solr.cloud.cdcr.CdcrTestsUtil.invokeCdcrAction(CdcrTestsUtil.java:83)
	at org.apache.solr.cloud.cdcr.CdcrTestsUtil.cdcrStart(CdcrTestsUtil.java:60)
	at org.apache.solr.cloud.cdcr.CdcrBidirectionalTest.testBiDir(CdcrBidirectionalTest.java:78)
	at java.base/jdk.internal.reflect.NativeMethodAccessorImpl.invoke0(Native Method)
	at java.base/jdk.internal.reflect.NativeMethodAccessorImpl.invoke(NativeMethodAccessorImpl.java:62)
	at java.base/jdk.internal.reflect.DelegatingMethodAccessorImpl.invoke(DelegatingMethodAccessorImpl.java:43)
	at java.base/java.lang.reflect.Method.invoke(Method.java:566)
	at com.carrotsearch.randomizedtesting.RandomizedRunner.invoke(RandomizedRunner.java:1742)
	at com.carrotsearch.randomizedtesting.RandomizedRunner$8.evaluate(RandomizedRunner.java:935)
	at com.carrotsearch.randomizedtesting.RandomizedRunner$9.evaluate(RandomizedRunner.java:971)
	at com.carrotsearch.randomizedtesting.RandomizedRunner$10.evaluate(RandomizedRunner.java:985)
	at com.carrotsearch.randomizedtesting.rules.SystemPropertiesRestoreRule$1.evaluate(SystemPropertiesRestoreRule.java:57)
	at org.apache.lucene.util.TestRuleSetupTeardownChained$1.evaluate(TestRuleSetupTeardownChained.java:49)
	at org.apache.lucene.util.AbstractBeforeAfterRule$1.evaluate(AbstractBeforeAfterRule.java:45)
	at org.apache.lucene.util.TestRuleThreadAndTestName$1.evaluate(TestRuleThreadAndTestName.java:48)
	at org.apache.lucene.util.TestRuleIgnoreAfterMaxFailures$1.evaluate(TestRuleIgnoreAfterMaxFailures.java:64)
	at org.apache.lucene.util.TestRuleMarkFailure$1.evaluate(TestRuleMarkFailure.java:47)
	at com.carrotsearch.randomizedtesting.rules.StatementAdapter.evaluate(StatementAdapter.java:36)
	at com.carrotsearch.randomizedtesting.ThreadLeakControl$StatementRunner.run(ThreadLeakControl.java:368)
	at com.carrotsearch.randomizedtesting.ThreadLeakControl.forkTimeoutingTask(ThreadLeakControl.java:817)
	at com.carrotsearch.randomizedtesting.ThreadLeakControl$3.evaluate(ThreadLeakControl.java:468)
	at com.carrotsearch.randomizedtesting.RandomizedRunner.runSingleTest(RandomizedRunner.java:944)
	at com.carrotsearch.randomizedtesting.RandomizedRunner$5.evaluate(RandomizedRunner.java:830)
	at com.carrotsearch.randomizedtesting.RandomizedRunner$6.evaluate(RandomizedRunner.java:880)
	at com.carrotsearch.randomizedtesting.RandomizedRunner$7.evaluate(RandomizedRunner.java:891)
	at com.carrotsearch.randomizedtesting.rules.StatementAdapter.evaluate(StatementAdapter.java:36)
	at com.carrotsearch.randomizedtesting.rules.SystemPropertiesRestoreRule$1.evaluate(SystemPropertiesRestoreRule.java:57)
	at org.apache.lucene.util.AbstractBeforeAfterRule$1.evaluate(AbstractBeforeAfterRule.java:45)
	at com.carrotsearch.randomizedtesting.rules.StatementAdapter.evaluate(StatementAdapter.java:36)
	at org.apache.lucene.util.TestRuleStoreClassName$1.evaluate(TestRuleStoreClassName.java:41)
	at com.carrotsearch.randomizedtesting.rules.NoShadowingOrOverridesOnMethodsRule$1.evaluate(NoShadowingOrOverridesOnMethodsRule.java:40)
	at com.carrotsearch.randomizedtesting.rules.NoShadowingOrOverridesOnMethodsRule$1.evaluate(NoShadowingOrOverridesOnMethodsRule.java:40)
	at com.carrotsearch.randomizedtesting.rules.StatementAdapter.evaluate(StatementAdapter.java:36)
	at com.carrotsearch.randomizedtesting.rules.StatementAdapter.evaluate(StatementAdapter.java:36)
	at org.apache.lucene.util.TestRuleAssertionsRequired$1.evaluate(TestRuleAssertionsRequired.java:53)
	at org.apache.lucene.util.TestRuleMarkFailure$1.evaluate(TestRuleMarkFailure.java:47)
	at org.apache.lucene.util.TestRuleIgnoreAfterMaxFailures$1.evaluate(TestRuleIgnoreAfterMaxFailures.java:64)
	at org.apache.lucene.util.TestRuleIgnoreTestSuites$1.evaluate(TestRuleIgnoreTestSuites.java:54)
	at com.carrotsearch.randomizedtesting.rules.StatementAdapter.evaluate(StatementAdapter.java:36)
	at com.carrotsearch.randomizedtesting.ThreadLeakControl$StatementRunner.run(ThreadLeakControl.java:368)
	at java.base/java.lang.Thread.run(Thread.java:834)


FAILED:  org.apache.solr.cloud.cdcr.CdcrBidirectionalTest.testBiDir

Er

[...truncated too long message...]

t.HttpSolrCall.call(HttpSolrCall.java:496)
   [junit4]   2> 	at org.apache.solr.servlet.SolrDispatchFilter.doFilter(SolrDispatchFilter.java:377)
   [junit4]   2> 	at org.apache.solr.servlet.SolrDispatchFilter.doFilter(SolrDispatchFilter.java:323)
   [junit4]   2> 	at org.eclipse.jetty.servlet.ServletHandler$CachedChain.doFilter(ServletHandler.java:1642)
   [junit4]   2> 	at org.apache.solr.client.solrj.embedded.JettySolrRunner$DebugFilter.doFilter(JettySolrRunner.java:139)
   [junit4]   2> 	at org.eclipse.jetty.servlet.ServletHandler$CachedChain.doFilter(ServletHandler.java:1642)
   [junit4]   2> 	at org.eclipse.jetty.servlet.ServletHandler.doHandle(ServletHandler.java:533)
   [junit4]   2> 	at org.eclipse.jetty.server.handler.ScopedHandler.nextHandle(ScopedHandler.java:255)
   [junit4]   2> 	at org.eclipse.jetty.server.session.SessionHandler.doHandle(SessionHandler.java:1595)
   [junit4]   2> 	at org.eclipse.jetty.server.handler.ScopedHandler.nextHandle(ScopedHandler.java:255)
   [junit4]   2> 	at org.eclipse.jetty.server.handler.ContextHandler.doHandle(ContextHandler.java:1317)
   [junit4]   2> 	at org.eclipse.jetty.server.handler.ScopedHandler.nextScope(ScopedHandler.java:203)
   [junit4]   2> 	at org.eclipse.jetty.servlet.ServletHandler.doScope(ServletHandler.java:473)
   [junit4]   2> 	at org.eclipse.jetty.server.session.SessionHandler.doScope(SessionHandler.java:1564)
   [junit4]   2> 	at org.eclipse.jetty.server.handler.ScopedHandler.nextScope(ScopedHandler.java:201)
   [junit4]   2> 	at org.eclipse.jetty.server.handler.ContextHandler.doScope(ContextHandler.java:1219)
   [junit4]   2> 	at org.eclipse.jetty.server.handler.ScopedHandler.handle(ScopedHandler.java:144)
   [junit4]   2> 	at org.eclipse.jetty.server.handler.gzip.GzipHandler.handle(GzipHandler.java:724)
   [junit4]   2> 	at org.eclipse.jetty.server.handler.HandlerWrapper.handle(HandlerWrapper.java:132)
   [junit4]   2> 	at org.eclipse.jetty.server.Server.handle(Server.java:531)
   [junit4]   2> 	at org.eclipse.jetty.server.HttpChannel.handle(HttpChannel.java:352)
   [junit4]   2> 	at org.eclipse.jetty.server.HttpConnection.onFillable(HttpConnection.java:260)
   [junit4]   2> 	at org.eclipse.jetty.io.AbstractConnection$ReadCallback.succeeded(AbstractConnection.java:281)
   [junit4]   2> 	at org.eclipse.jetty.io.FillInterest.fillable(FillInterest.java:102)
   [junit4]   2> 	at org.eclipse.jetty.io.ssl.SslConnection.onFillable(SslConnection.java:291)
   [junit4]   2> 	at org.eclipse.jetty.io.ssl.SslConnection$3.succeeded(SslConnection.java:151)
   [junit4]   2> 	at org.eclipse.jetty.io.FillInterest.fillable(FillInterest.java:102)
   [junit4]   2> 	at org.eclipse.jetty.io.ChannelEndPoint$2.run(ChannelEndPoint.java:118)
   [junit4]   2> 	at org.eclipse.jetty.util.thread.strategy.EatWhatYouKill.runTask(EatWhatYouKill.java:333)
   [junit4]   2> 	at org.eclipse.jetty.util.thread.strategy.EatWhatYouKill.doProduce(EatWhatYouKill.java:310)
   [junit4]   2> 	at org.eclipse.jetty.util.thread.strategy.EatWhatYouKill.tryProduce(EatWhatYouKill.java:168)
   [junit4]   2> 	at org.eclipse.jetty.util.thread.strategy.EatWhatYouKill.run(EatWhatYouKill.java:126)
   [junit4]   2> 	at org.eclipse.jetty.util.thread.ReservedThreadExecutor$ReservedThread.run(ReservedThreadExecutor.java:366)
   [junit4]   2> 	at org.eclipse.jetty.util.thread.QueuedThreadPool.runJob(QueuedThreadPool.java:762)
   [junit4]   2> 	at org.eclipse.jetty.util.thread.QueuedThreadPool$2.run(QueuedThreadPool.java:680)
   [junit4]   2> 	at java.base/java.lang.Thread.run(Thread.java:834)
   [junit4]   2> 
   [junit4]   2> 358011 INFO  (qtp1096650878-790) [n:127.0.0.1:34045_solr    x:policiesTest_s3_replica_n7] o.a.s.s.HttpSolrCall [admin] webapp=null path=/admin/cores params={nodeName=127.0.0.1:35279_solr&onlyIfLeaderActive=true&core=policiesTest_s3_replica_n7&coreNodeName=core_node10&action=PREPRECOVERY&checkLive=true&state=recovering&onlyIfLeader=true&wt=javabin&version=2} status=400 QTime=19003
   [junit4]   2> 358011 ERROR (SUITE-TestPolicyCloud-seed#[46B26282BF0A1176]-worker) [    ] o.a.z.s.ZooKeeperServer ZKShutdownHandler is not registered, so ZooKeeper server won't take any action on ERROR or SHUTDOWN server state changes
   [junit4]   2> 358011 INFO  (SUITE-TestPolicyCloud-seed#[46B26282BF0A1176]-worker) [    ] o.a.s.c.ZkTestServer connecting to 127.0.0.1:36571 36571
   [junit4]   2> 358132 INFO  (Thread-124) [    ] o.a.s.c.ZkTestServer connecting to 127.0.0.1:36571 36571
   [junit4]   2> 358133 WARN  (Thread-124) [    ] o.a.s.c.ZkTestServer Watch limit violations: 
   [junit4]   2> Maximum concurrent create/delete watches above limit:
   [junit4]   2> 
   [junit4]   2> 	34	/solr/collections/perReplicaDataColl/terms/shard1
   [junit4]   2> 	19	/solr/aliases.json
   [junit4]   2> 	17	/solr/configs/conf
   [junit4]   2> 	13	/solr/collections/policiesTest/terms/s3
   [junit4]   2> 	11	/solr/collections/testCreateCollectionSplitShard/terms/shard1_0
   [junit4]   2> 	10	/solr/collections/policiesTest/terms/s1
   [junit4]   2> 	9	/solr/collections/testCreateCollectionSplitShard/terms/shard1_1
   [junit4]   2> 	8	/solr/collections/testCreateCollectionSplitShard/terms/shard1
   [junit4]   2> 	6	/solr/collections/policiesTest/terms/shard1
   [junit4]   2> 	6	/solr/collections/testCreateCollectionAddReplica/terms/shard1
   [junit4]   2> 	5	/solr/security.json
   [junit4]   2> 	3	/solr/collections/metricsTest/terms/shard1
   [junit4]   2> 	3	/solr/collections/testCreateCollection/terms/shard1
   [junit4]   2> 	3	/solr/collections/policiesTest/terms/s2
   [junit4]   2> 	2	/solr/collections/testCreateCollection/terms/shard2
   [junit4]   2> 
   [junit4]   2> Maximum concurrent data watches above limit:
   [junit4]   2> 
   [junit4]   2> 	36	/solr/aliases.json
   [junit4]   2> 	19	/solr/clusterprops.json
   [junit4]   2> 	19	/solr/clusterstate.json
   [junit4]   2> 	6	/solr/collections/policiesTest/state.json
   [junit4]   2> 	5	/solr/collections/perReplicaDataColl/state.json
   [junit4]   2> 	3	/solr/collections/testCreateCollectionSplitShard/state.json
   [junit4]   2> 	2	/solr/collections/testCreateCollectionAddReplica/state.json
   [junit4]   2> 	2	/solr/collections/testCreateCollection/state.json
   [junit4]   2> 	2	/solr/collections/perReplicaDataColl/leader_elect/shard1/election/72221415373668365-core_node3-n_0000000000
   [junit4]   2> 	2	/solr/overseer_elect/election/72221415373668365-127.0.0.1:43007_solr-n_0000000000
   [junit4]   2> 	2	/solr/overseer_elect/election/72221415373668364-127.0.0.1:37033_solr-n_0000000001
   [junit4]   2> 
   [junit4]   2> Maximum concurrent children watches above limit:
   [junit4]   2> 
   [junit4]   2> 	92	/solr/collections
   [junit4]   2> 	19	/solr/live_nodes
   [junit4]   2> 
   [junit4]   2> NOTE: leaving temporary files on disk at: /home/jenkins/workspace/Lucene-Solr-7.x-Linux/solr/build/solr-core/test/J0/temp/solr.cloud.autoscaling.TestPolicyCloud_46B26282BF0A1176-001
   [junit4]   2> Sep 14, 2018 5:48:33 AM com.carrotsearch.randomizedtesting.ThreadLeakControl checkThreadLeaks
   [junit4]   2> WARNING: Will linger awaiting termination of 1 leaked thread(s).
   [junit4]   2> NOTE: test params are: codec=Asserting(Lucene70): {}, docValues:{}, maxPointsInLeafNode=1372, maxMBSortInHeap=5.742773717602391, sim=RandomSimilarity(queryNorm=true): {}, locale=ar-DZ, timezone=America/Adak
   [junit4]   2> NOTE: Linux 4.15.0-32-generic amd64/Oracle Corporation 11 (64-bit)/cpus=8,threads=1,free=278109880,total=536870912
   [junit4]   2> NOTE: All tests run in this JVM: [MetricTriggerIntegrationTest, CdcrBidirectionalTest, CdcrBidirectionalTest, MetricTriggerIntegrationTest, TestPolicyCloud]
   [junit4] Completed [18/25 (11!)] on J0 in 76.02s, 8 tests, 1 error <<< FAILURES!

[...truncated 67 lines...]
BUILD FAILED
/home/jenkins/workspace/Lucene-Solr-7.x-Linux/lucene/common-build.xml:1567: The following error occurred while executing this line:
/home/jenkins/workspace/Lucene-Solr-7.x-Linux/lucene/common-build.xml:1092: There were test failures: 25 suites, 90 tests, 8 errors, 3 failures [seed: 46B26282BF0A1176]

Total time: 6 minutes 35 seconds

[repro] Setting last failure code to 256

[repro] Failures:
[repro]   0/5 failed: org.apache.solr.cloud.rule.RulesTest
[repro]   1/5 failed: org.apache.solr.cloud.DeleteNodeTest
[repro]   2/5 failed: org.apache.solr.cloud.autoscaling.TestPolicyCloud
[repro]   3/5 failed: org.apache.solr.cloud.autoscaling.MetricTriggerIntegrationTest
[repro]   5/5 failed: org.apache.solr.cloud.cdcr.CdcrBidirectionalTest
[repro] Exiting with code 256
+ mv lucene/build lucene/build.repro
+ mv solr/build solr/build.repro
+ mv lucene/build.orig lucene/build
+ mv solr/build.orig solr/build
Archiving artifacts
Setting ANT_1_8_2_HOME=/var/lib/jenkins/tools/hudson.tasks.Ant_AntInstallation/ANT_1.8.2
[WARNINGS] Parsing warnings in console log with parser Java Compiler (javac)
Setting ANT_1_8_2_HOME=/var/lib/jenkins/tools/hudson.tasks.Ant_AntInstallation/ANT_1.8.2
Setting ANT_1_8_2_HOME=/var/lib/jenkins/tools/hudson.tasks.Ant_AntInstallation/ANT_1.8.2
<Git Blamer> Using GitBlamer to create author and commit information for all warnings.
<Git Blamer> GIT_COMMIT=ae6ceb5cb302b6db17637b5097f5f07740287fb3, workspace=/var/lib/jenkins/workspace/Lucene-Solr-7.x-Linux
[WARNINGS] Computing warning deltas based on reference build #2739
Recording test results
Setting ANT_1_8_2_HOME=/var/lib/jenkins/tools/hudson.tasks.Ant_AntInstallation/ANT_1.8.2
Build step 'Publish JUnit test result report' changed build result to UNSTABLE
Email was triggered for: Unstable (Test Failures)
Sending email for trigger: Unstable (Test Failures)
Setting ANT_1_8_2_HOME=/var/lib/jenkins/tools/hudson.tasks.Ant_AntInstallation/ANT_1.8.2
Setting ANT_1_8_2_HOME=/var/lib/jenkins/tools/hudson.tasks.Ant_AntInstallation/ANT_1.8.2
Setting ANT_1_8_2_HOME=/var/lib/jenkins/tools/hudson.tasks.Ant_AntInstallation/ANT_1.8.2
Setting ANT_1_8_2_HOME=/var/lib/jenkins/tools/hudson.tasks.Ant_AntInstallation/ANT_1.8.2

Mime
View raw message