lucene-dev mailing list archives

Site index · List index
Message view « Date » · « Thread »
Top « Date » · « Thread »
From Policeman Jenkins Server <jenk...@thetaphi.de>
Subject [JENKINS] Lucene-Solr-master-Windows (64bit/jdk-10) - Build # 7528 - Unstable!
Date Fri, 21 Sep 2018 02:55:42 GMT
Build: https://jenkins.thetaphi.de/job/Lucene-Solr-master-Windows/7528/
Java: 64bit/jdk-10 -XX:+UseCompressedOops -XX:+UseConcMarkSweepGC

2 tests failed.
FAILED:  org.apache.solr.cloud.autoscaling.sim.TestSimGenericDistributedQueue.testDistributedQueue

Error Message:
Test abandoned because suite timeout was reached.

Stack Trace:
java.lang.Exception: Test abandoned because suite timeout was reached.
	at __randomizedtesting.SeedInfo.seed([D89C446806E63393]:0)


FAILED:  junit.framework.TestSuite.org.apache.solr.cloud.autoscaling.sim.TestSimGenericDistributedQueue

Error Message:
Suite timeout exceeded (>= 7200000 msec).

Stack Trace:
java.lang.Exception: Suite timeout exceeded (>= 7200000 msec).
	at __randomizedtesting.SeedInfo.seed([D89C446806E63393]:0)




Build Log:
[...truncated 2014 lines...]
   [junit4] JVM J1: stderr was not empty, see: C:\Users\jenkins\workspace\Lucene-Solr-master-Windows\lucene\build\core\test\temp\junit4-J1-20180920_231048_85215800916887169780635.syserr
   [junit4] >>> JVM J1 emitted unexpected output (verbatim) ----
   [junit4] OpenJDK 64-Bit Server VM warning: Option UseConcMarkSweepGC was deprecated in version 9.0 and will likely be removed in a future release.
   [junit4] <<< JVM J1: EOF ----

[...truncated 5 lines...]
   [junit4] JVM J0: stderr was not empty, see: C:\Users\jenkins\workspace\Lucene-Solr-master-Windows\lucene\build\core\test\temp\junit4-J0-20180920_231048_8529801194710611504404.syserr
   [junit4] >>> JVM J0 emitted unexpected output (verbatim) ----
   [junit4] OpenJDK 64-Bit Server VM warning: Option UseConcMarkSweepGC was deprecated in version 9.0 and will likely be removed in a future release.
   [junit4] <<< JVM J0: EOF ----

[...truncated 316 lines...]
   [junit4] JVM J0: stderr was not empty, see: C:\Users\jenkins\workspace\Lucene-Solr-master-Windows\lucene\build\test-framework\test\temp\junit4-J0-20180920_231847_8134382064301340602382.syserr
   [junit4] >>> JVM J0 emitted unexpected output (verbatim) ----
   [junit4] OpenJDK 64-Bit Server VM warning: Option UseConcMarkSweepGC was deprecated in version 9.0 and will likely be removed in a future release.
   [junit4] <<< JVM J0: EOF ----

[...truncated 3 lines...]
   [junit4] JVM J1: stderr was not empty, see: C:\Users\jenkins\workspace\Lucene-Solr-master-Windows\lucene\build\test-framework\test\temp\junit4-J1-20180920_231847_8157591701404588767253.syserr
   [junit4] >>> JVM J1 emitted unexpected output (verbatim) ----
   [junit4] OpenJDK 64-Bit Server VM warning: Option UseConcMarkSweepGC was deprecated in version 9.0 and will likely be removed in a future release.
   [junit4] <<< JVM J1: EOF ----

[...truncated 1084 lines...]
   [junit4] JVM J1: stderr was not empty, see: C:\Users\jenkins\workspace\Lucene-Solr-master-Windows\lucene\build\analysis\common\test\temp\junit4-J1-20180920_232013_80313477644302976691311.syserr
   [junit4] >>> JVM J1 emitted unexpected output (verbatim) ----
   [junit4] OpenJDK 64-Bit Server VM warning: Option UseConcMarkSweepGC was deprecated in version 9.0 and will likely be removed in a future release.
   [junit4] <<< JVM J1: EOF ----

   [junit4] JVM J0: stderr was not empty, see: C:\Users\jenkins\workspace\Lucene-Solr-master-Windows\lucene\build\analysis\common\test\temp\junit4-J0-20180920_232013_8034924801453073123237.syserr
   [junit4] >>> JVM J0 emitted unexpected output (verbatim) ----
   [junit4] OpenJDK 64-Bit Server VM warning: Option UseConcMarkSweepGC was deprecated in version 9.0 and will likely be removed in a future release.
   [junit4] <<< JVM J0: EOF ----

[...truncated 257 lines...]
   [junit4] JVM J1: stderr was not empty, see: C:\Users\jenkins\workspace\Lucene-Solr-master-Windows\lucene\build\analysis\icu\test\temp\junit4-J1-20180920_232250_1233766935157315658076.syserr
   [junit4] >>> JVM J1 emitted unexpected output (verbatim) ----
   [junit4] OpenJDK 64-Bit Server VM warning: Option UseConcMarkSweepGC was deprecated in version 9.0 and will likely be removed in a future release.
   [junit4] <<< JVM J1: EOF ----

[...truncated 3 lines...]
   [junit4] JVM J0: stderr was not empty, see: C:\Users\jenkins\workspace\Lucene-Solr-master-Windows\lucene\build\analysis\icu\test\temp\junit4-J0-20180920_232250_123151876851998442807.syserr
   [junit4] >>> JVM J0 emitted unexpected output (verbatim) ----
   [junit4] OpenJDK 64-Bit Server VM warning: Option UseConcMarkSweepGC was deprecated in version 9.0 and will likely be removed in a future release.
   [junit4] <<< JVM J0: EOF ----

[...truncated 254 lines...]
   [junit4] JVM J1: stderr was not empty, see: C:\Users\jenkins\workspace\Lucene-Solr-master-Windows\lucene\build\analysis\kuromoji\test\temp\junit4-J1-20180920_232301_70711934004336869762484.syserr
   [junit4] >>> JVM J1 emitted unexpected output (verbatim) ----
   [junit4] OpenJDK 64-Bit Server VM warning: Option UseConcMarkSweepGC was deprecated in version 9.0 and will likely be removed in a future release.
   [junit4] <<< JVM J1: EOF ----

[...truncated 3 lines...]
   [junit4] JVM J0: stderr was not empty, see: C:\Users\jenkins\workspace\Lucene-Solr-master-Windows\lucene\build\analysis\kuromoji\test\temp\junit4-J0-20180920_232301_70714215828840766997222.syserr
   [junit4] >>> JVM J0 emitted unexpected output (verbatim) ----
   [junit4] OpenJDK 64-Bit Server VM warning: Option UseConcMarkSweepGC was deprecated in version 9.0 and will likely be removed in a future release.
   [junit4] <<< JVM J0: EOF ----

[...truncated 163 lines...]
   [junit4] JVM J1: stderr was not empty, see: C:\Users\jenkins\workspace\Lucene-Solr-master-Windows\lucene\build\analysis\morfologik\test\temp\junit4-J1-20180920_232335_14214140681096693253362.syserr
   [junit4] >>> JVM J1 emitted unexpected output (verbatim) ----
   [junit4] OpenJDK 64-Bit Server VM warning: Option UseConcMarkSweepGC was deprecated in version 9.0 and will likely be removed in a future release.
   [junit4] <<< JVM J1: EOF ----

[...truncated 3 lines...]
   [junit4] JVM J0: stderr was not empty, see: C:\Users\jenkins\workspace\Lucene-Solr-master-Windows\lucene\build\analysis\morfologik\test\temp\junit4-J0-20180920_232335_1426877656049943018800.syserr
   [junit4] >>> JVM J0 emitted unexpected output (verbatim) ----
   [junit4] OpenJDK 64-Bit Server VM warning: Option UseConcMarkSweepGC was deprecated in version 9.0 and will likely be removed in a future release.
   [junit4] <<< JVM J0: EOF ----

[...truncated 205 lines...]
   [junit4] JVM J1: stderr was not empty, see: C:\Users\jenkins\workspace\Lucene-Solr-master-Windows\lucene\build\analysis\nori\test\temp\junit4-J1-20180920_232339_9973847961748688968996.syserr
   [junit4] >>> JVM J1 emitted unexpected output (verbatim) ----
   [junit4] OpenJDK 64-Bit Server VM warning: Option UseConcMarkSweepGC was deprecated in version 9.0 and will likely be removed in a future release.
   [junit4] <<< JVM J1: EOF ----

[...truncated 6 lines...]
   [junit4] JVM J0: stderr was not empty, see: C:\Users\jenkins\workspace\Lucene-Solr-master-Windows\lucene\build\analysis\nori\test\temp\junit4-J0-20180920_232339_9972675834475872369248.syserr
   [junit4] >>> JVM J0 emitted unexpected output (verbatim) ----
   [junit4] OpenJDK 64-Bit Server VM warning: Option UseConcMarkSweepGC was deprecated in version 9.0 and will likely be removed in a future release.
   [junit4] <<< JVM J0: EOF ----

[...truncated 172 lines...]
   [junit4] JVM J0: stderr was not empty, see: C:\Users\jenkins\workspace\Lucene-Solr-master-Windows\lucene\build\analysis\opennlp\test\temp\junit4-J0-20180920_232352_0707891317101885778903.syserr
   [junit4] >>> JVM J0 emitted unexpected output (verbatim) ----
   [junit4] OpenJDK 64-Bit Server VM warning: Option UseConcMarkSweepGC was deprecated in version 9.0 and will likely be removed in a future release.
   [junit4] <<< JVM J0: EOF ----

   [junit4] JVM J1: stderr was not empty, see: C:\Users\jenkins\workspace\Lucene-Solr-master-Windows\lucene\build\analysis\opennlp\test\temp\junit4-J1-20180920_232352_07017398778062516319165.syserr
   [junit4] >>> JVM J1 emitted unexpected output (verbatim) ----
   [junit4] OpenJDK 64-Bit Server VM warning: Option UseConcMarkSweepGC was deprecated in version 9.0 and will likely be removed in a future release.
   [junit4] <<< JVM J1: EOF ----

[...truncated 177 lines...]
   [junit4] JVM J0: stderr was not empty, see: C:\Users\jenkins\workspace\Lucene-Solr-master-Windows\lucene\build\analysis\phonetic\test\temp\junit4-J0-20180920_232355_8548311421767619826585.syserr
   [junit4] >>> JVM J0 emitted unexpected output (verbatim) ----
   [junit4] OpenJDK 64-Bit Server VM warning: Option UseConcMarkSweepGC was deprecated in version 9.0 and will likely be removed in a future release.
   [junit4] <<< JVM J0: EOF ----

[...truncated 3 lines...]
   [junit4] JVM J1: stderr was not empty, see: C:\Users\jenkins\workspace\Lucene-Solr-master-Windows\lucene\build\analysis\phonetic\test\temp\junit4-J1-20180920_232355_8543962060752310963166.syserr
   [junit4] >>> JVM J1 emitted unexpected output (verbatim) ----
   [junit4] OpenJDK 64-Bit Server VM warning: Option UseConcMarkSweepGC was deprecated in version 9.0 and will likely be removed in a future release.
   [junit4] <<< JVM J1: EOF ----

[...truncated 160 lines...]
   [junit4] JVM J0: stderr was not empty, see: C:\Users\jenkins\workspace\Lucene-Solr-master-Windows\lucene\build\analysis\smartcn\test\temp\junit4-J0-20180920_232407_6418303409146516195488.syserr
   [junit4] >>> JVM J0 emitted unexpected output (verbatim) ----
   [junit4] OpenJDK 64-Bit Server VM warning: Option UseConcMarkSweepGC was deprecated in version 9.0 and will likely be removed in a future release.
   [junit4] <<< JVM J0: EOF ----

[...truncated 3 lines...]
   [junit4] JVM J1: stderr was not empty, see: C:\Users\jenkins\workspace\Lucene-Solr-master-Windows\lucene\build\analysis\smartcn\test\temp\junit4-J1-20180920_232407_64112194067362973667478.syserr
   [junit4] >>> JVM J1 emitted unexpected output (verbatim) ----
   [junit4] OpenJDK 64-Bit Server VM warning: Option UseConcMarkSweepGC was deprecated in version 9.0 and will likely be removed in a future release.
   [junit4] <<< JVM J1: EOF ----

[...truncated 168 lines...]
   [junit4] JVM J1: stderr was not empty, see: C:\Users\jenkins\workspace\Lucene-Solr-master-Windows\lucene\build\analysis\stempel\test\temp\junit4-J1-20180920_232413_85512485881989082088974.syserr
   [junit4] >>> JVM J1 emitted unexpected output (verbatim) ----
   [junit4] OpenJDK 64-Bit Server VM warning: Option UseConcMarkSweepGC was deprecated in version 9.0 and will likely be removed in a future release.
   [junit4] <<< JVM J1: EOF ----

   [junit4] JVM J0: stderr was not empty, see: C:\Users\jenkins\workspace\Lucene-Solr-master-Windows\lucene\build\analysis\stempel\test\temp\junit4-J0-20180920_232413_85517727492670250431831.syserr
   [junit4] >>> JVM J0 emitted unexpected output (verbatim) ----
   [junit4] OpenJDK 64-Bit Server VM warning: Option UseConcMarkSweepGC was deprecated in version 9.0 and will likely be removed in a future release.
   [junit4] <<< JVM J0: EOF ----

[...truncated 161 lines...]
   [junit4] JVM J1: stderr was not empty, see: C:\Users\jenkins\workspace\Lucene-Solr-master-Windows\lucene\build\backward-codecs\test\temp\junit4-J1-20180920_232417_58214981898770549129747.syserr
   [junit4] >>> JVM J1 emitted unexpected output (verbatim) ----
   [junit4] OpenJDK 64-Bit Server VM warning: Option UseConcMarkSweepGC was deprecated in version 9.0 and will likely be removed in a future release.
   [junit4] <<< JVM J1: EOF ----

[...truncated 19 lines...]
   [junit4] JVM J0: stderr was not empty, see: C:\Users\jenkins\workspace\Lucene-Solr-master-Windows\lucene\build\backward-codecs\test\temp\junit4-J0-20180920_232417_5827369676835090166256.syserr
   [junit4] >>> JVM J0 emitted unexpected output (verbatim) ----
   [junit4] OpenJDK 64-Bit Server VM warning: Option UseConcMarkSweepGC was deprecated in version 9.0 and will likely be removed in a future release.
   [junit4] <<< JVM J0: EOF ----

[...truncated 1408 lines...]
   [junit4] JVM J0: stderr was not empty, see: C:\Users\jenkins\workspace\Lucene-Solr-master-Windows\lucene\build\benchmark\test\temp\junit4-J0-20180920_232449_4804101330189030796707.syserr
   [junit4] >>> JVM J0 emitted unexpected output (verbatim) ----
   [junit4] OpenJDK 64-Bit Server VM warning: Option UseConcMarkSweepGC was deprecated in version 9.0 and will likely be removed in a future release.
   [junit4] <<< JVM J0: EOF ----

[...truncated 3 lines...]
   [junit4] JVM J1: stderr was not empty, see: C:\Users\jenkins\workspace\Lucene-Solr-master-Windows\lucene\build\benchmark\test\temp\junit4-J1-20180920_232449_4804177021873313615873.syserr
   [junit4] >>> JVM J1 emitted unexpected output (verbatim) ----
   [junit4] OpenJDK 64-Bit Server VM warning: Option UseConcMarkSweepGC was deprecated in version 9.0 and will likely be removed in a future release.
   [junit4] <<< JVM J1: EOF ----

[...truncated 255 lines...]
   [junit4] JVM J0: stderr was not empty, see: C:\Users\jenkins\workspace\Lucene-Solr-master-Windows\lucene\build\classification\test\temp\junit4-J0-20180920_232500_8005691730368195517531.syserr
   [junit4] >>> JVM J0 emitted unexpected output (verbatim) ----
   [junit4] OpenJDK 64-Bit Server VM warning: Option UseConcMarkSweepGC was deprecated in version 9.0 and will likely be removed in a future release.
   [junit4] <<< JVM J0: EOF ----

   [junit4] JVM J1: stderr was not empty, see: C:\Users\jenkins\workspace\Lucene-Solr-master-Windows\lucene\build\classification\test\temp\junit4-J1-20180920_232500_80011344199167236768393.syserr
   [junit4] >>> JVM J1 emitted unexpected output (verbatim) ----
   [junit4] OpenJDK 64-Bit Server VM warning: Option UseConcMarkSweepGC was deprecated in version 9.0 and will likely be removed in a future release.
   [junit4] <<< JVM J1: EOF ----

[...truncated 262 lines...]
   [junit4] JVM J1: stderr was not empty, see: C:\Users\jenkins\workspace\Lucene-Solr-master-Windows\lucene\build\codecs\test\temp\junit4-J1-20180920_232519_921934664251552278146.syserr
   [junit4] >>> JVM J1 emitted unexpected output (verbatim) ----
   [junit4] OpenJDK 64-Bit Server VM warning: Option UseConcMarkSweepGC was deprecated in version 9.0 and will likely be removed in a future release.
   [junit4] <<< JVM J1: EOF ----

[...truncated 3 lines...]
   [junit4] JVM J0: stderr was not empty, see: C:\Users\jenkins\workspace\Lucene-Solr-master-Windows\lucene\build\codecs\test\temp\junit4-J0-20180920_232519_92211074316355594946859.syserr
   [junit4] >>> JVM J0 emitted unexpected output (verbatim) ----
   [junit4] OpenJDK 64-Bit Server VM warning: Option UseConcMarkSweepGC was deprecated in version 9.0 and will likely be removed in a future release.
   [junit4] <<< JVM J0: EOF ----

[...truncated 235 lines...]
   [junit4] JVM J1: stderr was not empty, see: C:\Users\jenkins\workspace\Lucene-Solr-master-Windows\lucene\build\demo\test\temp\junit4-J1-20180920_232707_3658667677464086307690.syserr
   [junit4] >>> JVM J1 emitted unexpected output (verbatim) ----
   [junit4] OpenJDK 64-Bit Server VM warning: Option UseConcMarkSweepGC was deprecated in version 9.0 and will likely be removed in a future release.
   [junit4] <<< JVM J1: EOF ----

   [junit4] JVM J0: stderr was not empty, see: C:\Users\jenkins\workspace\Lucene-Solr-master-Windows\lucene\build\demo\test\temp\junit4-J0-20180920_232707_3651980423773080331123.syserr
   [junit4] >>> JVM J0 emitted unexpected output (verbatim) ----
   [junit4] OpenJDK 64-Bit Server VM warning: Option UseConcMarkSweepGC was deprecated in version 9.0 and will likely be removed in a future release.
   [junit4] <<< JVM J0: EOF ----

[...truncated 174 lines...]
   [junit4] JVM J0: stderr was not empty, see: C:\Users\jenkins\workspace\Lucene-Solr-master-Windows\lucene\build\expressions\test\temp\junit4-J0-20180920_232712_6238276937207685573763.syserr
   [junit4] >>> JVM J0 emitted unexpected output (verbatim) ----
   [junit4] OpenJDK 64-Bit Server VM warning: Option UseConcMarkSweepGC was deprecated in version 9.0 and will likely be removed in a future release.
   [junit4] <<< JVM J0: EOF ----

[...truncated 3 lines...]
   [junit4] JVM J1: stderr was not empty, see: C:\Users\jenkins\workspace\Lucene-Solr-master-Windows\lucene\build\expressions\test\temp\junit4-J1-20180920_232712_62210638889047090093559.syserr
   [junit4] >>> JVM J1 emitted unexpected output (verbatim) ----
   [junit4] OpenJDK 64-Bit Server VM warning: Option UseConcMarkSweepGC was deprecated in version 9.0 and will likely be removed in a future release.
   [junit4] <<< JVM J1: EOF ----

[...truncated 235 lines...]
   [junit4] JVM J0: stderr was not empty, see: C:\Users\jenkins\workspace\Lucene-Solr-master-Windows\lucene\build\facet\test\temp\junit4-J0-20180920_232718_7869993774943443810470.syserr
   [junit4] >>> JVM J0 emitted unexpected output (verbatim) ----
   [junit4] OpenJDK 64-Bit Server VM warning: Option UseConcMarkSweepGC was deprecated in version 9.0 and will likely be removed in a future release.
   [junit4] <<< JVM J0: EOF ----

[...truncated 3 lines...]
   [junit4] JVM J1: stderr was not empty, see: C:\Users\jenkins\workspace\Lucene-Solr-master-Windows\lucene\build\facet\test\temp\junit4-J1-20180920_232718_78610266049013189942537.syserr
   [junit4] >>> JVM J1 emitted unexpected output (verbatim) ----
   [junit4] OpenJDK 64-Bit Server VM warning: Option UseConcMarkSweepGC was deprecated in version 9.0 and will likely be removed in a future release.
   [junit4] <<< JVM J1: EOF ----

[...truncated 183 lines...]
   [junit4] JVM J0: stderr was not empty, see: C:\Users\jenkins\workspace\Lucene-Solr-master-Windows\lucene\build\grouping\test\temp\junit4-J0-20180920_232753_2997609265002898605074.syserr
   [junit4] >>> JVM J0 emitted unexpected output (verbatim) ----
   [junit4] OpenJDK 64-Bit Server VM warning: Option UseConcMarkSweepGC was deprecated in version 9.0 and will likely be removed in a future release.
   [junit4] <<< JVM J0: EOF ----

[...truncated 3 lines...]
   [junit4] JVM J1: stderr was not empty, see: C:\Users\jenkins\workspace\Lucene-Solr-master-Windows\lucene\build\grouping\test\temp\junit4-J1-20180920_232753_29913030927682196457579.syserr
   [junit4] >>> JVM J1 emitted unexpected output (verbatim) ----
   [junit4] OpenJDK 64-Bit Server VM warning: Option UseConcMarkSweepGC was deprecated in version 9.0 and will likely be removed in a future release.
   [junit4] <<< JVM J1: EOF ----

[...truncated 259 lines...]
   [junit4] JVM J0: stderr was not empty, see: C:\Users\jenkins\workspace\Lucene-Solr-master-Windows\lucene\build\highlighter\test\temp\junit4-J0-20180920_232800_08812208311744117856571.syserr
   [junit4] >>> JVM J0 emitted unexpected output (verbatim) ----
   [junit4] OpenJDK 64-Bit Server VM warning: Option UseConcMarkSweepGC was deprecated in version 9.0 and will likely be removed in a future release.
   [junit4] <<< JVM J0: EOF ----

   [junit4] JVM J1: stderr was not empty, see: C:\Users\jenkins\workspace\Lucene-Solr-master-Windows\lucene\build\highlighter\test\temp\junit4-J1-20180920_232800_08813668931224954921083.syserr
   [junit4] >>> JVM J1 emitted unexpected output (verbatim) ----
   [junit4] OpenJDK 64-Bit Server VM warning: Option UseConcMarkSweepGC was deprecated in version 9.0 and will likely be removed in a future release.
   [junit4] <<< JVM J1: EOF ----

[...truncated 167 lines...]
   [junit4] JVM J0: stderr was not empty, see: C:\Users\jenkins\workspace\Lucene-Solr-master-Windows\lucene\build\join\test\temp\junit4-J0-20180920_232827_2249021036793693529033.syserr
   [junit4] >>> JVM J0 emitted unexpected output (verbatim) ----
   [junit4] OpenJDK 64-Bit Server VM warning: Option UseConcMarkSweepGC was deprecated in version 9.0 and will likely be removed in a future release.
   [junit4] <<< JVM J0: EOF ----

[...truncated 3 lines...]
   [junit4] JVM J1: stderr was not empty, see: C:\Users\jenkins\workspace\Lucene-Solr-master-Windows\lucene\build\join\test\temp\junit4-J1-20180920_232827_2254725498647976814908.syserr
   [junit4] >>> JVM J1 emitted unexpected output (verbatim) ----
   [junit4] OpenJDK 64-Bit Server VM warning: Option UseConcMarkSweepGC was deprecated in version 9.0 and will likely be removed in a future release.
   [junit4] <<< JVM J1: EOF ----

[...truncated 156 lines...]
   [junit4] JVM J0: stderr was not empty, see: C:\Users\jenkins\workspace\Lucene-Solr-master-Windows\lucene\build\memory\test\temp\junit4-J0-20180920_232839_0976731107276918129863.syserr
   [junit4] >>> JVM J0 emitted unexpected output (verbatim) ----
   [junit4] OpenJDK 64-Bit Server VM warning: Option UseConcMarkSweepGC was deprecated in version 9.0 and will likely be removed in a future release.
   [junit4] <<< JVM J0: EOF ----

[...truncated 3 lines...]
   [junit4] JVM J1: stderr was not empty, see: C:\Users\jenkins\workspace\Lucene-Solr-master-Windows\lucene\build\memory\test\temp\junit4-J1-20180920_232839_0972203247402823543020.syserr
   [junit4] >>> JVM J1 emitted unexpected output (verbatim) ----
   [junit4] OpenJDK 64-Bit Server VM warning: Option UseConcMarkSweepGC was deprecated in version 9.0 and will likely be removed in a future release.
   [junit4] <<< JVM J1: EOF ----

[...truncated 199 lines...]
   [junit4] JVM J1: stderr was not empty, see: C:\Users\jenkins\workspace\Lucene-Solr-master-Windows\lucene\build\misc\test\temp\junit4-J1-20180920_232846_5406021179790062338735.syserr
   [junit4] >>> JVM J1 emitted unexpected output (verbatim) ----
   [junit4] OpenJDK 64-Bit Server VM warning: Option UseConcMarkSweepGC was deprecated in version 9.0 and will likely be removed in a future release.
   [junit4] <<< JVM J1: EOF ----

   [junit4] JVM J0: stderr was not empty, see: C:\Users\jenkins\workspace\Lucene-Solr-master-Windows\lucene\build\misc\test\temp\junit4-J0-20180920_232846_54017369522965074573637.syserr
   [junit4] >>> JVM J0 emitted unexpected output (verbatim) ----
   [junit4] OpenJDK 64-Bit Server VM warning: Option UseConcMarkSweepGC was deprecated in version 9.0 and will likely be removed in a future release.
   [junit4] <<< JVM J0: EOF ----

[...truncated 307 lines...]
   [junit4] JVM J0: stderr was not empty, see: C:\Users\jenkins\workspace\Lucene-Solr-master-Windows\lucene\build\queries\test\temp\junit4-J0-20180920_232911_08217584612133822816883.syserr
   [junit4] >>> JVM J0 emitted unexpected output (verbatim) ----
   [junit4] OpenJDK 64-Bit Server VM warning: Option UseConcMarkSweepGC was deprecated in version 9.0 and will likely be removed in a future release.
   [junit4] <<< JVM J0: EOF ----

[...truncated 3 lines...]
   [junit4] JVM J1: stderr was not empty, see: C:\Users\jenkins\workspace\Lucene-Solr-master-Windows\lucene\build\queries\test\temp\junit4-J1-20180920_232911_0829954419801311959609.syserr
   [junit4] >>> JVM J1 emitted unexpected output (verbatim) ----
   [junit4] OpenJDK 64-Bit Server VM warning: Option UseConcMarkSweepGC was deprecated in version 9.0 and will likely be removed in a future release.
   [junit4] <<< JVM J1: EOF ----

[...truncated 232 lines...]
   [junit4] JVM J1: stderr was not empty, see: C:\Users\jenkins\workspace\Lucene-Solr-master-Windows\lucene\build\queryparser\test\temp\junit4-J1-20180920_232919_92611556313494795042060.syserr
   [junit4] >>> JVM J1 emitted unexpected output (verbatim) ----
   [junit4] OpenJDK 64-Bit Server VM warning: Option UseConcMarkSweepGC was deprecated in version 9.0 and will likely be removed in a future release.
   [junit4] <<< JVM J1: EOF ----

[...truncated 3 lines...]
   [junit4] JVM J0: stderr was not empty, see: C:\Users\jenkins\workspace\Lucene-Solr-master-Windows\lucene\build\queryparser\test\temp\junit4-J0-20180920_232919_926799920895893554970.syserr
   [junit4] >>> JVM J0 emitted unexpected output (verbatim) ----
   [junit4] OpenJDK 64-Bit Server VM warning: Option UseConcMarkSweepGC was deprecated in version 9.0 and will likely be removed in a future release.
   [junit4] <<< JVM J0: EOF ----

[...truncated 197 lines...]
   [junit4] JVM J0: stderr was not empty, see: C:\Users\jenkins\workspace\Lucene-Solr-master-Windows\lucene\build\replicator\test\temp\junit4-J0-20180920_232928_9167912274968675094248.syserr
   [junit4] >>> JVM J0 emitted unexpected output (verbatim) ----
   [junit4] OpenJDK 64-Bit Server VM warning: Option UseConcMarkSweepGC was deprecated in version 9.0 and will likely be removed in a future release.
   [junit4] <<< JVM J0: EOF ----

[...truncated 23 lines...]
   [junit4] JVM J1: stderr was not empty, see: C:\Users\jenkins\workspace\Lucene-Solr-master-Windows\lucene\build\replicator\test\temp\junit4-J1-20180920_232928_91617689581570980862551.syserr
   [junit4] >>> JVM J1 emitted unexpected output (verbatim) ----
   [junit4] OpenJDK 64-Bit Server VM warning: Option UseConcMarkSweepGC was deprecated in version 9.0 and will likely be removed in a future release.
   [junit4] <<< JVM J1: EOF ----

[...truncated 218 lines...]
   [junit4] JVM J0: stderr was not empty, see: C:\Users\jenkins\workspace\Lucene-Solr-master-Windows\lucene\build\sandbox\test\temp\junit4-J0-20180920_232946_0541225443135642890199.syserr
   [junit4] >>> JVM J0 emitted unexpected output (verbatim) ----
   [junit4] OpenJDK 64-Bit Server VM warning: Option UseConcMarkSweepGC was deprecated in version 9.0 and will likely be removed in a future release.
   [junit4] <<< JVM J0: EOF ----

[...truncated 5 lines...]
   [junit4] JVM J1: stderr was not empty, see: C:\Users\jenkins\workspace\Lucene-Solr-master-Windows\lucene\build\sandbox\test\temp\junit4-J1-20180920_232946_05411518704539641155605.syserr
   [junit4] >>> JVM J1 emitted unexpected output (verbatim) ----
   [junit4] OpenJDK 64-Bit Server VM warning: Option UseConcMarkSweepGC was deprecated in version 9.0 and will likely be removed in a future release.
   [junit4] <<< JVM J1: EOF ----

[...truncated 297 lines...]
   [junit4] JVM J1: stderr was not empty, see: C:\Users\jenkins\workspace\Lucene-Solr-master-Windows\lucene\build\spatial-extras\test\temp\junit4-J1-20180920_233036_2308463738168873074348.syserr
   [junit4] >>> JVM J1 emitted unexpected output (verbatim) ----
   [junit4] OpenJDK 64-Bit Server VM warning: Option UseConcMarkSweepGC was deprecated in version 9.0 and will likely be removed in a future release.
   [junit4] <<< JVM J1: EOF ----

[...truncated 3 lines...]
   [junit4] JVM J0: stderr was not empty, see: C:\Users\jenkins\workspace\Lucene-Solr-master-Windows\lucene\build\spatial-extras\test\temp\junit4-J0-20180920_233036_2301291780504813114019.syserr
   [junit4] >>> JVM J0 emitted unexpected output (verbatim) ----
   [junit4] OpenJDK 64-Bit Server VM warning: Option UseConcMarkSweepGC was deprecated in version 9.0 and will likely be removed in a future release.
   [junit4] <<< JVM J0: EOF ----

[...truncated 193 lines...]
   [junit4] JVM J0: stderr was not empty, see: C:\Users\jenkins\workspace\Lucene-Solr-master-Windows\lucene\build\spatial3d\test\temp\junit4-J0-20180920_233103_93811868693451040985531.syserr
   [junit4] >>> JVM J0 emitted unexpected output (verbatim) ----
   [junit4] OpenJDK 64-Bit Server VM warning: Option UseConcMarkSweepGC was deprecated in version 9.0 and will likely be removed in a future release.
   [junit4] <<< JVM J0: EOF ----

[...truncated 5 lines...]
   [junit4] JVM J1: stderr was not empty, see: C:\Users\jenkins\workspace\Lucene-Solr-master-Windows\lucene\build\spatial3d\test\temp\junit4-J1-20180920_233103_93814881052062975753719.syserr
   [junit4] >>> JVM J1 emitted unexpected output (verbatim) ----
   [junit4] OpenJDK 64-Bit Server VM warning: Option UseConcMarkSweepGC was deprecated in version 9.0 and will likely be removed in a future release.
   [junit4] <<< JVM J1: EOF ----

[...truncated 152 lines...]
   [junit4] JVM J0: stderr was not empty, see: C:\Users\jenkins\workspace\Lucene-Solr-master-Windows\lucene\build\spatial\test\temp\junit4-J0-20180920_233120_2924747176721917932540.syserr
   [junit4] >>> JVM J0 emitted unexpected output (verbatim) ----
   [junit4] OpenJDK 64-Bit Server VM warning: Option UseConcMarkSweepGC was deprecated in version 9.0 and will likely be removed in a future release.
   [junit4] <<< JVM J0: EOF ----

[...truncated 256 lines...]
   [junit4] JVM J1: stderr was not empty, see: C:\Users\jenkins\workspace\Lucene-Solr-master-Windows\lucene\build\suggest\test\temp\junit4-J1-20180920_233124_2954827637493482852183.syserr
   [junit4] >>> JVM J1 emitted unexpected output (verbatim) ----
   [junit4] OpenJDK 64-Bit Server VM warning: Option UseConcMarkSweepGC was deprecated in version 9.0 and will likely be removed in a future release.
   [junit4] <<< JVM J1: EOF ----

[...truncated 3 lines...]
   [junit4] JVM J0: stderr was not empty, see: C:\Users\jenkins\workspace\Lucene-Solr-master-Windows\lucene\build\suggest\test\temp\junit4-J0-20180920_233124_29516868467461582559818.syserr
   [junit4] >>> JVM J0 emitted unexpected output (verbatim) ----
   [junit4] OpenJDK 64-Bit Server VM warning: Option UseConcMarkSweepGC was deprecated in version 9.0 and will likely be removed in a future release.
   [junit4] <<< JVM J0: EOF ----

[...truncated 4845 lines...]
   [junit4] JVM J1: stderr was not empty, see: C:\Users\jenkins\workspace\Lucene-Solr-master-Windows\solr\build\solr-core\test\temp\junit4-J1-20180920_233252_73418411331411658117479.syserr
   [junit4] >>> JVM J1 emitted unexpected output (verbatim) ----
   [junit4] OpenJDK 64-Bit Server VM warning: Option UseConcMarkSweepGC was deprecated in version 9.0 and will likely be removed in a future release.
   [junit4] <<< JVM J1: EOF ----

[...truncated 87 lines...]
   [junit4] Suite: org.apache.solr.cloud.autoscaling.sim.TestSimGenericDistributedQueue
   [junit4]   2> Creating dataDir: C:\Users\jenkins\workspace\Lucene-Solr-master-Windows\solr\build\solr-core\test\J0\temp\solr.cloud.autoscaling.sim.TestSimGenericDistributedQueue_D89C446806E63393-001\init-core-data-001
   [junit4]   2> ????? ??, ???? ??:??:?? ??????? com.carrotsearch.randomizedtesting.ThreadLeakControl$2 evaluate
   [junit4]   2> WARNING: Suite execution timed out: org.apache.solr.cloud.autoscaling.sim.TestSimGenericDistributedQueue
   [junit4]   2> ==== jstack at approximately timeout time ====
   [junit4]   2> "main" ID=1 WAITING on com.carrotsearch.randomizedtesting.RandomizedRunner$2@40343bc1
   [junit4]   2> 	at java.base@10/java.lang.Object.wait(Native Method)
   [junit4]   2> 	- waiting on com.carrotsearch.randomizedtesting.RandomizedRunner$2@40343bc1
   [junit4]   2> 	at java.base@10/java.lang.Thread.join(Thread.java:1353)
   [junit4]   2> 	at java.base@10/java.lang.Thread.join(Thread.java:1427)
   [junit4]   2> 	at app//com.carrotsearch.randomizedtesting.RandomizedRunner.runSuite(RandomizedRunner.java:637)
   [junit4]   2> 	at app//com.carrotsearch.randomizedtesting.RandomizedRunner.run(RandomizedRunner.java:494)
   [junit4]   2> 	at app//com.carrotsearch.ant.tasks.junit4.slave.SlaveMain.execute(SlaveMain.java:269)
   [junit4]   2> 	at app//com.carrotsearch.ant.tasks.junit4.slave.SlaveMain.main(SlaveMain.java:394)
   [junit4]   2> 	at app//com.carrotsearch.ant.tasks.junit4.slave.SlaveMainSafe.main(SlaveMainSafe.java:13)
   [junit4]   2> 
   [junit4]   2> "Reference Handler" ID=2 RUNNABLE
   [junit4]   2> 	at java.base@10/java.lang.ref.Reference.waitForReferencePendingList(Native Method)
   [junit4]   2> 	at java.base@10/java.lang.ref.Reference.processPendingReferences(Reference.java:174)
   [junit4]   2> 	at java.base@10/java.lang.ref.Reference.access$000(Reference.java:44)
   [junit4]   2> 	at java.base@10/java.lang.ref.Reference$ReferenceHandler.run(Reference.java:138)
   [junit4]   2> 
   [junit4]   2> "Finalizer" ID=3 WAITING on java.lang.ref.ReferenceQueue$Lock@23aff7d9
   [junit4]   2> 	at java.base@10/java.lang.Object.wait(Native Method)
   [junit4]   2> 	- waiting on java.lang.ref.ReferenceQueue$Lock@23aff7d9
   [junit4]   2> 	at java.base@10/java.lang.ref.ReferenceQueue.remove(ReferenceQueue.java:151)
   [junit4]   2> 	at java.base@10/java.lang.ref.ReferenceQueue.remove(ReferenceQueue.java:172)
   [junit4]   2> 	at java.base@10/java.lang.ref.Finalizer$FinalizerThread.run(Finalizer.java:216)
   [junit4]   2> 
   [junit4]   2> "Signal Dispatcher" ID=4 RUNNABLE
   [junit4]   2> 
   [junit4]   2> "Attach Listener" ID=5 RUNNABLE
   [junit4]   2> 
   [junit4]   2> "Common-Cleaner" ID=9 TIMED_WAITING on java.lang.ref.ReferenceQueue$Lock@320e0d7b
   [junit4]   2> 	at java.base@10/java.lang.Object.wait(Native Method)
   [junit4]   2> 	- timed waiting on java.lang.ref.ReferenceQueue$Lock@320e0d7b
   [junit4]   2> 	at java.base@10/java.lang.ref.ReferenceQueue.remove(ReferenceQueue.java:151)
   [junit4]   2> 	at java.base@10/jdk.internal.ref.CleanerImpl.run(CleanerImpl.java:148)
   [junit4]   2> 	at java.base@10/java.lang.Thread.run(Thread.java:844)
   [junit4]   2> 	at java.base@10/jdk.internal.misc.InnocuousThread.run(InnocuousThread.java:134)
   [junit4]   2> 
   [junit4]   2> "JUnit4-serializer-daemon" ID=11 TIMED_WAITING
   [junit4]   2> 	at java.base@10/java.lang.Thread.sleep(Native Method)
   [junit4]   2> 	at app//com.carrotsearch.ant.tasks.junit4.events.Serializer$1.run(Serializer.java:50)
   [junit4]   2> 
   [junit4]   2> "SeedGenerator Thread" ID=15 WAITING on sun.security.provider.SeedGenerator$ThreadedSeedGenerator@1b615dfb
   [junit4]   2> 	at java.base@10/java.lang.Object.wait(Native Method)
   [junit4]   2> 	- waiting on sun.security.provider.SeedGenerator$ThreadedSeedGenerator@1b615dfb
   [junit4]   2> 	at java.base@10/java.lang.Object.wait(Object.java:328)
   [junit4]   2> 	at java.base@10/sun.security.provider.SeedGenerator$ThreadedSeedGenerator.run(SeedGenerator.java:332)
   [junit4]   2> 	at java.base@10/java.lang.Thread.run(Thread.java:844)
   [junit4]   2> 
   [junit4]   2> "TimeLimitedCollector timer thread" ID=7512 TIMED_WAITING
   [junit4]   2> 	at java.base@10/java.lang.Thread.sleep(Native Method)
   [junit4]   2> 	at app//org.apache.lucene.search.TimeLimitingCollector$TimerThread.run(TimeLimitingCollector.java:261)
   [junit4]   2> 
   [junit4]   2> "SUITE-TestSimGenericDistributedQueue-seed#[D89C446806E63393]" ID=32562 RUNNABLE
   [junit4]   2> 	at java.management@10/sun.management.ThreadImpl.dumpThreads0(Native Method)
   [junit4]   2> 	at java.management@10/sun.management.ThreadImpl.dumpAllThreads(ThreadImpl.java:502)
   [junit4]   2> 	at java.management@10/sun.management.ThreadImpl.dumpAllThreads(ThreadImpl.java:490)
   [junit4]   2> 	at app//com.carrotsearch.randomizedtesting.ThreadLeakControl.formatThreadStacksFull(ThreadLeakControl.java:681)
   [junit4]   2> 	at app//com.carrotsearch.randomizedtesting.ThreadLeakControl.access$1000(ThreadLeakControl.java:65)
   [junit4]   2> 	at app//com.carrotsearch.randomizedtesting.ThreadLeakControl$2.evaluate(ThreadLeakControl.java:415)
   [junit4]   2> 	- locked java.lang.Object@10931fa
   [junit4]   2> 	at app//com.carrotsearch.randomizedtesting.RandomizedRunner.runSuite(RandomizedRunner.java:706)
   [junit4]   2> 	at app//com.carrotsearch.randomizedtesting.RandomizedRunner.access$200(RandomizedRunner.java:140)
   [junit4]   2> 	at app//com.carrotsearch.randomizedtesting.RandomizedRunner$2.run(RandomizedRunner.java:627)
   [junit4]   2> 
   [junit4]   2> "TEST-TestSimGenericDistributedQueue.testDistributedQueue-seed#[D89C446806E63393]" ID=32563 TIMED_WAITING on java.util.concurrent.locks.AbstractQueuedSynchronizer$ConditionObject@51490500
   [junit4]   2> 	at java.base@10/jdk.internal.misc.Unsafe.park(Native Method)
   [junit4]   2> 	- timed waiting on java.util.concurrent.locks.AbstractQueuedSynchronizer$ConditionObject@51490500
   [junit4]   2> 	at java.base@10/java.util.concurrent.locks.LockSupport.parkNanos(LockSupport.java:234)
   [junit4]   2> 	at java.base@10/java.util.concurrent.locks.AbstractQueuedSynchronizer$ConditionObject.awaitNanos(AbstractQueuedSynchronizer.java:2117)
   [junit4]   2> 	at app//org.apache.solr.cloud.autoscaling.sim.GenericDistributedQueue.peek(GenericDistributedQueue.java:194)
   [junit4]   2> 	at app//org.apache.solr.cloud.autoscaling.sim.GenericDistributedQueue.peek(GenericDistributedQueue.java:167)
   [junit4]   2> 	at app//org.apache.solr.cloud.autoscaling.sim.TestSimDistributedQueue.testDistributedQueue(TestSimDistributedQueue.java:74)
   [junit4]   2> 	at app//org.apache.solr.cloud.autoscaling.sim.TestSimGenericDistributedQueue.testDistributedQueue(TestSimGenericDistributedQueue.java:36)
   [junit4]   2> 	at java.base@10/jdk.internal.reflect.NativeMethodAccessorImpl.invoke0(Native Method)
   [junit4]   2> 	at java.base@10/jdk.internal.reflect.NativeMethodAccessorImpl.invoke(NativeMethodAccessorImpl.java:62)
   [junit4]   2> 	at java.base@10/jdk.internal.reflect.DelegatingMethodAccessorImpl.invoke(DelegatingMethodAccessorImpl.java:43)
   [junit4]   2> 	at java.base@10/java.lang.reflect.Method.invoke(Method.java:564)
   [junit4]   2> 	at app//com.carrotsearch.randomizedtesting.RandomizedRunner.invoke(RandomizedRunner.java:1742)
   [junit4]   2> 	at app//com.carrotsearch.randomizedtesting.RandomizedRunner$8.evaluate(RandomizedRunner.java:935)
   [junit4]   2> 	at app//com.carrotsearch.randomizedtesting.RandomizedRunner$9.evaluate(RandomizedRunner.java:971)
   [junit4]   2> 	at app//com.carrotsearch.randomizedtesting.RandomizedRunner$10.evaluate(RandomizedRunner.java:985)
   [junit4]   2> 	at app//com.carrotsearch.randomizedtesting.rules.SystemPropertiesRestoreRule$1.evaluate(SystemPropertiesRestoreRule.java:57)
   [junit4]   2> 	at app//org.apache.lucene.util.TestRuleSetupTeardownChained$1.evaluate(TestRuleSetupTeardownChained.java:49)
   [junit4]   2> 	at app//org.apache.lucene.util.AbstractBeforeAfterRule$1.evaluate(AbstractBeforeAfterRule.java:45)
   [junit4]   2> 	at app//org.apache.lucene.util.TestRuleThreadAndTestName$1.evaluate(TestRuleThreadAndTestName.java:48)
   [junit4]   2> 	at app//org.apache.lucene.util.TestRuleIgnoreAfterMaxFailures$1.evaluate(TestRuleIgnoreAfterMaxFailures.java:64)
   [junit4]   2> 	at app//org.apache.lucene.util.TestRuleMarkFailure$1.evaluate(TestRuleMarkFailure.java:47)
   [junit4]   2> 	at app//com.carrotsearch.randomizedtesting.rules.StatementAdapter.evaluate(StatementAdapter.java:36)
   [junit4]   2> 	at app//com.carrotsearch.randomizedtesting.ThreadLeakControl$StatementRunner.run(ThreadLeakControl.java:368)
   [junit4]   2> 	at app//com.carrotsearch.randomizedtesting.ThreadLeakControl.forkTimeoutingTask(ThreadLeakControl.java:817)
   [junit4]   2> 	at app//com.carrotsearch.randomizedtesting.ThreadLeakControl$3.evaluate(ThreadLeakControl.java:468)
   [junit4]   2> 	at app//com.carrotsearch.randomizedtesting.RandomizedRunner.runSingleTest(RandomizedRunner.java:944)
   [junit4]   2> 	at app//com.carrotsearch.randomizedtesting.RandomizedRunner$5.evaluate(RandomizedRunner.java:830)
   [junit4]   2> 	at app//com.carrotsearch.randomizedtesting.RandomizedRunner$6.evaluate(RandomizedRunner.java:880)
   [junit4]   2> 	at app//com.carrotsearch.randomizedtesting.RandomizedRunner$7.evaluate(RandomizedRunner.java:891)
   [junit4]   2> 	at app//com.carrotsearch.randomizedtesting.rules.StatementAdapter.evaluate(StatementAdapter.java:36)
   [junit4]   2> 	at app//com.carrotsearch.randomizedtesting.rules.SystemPropertiesRestoreRule$1.evaluate(SystemPropertiesRestoreRule.java:57)
   [junit4]   2> 	at app//org.apache.lucene.util.AbstractBeforeAfterRule$1.evaluate(AbstractBeforeAfterRule.java:45)
   [junit4]   2> 	at app//com.carrotsearch.randomizedtesting.rules.StatementAdapter.evaluate(StatementAdapter.java:36)
   [junit4]   2> 	at app//org.apache.lucene.util.TestRuleStoreClassName$1.evaluate(TestRuleStoreClassName.java:41)
   [junit4]   2> 	at app//com.carrotsearch.randomizedtesting.rules.NoShadowingOrOverridesOnMethodsRule$1.evaluate(NoShadowingOrOverridesOnMethodsRule.java:40)
   [junit4]   2> 	at app//com.carrotsearch.randomizedtesting.rules.NoShadowingOrOverridesOnMethodsRule$1.evaluate(NoShadowingOrOverridesOnMethodsRule.java:40)
   [junit4]   2> 	at app//com.carrotsearch.randomizedtesting.rules.StatementAdapter.evaluate(StatementAdapter.java:36)
   [junit4]   2> 	at app//com.carrotsearch.randomizedtesting.rules.StatementAdapter.evaluate(StatementAdapter.java:36)
   [junit4]   2> 	at app//org.apache.lucene.util.TestRuleAssertionsRequired$1.evaluate(TestRuleAssertionsRequired.java:53)
   [junit4]   2> 	at app//org.apache.lucene.util.TestRuleMarkFailure$1.evaluate(TestRuleMarkFailure.java:47)
   [junit4]   2> 	at app//org.apache.lucene.util.TestRuleIgnoreAfterMaxFailures$1.evaluate(TestRuleIgnoreAfterMaxFailures.java:64)
   [junit4]   2> 	at app//org.apache.lucene.util.TestRuleIgnoreTestSuites$1.evaluate(TestRuleIgnoreTestSuites.java:54)
   [junit4]   2> 	at app//com.carrotsearch.randomizedtesting.rules.StatementAdapter.evaluate(StatementAdapter.java:36)
   [junit4]   2> 	at app//com.carrotsearch.randomizedtesting.ThreadLeakControl$StatementRunner.run(ThreadLeakControl.java:368)
   [junit4]   2> 	at java.base@10/java.lang.Thread.run(Thread.java:844)
   [junit4]   2> 
   [junit4]   2> ^^==============================================
   [junit4]   2> 
   [junit4]   2> NOTE: reproduce with: ant test  -Dtestcase=TestSimGenericDistributedQueue -Dtests.method=testDistributedQueue -Dtests.seed=D89C446806E63393 -Dtests.slow=true -Dtests.locale=as-IN -Dtests.timezone=SystemV/EST5EDT -Dtests.asserts=true -Dtests.file.encoding=US-ASCII
   [junit4] ERROR   7200s J0 | TestSimGenericDistributedQueue.testDistributedQueue <<<
   [junit4]    > Throwable #1: java.lang.Exception: Test abandoned because suite timeout was reached.
   [junit4]    > 	at __randomizedtesting.SeedInfo.seed([D89C446806E63393]:0)
   [junit4]   2> ????? ??, ???? ??:??:?? ??????? com.carrotsearch.randomizedtesting.ThreadLeakControl checkThreadLeaks
   [junit4]   2> WARNING: Will linger awaiting termination of 1 leaked thread(s).
   [junit4]   2> ????? ??, ???? ??:??:?? ??????? com.carrotsearch.randomizedtesting.ThreadLeakControl checkThreadLeaks
   [junit4]   2> SEVERE: 1 thread leaked from SUITE scope at org.apache.solr.cloud.autoscaling.sim.TestSimGenericDistributedQueue: 
   [junit4]   2>    1) Thread[id=32563, name=TEST-TestSimGenericDistributedQueue.testDistributedQueue-seed#[D89C446806E63393], state=TIMED_WAITING, group=TGRP-TestSimGenericDistributedQueue]
   [junit4]   2>         at java.base@10/jdk.internal.misc.Unsafe.park(Native Method)
   [junit4]   2>         at java.base@10/java.util.concurrent.locks.LockSupport.parkNanos(LockSupport.java:234)
   [junit4]   2>         at java.base@10/java.util.concurrent.locks.AbstractQueuedSynchronizer$ConditionObject.awaitNanos(AbstractQueuedSynchronizer.java:2117)
   [junit4]   2>         at app//org.apache.solr.cloud.autoscaling.sim.GenericDistributedQueue.peek(GenericDistributedQueue.java:194)
   [junit4]   2>         at app//org.apache.solr.cloud.autoscaling.sim.GenericDistributedQueue.peek(GenericDistributedQueue.java:167)
   [junit4]   2>         at app//org.apache.solr.cloud.autoscaling.sim.TestSimDistributedQueue.testDistributedQueue(TestSimDistributedQueue.java:74)
   [junit4]   2>         at app//org.apache.solr.cloud.autoscaling.sim.TestSimGenericDistributedQueue.testDistributedQueue(TestSimGenericDistributedQueue.java:36)
   [junit4]   2>         at java.base@10/jdk.internal.reflect.NativeMethodAccessorImpl.invoke0(Native Method)
   [junit4]   2>         at java.base@10/jdk.internal.reflect.NativeMethodAccessorImpl.invoke(NativeMethodAccessorImpl.java:62)
   [junit4]   2>         at java.base@10/jdk.internal.reflect.DelegatingMethodAccessorImpl.invoke(DelegatingMethodAccessorImpl.java:43)
   [junit4]   2>         at java.base@10/java.lang.reflect.Method.invoke(Method.java:564)
   [junit4]   2>         at app//com.carrotsearch.randomizedtesting.RandomizedRunner.invoke(RandomizedRunner.java:1742)
   [junit4]   2>         at app//com.carrotsearch.randomizedtesting.RandomizedRunner$8.evaluate(RandomizedRunner.java:935)
   [junit4]   2>         at app//com.carrotsearch.randomizedtesting.RandomizedRunner$9.evaluate(RandomizedRunner.java:971)
   [junit4]   2>         at app//com.carrotsearch.randomizedtesting.RandomizedRunner$10.evaluate(RandomizedRunner.java:985)
   [junit4]   2>         at app//com.carrotsearch.randomizedtesting.rules.SystemPropertiesRestoreRule$1.evaluate(SystemPropertiesRestoreRule.java:57)
   [junit4]   2>         at app//org.apache.lucene.util.TestRuleSetupTeardownChained$1.evaluate(TestRuleSetupTeardownChained.java:49)
   [junit4]   2>         at app//org.apache.lucene.util.AbstractBeforeAfterRule$1.evaluate(AbstractBeforeAfterRule.java:45)
   [junit4]   2>         at app//org.apache.lucene.util.TestRuleThreadAndTestName$1.evaluate(TestRuleThreadAndTestName.java:48)
   [junit4]   2>         at app//org.apache.lucene.util.TestRuleIgnoreAfterMaxFailures$1.evaluate(TestRuleIgnoreAfterMaxFailures.java:64)
   [junit4]   2>         at app//org.apache.lucene.util.TestRuleMarkFailure$1.evaluate(TestRuleMarkFailure.java:47)
   [junit4]   2>         at app//com.carrotsearch.randomizedtesting.rules.StatementAdapter.evaluate(StatementAdapter.java:36)
   [junit4]   2>         at app//com.carrotsearch.randomizedtesting.ThreadLeakControl$StatementRunner.run(ThreadLeakControl.java:368)
   [junit4]   2>         at app//com.carrotsearch.randomizedtesting.ThreadLeakControl.forkTimeoutingTask(ThreadLeakControl.java:817)
   [junit4]   2>         at app//com.carrotsearch.randomizedtesting.ThreadLeakControl$3.evaluate(ThreadLeakControl.java:468)
   [junit4]   2>         at app//com.carrotsearch.randomizedtesting.RandomizedRunner.runSingleTest(RandomizedRunner.java:944)
   [junit4]   2>         at app//com.carrotsearch.randomizedtesting.RandomizedRunner$5.evaluate(RandomizedRunner.java:830)
   [junit4]   2>         at app//com.carrotsearch.randomizedtesting.RandomizedRunner$6.evaluate(RandomizedRunner.java:880)
   [junit4]   2>         at app//com.carrotsearch.randomizedtesting.RandomizedRunner$7.evaluate(RandomizedRunner.java:891)
   [junit4]   2>         at app//com.carrotsearch.randomizedtesting.rules.StatementAdapter.evaluate(StatementAdapter.java:36)
   [junit4]   2>         at app//com.carrotsearch.randomizedtesting.rules.SystemPropertiesRestoreRule$1.evaluate(SystemPropertiesRestoreRule.java:57)
   [junit4]   2>         at app//org.apache.lucene.util.AbstractBeforeAfterRule$1.evaluate(AbstractBeforeAfterRule.java:45)
   [junit4]   2>         at app//com.carrotsearch.randomizedtesting.rules.StatementAdapter.evaluate(StatementAdapter.java:36)
   [junit4]   2>         at app//org.apache.lucene.util.TestRuleStoreClassName$1.evaluate(TestRuleStoreClassName.java:41)
   [junit4]   2>         at app//com.carrotsearch.randomizedtesting.rules.NoShadowingOrOverridesOnMethodsRule$1.evaluate(NoShadowingOrOverridesOnMethodsRule.java:40)
   [junit4]   2>         at app//com.carrotsearch.randomizedtesting.rules.NoShadowingOrOverridesOnMethodsRule$1.evaluate(NoShadowingOrOverridesOnMethodsRule.java:40)
   [junit4]   2>         at app//com.carrotsearch.randomizedtesting.rules.StatementAdapter.evaluate(StatementAdapter.java:36)
   [junit4]   2>         at app//com.carrotsearch.randomizedtesting.rules.StatementAdapter.evaluate(StatementAdapter.java:36)
   [junit4]   2>         at app//org.apache.lucene.util.TestRuleAssertionsRequired$1.evaluate(TestRuleAssertionsRequired.java:53)
   [junit4]   2>         at app//org.apache.lucene.util.TestRuleMarkFailure$1.evaluate(TestRuleMarkFailure.java:47)
   [junit4]   2>         at app//org.apache.lucene.util.TestRuleIgnoreAfterMaxFailures$1.evaluate(TestRuleIgnoreAfterMaxFailures.java:64)
   [junit4]   2>         at app//org.apache.lucene.util.TestRuleIgnoreTestSuites$1.evaluate(TestRuleIgnoreTestSuites.java:54)
   [junit4]   2>         at app//com.carrotsearch.randomizedtesting.rules.StatementAdapter.evaluate(StatementAdapter.java:36)
   [junit4]   2>         at app//com.carrotsearch.randomizedtesting.ThreadLeakControl$StatementRunner.run(ThreadLeakControl.java:368)
   [junit4]   2>         at java.base@10/java.lang.Thread.run(Thread.java:844)
   [junit4]   2> ????? ??, ???? ??:??:?? ??????? com.carrotsearch.randomizedtesting.ThreadLeakControl tryToInterruptAll
   [junit4]   2> INFO: Starting to interrupt leaked threads:
   [junit4]   2>    1) Thread[id=32563, name=TEST-TestSimGenericDistributedQueue.testDistributedQueue-seed#[D89C446806E63393], state=TIMED_WAITING, group=TGRP-TestSimGenericDistributedQueue]
   [junit4]   2> NOTE: leaving temporary files on disk at: C:\Users\jenkins\workspace\Lucene-Solr-master-Windows\solr\build\solr-core\test\J0\temp\solr.cloud.autoscaling.sim.TestSimGenericDistributedQueue_D89C446806E63393-001
   [junit4]   2> Sep 21, 2018 2:29:45 AM com.carrotsearch.randomizedtesting.ThreadLeakControl tryToInterruptAll
   [junit4]   2> INFO: All leaked threads terminated.
   [junit4]   2> NOTE: test params are: codec=Asserting(Lucene80): {}, docValues:{}, maxPointsInLeafNode=2003, maxMBSortInHeap=7.641404924423431, sim=Asserting(org.apache.lucene.search.similarities.AssertingSimilarity@66be1eb1), locale=as-IN, timezone=SystemV/EST5EDT
   [junit4]   2> NOTE: Windows 10 10.0 amd64/Oracle Corporation 10 (64-bit)/cpus=3,threads=1,free=163255584,total=518979584
   [junit4]   2> NOTE: All tests run in this JVM: [OpenCloseCoreStressTest, DistribDocExpirationUpdateProcessorTest, HighlighterMaxOffsetTest, TestCloudSearcherWarming, LeaderFailureAfterFreshStartTest, CoreAdminCreateDiscoverTest, HttpPartitionOnCommitTest, BasicDistributedZkTest, PreAnalyzedUpdateProcessorTest, DirectUpdateHandlerTest, TestNRTOpen, TestStressLucene, CdcrReplicationHandlerTest, TestHdfsUpdateLog, TestMultiWordSynonyms, TestSimpleQParserPlugin, TolerantUpdateProcessorTest, DirectSolrConnectionTest, TestSimComputePlanAction, ShardSplitTest, ZkShardTermsTest, TestLeaderElectionWithEmptyReplica, DistributedQueryComponentCustomSortTest, DeleteReplicaTest, SpellCheckCollatorWithCollapseTest, TestMaxScoreQueryParser, TestExportWriter, TestSchemaManager, DateFieldTest, AnalysisAfterCoreReloadTest, SpatialFilterTest, TestRTGBase, MaxSizeAutoCommitTest, TestFilteredDocIdSet, SuggesterTSTTest, DeleteStatusTest, LeaderElectionContextKeyTest, TestJsonRequest, TestCustomSort, PreAnalyzedFieldTest, LargeFieldTest, TestZkAclsWithHadoopAuth, TimeZoneUtilsTest, CdcrUpdateLogTest, DocValuesMissingTest, TestGeoJSONResponseWriter, TestDistributedSearch, BadCopyFieldTest, TestCoreDiscovery, TestSolrCloudSnapshots, MultiSolrCloudTestCaseTest, TestChildDocTransformerHierarchy, TestDistributedGrouping, TestSQLHandlerNonCloud, RestartWhileUpdatingTest, PhrasesIdentificationComponentTest, SolrCLIZkUtilsTest, TestCollationField, CopyFieldTest, ClassificationUpdateProcessorIntegrationTest, CurrencyRangeFacetCloudTest, DistributedFacetPivotLargeTest, CollectionsAPIDistributedZkTest, BadComponentTest, TestScoreJoinQPNoScore, TestConfigSets, TestPrepRecovery, TermsComponentTest, AssignTest, TestSegmentSorting, TestSortableTextField, NoCacheHeaderTest, TestConfig, AtomicUpdatesTest, TestSolrConfigHandlerConcurrent, TestJsonFacets, TestReload, TestPhraseSuggestions, SolrCoreTest, TestStressReorder, PrimUtilsTest, PeerSyncWithLeaderAndIndexFingerprintCachingTest, TestSolrCoreParser, TestFunctionQuery, MetricsConfigTest, HttpTriggerListenerTest, TestPushWriter, DistributedQueryElevationComponentTest, TestSolrQueryResponse, SpatialHeatmapFacetsTest, ConvertedLegacyTest, TestStressVersions, TestCloudNestedDocsSort, TestCloudPseudoReturnFields, NumericFieldsTest, SignificantTermsQParserPluginTest, TestSort, AddSchemaFieldsUpdateProcessorFactoryTest, HdfsUnloadDistributedZkTest, ScheduledTriggerTest, IgnoreLargeDocumentProcessorFactoryTest, TestSubQueryTransformerCrossCore, TestFieldCacheSort, TestRecovery, TestOrdValues, TestSearchPerf, CoreMergeIndexesAdminHandlerTest, TestConfigReload, CoreSorterTest, TestPostingsSolrHighlighter, TestDocBasedVersionConstraints, SOLR749Test, TriggerSetPropertiesIntegrationTest, DocValuesTest, AutoScalingHandlerTest, AdminHandlersProxyTest, TestPKIAuthenticationPlugin, TestEmbeddedSolrServerConstructors, OverseerModifyCollectionTest, TestMultiValuedNumericRangeQuery, TestFastLRUCache, RulesTest, TestLuceneMatchVersion, TestRangeQuery, AsyncCallRequestStatusResponseTest, UUIDUpdateProcessorFallbackTest, BlockJoinFacetDistribTest, AliasIntegrationTest, TestXmlQParser, TestOmitPositions, TestPolicyCloud, SolrIndexSplitterTest, TestQueryTypes, TaggingAttributeTest, HDFSCollectionsAPITest, TestCoreAdminApis, DeleteLastCustomShardedReplicaTest, TestInitQParser, TestNestedUpdateProcessor, LeaderVoteWaitTimeoutTest, TestMaxTokenLenTokenizer, TestWordDelimiterFilterFactory, LIROnShardRestartTest, TestNumericTerms64, TestSchemaVersionResource, BinaryUpdateRequestHandlerTest, ShardRoutingCustomTest, TestConfigSetsAPIZkFailure, SolrMetricsIntegrationTest, TestManagedResource, TestLeaderInitiatedRecoveryThread, BlobRepositoryCloudTest, ExecutePlanActionTest, Tagger2Test, CdcrBootstrapTest, ExternalFileFieldSortTest, DistanceFunctionTest, TestRestManager, DistributedQueueTest, TestNonDefinedSimilarityFactory, TestSolrXml, EmbeddedSolrNoSerializeTest, SearchRateTriggerTest, TestPerFieldSimilarityWithDefaultOverride, SuggestComponentContextFilterQueryTest, DebugComponentTest, IndexSchemaTest, TestSolrConfigHandler, JsonLoaderTest, TestFuzzyAnalyzedSuggestions, TestGroupingSearch, DOMUtilTest, RequiredFieldsTest, DirectSolrSpellCheckerTest, OverriddenZkACLAndCredentialsProvidersTest, TestFileDictionaryLookup, TestCloudPhrasesIdentificationComponent, TestRawTransformer, ResponseBuilderTest, TestImpersonationWithHadoopAuth, TlogReplayBufferedWhileIndexingTest, TestRTimerTree, ZkCLITest, BlockDirectoryTest, AddBlockUpdateTest, TestRequestForwarding, FastVectorHighlighterTest, TestJoin, SpellingQueryConverterTest, TestStressInPlaceUpdates, MultiTermTest, TestQuerySenderNoQuery, TestConfigSetsAPI, TestAuthenticationFramework, TestSlowCompositeReaderWrapper, TestDocTermOrds, CreateRoutedAliasTest, TestIntervalFaceting, TemplateUpdateProcessorTest, MoveReplicaHDFSTest, LoggingHandlerTest, NodeMarkersRegistrationTest, TestDFRSimilarityFactory, DisMaxRequestHandlerTest, DistributedIntervalFacetingTest, EchoParamsTest, MinimalSchemaTest, OutputWriterTest, SampleTest, SolrInfoBeanTest, SolrTestCaseJ4Test, TestCrossCoreJoin, TestCursorMarkWithoutUniqueKey, TestRandomFaceting, TestSimpleTrackingShardHandler, TestSolrCoreProperties, TestTolerantSearch, TestTrie, PathHierarchyTokenizerFactoryTest, ProtectedTermFilterFactoryTest, TestCharFilters, TestLuceneIndexBackCompat, TestEmbeddedSolrServerAdminHandler, TestJettySolrRunner, ConnectionReuseTest, ActionThrottleTest, AddReplicaTest, ChaosMonkeyNothingIsSafeTest, ChaosMonkeyNothingIsSafeWithPullReplicasTest, ChaosMonkeySafeLeaderTest, ChaosMonkeySafeLeaderWithPullReplicasTest, CleanupOldIndexTest, CloudExitableDirectoryReaderTest, ClusterStateTest, ClusterStateUpdateTest, CollectionPropsTest, CollectionStateFormat2Test, CollectionsAPISolrJTest, HealthCheckHandlerTest, LeaderElectionTest, MigrateRouteKeyTest, MissingSegmentRecoveryTest, MoveReplicaHDFSFailoverTest, NodeMutatorTest, OutOfBoxZkACLAndCredentialsProvidersTest, OverseerStatusTest, OverseerTaskQueueTest, OverseerTest, PeerSyncReplicationTest, ReplicationFactorTest, SSLMigrationTest, SaslZkACLProviderTest, SharedFSAutoReplicaFailoverTest, SliceStateTest, SolrXmlInZkTest, SyncSliceTest, TestDeleteCollectionOnDownNodes, TestDistributedMap, TestDownShardTolerantSearch, TestExclusionRuleCollectionAccess, TestHashPartitioner, TestOnReconnectListenerSupport, TestPullReplicaErrorHandling, TestSizeLimitedDistributedMap, TestSkipOverseerOperations, TestTlogReplica, TestZkChroot, UnloadDistributedZkTest, ZkNodePropsTest, CollectionTooManyReplicasTest, CollectionsAPIAsyncDistributedZkTest, CustomCollectionTest, HdfsCollectionsAPIDistributedZkTest, TestCollectionAPI, TestRequestStatusCollectionAPI, AutoAddReplicasPlanActionTest, MetricTriggerIntegrationTest, MetricTriggerTest, NodeAddedTriggerIntegrationTest, NodeAddedTriggerTest, NodeLostTriggerIntegrationTest, ScheduledMaintenanceTriggerTest, ScheduledTriggerIntegrationTest, TestSimDistributedQueue, TestSimExecutePlanAction, TestSimGenericDistributedQueue]
   [junit4]   2> NOTE: reproduce with: ant test  -Dtestcase=TestSimGenericDistributedQueue -Dtests.seed=D89C446806E63393 -Dtests.slow=true -Dtests.locale=as-IN -Dtests.timezone=SystemV/EST5EDT -Dtests.asserts=true -Dtests.file.encoding=US-ASCII
   [junit4] ERROR   0.00s J0 | TestSimGenericDistributedQueue (suite) <<<
   [junit4]    > Throwable #1: java.lang.Exception: Suite timeout exceeded (>= 7200000 msec).
   [junit4]    > 	at __randomizedtesting.SeedInfo.seed([D89C446806E63393]:0)
   [junit4] Completed [834/834 (1!)] on J0 in 7280.16s, 1 test, 2 errors <<< FAILURES!

[...truncated 1 lines...]
   [junit4] JVM J0: stderr was not empty, see: C:\Users\jenkins\workspace\Lucene-Solr-master-Windows\solr\build\solr-core\test\temp\junit4-J0-20180920_233252_73412138884176987803492.syserr
   [junit4] >>> JVM J0 emitted unexpected output (verbatim) ----
   [junit4] OpenJDK 64-Bit Server VM warning: Option UseConcMarkSweepGC was deprecated in version 9.0 and will likely be removed in a future release.
   [junit4] <<< JVM J0: EOF ----

[...truncated 984 lines...]
   [junit4] JVM J1: stderr was not empty, see: C:\Users\jenkins\workspace\Lucene-Solr-master-Windows\solr\build\solr-solrj\test\temp\junit4-J1-20180921_022955_6004321884190864707583.syserr
   [junit4] >>> JVM J1 emitted unexpected output (verbatim) ----
   [junit4] OpenJDK 64-Bit Server VM warning: Option UseConcMarkSweepGC was deprecated in version 9.0 and will likely be removed in a future release.
   [junit4] <<< JVM J1: EOF ----

[...truncated 9 lines...]
   [junit4] JVM J0: stderr was not empty, see: C:\Users\jenkins\workspace\Lucene-Solr-master-Windows\solr\build\solr-solrj\test\temp\junit4-J0-20180921_022955_60013427325996839985575.syserr
   [junit4] >>> JVM J0 emitted unexpected output (verbatim) ----
   [junit4] OpenJDK 64-Bit Server VM warning: Option UseConcMarkSweepGC was deprecated in version 9.0 and will likely be removed in a future release.
   [junit4] <<< JVM J0: EOF ----

[...truncated 1513 lines...]
   [junit4] JVM J1: stderr was not empty, see: C:\Users\jenkins\workspace\Lucene-Solr-master-Windows\solr\build\contrib\solr-analysis-extras\test\temp\junit4-J1-20180921_023427_24117835417685615032766.syserr
   [junit4] >>> JVM J1 emitted unexpected output (verbatim) ----
   [junit4] OpenJDK 64-Bit Server VM warning: Option UseConcMarkSweepGC was deprecated in version 9.0 and will likely be removed in a future release.
   [junit4] <<< JVM J1: EOF ----

[...truncated 3 lines...]
   [junit4] JVM J0: stderr was not empty, see: C:\Users\jenkins\workspace\Lucene-Solr-master-Windows\solr\build\contrib\solr-analysis-extras\test\temp\junit4-J0-20180921_023427_24117929938348047200291.syserr
   [junit4] >>> JVM J0 emitted unexpected output (verbatim) ----
   [junit4] OpenJDK 64-Bit Server VM warning: Option UseConcMarkSweepGC was deprecated in version 9.0 and will likely be removed in a future release.
   [junit4] <<< JVM J0: EOF ----

[...truncated 804 lines...]
   [junit4] JVM J0: stderr was not empty, see: C:\Users\jenkins\workspace\Lucene-Solr-master-Windows\solr\build\contrib\solr-analytics\test\temp\junit4-J0-20180921_023515_74893581871544172135.syserr
   [junit4] >>> JVM J0 emitted unexpected output (verbatim) ----
   [junit4] OpenJDK 64-Bit Server VM warning: Option UseConcMarkSweepGC was deprecated in version 9.0 and will likely be removed in a future release.
   [junit4] <<< JVM J0: EOF ----

   [junit4] JVM J1: stderr was not empty, see: C:\Users\jenkins\workspace\Lucene-Solr-master-Windows\solr\build\contrib\solr-analytics\test\temp\junit4-J1-20180921_023515_75413010538874596566459.syserr
   [junit4] >>> JVM J1 emitted unexpected output (verbatim) ----
   [junit4] OpenJDK 64-Bit Server VM warning: Option UseConcMarkSweepGC was deprecated in version 9.0 and will likely be removed in a future release.
   [junit4] <<< JVM J1: EOF ----

[...truncated 572 lines...]
   [junit4] JVM J0: stderr was not empty, see: C:\Users\jenkins\workspace\Lucene-Solr-master-Windows\solr\build\contrib\solr-clustering\test\temp\junit4-J0-20180921_023703_5655517990577824514593.syserr
   [junit4] >>> JVM J0 emitted unexpected output (verbatim) ----
   [junit4] OpenJDK 64-Bit Server VM warning: Option UseConcMarkSweepGC was deprecated in version 9.0 and will likely be removed in a future release.
   [junit4] <<< JVM J0: EOF ----

[...truncated 3 lines...]
   [junit4] JVM J1: stderr was not empty, see: C:\Users\jenkins\workspace\Lucene-Solr-master-Windows\solr\build\contrib\solr-clustering\test\temp\junit4-J1-20180921_023703_56510679846422762303432.syserr
   [junit4] >>> JVM J1 emitted unexpected output (verbatim) ----
   [junit4] OpenJDK 64-Bit Server VM warning: Option UseConcMarkSweepGC was deprecated in version 9.0 and will likely be removed in a future release.
   [junit4] <<< JVM J1: EOF ----

[...truncated 1301 lines...]
   [junit4] JVM J0: stderr was not empty, see: C:\Users\jenkins\workspace\Lucene-Solr-master-Windows\solr\build\contrib\solr-dataimporthandler-extras\test\temp\junit4-J0-20180921_023803_4349533093856748711632.syserr
   [junit4] >>> JVM J0 emitted unexpected output (verbatim) ----
   [junit4] OpenJDK 64-Bit Server VM warning: Option UseConcMarkSweepGC was deprecated in version 9.0 and will likely be removed in a future release.
   [junit4] <<< JVM J0: EOF ----

[...truncated 3 lines...]
   [junit4] JVM J1: stderr was not empty, see: C:\Users\jenkins\workspace\Lucene-Solr-master-Windows\solr\build\contrib\solr-dataimporthandler-extras\test\temp\junit4-J1-20180921_023803_4349440672162834112650.syserr
   [junit4] >>> JVM J1 emitted unexpected output (verbatim) ----
   [junit4] OpenJDK 64-Bit Server VM warning: Option UseConcMarkSweepGC was deprecated in version 9.0 and will likely be removed in a future release.
   [junit4] <<< JVM J1: EOF ----

[...truncated 665 lines...]
   [junit4] JVM J1: stderr was not empty, see: C:\Users\jenkins\workspace\Lucene-Solr-master-Windows\solr\build\contrib\solr-dataimporthandler\test\temp\junit4-J1-20180921_023832_9726495992623370821767.syserr
   [junit4] >>> JVM J1 emitted unexpected output (verbatim) ----
   [junit4] OpenJDK 64-Bit Server VM warning: Option UseConcMarkSweepGC was deprecated in version 9.0 and will likely be removed in a future release.
   [junit4] <<< JVM J1: EOF ----

[...truncated 3 lines...]
   [junit4] JVM J0: stderr was not empty, see: C:\Users\jenkins\workspace\Lucene-Solr-master-Windows\solr\build\contrib\solr-dataimporthandler\test\temp\junit4-J0-20180921_023832_97417347701092242616191.syserr
   [junit4] >>> JVM J0 emitted unexpected output (verbatim) ----
   [junit4] OpenJDK 64-Bit Server VM warning: Option UseConcMarkSweepGC was deprecated in version 9.0 and will likely be removed in a future release.
   [junit4] <<< JVM J0: EOF ----

[...truncated 579 lines...]
   [junit4] JVM J1: stderr was not empty, see: C:\Users\jenkins\workspace\Lucene-Solr-master-Windows\solr\build\contrib\solr-cell\test\temp\junit4-J1-20180921_023939_83010278990374825880121.syserr
   [junit4] >>> JVM J1 emitted unexpected output (verbatim) ----
   [junit4] OpenJDK 64-Bit Server VM warning: Option UseConcMarkSweepGC was deprecated in version 9.0 and will likely be removed in a future release.
   [junit4] <<< JVM J1: EOF ----

[...truncated 3 lines...]
   [junit4] JVM J0: stderr was not empty, see: C:\Users\jenkins\workspace\Lucene-Solr-master-Windows\solr\build\contrib\solr-cell\test\temp\junit4-J0-20180921_023939_83012008601069957218968.syserr
   [junit4] >>> JVM J0 emitted unexpected output (verbatim) ----
   [junit4] OpenJDK 64-Bit Server VM warning: Option UseConcMarkSweepGC was deprecated in version 9.0 and will likely be removed in a future release.
   [junit4] <<< JVM J0: EOF ----

[...truncated 580 lines...]
   [junit4] JVM J0: stderr was not empty, see: C:\Users\jenkins\workspace\Lucene-Solr-master-Windows\solr\build\contrib\solr-langid\test\temp\junit4-J0-20180921_024017_48916705642569607341326.syserr
   [junit4] >>> JVM J0 emitted unexpected output (verbatim) ----
   [junit4] OpenJDK 64-Bit Server VM warning: Option UseConcMarkSweepGC was deprecated in version 9.0 and will likely be removed in a future release.
   [junit4] <<< JVM J0: EOF ----

[...truncated 3 lines...]
   [junit4] JVM J1: stderr was not empty, see: C:\Users\jenkins\workspace\Lucene-Solr-master-Windows\solr\build\contrib\solr-langid\test\temp\junit4-J1-20180921_024017_4893214802256590154959.syserr
   [junit4] >>> JVM J1 emitted unexpected output (verbatim) ----
   [junit4] OpenJDK 64-Bit Server VM warning: Option UseConcMarkSweepGC was deprecated in version 9.0 and will likely be removed in a future release.
   [junit4] <<< JVM J1: EOF ----

[...truncated 687 lines...]
   [junit4] JVM J0: stderr was not empty, see: C:\Users\jenkins\workspace\Lucene-Solr-master-Windows\solr\build\contrib\solr-ltr\test\temp\junit4-J0-20180921_024050_3651555854244950905840.syserr
   [junit4] >>> JVM J0 emitted unexpected output (verbatim) ----
   [junit4] OpenJDK 64-Bit Server VM warning: Option UseConcMarkSweepGC was deprecated in version 9.0 and will likely be removed in a future release.
   [junit4] <<< JVM J0: EOF ----

   [junit4] JVM J1: stderr was not empty, see: C:\Users\jenkins\workspace\Lucene-Solr-master-Windows\solr\build\contrib\solr-ltr\test\temp\junit4-J1-20180921_024050_36517729313915052877709.syserr
   [junit4] >>> JVM J1 emitted unexpected output (verbatim) ----
   [junit4] OpenJDK 64-Bit Server VM warning: Option UseConcMarkSweepGC was deprecated in version 9.0 and will likely be removed in a future release.
   [junit4] <<< JVM J1: EOF ----

[...truncated 578 lines...]
   [junit4] JVM J1: stderr was not empty, see: C:\Users\jenkins\workspace\Lucene-Solr-master-Windows\solr\build\contrib\solr-prometheus-exporter\test\temp\junit4-J1-20180921_024208_9434628461133490425514.syserr
   [junit4] >>> JVM J1 emitted unexpected output (verbatim) ----
   [junit4] OpenJDK 64-Bit Server VM warning: Option UseConcMarkSweepGC was deprecated in version 9.0 and will likely be removed in a future release.
   [junit4] <<< JVM J1: EOF ----

   [junit4] JVM J0: stderr was not empty, see: C:\Users\jenkins\workspace\Lucene-Solr-master-Windows\solr\build\contrib\solr-prometheus-exporter\test\temp\junit4-J0-20180921_024208_9428206931900706890891.syserr
   [junit4] >>> JVM J0 emitted unexpected output (verbatim) ----
   [junit4] OpenJDK 64-Bit Server VM warning: Option UseConcMarkSweepGC was deprecated in version 9.0 and will likely be removed in a future release.
   [junit4] <<< JVM J0: EOF ----

[...truncated 567 lines...]
   [junit4] JVM J0: stderr was not empty, see: C:\Users\jenkins\workspace\Lucene-Solr-master-Windows\solr\build\contrib\solr-velocity\test\temp\junit4-J0-20180921_024312_3325399938209847148646.syserr
   [junit4] >>> JVM J0 emitted unexpected output (verbatim) ----
   [junit4] OpenJDK 64-Bit Server VM warning: Option UseConcMarkSweepGC was deprecated in version 9.0 and will likely be removed in a future release.
   [junit4] <<< JVM J0: EOF ----

[...truncated 33299 lines...]
[repro] Jenkins log URL: https://jenkins.thetaphi.de/job/Lucene-Solr-master-Windows/7528/consoleText

[repro] Revision: d7e97fb7f84d8613683a080610f177b7cae2b31a

[repro] Ant options: "-Dargs=-XX:+UseCompressedOops -XX:+UseConcMarkSweepGC"

[repro] ant clean

[...truncated 6 lines...]
[repro] Test suites by module:
[repro]    solr\core
[repro]       TestSimGenericDistributedQueue
[repro] ant compile-test

[...truncated 3451 lines...]
[repro] ant test-nocompile -Dtests.dups=5 -Dtests.maxfailures=5 -Dtests.class="*.TestSimGenericDistributedQueue" -Dtests.showOutput=onerror "-Dargs=-XX:+UseCompressedOops -XX:+UseConcMarkSweepGC" -Dtests.seed=D89C446806E63393 -Dtests.slow=true -Dtests.locale=as-IN -Dtests.timezone=SystemV/EST5EDT -Dtests.asserts=true -Dtests.file.encoding=US-ASCII

[...truncated 65 lines...]
   [junit4] JVM J1: stderr was not empty, see: C:\Users\jenkins\workspace\Lucene-Solr-master-Windows\solr\build\solr-core\test\temp\junit4-J1-20180921_025125_9829321104827702525785.syserr
   [junit4] >>> JVM J1 emitted unexpected output (verbatim) ----
   [junit4] OpenJDK 64-Bit Server VM warning: Option UseConcMarkSweepGC was deprecated in version 9.0 and will likely be removed in a future release.
   [junit4] <<< JVM J1: EOF ----

[...truncated 8 lines...]
   [junit4] JVM J0: stderr was not empty, see: C:\Users\jenkins\workspace\Lucene-Solr-master-Windows\solr\build\solr-core\test\temp\junit4-J0-20180921_025125_98210382060788737792347.syserr
   [junit4] >>> JVM J0 emitted unexpected output (verbatim) ----
   [junit4] OpenJDK 64-Bit Server VM warning: Option UseConcMarkSweepGC was deprecated in version 9.0 and will likely be removed in a future release.
   [junit4] <<< JVM J0: EOF ----

[...truncated 21 lines...]
[repro] Failures:
[repro]   0/5 failed: org.apache.solr.cloud.autoscaling.sim.TestSimGenericDistributedQueue
[repro] Exiting with code 0

[...truncated 75 lines...]

Mime
View raw message