lucene-dev mailing list archives

Site index · List index
Message view « Date » · « Thread »
Top « Date » · « Thread »
From Policeman Jenkins Server <jenk...@thetaphi.de>
Subject [JENKINS] Lucene-Solr-master-Linux (64bit/jdk1.8.0_172) - Build # 22786 - Unstable!
Date Sun, 02 Sep 2018 03:25:25 GMT
Build: https://jenkins.thetaphi.de/job/Lucene-Solr-master-Linux/22786/
Java: 64bit/jdk1.8.0_172 -XX:+UseCompressedOops -XX:+UseConcMarkSweepGC

6 tests failed.
FAILED:  org.apache.solr.cloud.UnloadDistributedZkTest.test

Error Message:
Timeout occured while waiting response from server at: http://127.0.0.1:43413/xw_hhy/i

Stack Trace:
org.apache.solr.client.solrj.SolrServerException: Timeout occured while waiting response from server at: http://127.0.0.1:43413/xw_hhy/i
	at __randomizedtesting.SeedInfo.seed([7EAE4CC7A1DAD37A:F6FA731D0F26BE82]:0)
	at org.apache.solr.client.solrj.impl.HttpSolrClient.executeMethod(HttpSolrClient.java:654)
	at org.apache.solr.client.solrj.impl.HttpSolrClient.request(HttpSolrClient.java:255)
	at org.apache.solr.client.solrj.impl.HttpSolrClient.request(HttpSolrClient.java:244)
	at org.apache.solr.client.solrj.impl.LBHttpSolrClient.doRequest(LBHttpSolrClient.java:483)
	at org.apache.solr.client.solrj.impl.LBHttpSolrClient.request(LBHttpSolrClient.java:413)
	at org.apache.solr.client.solrj.impl.CloudSolrClient.sendRequest(CloudSolrClient.java:1109)
	at org.apache.solr.client.solrj.impl.CloudSolrClient.requestWithRetryOnStaleState(CloudSolrClient.java:886)
	at org.apache.solr.client.solrj.impl.CloudSolrClient.request(CloudSolrClient.java:819)
	at org.apache.solr.client.solrj.SolrRequest.process(SolrRequest.java:194)
	at org.apache.solr.client.solrj.SolrRequest.process(SolrRequest.java:211)
	at org.apache.solr.cloud.UnloadDistributedZkTest.testCoreUnloadAndLeaders(UnloadDistributedZkTest.java:307)
	at org.apache.solr.cloud.UnloadDistributedZkTest.test(UnloadDistributedZkTest.java:70)
	at sun.reflect.NativeMethodAccessorImpl.invoke0(Native Method)
	at sun.reflect.NativeMethodAccessorImpl.invoke(NativeMethodAccessorImpl.java:62)
	at sun.reflect.DelegatingMethodAccessorImpl.invoke(DelegatingMethodAccessorImpl.java:43)
	at java.lang.reflect.Method.invoke(Method.java:498)
	at com.carrotsearch.randomizedtesting.RandomizedRunner.invoke(RandomizedRunner.java:1737)
	at com.carrotsearch.randomizedtesting.RandomizedRunner$8.evaluate(RandomizedRunner.java:934)
	at com.carrotsearch.randomizedtesting.RandomizedRunner$9.evaluate(RandomizedRunner.java:970)
	at com.carrotsearch.randomizedtesting.RandomizedRunner$10.evaluate(RandomizedRunner.java:984)
	at org.apache.solr.BaseDistributedSearchTestCase$ShardsRepeatRule$ShardsFixedStatement.callStatement(BaseDistributedSearchTestCase.java:1008)
	at org.apache.solr.BaseDistributedSearchTestCase$ShardsRepeatRule$ShardsStatement.evaluate(BaseDistributedSearchTestCase.java:983)
	at com.carrotsearch.randomizedtesting.rules.SystemPropertiesRestoreRule$1.evaluate(SystemPropertiesRestoreRule.java:57)
	at org.apache.lucene.util.TestRuleSetupTeardownChained$1.evaluate(TestRuleSetupTeardownChained.java:49)
	at org.apache.lucene.util.AbstractBeforeAfterRule$1.evaluate(AbstractBeforeAfterRule.java:45)
	at org.apache.lucene.util.TestRuleThreadAndTestName$1.evaluate(TestRuleThreadAndTestName.java:48)
	at org.apache.lucene.util.TestRuleIgnoreAfterMaxFailures$1.evaluate(TestRuleIgnoreAfterMaxFailures.java:64)
	at org.apache.lucene.util.TestRuleMarkFailure$1.evaluate(TestRuleMarkFailure.java:47)
	at com.carrotsearch.randomizedtesting.rules.StatementAdapter.evaluate(StatementAdapter.java:36)
	at com.carrotsearch.randomizedtesting.ThreadLeakControl$StatementRunner.run(ThreadLeakControl.java:368)
	at com.carrotsearch.randomizedtesting.ThreadLeakControl.forkTimeoutingTask(ThreadLeakControl.java:817)
	at com.carrotsearch.randomizedtesting.ThreadLeakControl$3.evaluate(ThreadLeakControl.java:468)
	at com.carrotsearch.randomizedtesting.RandomizedRunner.runSingleTest(RandomizedRunner.java:943)
	at com.carrotsearch.randomizedtesting.RandomizedRunner$5.evaluate(RandomizedRunner.java:829)
	at com.carrotsearch.randomizedtesting.RandomizedRunner$6.evaluate(RandomizedRunner.java:879)
	at com.carrotsearch.randomizedtesting.RandomizedRunner$7.evaluate(RandomizedRunner.java:890)
	at com.carrotsearch.randomizedtesting.rules.StatementAdapter.evaluate(StatementAdapter.java:36)
	at com.carrotsearch.randomizedtesting.rules.SystemPropertiesRestoreRule$1.evaluate(SystemPropertiesRestoreRule.java:57)
	at org.apache.lucene.util.AbstractBeforeAfterRule$1.evaluate(AbstractBeforeAfterRule.java:45)
	at com.carrotsearch.randomizedtesting.rules.StatementAdapter.evaluate(StatementAdapter.java:36)
	at org.apache.lucene.util.TestRuleStoreClassName$1.evaluate(TestRuleStoreClassName.java:41)
	at com.carrotsearch.randomizedtesting.rules.NoShadowingOrOverridesOnMethodsRule$1.evaluate(NoShadowingOrOverridesOnMethodsRule.java:40)
	at com.carrotsearch.randomizedtesting.rules.NoShadowingOrOverridesOnMethodsRule$1.evaluate(NoShadowingOrOverridesOnMethodsRule.java:40)
	at com.carrotsearch.randomizedtesting.rules.StatementAdapter.evaluate(StatementAdapter.java:36)
	at com.carrotsearch.randomizedtesting.rules.StatementAdapter.evaluate(StatementAdapter.java:36)
	at com.carrotsearch.randomizedtesting.rules.StatementAdapter.evaluate(StatementAdapter.java:36)
	at org.apache.lucene.util.TestRuleAssertionsRequired$1.evaluate(TestRuleAssertionsRequired.java:53)
	at org.apache.lucene.util.TestRuleMarkFailure$1.evaluate(TestRuleMarkFailure.java:47)
	at org.apache.lucene.util.TestRuleIgnoreAfterMaxFailures$1.evaluate(TestRuleIgnoreAfterMaxFailures.java:64)
	at org.apache.lucene.util.TestRuleIgnoreTestSuites$1.evaluate(TestRuleIgnoreTestSuites.java:54)
	at com.carrotsearch.randomizedtesting.rules.StatementAdapter.evaluate(StatementAdapter.java:36)
	at com.carrotsearch.randomizedtesting.ThreadLeakControl$StatementRunner.run(ThreadLeakControl.java:368)
	at java.lang.Thread.run(Thread.java:748)
Caused by: java.net.SocketTimeoutException: Read timed out
	at java.net.SocketInputStream.socketRead0(Native Method)
	at java.net.SocketInputStream.socketRead(SocketInputStream.java:116)
	at java.net.SocketInputStream.read(SocketInputStream.java:171)
	at java.net.SocketInputStream.read(SocketInputStream.java:141)
	at org.apache.http.impl.io.SessionInputBufferImpl.streamRead(SessionInputBufferImpl.java:137)
	at org.apache.http.impl.io.SessionInputBufferImpl.fillBuffer(SessionInputBufferImpl.java:153)
	at org.apache.http.impl.io.SessionInputBufferImpl.readLine(SessionInputBufferImpl.java:282)
	at org.apache.http.impl.conn.DefaultHttpResponseParser.parseHead(DefaultHttpResponseParser.java:138)
	at org.apache.http.impl.conn.DefaultHttpResponseParser.parseHead(DefaultHttpResponseParser.java:56)
	at org.apache.http.impl.io.AbstractMessageParser.parse(AbstractMessageParser.java:259)
	at org.apache.http.impl.DefaultBHttpClientConnection.receiveResponseHeader(DefaultBHttpClientConnection.java:163)
	at org.apache.http.impl.conn.CPoolProxy.receiveResponseHeader(CPoolProxy.java:165)
	at org.apache.http.protocol.HttpRequestExecutor.doReceiveResponse(HttpRequestExecutor.java:273)
	at org.apache.http.protocol.HttpRequestExecutor.execute(HttpRequestExecutor.java:125)
	at org.apache.http.impl.execchain.MainClientExec.execute(MainClientExec.java:272)
	at org.apache.http.impl.execchain.ProtocolExec.execute(ProtocolExec.java:185)
	at org.apache.http.impl.execchain.RetryExec.execute(RetryExec.java:89)
	at org.apache.http.impl.execchain.RedirectExec.execute(RedirectExec.java:111)
	at org.apache.http.impl.client.InternalHttpClient.doExecute(InternalHttpClient.java:185)
	at org.apache.http.impl.client.CloseableHttpClient.execute(CloseableHttpClient.java:83)
	at org.apache.http.impl.client.CloseableHttpClient.execute(CloseableHttpClient.java:56)
	at org.apache.solr.client.solrj.impl.HttpSolrClient.executeMethod(HttpSolrClient.java:542)
	... 52 more


FAILED:  org.apache.solr.cloud.autoscaling.IndexSizeTriggerTest.testMixedBounds

Error Message:
expected:<MERGESHARDS> but was:<SPLITSHARD>

Stack Trace:
java.lang.AssertionError: expected:<MERGESHARDS> but was:<SPLITSHARD>
	at __randomizedtesting.SeedInfo.seed([7EAE4CC7A1DAD37A:742DF36AEC61D820]:0)
	at org.junit.Assert.fail(Assert.java:93)
	at org.junit.Assert.failNotEquals(Assert.java:647)
	at org.junit.Assert.assertEquals(Assert.java:128)
	at org.junit.Assert.assertEquals(Assert.java:147)
	at org.apache.solr.cloud.autoscaling.IndexSizeTriggerTest.testMixedBounds(IndexSizeTriggerTest.java:669)
	at sun.reflect.NativeMethodAccessorImpl.invoke0(Native Method)
	at sun.reflect.NativeMethodAccessorImpl.invoke(NativeMethodAccessorImpl.java:62)
	at sun.reflect.DelegatingMethodAccessorImpl.invoke(DelegatingMethodAccessorImpl.java:43)
	at java.lang.reflect.Method.invoke(Method.java:498)
	at com.carrotsearch.randomizedtesting.RandomizedRunner.invoke(RandomizedRunner.java:1737)
	at com.carrotsearch.randomizedtesting.RandomizedRunner$8.evaluate(RandomizedRunner.java:934)
	at com.carrotsearch.randomizedtesting.RandomizedRunner$9.evaluate(RandomizedRunner.java:970)
	at com.carrotsearch.randomizedtesting.RandomizedRunner$10.evaluate(RandomizedRunner.java:984)
	at com.carrotsearch.randomizedtesting.rules.SystemPropertiesRestoreRule$1.evaluate(SystemPropertiesRestoreRule.java:57)
	at org.apache.lucene.util.TestRuleSetupTeardownChained$1.evaluate(TestRuleSetupTeardownChained.java:49)
	at org.apache.lucene.util.AbstractBeforeAfterRule$1.evaluate(AbstractBeforeAfterRule.java:45)
	at org.apache.lucene.util.TestRuleThreadAndTestName$1.evaluate(TestRuleThreadAndTestName.java:48)
	at org.apache.lucene.util.TestRuleIgnoreAfterMaxFailures$1.evaluate(TestRuleIgnoreAfterMaxFailures.java:64)
	at org.apache.lucene.util.TestRuleMarkFailure$1.evaluate(TestRuleMarkFailure.java:47)
	at com.carrotsearch.randomizedtesting.rules.StatementAdapter.evaluate(StatementAdapter.java:36)
	at com.carrotsearch.randomizedtesting.ThreadLeakControl$StatementRunner.run(ThreadLeakControl.java:368)
	at com.carrotsearch.randomizedtesting.ThreadLeakControl.forkTimeoutingTask(ThreadLeakControl.java:817)
	at com.carrotsearch.randomizedtesting.ThreadLeakControl$3.evaluate(ThreadLeakControl.java:468)
	at com.carrotsearch.randomizedtesting.RandomizedRunner.runSingleTest(RandomizedRunner.java:943)
	at com.carrotsearch.randomizedtesting.RandomizedRunner$5.evaluate(RandomizedRunner.java:829)
	at com.carrotsearch.randomizedtesting.RandomizedRunner$6.evaluate(RandomizedRunner.java:879)
	at com.carrotsearch.randomizedtesting.RandomizedRunner$7.evaluate(RandomizedRunner.java:890)
	at com.carrotsearch.randomizedtesting.rules.StatementAdapter.evaluate(StatementAdapter.java:36)
	at com.carrotsearch.randomizedtesting.rules.SystemPropertiesRestoreRule$1.evaluate(SystemPropertiesRestoreRule.java:57)
	at org.apache.lucene.util.AbstractBeforeAfterRule$1.evaluate(AbstractBeforeAfterRule.java:45)
	at com.carrotsearch.randomizedtesting.rules.StatementAdapter.evaluate(StatementAdapter.java:36)
	at org.apache.lucene.util.TestRuleStoreClassName$1.evaluate(TestRuleStoreClassName.java:41)
	at com.carrotsearch.randomizedtesting.rules.NoShadowingOrOverridesOnMethodsRule$1.evaluate(NoShadowingOrOverridesOnMethodsRule.java:40)
	at com.carrotsearch.randomizedtesting.rules.NoShadowingOrOverridesOnMethodsRule$1.evaluate(NoShadowingOrOverridesOnMethodsRule.java:40)
	at com.carrotsearch.randomizedtesting.rules.StatementAdapter.evaluate(StatementAdapter.java:36)
	at com.carrotsearch.randomizedtesting.rules.StatementAdapter.evaluate(StatementAdapter.java:36)
	at com.carrotsearch.randomizedtesting.rules.StatementAdapter.evaluate(StatementAdapter.java:36)
	at org.apache.lucene.util.TestRuleAssertionsRequired$1.evaluate(TestRuleAssertionsRequired.java:53)
	at org.apache.lucene.util.TestRuleMarkFailure$1.evaluate(TestRuleMarkFailure.java:47)
	at org.apache.lucene.util.TestRuleIgnoreAfterMaxFailures$1.evaluate(TestRuleIgnoreAfterMaxFailures.java:64)
	at org.apache.lucene.util.TestRuleIgnoreTestSuites$1.evaluate(TestRuleIgnoreTestSuites.java:54)
	at com.carrotsearch.randomizedtesting.rules.StatementAdapter.evaluate(StatementAdapter.java:36)
	at com.carrotsearch.randomizedtesting.ThreadLeakControl$StatementRunner.run(ThreadLeakControl.java:368)
	at java.lang.Thread.run(Thread.java:748)


FAILED:  org.apache.solr.cloud.autoscaling.IndexSizeTriggerTest.testMixedBounds

Error Message:
expected:<MERGESHARDS> but was:<SPLITSHARD>

Stack Trace:
java.lang.AssertionError: expected:<MERGESHARDS> but was:<SPLITSHARD>
	at __randomizedtesting.SeedInfo.seed([7EAE4CC7A1DAD37A:742DF36AEC61D820]:0)
	at org.junit.Assert.fail(Assert.java:93)
	at org.junit.Assert.failNotEquals(Assert.java:647)
	at org.junit.Assert.assertEquals(Assert.java:128)
	at org.junit.Assert.assertEquals(Assert.java:147)
	at org.apache.solr.cloud.autoscaling.IndexSizeTriggerTest.testMixedBounds(IndexSizeTriggerTest.java:669)
	at sun.reflect.NativeMethodAccessorImpl.invoke0(Native Method)
	at sun.reflect.NativeMethodAccessorImpl.invoke(NativeMethodAccessorImpl.java:62)
	at sun.reflect.DelegatingMethodAccessorImpl.invoke(DelegatingMethodAccessorImpl.java:43)
	at java.lang.reflect.Method.invoke(Method.java:498)
	at com.carrotsearch.randomizedtesting.RandomizedRunner.invoke(RandomizedRunner.java:1737)
	at com.carrotsearch.randomizedtesting.RandomizedRunner$8.evaluate(RandomizedRunner.java:934)
	at com.carrotsearch.randomizedtesting.RandomizedRunner$9.evaluate(RandomizedRunner.java:970)
	at com.carrotsearch.randomizedtesting.RandomizedRunner$10.evaluate(RandomizedRunner.java:984)
	at com.carrotsearch.randomizedtesting.rules.SystemPropertiesRestoreRule$1.evaluate(SystemPropertiesRestoreRule.java:57)
	at org.apache.lucene.util.TestRuleSetupTeardownChained$1.evaluate(TestRuleSetupTeardownChained.java:49)
	at org.apache.lucene.util.AbstractBeforeAfterRule$1.evaluate(AbstractBeforeAfterRule.java:45)
	at org.apache.lucene.util.TestRuleThreadAndTestName$1.evaluate(TestRuleThreadAndTestName.java:48)
	at org.apache.lucene.util.TestRuleIgnoreAfterMaxFailures$1.evaluate(TestRuleIgnoreAfterMaxFailures.java:64)
	at org.apache.lucene.util.TestRuleMarkFailure$1.evaluate(TestRuleMarkFailure.java:47)
	at com.carrotsearch.randomizedtesting.rules.StatementAdapter.evaluate(StatementAdapter.java:36)
	at com.carrotsearch.randomizedtesting.ThreadLeakControl$StatementRunner.run(ThreadLeakControl.java:368)
	at com.carrotsearch.randomizedtesting.ThreadLeakControl.forkTimeoutingTask(ThreadLeakControl.java:817)
	at com.carrotsearch.randomizedtesting.ThreadLeakControl$3.evaluate(ThreadLeakControl.java:468)
	at com.carrotsearch.randomizedtesting.RandomizedRunner.runSingleTest(RandomizedRunner.java:943)
	at com.carrotsearch.randomizedtesting.RandomizedRunner$5.evaluate(RandomizedRunner.java:829)
	at com.carrotsearch.randomizedtesting.RandomizedRunner$6.evaluate(RandomizedRunner.java:879)
	at com.carrotsearch.randomizedtesting.RandomizedRunner$7.evaluate(RandomizedRunner.java:890)
	at com.carrotsearch.randomizedtesting.rules.StatementAdapter.evaluate(StatementAdapter.java:36)
	at com.carrotsearch.randomizedtesting.rules.SystemPropertiesRestoreRule$1.evaluate(SystemPropertiesRestoreRule.java:57)
	at org.apache.lucene.util.AbstractBeforeAfterRule$1.evaluate(AbstractBeforeAfterRule.java:45)
	at com.carrotsearch.randomizedtesting.rules.StatementAdapter.evaluate(StatementAdapter.java:36)
	at org.apache.lucene.util.TestRuleStoreClassName$1.evaluate(TestRuleStoreClassName.java:41)
	at com.carrotsearch.randomizedtesting.rules.NoShadowingOrOverridesOnMethodsRule$1.evaluate(NoShadowingOrOverridesOnMethodsRule.java:40)
	at com.carrotsearch.randomizedtesting.rules.NoShadowingOrOverridesOnMethodsRule$1.evaluate(NoShadowingOrOverridesOnMethodsRule.java:40)
	at com.carrotsearch.randomizedtesting.rules.StatementAdapter.evaluate(StatementAdapter.java:36)
	at com.carrotsearch.randomizedtesting.rules.StatementAdapter.evaluate(StatementAdapter.java:36)
	at com.carrotsearch.randomizedtesting.rules.StatementAdapter.evaluate(StatementAdapter.java:36)
	at org.apache.lucene.util.TestRuleAssertionsRequired$1.evaluate(TestRuleAssertionsRequired.java:53)
	at org.apache.lucene.util.TestRuleMarkFailure$1.evaluate(TestRuleMarkFailure.java:47)
	at org.apache.lucene.util.TestRuleIgnoreAfterMaxFailures$1.evaluate(TestRuleIgnoreAfterMaxFailures.java:64)
	at org.apache.lucene.util.TestRuleIgnoreTestSuites$1.evaluate(TestRuleIgnoreTestSuites.java:54)
	at com.carrotsearch.randomizedtesting.rules.StatementAdapter.evaluate(StatementAdapter.java:36)
	at com.carrotsearch.randomizedtesting.ThreadLeakControl$StatementRunner.run(ThreadLeakControl.java:368)
	at java.lang.Thread.run(Thread.java:748)


FAILED:  org.apache.solr.cloud.autoscaling.IndexSizeTriggerTest.testMixedBounds

Error Message:
expected:<MERGESHARDS> but was:<SPLITSHARD>

Stack Trace:
java.lang.AssertionError: expected:<MERGESHARDS> but was:<SPLITSHARD>
	at __randomizedtesting.SeedInfo.seed([7EAE4CC7A1DAD37A:742DF36AEC61D820]:0)
	at org.junit.Assert.fail(Assert.java:93)
	at org.junit.Assert.failNotEquals(Assert.java:647)
	at org.junit.Assert.assertEquals(Assert.java:128)
	at org.junit.Assert.assertEquals(Assert.java:147)
	at org.apache.solr.cloud.autoscaling.IndexSizeTriggerTest.testMixedBounds(IndexSizeTriggerTest.java:669)
	at sun.reflect.NativeMethodAccessorImpl.invoke0(Native Method)
	at sun.reflect.NativeMethodAccessorImpl.invoke(NativeMethodAccessorImpl.java:62)
	at sun.reflect.DelegatingMethodAccessorImpl.invoke(DelegatingMethodAccessorImpl.java:43)
	at java.lang.reflect.Method.invoke(Method.java:498)
	at com.carrotsearch.randomizedtesting.RandomizedRunner.invoke(RandomizedRunner.java:1737)
	at com.carrotsearch.randomizedtesting.RandomizedRunner$8.evaluate(RandomizedRunner.java:934)
	at com.carrotsearch.randomizedtesting.RandomizedRunner$9.evaluate(RandomizedRunner.java:970)
	at com.carrotsearch.randomizedtesting.RandomizedRunner$10.evaluate(RandomizedRunner.java:984)
	at com.carrotsearch.randomizedtesting.rules.SystemPropertiesRestoreRule$1.evaluate(SystemPropertiesRestoreRule.java:57)
	at org.apache.lucene.util.TestRuleSetupTeardownChained$1.evaluate(TestRuleSetupTeardownChained.java:49)
	at org.apache.lucene.util.AbstractBeforeAfterRule$1.evaluate(AbstractBeforeAfterRule.java:45)
	at org.apache.lucene.util.TestRuleThreadAndTestName$1.evaluate(TestRuleThreadAndTestName.java:48)
	at org.apache.lucene.util.TestRuleIgnoreAfterMaxFailures$1.evaluate(TestRuleIgnoreAfterMaxFailures.java:64)
	at org.apache.lucene.util.TestRuleMarkFailure$1.evaluate(TestRuleMarkFailure.java:47)
	at com.carrotsearch.randomizedtesting.rules.StatementAdapter.evaluate(StatementAdapter.java:36)
	at com.carrotsearch.randomizedtesting.ThreadLeakControl$StatementRunner.run(ThreadLeakControl.java:368)
	at com.carrotsearch.randomizedtesting.ThreadLeakControl.forkTimeoutingTask(ThreadLeakControl.java:817)
	at com.carrotsearch.randomizedtesting.ThreadLeakControl$3.evaluate(ThreadLeakControl.java:468)
	at com.carrotsearch.randomizedtesting.RandomizedRunner.runSingleTest(RandomizedRunner.java:943)
	at com.carrotsearch.randomizedtesting.RandomizedRunner$5.evaluate(RandomizedRunner.java:829)
	at com.carrotsearch.randomizedtesting.RandomizedRunner$6.evaluate(RandomizedRunner.java:879)
	at com.carrotsearch.randomizedtesting.RandomizedRunner$7.evaluate(RandomizedRunner.java:890)
	at com.carrotsearch.randomizedtesting.rules.StatementAdapter.evaluate(StatementAdapter.java:36)
	at com.carrotsearch.randomizedtesting.rules.SystemPropertiesRestoreRule$1.evaluate(SystemPropertiesRestoreRule.java:57)
	at org.apache.lucene.util.AbstractBeforeAfterRule$1.evaluate(AbstractBeforeAfterRule.java:45)
	at com.carrotsearch.randomizedtesting.rules.StatementAdapter.evaluate(StatementAdapter.java:36)
	at org.apache.lucene.util.TestRuleStoreClassName$1.evaluate(TestRuleStoreClassName.java:41)
	at com.carrotsearch.randomizedtesting.rules.NoShadowingOrOverridesOnMethodsRule$1.evaluate(NoShadowingOrOverridesOnMethodsRule.java:40)
	at com.carrotsearch.randomizedtesting.rules.NoShadowingOrOverridesOnMethodsRule$1.evaluate(NoShadowingOrOverridesOnMethodsRule.java:40)
	at com.carrotsearch.randomizedtesting.rules.StatementAdapter.evaluate(StatementAdapter.java:36)
	at com.carrotsearch.randomizedtesting.rules.StatementAdapter.evaluate(StatementAdapter.java:36)
	at com.carrotsearch.randomizedtesting.rules.StatementAdapter.evaluate(StatementAdapter.java:36)
	at org.apache.lucene.util.TestRuleAssertionsRequired$1.evaluate(TestRuleAssertionsRequired.java:53)
	at org.apache.lucene.util.TestRuleMarkFailure$1.evaluate(TestRuleMarkFailure.java:47)
	at org.apache.lucene.util.TestRuleIgnoreAfterMaxFailures$1.evaluate(TestRuleIgnoreAfterMaxFailures.java:64)
	at org.apache.lucene.util.TestRuleIgnoreTestSuites$1.evaluate(TestRuleIgnoreTestSuites.java:54)
	at com.carrotsearch.randomizedtesting.rules.StatementAdapter.evaluate(StatementAdapter.java:36)
	at com.carrotsearch.randomizedtesting.ThreadLeakControl$StatementRunner.run(ThreadLeakControl.java:368)
	at java.lang.Thread.run(Thread.java:748)


FAILED:  org.apache.solr.cloud.autoscaling.IndexSizeTriggerTest.testMixedBounds

Error Message:
expected:<MERGESHARDS> but was:<SPLITSHARD>

Stack Trace:
java.lang.AssertionError: expected:<MERGESHARDS> but was:<SPLITSHARD>
	at __randomizedtesting.SeedInfo.seed([7EAE4CC7A1DAD37A:742DF36AEC61D820]:0)
	at org.junit.Assert.fail(Assert.java:93)
	at org.junit.Assert.failNotEquals(Assert.java:647)
	at org.junit.Assert.assertEquals(Assert.java:128)
	at org.junit.Assert.assertEquals(Assert.java:147)
	at org.apache.solr.cloud.autoscaling.IndexSizeTriggerTest.testMixedBounds(IndexSizeTriggerTest.java:669)
	at sun.reflect.NativeMethodAccessorImpl.invoke0(Native Method)
	at sun.reflect.NativeMethodAccessorImpl.invoke(NativeMethodAccessorImpl.java:62)
	at sun.reflect.DelegatingMethodAccessorImpl.invoke(DelegatingMethodAccessorImpl.java:43)
	at java.lang.reflect.Method.invoke(Method.java:498)
	at com.carrotsearch.randomizedtesting.RandomizedRunner.invoke(RandomizedRunner.java:1737)
	at com.carrotsearch.randomizedtesting.RandomizedRunner$8.evaluate(RandomizedRunner.java:934)
	at com.carrotsearch.randomizedtesting.RandomizedRunner$9.evaluate(RandomizedRunner.java:970)
	at com.carrotsearch.randomizedtesting.RandomizedRunner$10.evaluate(RandomizedRunner.java:984)
	at com.carrotsearch.randomizedtesting.rules.SystemPropertiesRestoreRule$1.evaluate(SystemPropertiesRestoreRule.java:57)
	at org.apache.lucene.util.TestRuleSetupTeardownChained$1.evaluate(TestRuleSetupTeardownChained.java:49)
	at org.apache.lucene.util.AbstractBeforeAfterRule$1.evaluate(AbstractBeforeAfterRule.java:45)
	at org.apache.lucene.util.TestRuleThreadAndTestName$1.evaluate(TestRuleThreadAndTestName.java:48)
	at org.apache.lucene.util.TestRuleIgnoreAfterMaxFailures$1.evaluate(TestRuleIgnoreAfterMaxFailures.java:64)
	at org.apache.lucene.util.TestRuleMarkFailure$1.evaluate(TestRuleMarkFailure.java:47)
	at com.carrotsearch.randomizedtesting.rules.StatementAdapter.evaluate(StatementAdapter.java:36)
	at com.carrotsearch.randomizedtesting.ThreadLeakControl$StatementRunner.run(ThreadLeakControl.java:368)
	at com.carrotsearch.randomizedtesting.ThreadLeakControl.forkTimeoutingTask(ThreadLeakControl.java:817)
	at com.carrotsearch.randomizedtesting.ThreadLeakControl$3.evaluate(ThreadLeakControl.java:468)
	at com.carrotsearch.randomizedtesting.RandomizedRunner.runSingleTest(RandomizedRunner.java:943)
	at com.carrotsearch.randomizedtesting.RandomizedRunner$5.evaluate(RandomizedRunner.java:829)
	at com.carrotsearch.randomizedtesting.RandomizedRunner$6.evaluate(RandomizedRunner.java:879)
	at com.carrotsearch.randomizedtesting.RandomizedRunner$7.evaluate(RandomizedRunner.java:890)
	at com.carrotsearch.randomizedtesting.rules.StatementAdapter.evaluate(StatementAdapter.java:36)
	at com.carrotsearch.randomizedtesting.rules.SystemPropertiesRestoreRule$1.evaluate(SystemPropertiesRestoreRule.java:57)
	at org.apache.lucene.util.AbstractBeforeAfterRule$1.evaluate(AbstractBeforeAfterRule.java:45)
	at com.carrotsearch.randomizedtesting.rules.StatementAdapter.evaluate(StatementAdapter.java:36)
	at org.apache.lucene.util.TestRuleStoreClassName$1.evaluate(TestRuleStoreClassName.java:41)
	at com.carrotsearch.randomizedtesting.rules.NoShadowingOrOverridesOnMethodsRule$1.evaluate(NoShadowingOrOverridesOnMethodsRule.java:40)
	at com.carrotsearch.randomizedtesting.rules.NoShadowingOrOverridesOnMethodsRule$1.evaluate(NoShadowingOrOverridesOnMethodsRule.java:40)
	at com.carrotsearch.randomizedtesting.rules.StatementAdapter.evaluate(StatementAdapter.java:36)
	at com.carrotsearch.randomizedtesting.rules.StatementAdapter.evaluate(StatementAdapter.java:36)
	at com.carrotsearch.randomizedtesting.rules.StatementAdapter.evaluate(StatementAdapter.java:36)
	at org.apache.lucene.util.TestRuleAssertionsRequired$1.evaluate(TestRuleAssertionsRequired.java:53)
	at org.apache.lucene.util.TestRuleMarkFailure$1.evaluate(TestRuleMarkFailure.java:47)
	at org.apache.lucene.util.TestRuleIgnoreAfterMaxFailures$1.evaluate(TestRuleIgnoreAfterMaxFailures.java:64)
	at org.apache.lucene.util.TestRuleIgnoreTestSuites$1.evaluate(TestRuleIgnoreTestSuites.java:54)
	at com.carrotsearch.randomizedtesting.rules.StatementAdapter.evaluate(StatementAdapter.java:36)
	at com.carrotsearch.randomizedtesting.ThreadLeakControl$StatementRunner.run(ThreadLeakControl.java:368)
	at java.lang.Thread.run(Thread.java:748)


FAILED:  org.apache.solr.cloud.autoscaling.IndexSizeTriggerTest.testMixedBounds

Error Message:
expected:<MERGESHARDS> but was:<SPLITSHARD>

Stack Trace:
java.lang.AssertionError: expected:<MERGESHARDS> but was:<SPLITSHARD>
	at __randomizedtesting.SeedInfo.seed([7EAE4CC7A1DAD37A:742DF36AEC61D820]:0)
	at org.junit.Assert.fail(Assert.java:93)
	at org.junit.Assert.failNotEquals(Assert.java:647)
	at org.junit.Assert.assertEquals(Assert.java:128)
	at org.junit.Assert.assertEquals(Assert.java:147)
	at org.apache.solr.cloud.autoscaling.IndexSizeTriggerTest.testMixedBounds(IndexSizeTriggerTest.java:669)
	at sun.reflect.NativeMethodAccessorImpl.invoke0(Native Method)
	at sun.reflect.NativeMethodAccessorImpl.invoke(NativeMethodAccessorImpl.java:62)
	at sun.reflect.DelegatingMethodAccessorImpl.invoke(DelegatingMethodAccessorImpl.java:43)
	at java.lang.reflect.Method.invoke(Method.java:498)
	at com.carrotsearch.randomizedtesting.RandomizedRunner.invoke(RandomizedRunner.java:1737)
	at com.carrotsearch.randomizedtesting.RandomizedRunner$8.evaluate(RandomizedRunner.java:934)
	at com.carrotsearch.randomizedtesting.RandomizedRunner$9.evaluate(RandomizedRunner.java:970)
	at com.carrotsearch.randomizedtesting.RandomizedRunner$10.evaluate(RandomizedRunner.java:984)
	at com.carrotsearch.randomizedtesting.rules.SystemPropertiesRestoreRule$1.evaluate(SystemPropertiesRestoreRule.java:57)
	at org.apache.lucene.util.TestRuleSetupTeardownChained$1.evaluate(TestRuleSetupTeardownChained.java:49)
	at org.apache.lucene.util.AbstractBeforeAfterRule$1.evaluate(AbstractBeforeAfterRule.java:45)
	at org.apache.lucene.util.TestRuleThreadAndTestName$1.evaluate(TestRuleThreadAndTestName.java:48)
	at org.apache.lucene.util.TestRuleIgnoreAfterMaxFailures$1.evaluate(TestRuleIgnoreAfterMaxFailures.java:64)
	at org.apache.lucene.util.TestRuleMarkFailure$1.evaluate(TestRuleMarkFailure.java:47)
	at com.carrotsearch.randomizedtesting.rules.StatementAdapter.evaluate(StatementAdapter.java:36)
	at com.carrotsearch.randomizedtesting.ThreadLeakControl$StatementRunner.run(ThreadLeakControl.java:368)
	at com.carrotsearch.randomizedtesting.ThreadLeakControl.forkTimeoutingTask(ThreadLeakControl.java:817)
	at com.carrotsearch.randomizedtesting.ThreadLeakControl$3.evaluate(ThreadLeakControl.java:468)
	at com.carrotsearch.randomizedtesting.RandomizedRunner.runSingleTest(RandomizedRunner.java:943)
	at com.carrotsearch.randomizedtesting.RandomizedRunner$5.evaluate(RandomizedRunner.java:829)
	at com.carrotsearch.randomizedtesting.RandomizedRunner$6.evaluate(RandomizedRunner.java:879)
	at com.carrotsearch.randomizedtesting.RandomizedRunner$7.evaluate(RandomizedRunner.java:890)
	at com.carrotsearch.randomizedtesting.rules.StatementAdapter.evaluate(StatementAdapter.java:36)
	at com.carrotsearch.randomizedtesting.rules.SystemPropertiesRestoreRule$1.evaluate(SystemPropertiesRestoreRule.java:57)
	at org.apache.lucene.util.AbstractBeforeAfterRule$1.evaluate(AbstractBeforeAfterRule.java:45)
	at com.carrotsearch.randomizedtesting.rules.StatementAdapter.evaluate(StatementAdapter.java:36)
	at org.apache.lucene.util.TestRuleStoreClassName$1.evaluate(TestRuleStoreClassName.java:41)
	at com.carrotsearch.randomizedtesting.rules.NoShadowingOrOverridesOnMethodsRule$1.evaluate(NoShadowingOrOverridesOnMethodsRule.java:40)
	at com.carrotsearch.randomizedtesting.rules.NoShadowingOrOverridesOnMethodsRule$1.evaluate(NoShadowingOrOverridesOnMethodsRule.java:40)
	at com.carrotsearch.randomizedtesting.rules.StatementAdapter.evaluate(StatementAdapter.java:36)
	at com.carrotsearch.randomizedtesting.rules.StatementAdapter.evaluate(StatementAdapter.java:36)
	at com.carrotsearch.randomizedtesting.rules.StatementAdapter.evaluate(StatementAdapter.java:36)
	at org.apache.lucene.util.TestRuleAssertionsRequired$1.evaluate(TestRuleAssertionsRequired.java:53)
	at org.apache.lucene.util.TestRuleMarkFailure$1.evaluate(TestRuleMarkFailure.java:47)
	at org.apache.lucene.util.TestRuleIgnoreAfterMaxFailures$1.evaluate(TestRuleIgnoreAfterMaxFailures.java:64)
	at org.apache.lucene.util.TestRuleIgnoreTestSuites$1.evaluate(TestRuleIgnoreTestSuites.java:54)
	at com.carrotsearch.randomizedtesting.rules.StatementAdapter.evaluate(StatementAdapter.java:36)
	at com.carrotsearch.randomizedtesting.ThreadLeakControl$StatementRunner.run(ThreadLeakControl.java:368)
	at java.lang.Thread.run(Thread.java:748)




Build Log:
[...truncated 13811 lines...]
   [junit4] Suite: org.apache.solr.cloud.UnloadDistributedZkTest
   [junit4]   2> Creating dataDir: /home/jenkins/workspace/Lucene-Solr-master-Linux/solr/build/solr-core/test/J1/temp/solr.cloud.UnloadDistributedZkTest_7EAE4CC7A1DAD37A-001/init-core-data-001
   [junit4]   2> 802333 WARN  (SUITE-UnloadDistributedZkTest-seed#[7EAE4CC7A1DAD37A]-worker) [    ] o.a.s.SolrTestCaseJ4 startTrackingSearchers: numOpens=1 numCloses=1
   [junit4]   2> 802333 INFO  (SUITE-UnloadDistributedZkTest-seed#[7EAE4CC7A1DAD37A]-worker) [    ] o.a.s.SolrTestCaseJ4 Using PointFields (NUMERIC_POINTS_SYSPROP=true) w/NUMERIC_DOCVALUES_SYSPROP=true
   [junit4]   2> 802334 INFO  (SUITE-UnloadDistributedZkTest-seed#[7EAE4CC7A1DAD37A]-worker) [    ] o.a.s.SolrTestCaseJ4 Randomized ssl (false) and clientAuth (false) via: @org.apache.solr.SolrTestCaseJ4$SuppressSSL(bugUrl=https://issues.apache.org/jira/browse/SOLR-5776)
   [junit4]   2> 802334 INFO  (SUITE-UnloadDistributedZkTest-seed#[7EAE4CC7A1DAD37A]-worker) [    ] o.a.s.SolrTestCaseJ4 SecureRandom sanity checks: test.solr.allowed.securerandom=null & java.security.egd=file:/dev/./urandom
   [junit4]   2> 802334 INFO  (SUITE-UnloadDistributedZkTest-seed#[7EAE4CC7A1DAD37A]-worker) [    ] o.a.s.BaseDistributedSearchTestCase Setting hostContext system property: /xw_hhy/i
   [junit4]   2> 802336 INFO  (TEST-UnloadDistributedZkTest.test-seed#[7EAE4CC7A1DAD37A]) [    ] o.a.s.c.ZkTestServer STARTING ZK TEST SERVER
   [junit4]   2> 802336 INFO  (Thread-3917) [    ] o.a.s.c.ZkTestServer client port:0.0.0.0/0.0.0.0:0
   [junit4]   2> 802336 INFO  (Thread-3917) [    ] o.a.s.c.ZkTestServer Starting server
   [junit4]   2> 802337 ERROR (Thread-3917) [    ] o.a.z.s.ZooKeeperServer ZKShutdownHandler is not registered, so ZooKeeper server won't take any action on ERROR or SHUTDOWN server state changes
   [junit4]   2> 802436 INFO  (TEST-UnloadDistributedZkTest.test-seed#[7EAE4CC7A1DAD37A]) [    ] o.a.s.c.ZkTestServer start zk server on port:46315
   [junit4]   2> 802437 INFO  (zkConnectionManagerCallback-6231-thread-1) [    ] o.a.s.c.c.ConnectionManager zkClient has connected
   [junit4]   2> 802439 INFO  (zkConnectionManagerCallback-6233-thread-1) [    ] o.a.s.c.c.ConnectionManager zkClient has connected
   [junit4]   2> 802441 INFO  (TEST-UnloadDistributedZkTest.test-seed#[7EAE4CC7A1DAD37A]) [    ] o.a.s.c.AbstractZkTestCase put /home/jenkins/workspace/Lucene-Solr-master-Linux/solr/core/src/test-files/solr/collection1/conf/solrconfig-tlog.xml to /configs/conf1/solrconfig.xml
   [junit4]   2> 802442 INFO  (TEST-UnloadDistributedZkTest.test-seed#[7EAE4CC7A1DAD37A]) [    ] o.a.s.c.AbstractZkTestCase put /home/jenkins/workspace/Lucene-Solr-master-Linux/solr/core/src/test-files/solr/collection1/conf/schema.xml to /configs/conf1/schema.xml
   [junit4]   2> 802442 INFO  (TEST-UnloadDistributedZkTest.test-seed#[7EAE4CC7A1DAD37A]) [    ] o.a.s.c.AbstractZkTestCase put /home/jenkins/workspace/Lucene-Solr-master-Linux/solr/core/src/test-files/solr/collection1/conf/solrconfig.snippet.randomindexconfig.xml to /configs/conf1/solrconfig.snippet.randomindexconfig.xml
   [junit4]   2> 802443 INFO  (TEST-UnloadDistributedZkTest.test-seed#[7EAE4CC7A1DAD37A]) [    ] o.a.s.c.AbstractZkTestCase put /home/jenkins/workspace/Lucene-Solr-master-Linux/solr/core/src/test-files/solr/collection1/conf/stopwords.txt to /configs/conf1/stopwords.txt
   [junit4]   2> 802443 INFO  (TEST-UnloadDistributedZkTest.test-seed#[7EAE4CC7A1DAD37A]) [    ] o.a.s.c.AbstractZkTestCase put /home/jenkins/workspace/Lucene-Solr-master-Linux/solr/core/src/test-files/solr/collection1/conf/protwords.txt to /configs/conf1/protwords.txt
   [junit4]   2> 802443 INFO  (TEST-UnloadDistributedZkTest.test-seed#[7EAE4CC7A1DAD37A]) [    ] o.a.s.c.AbstractZkTestCase put /home/jenkins/workspace/Lucene-Solr-master-Linux/solr/core/src/test-files/solr/collection1/conf/currency.xml to /configs/conf1/currency.xml
   [junit4]   2> 802444 INFO  (TEST-UnloadDistributedZkTest.test-seed#[7EAE4CC7A1DAD37A]) [    ] o.a.s.c.AbstractZkTestCase put /home/jenkins/workspace/Lucene-Solr-master-Linux/solr/core/src/test-files/solr/collection1/conf/enumsConfig.xml to /configs/conf1/enumsConfig.xml
   [junit4]   2> 802444 INFO  (TEST-UnloadDistributedZkTest.test-seed#[7EAE4CC7A1DAD37A]) [    ] o.a.s.c.AbstractZkTestCase put /home/jenkins/workspace/Lucene-Solr-master-Linux/solr/core/src/test-files/solr/collection1/conf/open-exchange-rates.json to /configs/conf1/open-exchange-rates.json
   [junit4]   2> 802445 INFO  (TEST-UnloadDistributedZkTest.test-seed#[7EAE4CC7A1DAD37A]) [    ] o.a.s.c.AbstractZkTestCase put /home/jenkins/workspace/Lucene-Solr-master-Linux/solr/core/src/test-files/solr/collection1/conf/mapping-ISOLatin1Accent.txt to /configs/conf1/mapping-ISOLatin1Accent.txt
   [junit4]   2> 802445 INFO  (TEST-UnloadDistributedZkTest.test-seed#[7EAE4CC7A1DAD37A]) [    ] o.a.s.c.AbstractZkTestCase put /home/jenkins/workspace/Lucene-Solr-master-Linux/solr/core/src/test-files/solr/collection1/conf/old_synonyms.txt to /configs/conf1/old_synonyms.txt
   [junit4]   2> 802446 INFO  (TEST-UnloadDistributedZkTest.test-seed#[7EAE4CC7A1DAD37A]) [    ] o.a.s.c.AbstractZkTestCase put /home/jenkins/workspace/Lucene-Solr-master-Linux/solr/core/src/test-files/solr/collection1/conf/synonyms.txt to /configs/conf1/synonyms.txt
   [junit4]   2> 802446 INFO  (TEST-UnloadDistributedZkTest.test-seed#[7EAE4CC7A1DAD37A]) [    ] o.a.s.c.AbstractFullDistribZkTestBase Will use NRT replicas unless explicitly asked otherwise
   [junit4]   2> 803054 INFO  (TEST-UnloadDistributedZkTest.test-seed#[7EAE4CC7A1DAD37A]) [    ] o.e.j.s.Server jetty-9.4.11.v20180605; built: 2018-06-05T18:24:03.829Z; git: d5fc0523cfa96bfebfbda19606cad384d772f04c; jvm 1.8.0_172-b11
   [junit4]   2> 803055 INFO  (TEST-UnloadDistributedZkTest.test-seed#[7EAE4CC7A1DAD37A]) [    ] o.e.j.s.session DefaultSessionIdManager workerName=node0
   [junit4]   2> 803055 INFO  (TEST-UnloadDistributedZkTest.test-seed#[7EAE4CC7A1DAD37A]) [    ] o.e.j.s.session No SessionScavenger set, using defaults
   [junit4]   2> 803055 INFO  (TEST-UnloadDistributedZkTest.test-seed#[7EAE4CC7A1DAD37A]) [    ] o.e.j.s.session node0 Scavenging every 600000ms
   [junit4]   2> 803057 INFO  (TEST-UnloadDistributedZkTest.test-seed#[7EAE4CC7A1DAD37A]) [    ] o.e.j.s.h.ContextHandler Started o.e.j.s.ServletContextHandler@5d7be69f{/xw_hhy/i,null,AVAILABLE}
   [junit4]   2> 803057 INFO  (TEST-UnloadDistributedZkTest.test-seed#[7EAE4CC7A1DAD37A]) [    ] o.e.j.s.AbstractConnector Started ServerConnector@45f33dee{HTTP/1.1,[http/1.1]}{127.0.0.1:38811}
   [junit4]   2> 803057 INFO  (TEST-UnloadDistributedZkTest.test-seed#[7EAE4CC7A1DAD37A]) [    ] o.e.j.s.Server Started @803117ms
   [junit4]   2> 803057 INFO  (TEST-UnloadDistributedZkTest.test-seed#[7EAE4CC7A1DAD37A]) [    ] o.a.s.c.s.e.JettySolrRunner Jetty properties: {solr.data.dir=/home/jenkins/workspace/Lucene-Solr-master-Linux/solr/build/solr-core/test/J1/temp/solr.cloud.UnloadDistributedZkTest_7EAE4CC7A1DAD37A-001/tempDir-001/control/data, replicaType=NRT, hostContext=/xw_hhy/i, hostPort=38811, coreRootDirectory=/home/jenkins/workspace/Lucene-Solr-master-Linux/solr/build/solr-core/test/J1/temp/solr.cloud.UnloadDistributedZkTest_7EAE4CC7A1DAD37A-001/control-001/cores}
   [junit4]   2> 803057 ERROR (TEST-UnloadDistributedZkTest.test-seed#[7EAE4CC7A1DAD37A]) [    ] o.a.s.u.StartupLoggingUtils Missing Java Option solr.log.dir. Logging may be missing or incomplete.
   [junit4]   2> 803057 INFO  (TEST-UnloadDistributedZkTest.test-seed#[7EAE4CC7A1DAD37A]) [    ] o.a.s.s.SolrDispatchFilter Using logger factory org.apache.logging.slf4j.Log4jLoggerFactory
   [junit4]   2> 803057 INFO  (TEST-UnloadDistributedZkTest.test-seed#[7EAE4CC7A1DAD37A]) [    ] o.a.s.s.SolrDispatchFilter  ___      _       Welcome to Apache Solr? version 8.0.0
   [junit4]   2> 803057 INFO  (TEST-UnloadDistributedZkTest.test-seed#[7EAE4CC7A1DAD37A]) [    ] o.a.s.s.SolrDispatchFilter / __| ___| |_ _   Starting in cloud mode on port null
   [junit4]   2> 803057 INFO  (TEST-UnloadDistributedZkTest.test-seed#[7EAE4CC7A1DAD37A]) [    ] o.a.s.s.SolrDispatchFilter \__ \/ _ \ | '_|  Install dir: null
   [junit4]   2> 803057 INFO  (TEST-UnloadDistributedZkTest.test-seed#[7EAE4CC7A1DAD37A]) [    ] o.a.s.s.SolrDispatchFilter |___/\___/_|_|    Start time: 2018-09-02T02:10:59.223Z
   [junit4]   2> 803058 INFO  (zkConnectionManagerCallback-6235-thread-1) [    ] o.a.s.c.c.ConnectionManager zkClient has connected
   [junit4]   2> 803059 INFO  (TEST-UnloadDistributedZkTest.test-seed#[7EAE4CC7A1DAD37A]) [    ] o.a.s.s.SolrDispatchFilter Loading solr.xml from SolrHome (not found in ZooKeeper)
   [junit4]   2> 803059 INFO  (TEST-UnloadDistributedZkTest.test-seed#[7EAE4CC7A1DAD37A]) [    ] o.a.s.c.SolrXmlConfig Loading container configuration from /home/jenkins/workspace/Lucene-Solr-master-Linux/solr/build/solr-core/test/J1/temp/solr.cloud.UnloadDistributedZkTest_7EAE4CC7A1DAD37A-001/control-001/solr.xml
   [junit4]   2> 803061 INFO  (TEST-UnloadDistributedZkTest.test-seed#[7EAE4CC7A1DAD37A]) [    ] o.a.s.c.SolrXmlConfig Configuration parameter autoReplicaFailoverWorkLoopDelay is ignored
   [junit4]   2> 803061 INFO  (TEST-UnloadDistributedZkTest.test-seed#[7EAE4CC7A1DAD37A]) [    ] o.a.s.c.SolrXmlConfig Configuration parameter autoReplicaFailoverBadNodeExpiration is ignored
   [junit4]   2> 803062 INFO  (TEST-UnloadDistributedZkTest.test-seed#[7EAE4CC7A1DAD37A]) [    ] o.a.s.c.SolrXmlConfig MBean server found: com.sun.jmx.mbeanserver.JmxMBeanServer@442b3e77, but no JMX reporters were configured - adding default JMX reporter.
   [junit4]   2> 803112 INFO  (TEST-UnloadDistributedZkTest.test-seed#[7EAE4CC7A1DAD37A]) [    ] o.a.s.c.ZkContainer Zookeeper client=127.0.0.1:46315/solr
   [junit4]   2> 803113 INFO  (zkConnectionManagerCallback-6239-thread-1) [    ] o.a.s.c.c.ConnectionManager zkClient has connected
   [junit4]   2> 803114 INFO  (zkConnectionManagerCallback-6241-thread-1) [    ] o.a.s.c.c.ConnectionManager zkClient has connected
   [junit4]   2> 803145 INFO  (TEST-UnloadDistributedZkTest.test-seed#[7EAE4CC7A1DAD37A]) [n:127.0.0.1:38811_xw_hhy%2Fi    ] o.a.s.c.OverseerElectionContext I am going to be the leader 127.0.0.1:38811_xw_hhy%2Fi
   [junit4]   2> 803146 INFO  (TEST-UnloadDistributedZkTest.test-seed#[7EAE4CC7A1DAD37A]) [n:127.0.0.1:38811_xw_hhy%2Fi    ] o.a.s.c.Overseer Overseer (id=72152617052209156-127.0.0.1:38811_xw_hhy%2Fi-n_0000000000) starting
   [junit4]   2> 803148 INFO  (zkConnectionManagerCallback-6248-thread-1) [    ] o.a.s.c.c.ConnectionManager zkClient has connected
   [junit4]   2> 803149 INFO  (TEST-UnloadDistributedZkTest.test-seed#[7EAE4CC7A1DAD37A]) [n:127.0.0.1:38811_xw_hhy%2Fi    ] o.a.s.c.s.i.ZkClientClusterStateProvider Cluster at 127.0.0.1:46315/solr ready
   [junit4]   2> 803150 INFO  (TEST-UnloadDistributedZkTest.test-seed#[7EAE4CC7A1DAD37A]) [n:127.0.0.1:38811_xw_hhy%2Fi    ] o.a.s.c.ZkController Register node as live in ZooKeeper:/live_nodes/127.0.0.1:38811_xw_hhy%2Fi
   [junit4]   2> 803150 INFO  (OverseerStateUpdate-72152617052209156-127.0.0.1:38811_xw_hhy%2Fi-n_0000000000) [n:127.0.0.1:38811_xw_hhy%2Fi    ] o.a.s.c.Overseer Starting to work on the main queue : 127.0.0.1:38811_xw_hhy%2Fi
   [junit4]   2> 803150 INFO  (OverseerStateUpdate-72152617052209156-127.0.0.1:38811_xw_hhy%2Fi-n_0000000000) [n:127.0.0.1:38811_xw_hhy%2Fi    ] o.a.s.c.c.ZkStateReader Updated live nodes from ZooKeeper... (0) -> (1)
   [junit4]   2> 803150 INFO  (zkCallback-6247-thread-1) [    ] o.a.s.c.c.ZkStateReader Updated live nodes from ZooKeeper... (0) -> (1)
   [junit4]   2> 803162 INFO  (TEST-UnloadDistributedZkTest.test-seed#[7EAE4CC7A1DAD37A]) [n:127.0.0.1:38811_xw_hhy%2Fi    ] o.a.s.h.a.MetricsHistoryHandler No .system collection, keeping metrics history in memory.
   [junit4]   2> 803174 INFO  (TEST-UnloadDistributedZkTest.test-seed#[7EAE4CC7A1DAD37A]) [n:127.0.0.1:38811_xw_hhy%2Fi    ] o.a.s.m.r.SolrJmxReporter JMX monitoring for 'solr.node' (registry 'solr.node') enabled at server: com.sun.jmx.mbeanserver.JmxMBeanServer@442b3e77
   [junit4]   2> 803179 INFO  (TEST-UnloadDistributedZkTest.test-seed#[7EAE4CC7A1DAD37A]) [n:127.0.0.1:38811_xw_hhy%2Fi    ] o.a.s.m.r.SolrJmxReporter JMX monitoring for 'solr.jvm' (registry 'solr.jvm') enabled at server: com.sun.jmx.mbeanserver.JmxMBeanServer@442b3e77
   [junit4]   2> 803179 INFO  (TEST-UnloadDistributedZkTest.test-seed#[7EAE4CC7A1DAD37A]) [n:127.0.0.1:38811_xw_hhy%2Fi    ] o.a.s.m.r.SolrJmxReporter JMX monitoring for 'solr.jetty' (registry 'solr.jetty') enabled at server: com.sun.jmx.mbeanserver.JmxMBeanServer@442b3e77
   [junit4]   2> 803180 INFO  (TEST-UnloadDistributedZkTest.test-seed#[7EAE4CC7A1DAD37A]) [n:127.0.0.1:38811_xw_hhy%2Fi    ] o.a.s.c.CorePropertiesLocator Found 0 core definitions underneath /home/jenkins/workspace/Lucene-Solr-master-Linux/solr/build/solr-core/test/J1/temp/solr.cloud.UnloadDistributedZkTest_7EAE4CC7A1DAD37A-001/control-001/cores
   [junit4]   2> 803192 INFO  (zkConnectionManagerCallback-6254-thread-1) [    ] o.a.s.c.c.ConnectionManager zkClient has connected
   [junit4]   2> 803193 INFO  (TEST-UnloadDistributedZkTest.test-seed#[7EAE4CC7A1DAD37A]) [    ] o.a.s.c.c.ZkStateReader Updated live nodes from ZooKeeper... (0) -> (1)
   [junit4]   2> 803193 INFO  (TEST-UnloadDistributedZkTest.test-seed#[7EAE4CC7A1DAD37A]) [    ] o.a.s.c.s.i.ZkClientClusterStateProvider Cluster at 127.0.0.1:46315/solr ready
   [junit4]   2> 803194 INFO  (qtp229384460-17942) [n:127.0.0.1:38811_xw_hhy%2Fi    ] o.a.s.h.a.CollectionsHandler Invoked Collection Action :create with params collection.configName=conf1&name=control_collection&nrtReplicas=1&action=CREATE&numShards=1&createNodeSet=127.0.0.1:38811_xw_hhy%252Fi&wt=javabin&version=2 and sendToOCPQueue=true
   [junit4]   2> 803196 INFO  (OverseerThreadFactory-4362-thread-1-processing-n:127.0.0.1:38811_xw_hhy%2Fi) [n:127.0.0.1:38811_xw_hhy%2Fi    ] o.a.s.c.a.c.CreateCollectionCmd Create collection control_collection
   [junit4]   2> 803300 INFO  (qtp229384460-17937) [n:127.0.0.1:38811_xw_hhy%2Fi    x:control_collection_shard1_replica_n1] o.a.s.h.a.CoreAdminOperation core create command qt=/admin/cores&collection.configName=conf1&newCollection=true&name=control_collection_shard1_replica_n1&action=CREATE&numShards=1&collection=control_collection&shard=shard1&wt=javabin&version=2&replicaType=NRT
   [junit4]   2> 803301 INFO  (qtp229384460-17937) [n:127.0.0.1:38811_xw_hhy%2Fi    x:control_collection_shard1_replica_n1] o.a.s.c.TransientSolrCoreCacheDefault Allocating transient cache for 4 transient cores
   [junit4]   2> 804885 INFO  (qtp229384460-17937) [n:127.0.0.1:38811_xw_hhy%2Fi c:control_collection s:shard1  x:control_collection_shard1_replica_n1] o.a.s.c.SolrConfig Using Lucene MatchVersion: 8.0.0
   [junit4]   2> 804895 INFO  (qtp229384460-17937) [n:127.0.0.1:38811_xw_hhy%2Fi c:control_collection s:shard1  x:control_collection_shard1_replica_n1] o.a.s.s.IndexSchema [control_collection_shard1_replica_n1] Schema name=test
   [junit4]   2> 804959 INFO  (qtp229384460-17937) [n:127.0.0.1:38811_xw_hhy%2Fi c:control_collection s:shard1  x:control_collection_shard1_replica_n1] o.a.s.s.IndexSchema Loaded schema test/1.0 with uniqueid field id
   [junit4]   2> 804967 INFO  (qtp229384460-17937) [n:127.0.0.1:38811_xw_hhy%2Fi c:control_collection s:shard1  x:control_collection_shard1_replica_n1] o.a.s.c.CoreContainer Creating SolrCore 'control_collection_shard1_replica_n1' using configuration from collection control_collection, trusted=true
   [junit4]   2> 804967 INFO  (qtp229384460-17937) [n:127.0.0.1:38811_xw_hhy%2Fi c:control_collection s:shard1  x:control_collection_shard1_replica_n1] o.a.s.m.r.SolrJmxReporter JMX monitoring for 'solr.core.control_collection.shard1.replica_n1' (registry 'solr.core.control_collection.shard1.replica_n1') enabled at server: com.sun.jmx.mbeanserver.JmxMBeanServer@442b3e77
   [junit4]   2> 804967 INFO  (qtp229384460-17937) [n:127.0.0.1:38811_xw_hhy%2Fi c:control_collection s:shard1  x:control_collection_shard1_replica_n1] o.a.s.c.SolrCore solr.RecoveryStrategy.Builder
   [junit4]   2> 804967 INFO  (qtp229384460-17937) [n:127.0.0.1:38811_xw_hhy%2Fi c:control_collection s:shard1  x:control_collection_shard1_replica_n1] o.a.s.c.SolrCore [[control_collection_shard1_replica_n1] ] Opening new SolrCore at [/home/jenkins/workspace/Lucene-Solr-master-Linux/solr/build/solr-core/test/J1/temp/solr.cloud.UnloadDistributedZkTest_7EAE4CC7A1DAD37A-001/control-001/cores/control_collection_shard1_replica_n1], dataDir=[/home/jenkins/workspace/Lucene-Solr-master-Linux/solr/build/solr-core/test/J1/temp/solr.cloud.UnloadDistributedZkTest_7EAE4CC7A1DAD37A-001/control-001/cores/control_collection_shard1_replica_n1/data/]
   [junit4]   2> 804969 INFO  (qtp229384460-17937) [n:127.0.0.1:38811_xw_hhy%2Fi c:control_collection s:shard1  x:control_collection_shard1_replica_n1] o.a.s.u.RandomMergePolicy RandomMergePolicy wrapping class org.apache.lucene.index.TieredMergePolicy: [TieredMergePolicy: maxMergeAtOnce=35, maxMergeAtOnceExplicit=40, maxMergedSegmentMB=41.1240234375, floorSegmentMB=1.693359375, forceMergeDeletesPctAllowed=6.399636045180079, segmentsPerTier=38.0, maxCFSSegmentSizeMB=8.796093022207999E12, noCFSRatio=0.1256463947391877, deletesPctAllowed=41.830958535666376
   [junit4]   2> 804970 WARN  (qtp229384460-17937) [n:127.0.0.1:38811_xw_hhy%2Fi c:control_collection s:shard1  x:control_collection_shard1_replica_n1] o.a.s.c.RequestHandlers INVALID paramSet a in requestHandler {type = requestHandler,name = /dump,class = DumpRequestHandler,attributes = {initParams=a, name=/dump, class=DumpRequestHandler},args = {defaults={a=A,b=B}}}
   [junit4]   2> 804995 INFO  (qtp229384460-17937) [n:127.0.0.1:38811_xw_hhy%2Fi c:control_collection s:shard1  x:control_collection_shard1_replica_n1] o.a.s.u.UpdateHandler Using UpdateLog implementation: org.apache.solr.update.UpdateLog
   [junit4]   2> 804995 INFO  (qtp229384460-17937) [n:127.0.0.1:38811_xw_hhy%2Fi c:control_collection s:shard1  x:control_collection_shard1_replica_n1] o.a.s.u.UpdateLog Initializing UpdateLog: dataDir= defaultSyncLevel=FLUSH numRecordsToKeep=100 maxNumLogsToKeep=10 numVersionBuckets=65536
   [junit4]   2> 804996 INFO  (qtp229384460-17937) [n:127.0.0.1:38811_xw_hhy%2Fi c:control_collection s:shard1  x:control_collection_shard1_replica_n1] o.a.s.u.CommitTracker Hard AutoCommit: disabled
   [junit4]   2> 804996 INFO  (qtp229384460-17937) [n:127.0.0.1:38811_xw_hhy%2Fi c:control_collection s:shard1  x:control_collection_shard1_replica_n1] o.a.s.u.CommitTracker Soft AutoCommit: disabled
   [junit4]   2> 804997 INFO  (qtp229384460-17937) [n:127.0.0.1:38811_xw_hhy%2Fi c:control_collection s:shard1  x:control_collection_shard1_replica_n1] o.a.s.u.RandomMergePolicy RandomMergePolicy wrapping class org.apache.lucene.index.LogByteSizeMergePolicy: [LogByteSizeMergePolicy: minMergeSize=1677721, mergeFactor=44, maxMergeSize=2147483648, maxMergeSizeForForcedMerge=9223372036854775807, calibrateSizeByDeletes=true, maxMergeDocs=2147483647, maxCFSSegmentSizeMB=8.796093022207999E12, noCFSRatio=0.0]
   [junit4]   2> 804997 INFO  (qtp229384460-17937) [n:127.0.0.1:38811_xw_hhy%2Fi c:control_collection s:shard1  x:control_collection_shard1_replica_n1] o.a.s.s.SolrIndexSearcher Opening [Searcher@1fbdb055[control_collection_shard1_replica_n1] main]
   [junit4]   2> 804998 INFO  (qtp229384460-17937) [n:127.0.0.1:38811_xw_hhy%2Fi c:control_collection s:shard1  x:control_collection_shard1_replica_n1] o.a.s.r.ManagedResourceStorage Configured ZooKeeperStorageIO with znodeBase: /configs/conf1
   [junit4]   2> 804998 INFO  (qtp229384460-17937) [n:127.0.0.1:38811_xw_hhy%2Fi c:control_collection s:shard1  x:control_collection_shard1_replica_n1] o.a.s.r.ManagedResourceStorage Loaded null at path _rest_managed.json using ZooKeeperStorageIO:path=/configs/conf1
   [junit4]   2> 804999 INFO  (qtp229384460-17937) [n:127.0.0.1:38811_xw_hhy%2Fi c:control_collection s:shard1  x:control_collection_shard1_replica_n1] o.a.s.h.ReplicationHandler Commits will be reserved for 10000ms.
   [junit4]   2> 804999 INFO  (qtp229384460-17937) [n:127.0.0.1:38811_xw_hhy%2Fi c:control_collection s:shard1  x:control_collection_shard1_replica_n1] o.a.s.u.UpdateLog Could not find max version in index or recent updates, using new clock 1610459917755351040
   [junit4]   2> 804999 INFO  (searcherExecutor-4367-thread-1-processing-n:127.0.0.1:38811_xw_hhy%2Fi x:control_collection_shard1_replica_n1 c:control_collection s:shard1) [n:127.0.0.1:38811_xw_hhy%2Fi c:control_collection s:shard1  x:control_collection_shard1_replica_n1] o.a.s.c.SolrCore [control_collection_shard1_replica_n1] Registered new searcher Searcher@1fbdb055[control_collection_shard1_replica_n1] main{ExitableDirectoryReader(UninvertingDirectoryReader())}
   [junit4]   2> 805002 INFO  (qtp229384460-17937) [n:127.0.0.1:38811_xw_hhy%2Fi c:control_collection s:shard1  x:control_collection_shard1_replica_n1] o.a.s.c.ZkShardTerms Successful update of terms at /collections/control_collection/terms/shard1 to Terms{values={core_node2=0}, version=0}
   [junit4]   2> 805004 INFO  (qtp229384460-17937) [n:127.0.0.1:38811_xw_hhy%2Fi c:control_collection s:shard1  x:control_collection_shard1_replica_n1] o.a.s.c.ShardLeaderElectionContext Enough replicas found to continue.
   [junit4]   2> 805004 INFO  (qtp229384460-17937) [n:127.0.0.1:38811_xw_hhy%2Fi c:control_collection s:shard1  x:control_collection_shard1_replica_n1] o.a.s.c.ShardLeaderElectionContext I may be the new leader - try and sync
   [junit4]   2> 805004 INFO  (qtp229384460-17937) [n:127.0.0.1:38811_xw_hhy%2Fi c:control_collection s:shard1  x:control_collection_shard1_replica_n1] o.a.s.c.SyncStrategy Sync replicas to http://127.0.0.1:38811/xw_hhy/i/control_collection_shard1_replica_n1/
   [junit4]   2> 805004 INFO  (qtp229384460-17937) [n:127.0.0.1:38811_xw_hhy%2Fi c:control_collection s:shard1  x:control_collection_shard1_replica_n1] o.a.s.c.SyncStrategy Sync Success - now sync replicas to me
   [junit4]   2> 805004 INFO  (qtp229384460-17937) [n:127.0.0.1:38811_xw_hhy%2Fi c:control_collection s:shard1  x:control_collection_shard1_replica_n1] o.a.s.c.SyncStrategy http://127.0.0.1:38811/xw_hhy/i/control_collection_shard1_replica_n1/ has no replicas
   [junit4]   2> 805004 INFO  (qtp229384460-17937) [n:127.0.0.1:38811_xw_hhy%2Fi c:control_collection s:shard1  x:control_collection_shard1_replica_n1] o.a.s.c.ShardLeaderElectionContext Found all replicas participating in election, clear LIR
   [junit4]   2> 805015 INFO  (qtp229384460-17937) [n:127.0.0.1:38811_xw_hhy%2Fi c:control_collection s:shard1  x:control_collection_shard1_replica_n1] o.a.s.c.ShardLeaderElectionContext I am the new leader: http://127.0.0.1:38811/xw_hhy/i/control_collection_shard1_replica_n1/ shard1
   [junit4]   2> 805166 INFO  (qtp229384460-17937) [n:127.0.0.1:38811_xw_hhy%2Fi c:control_collection s:shard1  x:control_collection_shard1_replica_n1] o.a.s.c.ZkController I am the leader, no recovery necessary
   [junit4]   2> 805168 INFO  (qtp229384460-17937) [n:127.0.0.1:38811_xw_hhy%2Fi c:control_collection s:shard1  x:control_collection_shard1_replica_n1] o.a.s.s.HttpSolrCall [admin] webapp=null path=/admin/cores params={qt=/admin/cores&collection.configName=conf1&newCollection=true&name=control_collection_shard1_replica_n1&action=CREATE&numShards=1&collection=control_collection&shard=shard1&wt=javabin&version=2&replicaType=NRT} status=0 QTime=1868
   [junit4]   2> 805169 INFO  (qtp229384460-17942) [n:127.0.0.1:38811_xw_hhy%2Fi    ] o.a.s.h.a.CollectionsHandler Wait for new collection to be active for at most 30 seconds. Check all shard replicas
   [junit4]   2> 805197 INFO  (OverseerCollectionConfigSetProcessor-72152617052209156-127.0.0.1:38811_xw_hhy%2Fi-n_0000000000) [n:127.0.0.1:38811_xw_hhy%2Fi    ] o.a.s.c.OverseerTaskQueue Response ZK path: /overseer/collection-queue-work/qnr-0000000000 doesn't exist.  Requestor may have disconnected from ZooKeeper
   [junit4]   2> 805269 INFO  (zkCallback-6240-thread-1) [    ] o.a.s.c.c.ZkStateReader A cluster state change: [WatchedEvent state:SyncConnected type:NodeDataChanged path:/collections/control_collection/state.json] for collection [control_collection] has occurred - updating... (live nodes size: [1])
   [junit4]   2> 806169 INFO  (qtp229384460-17942) [n:127.0.0.1:38811_xw_hhy%2Fi    ] o.a.s.s.HttpSolrCall [admin] webapp=null path=/admin/collections params={collection.configName=conf1&name=control_collection&nrtReplicas=1&action=CREATE&numShards=1&createNodeSet=127.0.0.1:38811_xw_hhy%252Fi&wt=javabin&version=2} status=0 QTime=2975
   [junit4]   2> 806174 INFO  (zkConnectionManagerCallback-6259-thread-1) [    ] o.a.s.c.c.ConnectionManager zkClient has connected
   [junit4]   2> 806174 INFO  (TEST-UnloadDistributedZkTest.test-seed#[7EAE4CC7A1DAD37A]) [    ] o.a.s.c.c.ZkStateReader Updated live nodes from ZooKeeper... (0) -> (1)
   [junit4]   2> 806175 INFO  (TEST-UnloadDistributedZkTest.test-seed#[7EAE4CC7A1DAD37A]) [    ] o.a.s.c.s.i.ZkClientClusterStateProvider Cluster at 127.0.0.1:46315/solr ready
   [junit4]   2> 806175 INFO  (TEST-UnloadDistributedZkTest.test-seed#[7EAE4CC7A1DAD37A]) [    ] o.a.s.c.ChaosMonkey monkey: init - expire sessions:false cause connection loss:false
   [junit4]   2> 806176 INFO  (qtp229384460-17938) [n:127.0.0.1:38811_xw_hhy%2Fi    ] o.a.s.h.a.CollectionsHandler Invoked Collection Action :create with params collection.configName=conf1&name=collection1&nrtReplicas=1&action=CREATE&numShards=2&createNodeSet=&stateFormat=1&wt=javabin&version=2 and sendToOCPQueue=true
   [junit4]   2> 806178 INFO  (OverseerThreadFactory-4362-thread-2-processing-n:127.0.0.1:38811_xw_hhy%2Fi) [n:127.0.0.1:38811_xw_hhy%2Fi    ] o.a.s.c.a.c.CreateCollectionCmd Create collection collection1
   [junit4]   2> 806380 WARN  (OverseerThreadFactory-4362-thread-2-processing-n:127.0.0.1:38811_xw_hhy%2Fi) [n:127.0.0.1:38811_xw_hhy%2Fi    ] o.a.s.c.a.c.CreateCollectionCmd It is unusual to create a collection (collection1) without cores.
   [junit4]   2> 806381 INFO  (qtp229384460-17938) [n:127.0.0.1:38811_xw_hhy%2Fi    ] o.a.s.h.a.CollectionsHandler Wait for new collection to be active for at most 30 seconds. Check all shard replicas
   [junit4]   2> 806381 INFO  (qtp229384460-17938) [n:127.0.0.1:38811_xw_hhy%2Fi    ] o.a.s.s.HttpSolrCall [admin] webapp=null path=/admin/collections params={collection.configName=conf1&name=collection1&nrtReplicas=1&action=CREATE&numShards=2&createNodeSet=&stateFormat=1&wt=javabin&version=2} status=0 QTime=205
   [junit4]   2> 806470 INFO  (TEST-UnloadDistributedZkTest.test-seed#[7EAE4CC7A1DAD37A]) [    ] o.a.s.c.AbstractFullDistribZkTestBase create jetty 1 in directory /home/jenkins/workspace/Lucene-Solr-master-Linux/solr/build/solr-core/test/J1/temp/solr.cloud.UnloadDistributedZkTest_7EAE4CC7A1DAD37A-001/shard-1-001 of type NRT
   [junit4]   2> 806471 INFO  (TEST-UnloadDistributedZkTest.test-seed#[7EAE4CC7A1DAD37A]) [    ] o.e.j.s.Server jetty-9.4.11.v20180605; built: 2018-06-05T18:24:03.829Z; git: d5fc0523cfa96bfebfbda19606cad384d772f04c; jvm 1.8.0_172-b11
   [junit4]   2> 806471 INFO  (TEST-UnloadDistributedZkTest.test-seed#[7EAE4CC7A1DAD37A]) [    ] o.e.j.s.session DefaultSessionIdManager workerName=node0
   [junit4]   2> 806471 INFO  (TEST-UnloadDistributedZkTest.test-seed#[7EAE4CC7A1DAD37A]) [    ] o.e.j.s.session No SessionScavenger set, using defaults
   [junit4]   2> 806471 INFO  (TEST-UnloadDistributedZkTest.test-seed#[7EAE4CC7A1DAD37A]) [    ] o.e.j.s.session node0 Scavenging every 600000ms
   [junit4]   2> 806472 INFO  (TEST-UnloadDistributedZkTest.test-seed#[7EAE4CC7A1DAD37A]) [    ] o.e.j.s.h.ContextHandler Started o.e.j.s.ServletContextHandler@2d0cb551{/xw_hhy/i,null,AVAILABLE}
   [junit4]   2> 806472 INFO  (TEST-UnloadDistributedZkTest.test-seed#[7EAE4CC7A1DAD37A]) [    ] o.e.j.s.AbstractConnector Started ServerConnector@18b0ad7{HTTP/1.1,[http/1.1]}{127.0.0.1:43413}
   [junit4]   2> 806472 INFO  (TEST-UnloadDistributedZkTest.test-seed#[7EAE4CC7A1DAD37A]) [    ] o.e.j.s.Server Started @806532ms
   [junit4]   2> 806472 INFO  (TEST-UnloadDistributedZkTest.test-seed#[7EAE4CC7A1DAD37A]) [    ] o.a.s.c.s.e.JettySolrRunner Jetty properties: {solr.data.dir=/home/jenkins/workspace/Lucene-Solr-master-Linux/solr/build/solr-core/test/J1/temp/solr.cloud.UnloadDistributedZkTest_7EAE4CC7A1DAD37A-001/tempDir-001/jetty1, solrconfig=solrconfig.xml, hostContext=/xw_hhy/i, hostPort=43413, coreRootDirectory=/home/jenkins/workspace/Lucene-Solr-master-Linux/solr/build/solr-core/test/J1/../../../../../../../../../home/jenkins/workspace/Lucene-Solr-master-Linux/solr/build/solr-core/test/J1/temp/solr.cloud.UnloadDistributedZkTest_7EAE4CC7A1DAD37A-001/shard-1-001/cores}
   [junit4]   2> 806472 ERROR (TEST-UnloadDistributedZkTest.test-seed#[7EAE4CC7A1DAD37A]) [    ] o.a.s.u.StartupLoggingUtils Missing Java Option solr.log.dir. Logging may be missing or incomplete.
   [junit4]   2> 806472 INFO  (TEST-UnloadDistributedZkTest.test-seed#[7EAE4CC7A1DAD37A]) [    ] o.a.s.s.SolrDispatchFilter Using logger factory org.apache.logging.slf4j.Log4jLoggerFactory
   [junit4]   2> 806472 INFO  (TEST-UnloadDistributedZkTest.test-seed#[7EAE4CC7A1DAD37A]) [    ] o.a.s.s.SolrDispatchFilter  ___      _       Welcome to Apache Solr? version 8.0.0
   [junit4]   2> 806472 INFO  (TEST-UnloadDistributedZkTest.test-seed#[7EAE4CC7A1DAD37A]) [    ] o.a.s.s.SolrDispatchFilter / __| ___| |_ _   Starting in cloud mode on port null
   [junit4]   2> 806472 INFO  (TEST-UnloadDistributedZkTest.test-seed#[7EAE4CC7A1DAD37A]) [    ] o.a.s.s.SolrDispatchFilter \__ \/ _ \ | '_|  Install dir: null
   [junit4]   2> 806472 INFO  (TEST-UnloadDistributedZkTest.test-seed#[7EAE4CC7A1DAD37A]) [    ] o.a.s.s.SolrDispatchFilter |___/\___/_|_|    Start time: 2018-09-02T02:11:02.638Z
   [junit4]   2> 806473 INFO  (zkConnectionManagerCallback-6261-thread-1) [    ] o.a.s.c.c.ConnectionManager zkClient has connected
   [junit4]   2> 806474 INFO  (TEST-UnloadDistributedZkTest.test-seed#[7EAE4CC7A1DAD37A]) [    ] o.a.s.s.SolrDispatchFilter Loading solr.xml from SolrHome (not found in ZooKeeper)
   [junit4]   2> 806474 INFO  (TEST-UnloadDistributedZkTest.test-seed#[7EAE4CC7A1DAD37A]) [    ] o.a.s.c.SolrXmlConfig Loading container configuration from /home/jenkins/workspace/Lucene-Solr-master-Linux/solr/build/solr-core/test/J1/temp/solr.cloud.UnloadDistributedZkTest_7EAE4CC7A1DAD37A-001/shard-1-001/solr.xml
   [junit4]   2> 806476 INFO  (TEST-UnloadDistributedZkTest.test-seed#[7EAE4CC7A1DAD37A]) [    ] o.a.s.c.SolrXmlConfig Configuration parameter autoReplicaFailoverWorkLoopDelay is ignored
   [junit4]   2> 806476 INFO  (TEST-UnloadDistributedZkTest.test-seed#[7EAE4CC7A1DAD37A]) [    ] o.a.s.c.SolrXmlConfig Configuration parameter autoReplicaFailoverBadNodeExpiration is ignored
   [junit4]   2> 806476 INFO  (TEST-UnloadDistributedZkTest.test-seed#[7EAE4CC7A1DAD37A]) [    ] o.a.s.c.SolrXmlConfig MBean server found: com.sun.jmx.mbeanserver.JmxMBeanServer@442b3e77, but no JMX reporters were configured - adding default JMX reporter.
   [junit4]   2> 806628 INFO  (TEST-UnloadDistributedZkTest.test-seed#[7EAE4CC7A1DAD37A]) [    ] o.a.s.c.ZkContainer Zookeeper client=127.0.0.1:46315/solr
   [junit4]   2> 806629 INFO  (zkConnectionManagerCallback-6265-thread-1) [    ] o.a.s.c.c.ConnectionManager zkClient has connected
   [junit4]   2> 806630 INFO  (zkConnectionManagerCallback-6267-thread-1) [    ] o.a.s.c.c.ConnectionManager zkClient has connected
   [junit4]   2> 806632 INFO  (TEST-UnloadDistributedZkTest.test-seed#[7EAE4CC7A1DAD37A]) [    ] o.a.s.c.c.ZkStateReader Updated live nodes from ZooKeeper... (0) -> (1)
   [junit4]   2> 806634 INFO  (TEST-UnloadDistributedZkTest.test-seed#[7EAE4CC7A1DAD37A]) [    ] o.a.s.c.TransientSolrCoreCacheDefault Allocating transient cache for 4 transient cores
   [junit4]   2> 806634 INFO  (TEST-UnloadDistributedZkTest.test-seed#[7EAE4CC7A1DAD37A]) [    ] o.a.s.c.ZkController Register node as live in ZooKeeper:/live_nodes/127.0.0.1:43413_xw_hhy%2Fi
   [junit4]   2> 806634 INFO  (zkCallback-6247-thread-1) [    ] o.a.s.c.c.ZkStateReader Updated live nodes from ZooKeeper... (1) -> (2)
   [junit4]   2> 806634 INFO  (zkCallback-6240-thread-1) [    ] o.a.s.c.c.ZkStateReader Updated live nodes from ZooKeeper... (1) -> (2)
   [junit4]   2> 806634 INFO  (zkCallback-6266-thread-1) [    ] o.a.s.c.c.ZkStateReader Updated live nodes from ZooKeeper... (1) -> (2)
   [junit4]   2> 806637 INFO  (zkCallback-6258-thread-1) [    ] o.a.s.c.c.ZkStateReader Updated live nodes from ZooKeeper... (1) -> (2)
   [junit4]   2> 806653 INFO  (zkConnectionManagerCallback-6274-thread-1) [    ] o.a.s.c.c.ConnectionManager zkClient has connected
   [junit4]   2> 806653 INFO  (TEST-UnloadDistributedZkTest.test-seed#[7EAE4CC7A1DAD37A]) [    ] o.a.s.c.c.ZkStateReader Updated live nodes from ZooKeeper... (0) -> (2)
   [junit4]   2> 806654 INFO  (TEST-UnloadDistributedZkTest.test-seed#[7EAE4CC7A1DAD37A]) [    ] o.a.s.c.s.i.ZkClientClusterStateProvider Cluster at 127.0.0.1:46315/solr ready
   [junit4]   2> 806654 INFO  (TEST-UnloadDistributedZkTest.test-seed#[7EAE4CC7A1DAD37A]) [    ] o.a.s.h.a.MetricsHistoryHandler No .system collection, keeping metrics history in memory.
   [junit4]   2> 806675 INFO  (TEST-UnloadDistributedZkTest.test-seed#[7EAE4CC7A1DAD37A]) [    ] o.a.s.m.r.SolrJmxReporter JMX monitoring for 'solr.node' (registry 'solr.node') enabled at server: com.sun.jmx.mbeanserver.JmxMBeanServer@442b3e77
   [junit4]   2> 806681 INFO  (TEST-UnloadDistributedZkTest.test-seed#[7EAE4CC7A1DAD37A]) [    ] o.a.s.m.r.SolrJmxReporter JMX monitoring for 'solr.jvm' (registry 'solr.jvm') enabled at server: com.sun.jmx.mbeanserver.JmxMBeanServer@442b3e77
   [junit4]   2> 806681 INFO  (TEST-UnloadDistributedZkTest.test-seed#[7EAE4CC7A1DAD37A]) [    ] o.a.s.m.r.SolrJmxReporter JMX monitoring for 'solr.jetty' (registry 'solr.jetty') enabled at server: com.sun.jmx.mbeanserver.JmxMBeanServer@442b3e77
   [junit4]   2> 806682 INFO  (TEST-UnloadDistributedZkTest.test-seed#[7EAE4CC7A1DAD37A]) [    ] o.a.s.c.CorePropertiesLocator Found 0 core definitions underneath /home/jenkins/workspace/Lucene-Solr-master-Linux/solr/build/solr-core/test/J1/../../../../../../../../../home/jenkins/workspace/Lucene-Solr-master-Linux/solr/build/solr-core/test/J1/temp/solr.cloud.UnloadDistributedZkTest_7EAE4CC7A1DAD37A-001/shard-1-001/cores
   [junit4]   2> 806698 INFO  (qtp229384460-17940) [n:127.0.0.1:38811_xw_hhy%2Fi    ] o.a.s.h.a.CollectionsHandler Invoked Collection Action :addreplica with params node=127.0.0.1:43413_xw_hhy%252Fi&action=ADDREPLICA&collection=collection1&shard=shard2&type=NRT&wt=javabin&version=2 and sendToOCPQueue=true
   [junit4]   2> 806700 INFO  (OverseerCollectionConfigSetProcessor-72152617052209156-127.0.0.1:38811_xw_hhy%2Fi-n_0000000000) [n:127.0.0.1:38811_xw_hhy%2Fi    ] o.a.s.c.OverseerTaskQueue Response ZK path: /overseer/collection-queue-work/qnr-0000000002 doesn't exist.  Requestor may have disconnected from ZooKeeper
   [junit4]   2> 806700 INFO  (OverseerThreadFactory-4362-thread-3-processing-n:127.0.0.1:38811_xw_hhy%2Fi) [n:127.0.0.1:38811_xw_hhy%2Fi c:collection1 s:shard2  ] o.a.s.c.a.c.AddReplicaCmd Node Identified 127.0.0.1:43413_xw_hhy%2Fi for creating new replica of shard shard2
   [junit4]   2> 806701 INFO  (qtp993175066-17999) [n:127.0.0.1:43413_xw_hhy%2Fi    x:collection1_shard2_replica_n41] o.a.s.h.a.CoreAdminOperation core create command qt=/admin/cores&collection.configName=conf1&name=collection1_shard2_replica_n41&action=CREATE&collection=collection1&shard=shard2&wt=javabin&version=2&replicaType=NRT
   [junit4]   2> 807711 INFO  (qtp993175066-17999) [n:127.0.0.1:43413_xw_hhy%2Fi c:collection1 s:shard2  x:collection1_shard2_replica_n41] o.a.s.c.SolrConfig Using Lucene MatchVersion: 8.0.0
   [junit4]   2> 807718 INFO  (qtp993175066-17999) [n:127.0.0.1:43413_xw_hhy%2Fi c:collection1 s:shard2  x:collection1_shard2_replica_n41] o.a.s.s.IndexSchema [collection1_shard2_replica_n41] Schema name=test
   [junit4]   2> 807779 INFO  (qtp993175066-17999) [n:127.0.0.1:43413_xw_hhy%2Fi c:collection1 s:shard2  x:collection1_shard2_replica_n41] o.a.s.s.IndexSchema Loaded schema test/1.0 with uniqueid field id
   [junit4]   2> 807786 INFO  (qtp993175066-17999) [n:127.0.0.1:43413_xw_hhy%2Fi c:collection1 s:shard2  x:collection1_shard2_replica_n41] o.a.s.c.CoreContainer Creating SolrCore 'collection1_shard2_replica_n41' using configuration from collection collection1, trusted=true
   [junit4]   2> 807787 INFO  (qtp993175066-17999) [n:127.0.0.1:43413_xw_hhy%2Fi c:collection1 s:shard2  x:collection1_shard2_replica_n41] o.a.s.m.r.SolrJmxReporter JMX monitoring for 'solr.core.collection1.shard2.replica_n41' (registry 'solr.core.collection1.shard2.replica_n41') enabled at server: com.sun.jmx.mbeanserver.JmxMBeanServer@442b3e77
   [junit4]   2> 807787 INFO  (qtp993175066-17999) [n:127.0.0.1:43413_xw_hhy%2Fi c:collection1 s:shard2  x:collection1_shard2_replica_n41] o.a.s.c.SolrCore solr.RecoveryStrategy.Builder
   [junit4]   2> 807787 INFO  (qtp993175066-17999) [n:127.0.0.1:43413_xw_hhy%2Fi c:collection1 s:shard2  x:collection1_shard2_replica_n41] o.a.s.c.SolrCore [[collection1_shard2_replica_n41] ] Opening new SolrCore at [/home/jenkins/workspace/Lucene-Solr-master-Linux/solr/build/solr-core/test/J1/temp/solr.cloud.UnloadDistributedZkTest_7EAE4CC7A1DAD37A-001/shard-1-001/cores/collection1_shard2_replica_n41], dataDir=[/home/jenkins/workspace/Lucene-Solr-master-Linux/solr/build/solr-core/test/J1/../../../../../../../../../home/jenkins/workspace/Lucene-Solr-master-Linux/solr/build/solr-core/test/J1/temp/solr.cloud.UnloadDistributedZkTest_7EAE4CC7A1DAD37A-001/shard-1-001/cores/collection1_shard2_replica_n41/data/]
   [junit4]   2> 807788 INFO  (qtp993175066-17999) [n:127.0.0.1:43413_xw_hhy%2Fi c:collection1 s:shard2  x:collection1_shard2_replica_n41] o.a.s.u.RandomMergePolicy RandomMergePolicy wrapping class org.apache.lucene.index.TieredMergePolicy: [TieredMergePolicy: maxMergeAtOnce=35, maxMergeAtOnceExplicit=40, maxMergedSegmentMB=41.1240234375, floorSegmentMB=1.693359375, forceMergeDeletesPctAllowed=6.399636045180079, segmentsPerTier=38.0, maxCFSSegmentSizeMB=8.796093022207999E12, noCFSRatio=0.1256463947391877, deletesPctAllowed=41.830958535666376
   [junit4]   2> 807789 WARN  (qtp993175066-17999) [n:127.0.0.1:43413_xw_hhy%2Fi c:collection1 s:shard2  x:collection1_shard2_replica_n41] o.a.s.c.RequestHandlers INVALID paramSet a in requestHandler {type = requestHandler,name = /dump,class = DumpRequestHandler,attributes = {initParams=a, name=/dump, class=DumpRequestHandler},args = {defaults={a=A,b=B}}}
   [junit4]   2> 807814 INFO  (qtp993175066-17999) [n:127.0.0.1:43413_xw_hhy%2Fi c:collection1 s:shard2  x:collection1_shard2_replica_n41] o.a.s.u.UpdateHandler Using UpdateLog implementation: org.apache.solr.update.UpdateLog
   [junit4]   2> 807814 INFO  (qtp993175066-17999) [n:127.0.0.1:43413_xw_hhy%2Fi c:collection1 s:shard2  x:collection1_shard2_replica_n41] o.a.s.u.UpdateLog Initializing UpdateLog: dataDir= defaultSyncLevel=FLUSH numRecordsToKeep=100 maxNumLogsToKeep=10 numVersionBuckets=65536
   [junit4]   2> 807815 INFO  (qtp993175066-17999) [n:127.0.0.1:43413_xw_hhy%2Fi c:collection1 s:shard2  x:collection1_shard2_replica_n41] o.a.s.u.CommitTracker Hard AutoCommit: disabled
   [junit4]   2> 807815 INFO  (qtp993175066-17999) [n:127.0.0.1:43413_xw_hhy%2Fi c:collection1 s:shard2  x:collection1_shard2_replica_n41] o.a.s.u.CommitTracker Soft AutoCommit: disabled
   [junit4]   2> 807816 INFO  (qtp993175066-17999) [n:127.0.0.1:43413_xw_hhy%2Fi c:collection1 s:shard2  x:collection1_shard2_replica_n41] o.a.s.u.RandomMergePolicy RandomMergePolicy wrapping class org.apache.lucene.index.LogByteSizeMergePolicy: [LogByteSizeMergePolicy: minMergeSize=1677721, mergeFactor=44, maxMergeSize=2147483648, maxMergeSizeForForcedMerge=9223372036854775807, calibrateSizeByDeletes=true, maxMergeDocs=2147483647, maxCFSSegmentSizeMB=8.796093022207999E12, noCFSRatio=0.0]
   [junit4]   2> 807816 INFO  (qtp993175066-17999) [n:127.0.0.1:43413_xw_hhy%2Fi c:collection1 s:shard2  x:collection1_shard2_replica_n41] o.a.s.s.SolrIndexSearcher Opening [Searcher@12784038[collection1_shard2_replica_n41] main]
   [junit4]   2> 807817 INFO  (qtp993175066-17999) [n:127.0.0.1:43413_xw_hhy%2Fi c:collection1 s:shard2  x:collection1_shard2_replica_n41] o.a.s.r.ManagedResourceStorage Configured ZooKeeperStorageIO with znodeBase: /configs/conf1
   [junit4]   2> 807817 INFO  (qtp993175066-17999) [n:127.0.0.1:43413_xw_hhy%2Fi c:collection1 s:shard2  x:collection1_shard2_replica_n41] o.a.s.r.ManagedResourceStorage Loaded null at path _rest_managed.json using ZooKeeperStorageIO:path=/configs/conf1
   [junit4]   2> 807817 INFO  (qtp993175066-17999) [n:127.0.0.1:43413_xw_hhy%2Fi c:collection1 s:shard2  x:collection1_shard2_replica_n41] o.a.s.h.ReplicationHandler Commits will be reserved for 10000ms.
   [junit4]   2> 807817 INFO  (qtp993175066-17999) [n:127.0.0.1:43413_xw_hhy%2Fi c:collection1 s:shard2  x:collection1_shard2_replica_n41] o.a.s.u.UpdateLog Could not find max version in index or recent updates, using new clock 1610459920710238208
   [junit4]   2> 807818 INFO  (searcherExecutor-4381-thread-1-processing-n:127.0.0.1:43413_xw_hhy%2Fi x:collection1_shard2_replica_n41 c:collection1 s:shard2) [n:127.0.0.1:43413_xw_hhy%2Fi c:collection1 s:shard2  x:collection1_shard2_replica_n41] o.a.s.c.SolrCore [collection1_shard2_replica_n41] Registered new searcher Searcher@12784038[collection1_shard2_replica_n41] main{ExitableDirectoryReader(UninvertingDirectoryReader())}
   [junit4]   2> 807821 INFO  (qtp993175066-17999) [n:127.0.0.1:43413_xw_hhy%2Fi c:collection1 s:shard2  x:collection1_shard2_replica_n41] o.a.s.c.ZkShardTerms Successful update of terms at /collections/collection1/terms/shard2 to Terms{values={core_node42=0}, version=0}
   [junit4]   2> 807822 INFO  (qtp993175066-17999) [n:127.0.0.1:43413_xw_hhy%2Fi c:collection1 s:shard2  x:collection1_shard2_replica_n41] o.a.s.c.ShardLeaderElectionContext Enough replicas found to continue.
   [junit4]   2> 807822 INFO  (qtp993175066-17999) [n:127.0.0.1:43413_xw_hhy%2Fi c:collection1 s:shard2  x:collection1_shard2_replica_n41] o.a.s.c.ShardLeaderElectionContext I may be the new leader - try and sync
   [junit4]   2> 807822 INFO  (qtp993175066-17999) [n:127.0.0.1:43413_xw_hhy%2Fi c:collection1 s:shard2  x:collection1_shard2_replica_n41] o.a.s.c.SyncStrategy Sync replicas to http://127.0.0.1:43413/xw_hhy/i/collection1_shard2_replica_n41/
   [junit4]   2> 807822 INFO  (qtp993175066-17999) [n:127.0.0.1:43413_xw_hhy%2Fi c:collection1 s:shard2  x:collection1_shard2_replica_n41] o.a.s.c.SyncStrategy Sync Success - now sync replicas to me
   [junit4]   2> 807822 INFO  (qtp993175066-17999) [n:127.0.0.1:43413_xw_hhy%2Fi c:collection1 s:shard2  x:collection1_shard2_replica_n41] o.a.s.c.SyncStrategy http://127.0.0.1:43413/xw_hhy/i/collection1_shard2_replica_n41/ has no replicas
   [junit4]   2> 807822 INFO  (qtp993175066-17999) [n:127.0.0.1:43413_xw_hhy%2Fi c:collection1 s:shard2  x:collection1_shard2_replica_n41] o.a.s.c.ShardLeaderElectionContext Found all replicas participating in election, clear LIR
   [junit4]   2> 807823 INFO  (qtp993175066-17999) [n:127.0.0.1:43413_xw_hhy%2Fi c:collection1 s:shard2  x:collection1_shard2_replica_n41] o.a.s.c.ShardLeaderElectionContext I am the new leader: http://127.0.0.1:43413/xw_hhy/i/collection1_shard2_replica_n41/ shard2
   [junit4]   2> 807973 INFO  (qtp993175066-17999) [n:127.0.0.1:43413_xw_hhy%2Fi c:collection1 s:shard2  x:collection1_shard2_replica_n41] o.a.s.c.ZkController I am the leader, no recovery necessary
   [junit4]   2> 807976 INFO  (qtp993175066-17999) [n:127.0.0.1:43413_xw_hhy%2Fi c:collection1 s:shard2  x:collection1_shard2_replica_n41] o.a.s.s.HttpSolrCall [admin] webapp=null path=/admin/cores params={qt=/admin/cores&collection.configName=conf1&name=collection1_shard2_replica_n41&action=CREATE&collection=collection1&shard=shard2&wt=javabin&version=2&replicaType=NRT} status=0 QTime=1274
   [junit4]   2> 807977 INFO  (qtp229384460-17940) [n:127.0.0.1:38811_xw_hhy%2Fi c:collection1   ] o.a.s.s.HttpSolrCall [admin] webapp=null path=/admin/collections params={node=127.0.0.1:43413_xw_hhy%252Fi&action=ADDREPLICA&collection=collection1&shard=shard2&type=NRT&wt=javabin&version=2} status=0 QTime=1279
   [junit4]   2> 808042 INFO  (TEST-UnloadDistributedZkTest.test-seed#[7EAE4CC7A1DAD37A]) [    ] o.a.s.c.AbstractFullDistribZkTestBase create jetty 2 in directory /home/jenkins/workspace/Lucene-Solr-master-Linux/solr/build/solr-core/test/J1/temp/solr.cloud.UnloadDistributedZkTest_7EAE4CC7A1DAD37A-001/shard-2-001 of type NRT
   [junit4]   2> 808042 INFO  (TEST-UnloadDistributedZkTest.test-seed#[7EAE4CC7A1DAD37A]) [    ] o.e.j.s.Server jetty-9.4.11.v20180605; built: 2018-06-05T18:24:03.829Z; git: d5fc0523cfa96bfebfbda19606cad384d772f04c; jvm 1.8.0_172-b11
   [junit4]   2> 808043 INFO  (TEST-UnloadDistributedZkTest.test-seed#[7EAE4CC7A1DAD37A]) [    ] o.e.j.s.session DefaultSessionIdManager workerName=node0
   [junit4]   2> 808043 INFO  (TEST-UnloadDistributedZkTest.test-seed#[7EAE4CC7A1DAD37A]) [    ] o.e.j.s.session No SessionScavenger set, using defaults
   [junit4]   2> 808043 INFO  (TEST-UnloadDistributedZkTest.test-seed#[7EAE4CC7A1DAD37A]) [    ] o.e.j.s.session node0 Scavenging every 600000ms
   [junit4]   2> 808043 INFO  (TEST-UnloadDistributedZkTest.test-seed#[7EAE4CC7A1DAD37A]) [    ] o.e.j.s.h.ContextHandler Started o.e.j.s.ServletContextHandler@1ea7e2b7{/xw_hhy/i,null,AVAILABLE}
   [junit4]   2> 808044 INFO  (TEST-UnloadDistributedZkTest.test-seed#[7EAE4CC7A1DAD37A]) [    ] o.e.j.s.AbstractConnector Started ServerConnector@2d98454c{HTTP/1.1,[http/1.1]}{127.0.0.1:37303}
   [junit4]   2> 808044 INFO  (TEST-UnloadDistributedZkTest.test-seed#[7EAE4CC7A1DAD37A]) [    ] o.e.j.s.Server Started @808104ms
   [junit4]   2> 808044 INFO  (TEST-UnloadDistributedZkTest.test-seed#[7EAE4CC7A1DAD37A]) [    ] o.a.s.c.s.e.JettySolrRunner Jetty properties: {solr.data.dir=/home/jenkins/workspace/Lucene-Solr-master-Linux/solr/build/solr-core/test/J1/temp/solr.cloud.UnloadDistributedZkTest_7EAE4CC7A1DAD37A-001/tempDir-001/jetty2, solrconfig=solrconfig.xml, hostContext=/xw_hhy/i, hostPort=37303, coreRootDirectory=/home/jenkins/workspace/Lucene-Solr-master-Linux/solr/build/solr-core/test/J1/temp/solr.cloud.UnloadDistributedZkTest_7EAE4CC7A1DAD37A-001/shard-2-001/cores}
   [junit4]   2> 808044 ERROR (TEST-UnloadDistributedZkTest.test-seed#[7EAE4CC7A1DAD37A]) [    ] o.a.s.u.StartupLoggingUtils Missing Java Option solr.log.dir. Logging may be missing or incomplete.
   [junit4]   2> 808044 INFO  (TEST-UnloadDistributedZkTest.test-seed#[7EAE4CC7A1DAD37A]) [    ] o.a.s.s.SolrDispatchFilter Using logger factory org.apache.logging.slf4j.Log4jLoggerFactory
   [junit4]   2> 808044 INFO  (TEST-UnloadDistributedZkTest.test-seed#[7EAE4CC7A1DAD37A]) [    ] o.a.s.s.SolrDispatchFilter  ___      _       Welcome to Apache Solr? version 8.0.0
   [junit4]   2> 808044 INFO  (TEST-UnloadDistributedZkTest.test-seed#[7EAE4CC7A1DAD37A]) [    ] o.a.s.s.SolrDispatchFilter / __| ___| |_ _   Starting in cloud mode on port null
   [junit4]   2> 808044 INFO  (TEST-UnloadDistributedZkTest.test-seed#[7EAE4CC7A1DAD37A]) [    ] o.a.s.s.SolrDispatchFilter \__ \/ _ \ | '_|  Install dir: null
   [junit4]   2> 808044 INFO  (TEST-UnloadDistributedZkTest.test-seed#[7EAE4CC7A1DAD37A]) [    ] o.a.s.s.SolrDispatchFilter |___/\___/_|_|    Start time: 2018-09-02T02:11:04.210Z
   [junit4]   2> 808045 INFO  (zkConnectionManagerCallback-6277-thread-1) [    ] o.a.s.c.c.ConnectionManager zkClient has connected
   [junit4]   2> 808046 INFO  (TEST-UnloadDistributedZkTest.test-seed#[7EAE4CC7A1DAD37A]) [    ] o.a.s.s.SolrDispatchFilter Loading solr.xml from SolrHome (not found in ZooKeeper)
   [junit4]   2> 808046 INFO  (TEST-UnloadDistributedZkTest.test-seed#[7EAE4CC7A1DAD37A]) [    ] o.a.s.c.SolrXmlConfig Loading container configuration from /home/jenkins/workspace/Lucene-Solr-master-Linux/solr/build/solr-core/test/J1/temp/solr.cloud.UnloadDistributedZkTest_7EAE4CC7A1DAD37A-001/shard-2-001/solr.xml
   [junit4]   2> 808048 INFO  (TEST-UnloadDistributedZkTest.test-seed#[7EAE4CC7A1DAD37A]) [    ] o.a.s.c.SolrXmlConfig Configuration parameter autoReplicaFailoverWorkLoopDelay is ignored
   [junit4]   2> 808048 INFO  (TEST-UnloadDistributedZkTest.test-seed#[7EAE4CC7A1DAD37A]) [    ] o.a.s.c.SolrXmlConfig Configuration parameter autoReplicaFailoverBadNodeExpiration is ignored
   [junit4]   2> 808048 INFO  (TEST-UnloadDistributedZkTest.test-seed#[7EAE4CC7A1DAD37A]) [    ] o.a.s.c.SolrXmlConfig MBean server found: com.sun.jmx.mbeanserver.JmxMBeanServer@442b3e77, but no JMX reporters were configured - adding default JMX reporter.
   [junit4]   2> 808104 INFO  (TEST-UnloadDistributedZkTest.test-seed#[7EAE4CC7A1DAD37A]) [    ] o.a.s.c.ZkContainer Zookeeper client=127.0.0.1:46315/solr
   [junit4]   2> 808106 INFO  (zkConnectionManagerCallback-6281-thread-1) [    ] o.a.s.c.c.ConnectionManager zkClient has connected
   [junit4]   2> 808107 INFO  (zkConnectionManagerCallback-6283-thread-1) [    ] o.a.s.c.c.ConnectionManager zkClient has connected
   [junit4]   2> 808110 INFO  (TEST-UnloadDistributedZkTest.test-seed#[7EAE4CC7A1DAD37A]) [    ] o.a.s.c.c.ZkStateReader Updated live nodes from ZooKeeper... (0) -> (2)
   [junit4]   2> 808111 INFO  (TEST-UnloadDistributedZkTest.test-seed#[7EAE4CC7A1DAD37A]) [    ] o.a.s.c.TransientSolrCoreCacheDefault Allocating transient cache for 4 transient cores
   [junit4]   2> 808111 INFO  (TEST-UnloadDistributedZkTest.test-seed#[7EAE4CC7A1DAD37A]) [    ] o.a.s.c.ZkController Register node as live in ZooKeeper:/live_nodes/127.0.0.1:37303_xw_hhy%2Fi
   [junit4]   2> 808112 INFO  (zkCallback-6266-thread-1) [    ] o.a.s.c.c.ZkStateReader Updated live nodes from ZooKeeper... (2) -> (3)
   [junit4]   2> 808112 INFO  (zkCallback-6247-thread-1) [    ] o.a.s.c.c.ZkStateReader Updated live nodes from ZooKeeper... (2) -> (3)
   [junit4]   2> 808112 INFO  (zkCallback-6258-thread-1) [    ] o.a.s.c.c.ZkStateReader Updated live nodes from ZooKeeper... (2) -> (3)
   [junit4]   2> 808112 INFO  (zkCallback-6273-thread-1) [    ] o.a.s.c.c.ZkStateReader Updated live nodes from ZooKeeper... (2) -> (3)
   [junit4]   2> 808112 INFO  (zkCallback-6240-thread-1) [    ] o.a.s.c.c.ZkStateReader Updated live nodes from ZooKeeper... (2) -> (3)
   [junit4]   2> 808113 INFO  (zkCallback-6282-thread-1) [    ] o.a.s.c.c.ZkStateReader Updated live nodes from ZooKeeper... (2) -> (3)
   [junit4]   2> 808125 INFO  (zkConnectionManagerCallback-6290-thread-1) [    ] o.a.s.c.c.ConnectionManager zkClient has connected
   [junit4]   2> 808125 INFO  (TEST-UnloadDistributedZkTest.test-seed#[7EAE4CC7A1DAD37A]) [    ] o.a.s.c.c.ZkStateReader Updated live nodes from ZooKeeper... (0) -> (3)
   [junit4]   2> 808126 INFO  (TEST-UnloadDistributedZkTest.test-seed#[7EAE4CC7A1DAD37A]) [    ] o.a.s.c.s.i.ZkClientClusterStateProvider Cluster at 127.0.0.1:46315/solr ready
   [junit4]   2> 808126 INFO  (TEST-UnloadDistributedZkTest.test-seed#[7EAE4CC7A1DAD37A]) [    ] o.a.s.h.a.MetricsHistoryHandler No .system collection, keeping metrics history in memory.
   [junit4]   2> 808139 INFO  (TEST-UnloadDistributedZkTest.test-seed#[7EAE4CC7A1DAD37A]) [    ] o.a.s.m.r.SolrJmxReporter JMX monitoring for 'solr.node' (registry 'solr.node') enabled at server: com.sun.jmx.mbeanserver.JmxMBeanServer@442b3e77
   [junit4]   2> 808150 INFO  (TEST-UnloadDistributedZkTest.test-seed#[7EAE4CC7A1DAD37A]) [    ] o.a.s.m.r.SolrJmxReporter JMX monitoring for 'solr.jvm' (registry 'solr.jvm') enabled at server: com.sun.jmx.mbeanserver.JmxMBeanServer@442b3e77
   [junit4]   2> 808150 INFO  (TEST-UnloadDistributedZkTest.test-seed#[7EAE4CC7A1DAD37A]) [    ] o.a.s.m.r.SolrJmxReporter JMX monitoring for 'solr.jetty' (registry 'solr.jetty') enabled at server: com.sun.jmx.mbeanserver.JmxMBeanServer@442b3e77
   [junit4]   2> 808152 INFO  (TEST-UnloadDistributedZkTest.test-seed#[7EAE4CC7A1DAD37A]) [    ] o.a.s.c.CorePropertiesLocator Found 0 core definitions underneath /home/jenkins/workspace/Lucene-Solr-master-Linux/solr/build/solr-core/test/J1/temp/solr.cloud.UnloadDistributedZkTest_7EAE4CC7A1DAD37A-001/shard-2-001/cores
   [junit4]   2> 808186 INFO  (qtp253099333-18037) [n:127.0.0.1:37303_xw_hhy%2Fi    ] o.a.s.h.a.CollectionsHandler Invoked Collection Action :addreplica with params node=127.0.0.1:37303_xw_hhy%252Fi&action=ADDREPLICA&collection=collection1&shard=shard1&type=NRT&wt=javabin&version=2 and sendToOCPQueue=true
   [junit4]   2> 808187 INFO  (OverseerCollectionConfigSetProcessor-72152617052209156-127.0.0.1:38811_xw_hhy%2Fi-n_0000000000) [n:127.0.0.1:38811_xw_hhy%2Fi    ] o.a.s.c.OverseerTaskQueue Response ZK path: /overseer/collection-queue-work/qnr-0000000004 doesn't exist.  Requestor may have disconnected from ZooKeeper
   [junit4]   2> 808188 INFO  (OverseerThreadFactory-4362-thread-4-processing-n:127.0.0.1:38811_xw_hhy%2Fi) [n:127.0.0.1:38811_xw_hhy%2Fi c:collection1 s:shard1  ] o.a.s.c.a.c.AddReplicaCmd Node Identified 127.0.0.1:37303_xw_hhy%2Fi for creating new replica of shard shard1
   [junit4]   2> 808189 INFO  (qtp253099333-18032) [n:127.0.0.1:37303_xw_hhy%2Fi    x:collection1_shard1_replica_n43] o.a.s.h.a.CoreAdminOperation core create command qt=/admin/cores&collection.configName=conf1&name=collection1_shard1_replica_n43&action=CREATE&collection=collection1&shard=shard1&wt=javabin&version=2&replicaType=NRT
   [junit4]   2> 809200 INFO  (qtp253099333-18032) [n:127.0.0.1:37303_xw_hhy%2Fi c:collection1 s:shard1  x:collection1_shard1_replica_n43] o.a.s.c.SolrConfig Using Lucene MatchVersion: 8.0.0
   [junit4]   2> 809211 INFO  (qtp253099333-18032) [n:127.0.0.1:37303_xw_hhy%2Fi c:collection1 s:shard1  x:collection1_shard1_replica_n43] o.a.s.s.IndexSchema [collection1_shard1_replica_n43] Schema name=test
   [junit4]   2> 809286 INFO  (qtp253099333-18032) [n:127.0.0.1:37303_xw_hhy%2Fi c:collection1 s:shard1  x:collection1_shard1_replica_n43] o.a.s.s.IndexSchema Loaded schema test/1.0 with uniqueid field id
   [junit4]   2> 809299 INFO  (qtp253099333-18032) [n:127.0.0.1:37303_xw_hhy%2Fi c:collection1 s:shard1  x:collection1_shard1_replica_n43] o.a.s.c.CoreContainer Creating SolrCore 'collection1_shard1_replica_n43' using configuration from collection collection1, trusted=true
   [junit4]   2> 809299 INFO  (qtp253099333-18032) [n:127.0.0.1:37303_xw_hhy%2Fi c:collection1 s:shard1  x:collection1_shard1_replica_n43] o.a.s.m.r.SolrJmxReporter JMX monitoring for 'solr.core.collection1.shard1.replica_n43' (registry 'solr.core.collection1.shard1.replica_n43') enabled at server: com.sun.jmx.mbeanserver.JmxMBeanServer@442b3e77
   [junit4]   2> 809299 INFO  (qtp253099333-18032) [n:127.0.0.1:37303_xw_hhy%2Fi c:collection1 s:shard1  x:collection1_shard1_replica_n43] o.a.s.c.SolrCore solr.RecoveryStrategy.Builder
   [junit4]   2> 809299 INFO  (qtp253099333-18032) [n:127.0.0.1:37303_xw_hhy%2Fi c:collection1 s:shard1  x:collection1_shard1_replica_n43] o.a.s.c.SolrCore [[collection1_shard1_replica_n43] ] Opening new SolrCore at [/home/jenkins/workspace/Lucene-Solr-master-Linux/solr/build/solr-core/test/J1/temp/solr.cloud.UnloadDistributedZkTest_7EAE4CC7A1DAD37A-001/shard-2-001/cores/collection1_shard1_replica_n43], dataDir=[/home/jenkins/workspace/Lucene-Solr-master-Linux/solr/build/solr-core/test/J1/temp/solr.cloud.UnloadDistributedZkTest_7EAE4CC7A1DAD37A-001/shard-2-001/cores/collection1_shard1_replica_n43/data/]
   [junit4]   2> 809301 INFO  (qtp253099333-18032) [n:127.0.0.1:37303_xw_hhy%2Fi c:collection1 s:shard1  x:collection1_shard1_replica_n43] o.a.s.u.RandomMergePolicy RandomMergePolicy wrapping class org.apache.lucene.index.TieredMergePolicy: [TieredMergePolicy: maxMergeAtOnce=35, maxMergeAtOnceExplicit=40, maxMergedSegmentMB=41.1240234375, floorSegmentMB=1.693359375, forceMergeDeletesPctAllowed=6.399636045180079, segmentsPerTier=38.0, maxCFSSegmentSizeMB=8.796093022207999E12, noCFSRatio=0.1256463947391877, deletesPctAllowed=41.830958535666376
   [junit4]   2> 809302 WARN  (qtp253099333-18032) [n:127.0.0.1:37303_xw_hhy%2Fi c:collection1 s:shard1  x:collection1_shard1_replica_n43] o.a.s.c.RequestHandlers INVALID paramSet a in requestHandler {type = requestHandler,name = /dump,class = DumpRequestHandler,attributes = {initParams=a, name=/dump, class=DumpRequestHandler},args = {defaults={a=A,b=B}}}
   [junit4]   2> 809339 INFO  (qtp253099333-18032) [n:127.0.0.1:37303_xw_hhy%2Fi c:collection1 s:shard1  x:collection1_shard1_replica_n43] o.a.s.u.UpdateHandler Using UpdateLog implementation: org.apache.solr.update.UpdateLog
   [junit4]   2> 809339 INFO  (qtp253099333-18032) [n:127.0.0.1:37303_xw_hhy%2Fi c:collection1 s:shard1  x:collection1_shard1_replica_n43] o.a.s.u.UpdateLog Initializing UpdateLog: dataDir= defaultSyncLevel=FLUSH numRecordsToKeep=100 maxNumLogsToKeep=10 numVersionBuckets=65536
   [junit4]   2> 809340 INFO  (qtp253099333-18032) [n:127.0.0.1:37303_xw_hhy%2Fi c:collection1 s:shard1  x:collection1_shard1_replica_n43] o.a.s.u.CommitTracker Hard AutoCommit: disabled
   [junit4]   2> 809340 INFO  (qtp253099333-18032) [n:127.0.0.1:37303_xw_hhy%2Fi c:collection1 s:shard1  x:collection1_shard1_replica_n43] o.a.s.u.CommitTracker Soft AutoCommit: disabled
   [junit4]   2> 809340 INFO  (qtp253099333-18032) [n:127.0.0.1:37303_xw_hhy%2Fi c:collection1 s:shard1  x:collection1_shard1_replica_n43] o.a.s.u.RandomMergePolicy RandomMergePolicy wrapping class org.apache.lucene.index.LogByteSizeMergePolicy: [LogByteSizeMergePolicy: minMergeSize=1677721, mergeFactor=44, maxMergeSize=2147483648, maxMergeSizeForForcedMerge=9223372036854775807, calibrateSizeByDeletes=true, maxMergeDocs=2147483647, maxCFSSegmentSizeMB=8.796093022207999E12, noCFSRatio=0.0]
   [junit4]   2> 809341 INFO  (qtp253099333-18032) [n:127.0.0.1:37303_xw_hhy%2Fi c:collection1 s:shard1  x:collection1_shard1_replica_n43] o.a.s.s.SolrIndexSearcher Opening [Searcher@4af2c64e[collection1_shard1_replica_n43] main]
   [junit4]   2> 809341 INFO  (qtp253099333-18032) [n:127.0.0.1:37303_xw_hhy%2Fi c:collection1 s:shard1  x:collection1_shard1_replica_n43] o.a.s.r.ManagedResourceStorage Configured ZooKeeperStorageIO with znodeBase: /configs/conf1
   [junit4]   2> 809342 INFO  (qtp253099333-18032) [n:127.0.0.1:37303_xw_hhy%2Fi c:collection1 s:shard1  x:collection1_shard1_replica_n43] o.a.s.r.ManagedResourceStorage Loaded null at path _rest_managed.json using ZooKeeperStorageIO:path=/configs/conf1
   [junit4]   2> 809342 INFO  (qtp253099333-18032) [n:127.0.0.1:37303_xw_hhy%2Fi c:collection1 s:shard1  x:collection1_shard1_replica_n43] o.a.s.h.ReplicationHandler Commits will be reserved for 10000ms.
   [junit4]   2> 809342 INFO  (qtp253099333-18032) [n:127.0.0.1:37303_xw_hhy%2Fi c:collection1 s:shard1  x:collection1_shard1_replica_n43] o.a.s.u.UpdateLog Could not find max version in index or recent updates, using new clock 1610459922309316608
   [junit4]   2> 809342 INFO  (searcherExecutor-4395-thread-1-processing-n:127.0.0.1:37303_xw_hhy%2Fi x:collection1_shard1_replica_n43 c:collection1 s:shard1) [n:127.0.0.1:37303_xw_hhy%2Fi c:collection1 s:shard1  x:collection1_shard1_replica_n43] o.a.s.c.SolrCore [collection1_shard1_replica_n43] Registered new searcher Searcher@4af2c64e[collection1_shard1_replica_n43] main{ExitableDirectoryReader(UninvertingDirectoryReader())}
   [junit4]   2> 809344 INFO  (qtp253099333-18032) [n:127.0.0.1:37303_xw_hhy%2Fi c:collection1 s:shard1  x:collection1_shard1_replica_n43] o.a.s.c.ZkShardTerms Successful update of terms at /collections/collection1/terms/shard1 to Terms{values={core_node44=0}, version=0}
   [junit4]   2> 809346 INFO  (qtp253099333-18032) [n:127.0.0.1:37303_xw_hhy%2Fi c:collection1 s:shard1  x:collection1_shard1_replica_n43] o.a.s.c.ShardLeaderElectionContext Enough replicas found to continue.
   [junit4]   2> 809346 INFO  (qtp253099333-18032) [n:127.0.0.1:37303_xw_hhy%2Fi c:collection1 s:shard1  x:collection1_shard1_replica_n43] o.a.s.c.ShardLeaderElectionContext I may be the new leader - try and sync
   [junit4]   2> 809346 INFO  (qtp253099333-18032) [n:127.0.0.1:37303_xw_hhy%2Fi c:collection1 s:shard1  x:collection1_shard1_replica_n43] o.a.s.c.SyncStrategy Sync replicas to http://127.0.0.1:37303/xw_hhy/i/collect

[...truncated too long message...]

y-closer-180-thread-1) [    ] o.a.s.m.SolrMetricManager Closing metric reporters for registry=solr.cluster, tag=null
   [junit4]   2> 322272 INFO  (zkCallback-191-thread-3) [    ] o.a.s.c.c.ZkStateReader Updated live nodes from ZooKeeper... (2) -> (0)
   [junit4]   2> 322272 INFO  (zkCallback-205-thread-3) [    ] o.a.s.c.c.ZkStateReader Updated live nodes from ZooKeeper... (2) -> (0)
   [junit4]   2> 322272 INFO  (zkCallback-212-thread-1) [    ] o.a.s.c.c.ZkStateReader Updated live nodes from ZooKeeper... (2) -> (0)
   [junit4]   2> 322272 INFO  (zkCallback-198-thread-1) [    ] o.a.s.c.c.ZkStateReader Updated live nodes from ZooKeeper... (2) -> (0)
   [junit4]   2> 322276 INFO  (jetty-closer-180-thread-1) [    ] o.a.s.c.Overseer Overseer (id=72152876128075780-127.0.0.1:42859_solr-n_0000000000) closing
   [junit4]   2> 322276 INFO  (OverseerStateUpdate-72152876128075780-127.0.0.1:42859_solr-n_0000000000) [n:127.0.0.1:42859_solr    ] o.a.s.c.Overseer Overseer Loop exiting : 127.0.0.1:42859_solr
   [junit4]   2> 322278 WARN  (OverseerAutoScalingTriggerThread-72152876128075780-127.0.0.1:42859_solr-n_0000000000) [    ] o.a.s.c.a.OverseerTriggerThread OverseerTriggerThread woken up but we are closed, exiting.
   [junit4]   2> 322278 DEBUG (jetty-closer-180-thread-1) [    ] o.a.s.c.a.ScheduledTriggers Shutting down scheduled thread pool executor now
   [junit4]   2> 322278 DEBUG (jetty-closer-180-thread-1) [    ] o.a.s.c.a.ScheduledTriggers Shutting down action executor now
   [junit4]   2> 322278 DEBUG (jetty-closer-180-thread-1) [    ] o.a.s.c.a.ScheduledTriggers Awaiting termination for action executor
   [junit4]   2> 322278 DEBUG (jetty-closer-180-thread-1) [    ] o.a.s.c.a.ScheduledTriggers Awaiting termination for scheduled thread pool executor
   [junit4]   2> 322278 DEBUG (jetty-closer-180-thread-1) [    ] o.a.s.c.a.ScheduledTriggers ScheduledTriggers closed completely
   [junit4]   2> 322278 DEBUG (jetty-closer-180-thread-1) [    ] o.a.s.c.a.OverseerTriggerThread OverseerTriggerThread has been closed explicitly
   [junit4]   2> 322280 INFO  (jetty-closer-180-thread-2) [    ] o.e.j.s.h.ContextHandler Stopped o.e.j.s.ServletContextHandler@7c882d27{/solr,null,UNAVAILABLE}
   [junit4]   2> 322280 INFO  (jetty-closer-180-thread-2) [    ] o.e.j.s.session node0 Stopped scavenging
   [junit4]   2> 322281 INFO  (jetty-closer-180-thread-1) [    ] o.e.j.s.h.ContextHandler Stopped o.e.j.s.ServletContextHandler@2d331fab{/solr,null,UNAVAILABLE}
   [junit4]   2> 322282 INFO  (jetty-closer-180-thread-1) [    ] o.e.j.s.session node0 Stopped scavenging
   [junit4]   2> 322282 ERROR (SUITE-IndexSizeTriggerTest-seed#[7EAE4CC7A1DAD37A]-worker) [    ] o.a.z.s.ZooKeeperServer ZKShutdownHandler is not registered, so ZooKeeper server won't take any action on ERROR or SHUTDOWN server state changes
   [junit4]   2> 322282 INFO  (SUITE-IndexSizeTriggerTest-seed#[7EAE4CC7A1DAD37A]-worker) [    ] o.a.s.c.ZkTestServer connecting to 127.0.0.1:45107 45107
   [junit4]   2> 322297 INFO  (Thread-132) [    ] o.a.s.c.ZkTestServer connecting to 127.0.0.1:45107 45107
   [junit4]   2> 322297 WARN  (Thread-132) [    ] o.a.s.c.ZkTestServer Watch limit violations: 
   [junit4]   2> Maximum concurrent create/delete watches above limit:
   [junit4]   2> 
   [junit4]   2> 	13	/solr/collections/testSplitIntegration_collection/terms/shard2_0
   [junit4]   2> 	13	/solr/collections/testMixedBounds_collection/terms/shard2_0
   [junit4]   2> 	13	/solr/collections/testMixedBounds_collection/terms/shard1_0
   [junit4]   2> 	12	/solr/collections/testSplitIntegration_collection/terms/shard1_1
   [junit4]   2> 	12	/solr/collections/testMixedBounds_collection/terms/shard2_1_0
   [junit4]   2> 	11	/solr/collections/testTrigger_collection/terms/shard2
   [junit4]   2> 	11	/solr/collections/testMixedBounds_collection/terms/shard2_0_0
   [junit4]   2> 	10	/solr/collections/testTrigger_collection/terms/shard1
   [junit4]   2> 	10	/solr/collections/testMergeIntegration_collection/terms/shard2
   [junit4]   2> 	10	/solr/collections/testMergeIntegration_collection/terms/shard1
   [junit4]   2> 	9	/solr/collections/testSplitIntegration_collection/terms/shard2_1
   [junit4]   2> 	9	/solr/collections/testSplitIntegration_collection/terms/shard1_0
   [junit4]   2> 	9	/solr/collections/testMixedBounds_collection/terms/shard2_1
   [junit4]   2> 	9	/solr/aliases.json
   [junit4]   2> 	9	/solr/collections/testMixedBounds_collection/terms/shard2_0_1
   [junit4]   2> 	9	/solr/collections/testMixedBounds_collection/terms/shard1
   [junit4]   2> 	9	/solr/collections/testMixedBounds_collection/terms/shard2
   [junit4]   2> 	9	/solr/clusterprops.json
   [junit4]   2> 	9	/solr/collections/testSplitIntegration_collection/terms/shard2
   [junit4]   2> 	8	/solr/collections/testMixedBounds_collection/terms/shard1_1
   [junit4]   2> 	8	/solr/collections/testMixedBounds_collection/terms/shard2_1_1
   [junit4]   2> 	8	/solr/configs/conf
   [junit4]   2> 	8	/solr/collections/testSplitIntegration_collection/terms/shard1
   [junit4]   2> 	2	/solr/security.json
   [junit4]   2> 
   [junit4]   2> Maximum concurrent data watches above limit:
   [junit4]   2> 
   [junit4]   2> 	10	/solr/aliases.json
   [junit4]   2> 	9	/solr/clusterstate.json
   [junit4]   2> 	4	/solr/collections/testSplitIntegration_collection/state.json
   [junit4]   2> 	4	/solr/collections/testTrigger_collection/state.json
   [junit4]   2> 	4	/solr/collections/testMergeIntegration_collection/state.json
   [junit4]   2> 	3	/solr/collections/testMixedBounds_collection/state.json
   [junit4]   2> 
   [junit4]   2> Maximum concurrent children watches above limit:
   [junit4]   2> 
   [junit4]   2> 	25	/solr/collections
   [junit4]   2> 	9	/solr/live_nodes
   [junit4]   2> 
   [junit4]   2> NOTE: leaving temporary files on disk at: /home/jenkins/workspace/Lucene-Solr-master-Linux/solr/build/solr-core/test/J2/temp/solr.cloud.autoscaling.IndexSizeTriggerTest_7EAE4CC7A1DAD37A-002
   [junit4]   2> Sep 02, 2018 3:18:58 AM com.carrotsearch.randomizedtesting.ThreadLeakControl checkThreadLeaks
   [junit4]   2> WARNING: Will linger awaiting termination of 6 leaked thread(s).
   [junit4]   2> NOTE: test params are: codec=Asserting(Lucene80): {foo=PostingsFormat(name=MockRandom), id=PostingsFormat(name=LuceneFixedGap)}, docValues:{}, maxPointsInLeafNode=748, maxMBSortInHeap=7.628368238494326, sim=Asserting(org.apache.lucene.search.similarities.AssertingSimilarity@1fd06f82), locale=th-TH, timezone=EST
   [junit4]   2> NOTE: Linux 4.15.0-32-generic amd64/Oracle Corporation 1.8.0_172 (64-bit)/cpus=8,threads=1,free=126427984,total=518979584
   [junit4]   2> NOTE: All tests run in this JVM: [UnloadDistributedZkTest, IndexSizeTriggerTest, IndexSizeTriggerTest]
   [junit4] Completed [9/10 (4!)] on J2 in 126.92s, 4 tests, 1 failure <<< FAILURES!
   [junit4] 
   [junit4] Suite: org.apache.solr.cloud.autoscaling.IndexSizeTriggerTest
   [junit4] OK      17.3s J1 | IndexSizeTriggerTest.testTrigger
   [junit4] OK      36.6s J1 | IndexSizeTriggerTest.testMixedBounds
   [junit4] OK      17.3s J1 | IndexSizeTriggerTest.testMergeIntegration
   [junit4] OK      35.6s J1 | IndexSizeTriggerTest.testSplitIntegration
   [junit4] Completed [10/10 (4!)] on J1 in 108.02s, 4 tests
   [junit4] 
   [junit4] 
   [junit4] Tests with failures [seed: 7EAE4CC7A1DAD37A]:
   [junit4]   - org.apache.solr.cloud.autoscaling.IndexSizeTriggerTest.testMixedBounds
   [junit4]   - org.apache.solr.cloud.autoscaling.IndexSizeTriggerTest.testMixedBounds
   [junit4]   - org.apache.solr.cloud.autoscaling.IndexSizeTriggerTest.testMixedBounds
   [junit4]   - org.apache.solr.cloud.autoscaling.IndexSizeTriggerTest.testMixedBounds
   [junit4] 
   [junit4] 
   [junit4] JVM J0:     0.62 ..   252.76 =   252.14s
   [junit4] JVM J1:     0.41 ..   359.43 =   359.02s
   [junit4] JVM J2:     0.39 ..   323.56 =   323.17s
   [junit4] Execution time total: 5 minutes 59 seconds
   [junit4] Tests summary: 10 suites, 25 tests, 4 failures

BUILD FAILED
/home/jenkins/workspace/Lucene-Solr-master-Linux/lucene/common-build.xml:1568: The following error occurred while executing this line:
/home/jenkins/workspace/Lucene-Solr-master-Linux/lucene/common-build.xml:1092: There were test failures: 10 suites, 25 tests, 4 failures [seed: 7EAE4CC7A1DAD37A]

Total time: 6 minutes 0 seconds

[repro] Setting last failure code to 256

[repro] Failures:
[repro]   0/5 failed: org.apache.solr.cloud.UnloadDistributedZkTest
[repro]   4/5 failed: org.apache.solr.cloud.autoscaling.IndexSizeTriggerTest
[repro] Exiting with code 256
+ mv lucene/build lucene/build.repro
+ mv solr/build solr/build.repro
+ mv lucene/build.orig lucene/build
+ mv solr/build.orig solr/build
Archiving artifacts
Setting ANT_1_8_2_HOME=/var/lib/jenkins/tools/hudson.tasks.Ant_AntInstallation/ANT_1.8.2
[WARNINGS] Parsing warnings in console log with parser Java Compiler (javac)
Setting ANT_1_8_2_HOME=/var/lib/jenkins/tools/hudson.tasks.Ant_AntInstallation/ANT_1.8.2
Setting ANT_1_8_2_HOME=/var/lib/jenkins/tools/hudson.tasks.Ant_AntInstallation/ANT_1.8.2
<Git Blamer> Using GitBlamer to create author and commit information for all warnings.
<Git Blamer> GIT_COMMIT=d93c46ea94dec612aa53e37d119fe34b5e8a828e, workspace=/var/lib/jenkins/workspace/Lucene-Solr-master-Linux
[WARNINGS] Computing warning deltas based on reference build #22785
Recording test results
Setting ANT_1_8_2_HOME=/var/lib/jenkins/tools/hudson.tasks.Ant_AntInstallation/ANT_1.8.2
Build step 'Publish JUnit test result report' changed build result to UNSTABLE
Email was triggered for: Unstable (Test Failures)
Sending email for trigger: Unstable (Test Failures)
Setting ANT_1_8_2_HOME=/var/lib/jenkins/tools/hudson.tasks.Ant_AntInstallation/ANT_1.8.2
Setting ANT_1_8_2_HOME=/var/lib/jenkins/tools/hudson.tasks.Ant_AntInstallation/ANT_1.8.2
Setting ANT_1_8_2_HOME=/var/lib/jenkins/tools/hudson.tasks.Ant_AntInstallation/ANT_1.8.2
Setting ANT_1_8_2_HOME=/var/lib/jenkins/tools/hudson.tasks.Ant_AntInstallation/ANT_1.8.2

Mime
View raw message