lucene-dev mailing list archives

Site index · List index
Message view « Date » · « Thread »
Top « Date » · « Thread »
From Policeman Jenkins Server <jenk...@thetaphi.de>
Subject [JENKINS-EA] Lucene-Solr-master-Linux (64bit/jdk-11-ea+28) - Build # 22861 - Still Unstable!
Date Sat, 15 Sep 2018 10:54:28 GMT
Build: https://jenkins.thetaphi.de/job/Lucene-Solr-master-Linux/22861/
Java: 64bit/jdk-11-ea+28 -XX:+UseCompressedOops -XX:+UseSerialGC

11 tests failed.
FAILED:  org.apache.solr.cloud.autoscaling.ComputePlanActionTest.testNodeAdded

Error Message:
Timed out waiting for replicas of new collection to be active null Live Nodes: [127.0.0.1:45527_solr] Last available state: null

Stack Trace:
java.lang.AssertionError: Timed out waiting for replicas of new collection to be active
null
Live Nodes: [127.0.0.1:45527_solr]
Last available state: null
	at __randomizedtesting.SeedInfo.seed([16F3679107374147:733031E6A594E944]:0)
	at org.junit.Assert.fail(Assert.java:93)
	at org.apache.solr.cloud.SolrCloudTestCase.waitForState(SolrCloudTestCase.java:280)
	at org.apache.solr.cloud.autoscaling.ComputePlanActionTest.testNodeAdded(ComputePlanActionTest.java:359)
	at java.base/jdk.internal.reflect.NativeMethodAccessorImpl.invoke0(Native Method)
	at java.base/jdk.internal.reflect.NativeMethodAccessorImpl.invoke(NativeMethodAccessorImpl.java:62)
	at java.base/jdk.internal.reflect.DelegatingMethodAccessorImpl.invoke(DelegatingMethodAccessorImpl.java:43)
	at java.base/java.lang.reflect.Method.invoke(Method.java:566)
	at com.carrotsearch.randomizedtesting.RandomizedRunner.invoke(RandomizedRunner.java:1742)
	at com.carrotsearch.randomizedtesting.RandomizedRunner$8.evaluate(RandomizedRunner.java:935)
	at com.carrotsearch.randomizedtesting.RandomizedRunner$9.evaluate(RandomizedRunner.java:971)
	at com.carrotsearch.randomizedtesting.RandomizedRunner$10.evaluate(RandomizedRunner.java:985)
	at com.carrotsearch.randomizedtesting.rules.SystemPropertiesRestoreRule$1.evaluate(SystemPropertiesRestoreRule.java:57)
	at org.apache.lucene.util.TestRuleSetupTeardownChained$1.evaluate(TestRuleSetupTeardownChained.java:49)
	at org.apache.lucene.util.AbstractBeforeAfterRule$1.evaluate(AbstractBeforeAfterRule.java:45)
	at org.apache.lucene.util.TestRuleThreadAndTestName$1.evaluate(TestRuleThreadAndTestName.java:48)
	at org.apache.lucene.util.TestRuleIgnoreAfterMaxFailures$1.evaluate(TestRuleIgnoreAfterMaxFailures.java:64)
	at org.apache.lucene.util.TestRuleMarkFailure$1.evaluate(TestRuleMarkFailure.java:47)
	at com.carrotsearch.randomizedtesting.rules.StatementAdapter.evaluate(StatementAdapter.java:36)
	at com.carrotsearch.randomizedtesting.ThreadLeakControl$StatementRunner.run(ThreadLeakControl.java:368)
	at com.carrotsearch.randomizedtesting.ThreadLeakControl.forkTimeoutingTask(ThreadLeakControl.java:817)
	at com.carrotsearch.randomizedtesting.ThreadLeakControl$3.evaluate(ThreadLeakControl.java:468)
	at com.carrotsearch.randomizedtesting.RandomizedRunner.runSingleTest(RandomizedRunner.java:944)
	at com.carrotsearch.randomizedtesting.RandomizedRunner$5.evaluate(RandomizedRunner.java:830)
	at com.carrotsearch.randomizedtesting.RandomizedRunner$6.evaluate(RandomizedRunner.java:880)
	at com.carrotsearch.randomizedtesting.RandomizedRunner$7.evaluate(RandomizedRunner.java:891)
	at com.carrotsearch.randomizedtesting.rules.StatementAdapter.evaluate(StatementAdapter.java:36)
	at com.carrotsearch.randomizedtesting.rules.SystemPropertiesRestoreRule$1.evaluate(SystemPropertiesRestoreRule.java:57)
	at org.apache.lucene.util.AbstractBeforeAfterRule$1.evaluate(AbstractBeforeAfterRule.java:45)
	at com.carrotsearch.randomizedtesting.rules.StatementAdapter.evaluate(StatementAdapter.java:36)
	at org.apache.lucene.util.TestRuleStoreClassName$1.evaluate(TestRuleStoreClassName.java:41)
	at com.carrotsearch.randomizedtesting.rules.NoShadowingOrOverridesOnMethodsRule$1.evaluate(NoShadowingOrOverridesOnMethodsRule.java:40)
	at com.carrotsearch.randomizedtesting.rules.NoShadowingOrOverridesOnMethodsRule$1.evaluate(NoShadowingOrOverridesOnMethodsRule.java:40)
	at com.carrotsearch.randomizedtesting.rules.StatementAdapter.evaluate(StatementAdapter.java:36)
	at com.carrotsearch.randomizedtesting.rules.StatementAdapter.evaluate(StatementAdapter.java:36)
	at org.apache.lucene.util.TestRuleAssertionsRequired$1.evaluate(TestRuleAssertionsRequired.java:53)
	at org.apache.lucene.util.TestRuleMarkFailure$1.evaluate(TestRuleMarkFailure.java:47)
	at org.apache.lucene.util.TestRuleIgnoreAfterMaxFailures$1.evaluate(TestRuleIgnoreAfterMaxFailures.java:64)
	at org.apache.lucene.util.TestRuleIgnoreTestSuites$1.evaluate(TestRuleIgnoreTestSuites.java:54)
	at com.carrotsearch.randomizedtesting.rules.StatementAdapter.evaluate(StatementAdapter.java:36)
	at com.carrotsearch.randomizedtesting.ThreadLeakControl$StatementRunner.run(ThreadLeakControl.java:368)
	at java.base/java.lang.Thread.run(Thread.java:834)


FAILED:  org.apache.solr.cloud.autoscaling.ComputePlanActionTest.testNodeLostTriggerWithDeleteNodePreferredOp

Error Message:
Timed out waiting for replicas of new collection to be active null Live Nodes: [127.0.0.1:33165_solr, 127.0.0.1:45527_solr] Last available state: null

Stack Trace:
java.lang.AssertionError: Timed out waiting for replicas of new collection to be active
null
Live Nodes: [127.0.0.1:33165_solr, 127.0.0.1:45527_solr]
Last available state: null
	at __randomizedtesting.SeedInfo.seed([16F3679107374147:895CC372708FD82E]:0)
	at org.junit.Assert.fail(Assert.java:93)
	at org.apache.solr.cloud.SolrCloudTestCase.waitForState(SolrCloudTestCase.java:280)
	at org.apache.solr.cloud.autoscaling.ComputePlanActionTest.testNodeLostTriggerWithDeleteNodePreferredOp(ComputePlanActionTest.java:655)
	at java.base/jdk.internal.reflect.NativeMethodAccessorImpl.invoke0(Native Method)
	at java.base/jdk.internal.reflect.NativeMethodAccessorImpl.invoke(NativeMethodAccessorImpl.java:62)
	at java.base/jdk.internal.reflect.DelegatingMethodAccessorImpl.invoke(DelegatingMethodAccessorImpl.java:43)
	at java.base/java.lang.reflect.Method.invoke(Method.java:566)
	at com.carrotsearch.randomizedtesting.RandomizedRunner.invoke(RandomizedRunner.java:1742)
	at com.carrotsearch.randomizedtesting.RandomizedRunner$8.evaluate(RandomizedRunner.java:935)
	at com.carrotsearch.randomizedtesting.RandomizedRunner$9.evaluate(RandomizedRunner.java:971)
	at com.carrotsearch.randomizedtesting.RandomizedRunner$10.evaluate(RandomizedRunner.java:985)
	at com.carrotsearch.randomizedtesting.rules.SystemPropertiesRestoreRule$1.evaluate(SystemPropertiesRestoreRule.java:57)
	at org.apache.lucene.util.TestRuleSetupTeardownChained$1.evaluate(TestRuleSetupTeardownChained.java:49)
	at org.apache.lucene.util.AbstractBeforeAfterRule$1.evaluate(AbstractBeforeAfterRule.java:45)
	at org.apache.lucene.util.TestRuleThreadAndTestName$1.evaluate(TestRuleThreadAndTestName.java:48)
	at org.apache.lucene.util.TestRuleIgnoreAfterMaxFailures$1.evaluate(TestRuleIgnoreAfterMaxFailures.java:64)
	at org.apache.lucene.util.TestRuleMarkFailure$1.evaluate(TestRuleMarkFailure.java:47)
	at com.carrotsearch.randomizedtesting.rules.StatementAdapter.evaluate(StatementAdapter.java:36)
	at com.carrotsearch.randomizedtesting.ThreadLeakControl$StatementRunner.run(ThreadLeakControl.java:368)
	at com.carrotsearch.randomizedtesting.ThreadLeakControl.forkTimeoutingTask(ThreadLeakControl.java:817)
	at com.carrotsearch.randomizedtesting.ThreadLeakControl$3.evaluate(ThreadLeakControl.java:468)
	at com.carrotsearch.randomizedtesting.RandomizedRunner.runSingleTest(RandomizedRunner.java:944)
	at com.carrotsearch.randomizedtesting.RandomizedRunner$5.evaluate(RandomizedRunner.java:830)
	at com.carrotsearch.randomizedtesting.RandomizedRunner$6.evaluate(RandomizedRunner.java:880)
	at com.carrotsearch.randomizedtesting.RandomizedRunner$7.evaluate(RandomizedRunner.java:891)
	at com.carrotsearch.randomizedtesting.rules.StatementAdapter.evaluate(StatementAdapter.java:36)
	at com.carrotsearch.randomizedtesting.rules.SystemPropertiesRestoreRule$1.evaluate(SystemPropertiesRestoreRule.java:57)
	at org.apache.lucene.util.AbstractBeforeAfterRule$1.evaluate(AbstractBeforeAfterRule.java:45)
	at com.carrotsearch.randomizedtesting.rules.StatementAdapter.evaluate(StatementAdapter.java:36)
	at org.apache.lucene.util.TestRuleStoreClassName$1.evaluate(TestRuleStoreClassName.java:41)
	at com.carrotsearch.randomizedtesting.rules.NoShadowingOrOverridesOnMethodsRule$1.evaluate(NoShadowingOrOverridesOnMethodsRule.java:40)
	at com.carrotsearch.randomizedtesting.rules.NoShadowingOrOverridesOnMethodsRule$1.evaluate(NoShadowingOrOverridesOnMethodsRule.java:40)
	at com.carrotsearch.randomizedtesting.rules.StatementAdapter.evaluate(StatementAdapter.java:36)
	at com.carrotsearch.randomizedtesting.rules.StatementAdapter.evaluate(StatementAdapter.java:36)
	at org.apache.lucene.util.TestRuleAssertionsRequired$1.evaluate(TestRuleAssertionsRequired.java:53)
	at org.apache.lucene.util.TestRuleMarkFailure$1.evaluate(TestRuleMarkFailure.java:47)
	at org.apache.lucene.util.TestRuleIgnoreAfterMaxFailures$1.evaluate(TestRuleIgnoreAfterMaxFailures.java:64)
	at org.apache.lucene.util.TestRuleIgnoreTestSuites$1.evaluate(TestRuleIgnoreTestSuites.java:54)
	at com.carrotsearch.randomizedtesting.rules.StatementAdapter.evaluate(StatementAdapter.java:36)
	at com.carrotsearch.randomizedtesting.ThreadLeakControl$StatementRunner.run(ThreadLeakControl.java:368)
	at java.base/java.lang.Thread.run(Thread.java:834)


FAILED:  org.apache.solr.cloud.autoscaling.ComputePlanActionTest.testNodeAdded

Error Message:
Timed out waiting for replicas of new collection to be active null Live Nodes: [127.0.0.1:43641_solr] Last available state: null

Stack Trace:
java.lang.AssertionError: Timed out waiting for replicas of new collection to be active
null
Live Nodes: [127.0.0.1:43641_solr]
Last available state: null
	at __randomizedtesting.SeedInfo.seed([16F3679107374147:733031E6A594E944]:0)
	at org.junit.Assert.fail(Assert.java:93)
	at org.apache.solr.cloud.SolrCloudTestCase.waitForState(SolrCloudTestCase.java:280)
	at org.apache.solr.cloud.autoscaling.ComputePlanActionTest.testNodeAdded(ComputePlanActionTest.java:359)
	at java.base/jdk.internal.reflect.NativeMethodAccessorImpl.invoke0(Native Method)
	at java.base/jdk.internal.reflect.NativeMethodAccessorImpl.invoke(NativeMethodAccessorImpl.java:62)
	at java.base/jdk.internal.reflect.DelegatingMethodAccessorImpl.invoke(DelegatingMethodAccessorImpl.java:43)
	at java.base/java.lang.reflect.Method.invoke(Method.java:566)
	at com.carrotsearch.randomizedtesting.RandomizedRunner.invoke(RandomizedRunner.java:1742)
	at com.carrotsearch.randomizedtesting.RandomizedRunner$8.evaluate(RandomizedRunner.java:935)
	at com.carrotsearch.randomizedtesting.RandomizedRunner$9.evaluate(RandomizedRunner.java:971)
	at com.carrotsearch.randomizedtesting.RandomizedRunner$10.evaluate(RandomizedRunner.java:985)
	at com.carrotsearch.randomizedtesting.rules.SystemPropertiesRestoreRule$1.evaluate(SystemPropertiesRestoreRule.java:57)
	at org.apache.lucene.util.TestRuleSetupTeardownChained$1.evaluate(TestRuleSetupTeardownChained.java:49)
	at org.apache.lucene.util.AbstractBeforeAfterRule$1.evaluate(AbstractBeforeAfterRule.java:45)
	at org.apache.lucene.util.TestRuleThreadAndTestName$1.evaluate(TestRuleThreadAndTestName.java:48)
	at org.apache.lucene.util.TestRuleIgnoreAfterMaxFailures$1.evaluate(TestRuleIgnoreAfterMaxFailures.java:64)
	at org.apache.lucene.util.TestRuleMarkFailure$1.evaluate(TestRuleMarkFailure.java:47)
	at com.carrotsearch.randomizedtesting.rules.StatementAdapter.evaluate(StatementAdapter.java:36)
	at com.carrotsearch.randomizedtesting.ThreadLeakControl$StatementRunner.run(ThreadLeakControl.java:368)
	at com.carrotsearch.randomizedtesting.ThreadLeakControl.forkTimeoutingTask(ThreadLeakControl.java:817)
	at com.carrotsearch.randomizedtesting.ThreadLeakControl$3.evaluate(ThreadLeakControl.java:468)
	at com.carrotsearch.randomizedtesting.RandomizedRunner.runSingleTest(RandomizedRunner.java:944)
	at com.carrotsearch.randomizedtesting.RandomizedRunner$5.evaluate(RandomizedRunner.java:830)
	at com.carrotsearch.randomizedtesting.RandomizedRunner$6.evaluate(RandomizedRunner.java:880)
	at com.carrotsearch.randomizedtesting.RandomizedRunner$7.evaluate(RandomizedRunner.java:891)
	at com.carrotsearch.randomizedtesting.rules.StatementAdapter.evaluate(StatementAdapter.java:36)
	at com.carrotsearch.randomizedtesting.rules.SystemPropertiesRestoreRule$1.evaluate(SystemPropertiesRestoreRule.java:57)
	at org.apache.lucene.util.AbstractBeforeAfterRule$1.evaluate(AbstractBeforeAfterRule.java:45)
	at com.carrotsearch.randomizedtesting.rules.StatementAdapter.evaluate(StatementAdapter.java:36)
	at org.apache.lucene.util.TestRuleStoreClassName$1.evaluate(TestRuleStoreClassName.java:41)
	at com.carrotsearch.randomizedtesting.rules.NoShadowingOrOverridesOnMethodsRule$1.evaluate(NoShadowingOrOverridesOnMethodsRule.java:40)
	at com.carrotsearch.randomizedtesting.rules.NoShadowingOrOverridesOnMethodsRule$1.evaluate(NoShadowingOrOverridesOnMethodsRule.java:40)
	at com.carrotsearch.randomizedtesting.rules.StatementAdapter.evaluate(StatementAdapter.java:36)
	at com.carrotsearch.randomizedtesting.rules.StatementAdapter.evaluate(StatementAdapter.java:36)
	at org.apache.lucene.util.TestRuleAssertionsRequired$1.evaluate(TestRuleAssertionsRequired.java:53)
	at org.apache.lucene.util.TestRuleMarkFailure$1.evaluate(TestRuleMarkFailure.java:47)
	at org.apache.lucene.util.TestRuleIgnoreAfterMaxFailures$1.evaluate(TestRuleIgnoreAfterMaxFailures.java:64)
	at org.apache.lucene.util.TestRuleIgnoreTestSuites$1.evaluate(TestRuleIgnoreTestSuites.java:54)
	at com.carrotsearch.randomizedtesting.rules.StatementAdapter.evaluate(StatementAdapter.java:36)
	at com.carrotsearch.randomizedtesting.ThreadLeakControl$StatementRunner.run(ThreadLeakControl.java:368)
	at java.base/java.lang.Thread.run(Thread.java:834)


FAILED:  org.apache.solr.cloud.autoscaling.ComputePlanActionTest.testNodeLostTriggerWithDeleteNodePreferredOp

Error Message:
Timed out waiting for replicas of new collection to be active null Live Nodes: [127.0.0.1:43403_solr, 127.0.0.1:43641_solr] Last available state: null

Stack Trace:
java.lang.AssertionError: Timed out waiting for replicas of new collection to be active
null
Live Nodes: [127.0.0.1:43403_solr, 127.0.0.1:43641_solr]
Last available state: null
	at __randomizedtesting.SeedInfo.seed([16F3679107374147:895CC372708FD82E]:0)
	at org.junit.Assert.fail(Assert.java:93)
	at org.apache.solr.cloud.SolrCloudTestCase.waitForState(SolrCloudTestCase.java:280)
	at org.apache.solr.cloud.autoscaling.ComputePlanActionTest.testNodeLostTriggerWithDeleteNodePreferredOp(ComputePlanActionTest.java:655)
	at java.base/jdk.internal.reflect.NativeMethodAccessorImpl.invoke0(Native Method)
	at java.base/jdk.internal.reflect.NativeMethodAccessorImpl.invoke(NativeMethodAccessorImpl.java:62)
	at java.base/jdk.internal.reflect.DelegatingMethodAccessorImpl.invoke(DelegatingMethodAccessorImpl.java:43)
	at java.base/java.lang.reflect.Method.invoke(Method.java:566)
	at com.carrotsearch.randomizedtesting.RandomizedRunner.invoke(RandomizedRunner.java:1742)
	at com.carrotsearch.randomizedtesting.RandomizedRunner$8.evaluate(RandomizedRunner.java:935)
	at com.carrotsearch.randomizedtesting.RandomizedRunner$9.evaluate(RandomizedRunner.java:971)
	at com.carrotsearch.randomizedtesting.RandomizedRunner$10.evaluate(RandomizedRunner.java:985)
	at com.carrotsearch.randomizedtesting.rules.SystemPropertiesRestoreRule$1.evaluate(SystemPropertiesRestoreRule.java:57)
	at org.apache.lucene.util.TestRuleSetupTeardownChained$1.evaluate(TestRuleSetupTeardownChained.java:49)
	at org.apache.lucene.util.AbstractBeforeAfterRule$1.evaluate(AbstractBeforeAfterRule.java:45)
	at org.apache.lucene.util.TestRuleThreadAndTestName$1.evaluate(TestRuleThreadAndTestName.java:48)
	at org.apache.lucene.util.TestRuleIgnoreAfterMaxFailures$1.evaluate(TestRuleIgnoreAfterMaxFailures.java:64)
	at org.apache.lucene.util.TestRuleMarkFailure$1.evaluate(TestRuleMarkFailure.java:47)
	at com.carrotsearch.randomizedtesting.rules.StatementAdapter.evaluate(StatementAdapter.java:36)
	at com.carrotsearch.randomizedtesting.ThreadLeakControl$StatementRunner.run(ThreadLeakControl.java:368)
	at com.carrotsearch.randomizedtesting.ThreadLeakControl.forkTimeoutingTask(ThreadLeakControl.java:817)
	at com.carrotsearch.randomizedtesting.ThreadLeakControl$3.evaluate(ThreadLeakControl.java:468)
	at com.carrotsearch.randomizedtesting.RandomizedRunner.runSingleTest(RandomizedRunner.java:944)
	at com.carrotsearch.randomizedtesting.RandomizedRunner$5.evaluate(RandomizedRunner.java:830)
	at com.carrotsearch.randomizedtesting.RandomizedRunner$6.evaluate(RandomizedRunner.java:880)
	at com.carrotsearch.randomizedtesting.RandomizedRunner$7.evaluate(RandomizedRunner.java:891)
	at com.carrotsearch.randomizedtesting.rules.StatementAdapter.evaluate(StatementAdapter.java:36)
	at com.carrotsearch.randomizedtesting.rules.SystemPropertiesRestoreRule$1.evaluate(SystemPropertiesRestoreRule.java:57)
	at org.apache.lucene.util.AbstractBeforeAfterRule$1.evaluate(AbstractBeforeAfterRule.java:45)
	at com.carrotsearch.randomizedtesting.rules.StatementAdapter.evaluate(StatementAdapter.java:36)
	at org.apache.lucene.util.TestRuleStoreClassName$1.evaluate(TestRuleStoreClassName.java:41)
	at com.carrotsearch.randomizedtesting.rules.NoShadowingOrOverridesOnMethodsRule$1.evaluate(NoShadowingOrOverridesOnMethodsRule.java:40)
	at com.carrotsearch.randomizedtesting.rules.NoShadowingOrOverridesOnMethodsRule$1.evaluate(NoShadowingOrOverridesOnMethodsRule.java:40)
	at com.carrotsearch.randomizedtesting.rules.StatementAdapter.evaluate(StatementAdapter.java:36)
	at com.carrotsearch.randomizedtesting.rules.StatementAdapter.evaluate(StatementAdapter.java:36)
	at org.apache.lucene.util.TestRuleAssertionsRequired$1.evaluate(TestRuleAssertionsRequired.java:53)
	at org.apache.lucene.util.TestRuleMarkFailure$1.evaluate(TestRuleMarkFailure.java:47)
	at org.apache.lucene.util.TestRuleIgnoreAfterMaxFailures$1.evaluate(TestRuleIgnoreAfterMaxFailures.java:64)
	at org.apache.lucene.util.TestRuleIgnoreTestSuites$1.evaluate(TestRuleIgnoreTestSuites.java:54)
	at com.carrotsearch.randomizedtesting.rules.StatementAdapter.evaluate(StatementAdapter.java:36)
	at com.carrotsearch.randomizedtesting.ThreadLeakControl$StatementRunner.run(ThreadLeakControl.java:368)
	at java.base/java.lang.Thread.run(Thread.java:834)


FAILED:  org.apache.solr.cloud.autoscaling.ComputePlanActionTest.testNodeAddedTriggerWithAddReplicaPreferredOp_2Shard

Error Message:
Timed out waiting for replicas of new collection to be active null Live Nodes: [127.0.0.1:42789_solr, 127.0.0.1:42921_solr] Last available state: null

Stack Trace:
java.lang.AssertionError: Timed out waiting for replicas of new collection to be active
null
Live Nodes: [127.0.0.1:42789_solr, 127.0.0.1:42921_solr]
Last available state: null
	at __randomizedtesting.SeedInfo.seed([16F3679107374147:AF685C4E946B9281]:0)
	at org.junit.Assert.fail(Assert.java:93)
	at org.apache.solr.cloud.SolrCloudTestCase.waitForState(SolrCloudTestCase.java:280)
	at org.apache.solr.cloud.autoscaling.ComputePlanActionTest.nodeAddedTriggerWithAddReplicaPreferredOp(ComputePlanActionTest.java:585)
	at org.apache.solr.cloud.autoscaling.ComputePlanActionTest.testNodeAddedTriggerWithAddReplicaPreferredOp_2Shard(ComputePlanActionTest.java:524)
	at java.base/jdk.internal.reflect.NativeMethodAccessorImpl.invoke0(Native Method)
	at java.base/jdk.internal.reflect.NativeMethodAccessorImpl.invoke(NativeMethodAccessorImpl.java:62)
	at java.base/jdk.internal.reflect.DelegatingMethodAccessorImpl.invoke(DelegatingMethodAccessorImpl.java:43)
	at java.base/java.lang.reflect.Method.invoke(Method.java:566)
	at com.carrotsearch.randomizedtesting.RandomizedRunner.invoke(RandomizedRunner.java:1742)
	at com.carrotsearch.randomizedtesting.RandomizedRunner$8.evaluate(RandomizedRunner.java:935)
	at com.carrotsearch.randomizedtesting.RandomizedRunner$9.evaluate(RandomizedRunner.java:971)
	at com.carrotsearch.randomizedtesting.RandomizedRunner$10.evaluate(RandomizedRunner.java:985)
	at com.carrotsearch.randomizedtesting.rules.SystemPropertiesRestoreRule$1.evaluate(SystemPropertiesRestoreRule.java:57)
	at org.apache.lucene.util.TestRuleSetupTeardownChained$1.evaluate(TestRuleSetupTeardownChained.java:49)
	at org.apache.lucene.util.AbstractBeforeAfterRule$1.evaluate(AbstractBeforeAfterRule.java:45)
	at org.apache.lucene.util.TestRuleThreadAndTestName$1.evaluate(TestRuleThreadAndTestName.java:48)
	at org.apache.lucene.util.TestRuleIgnoreAfterMaxFailures$1.evaluate(TestRuleIgnoreAfterMaxFailures.java:64)
	at org.apache.lucene.util.TestRuleMarkFailure$1.evaluate(TestRuleMarkFailure.java:47)
	at com.carrotsearch.randomizedtesting.rules.StatementAdapter.evaluate(StatementAdapter.java:36)
	at com.carrotsearch.randomizedtesting.ThreadLeakControl$StatementRunner.run(ThreadLeakControl.java:368)
	at com.carrotsearch.randomizedtesting.ThreadLeakControl.forkTimeoutingTask(ThreadLeakControl.java:817)
	at com.carrotsearch.randomizedtesting.ThreadLeakControl$3.evaluate(ThreadLeakControl.java:468)
	at com.carrotsearch.randomizedtesting.RandomizedRunner.runSingleTest(RandomizedRunner.java:944)
	at com.carrotsearch.randomizedtesting.RandomizedRunner$5.evaluate(RandomizedRunner.java:830)
	at com.carrotsearch.randomizedtesting.RandomizedRunner$6.evaluate(RandomizedRunner.java:880)
	at com.carrotsearch.randomizedtesting.RandomizedRunner$7.evaluate(RandomizedRunner.java:891)
	at com.carrotsearch.randomizedtesting.rules.StatementAdapter.evaluate(StatementAdapter.java:36)
	at com.carrotsearch.randomizedtesting.rules.SystemPropertiesRestoreRule$1.evaluate(SystemPropertiesRestoreRule.java:57)
	at org.apache.lucene.util.AbstractBeforeAfterRule$1.evaluate(AbstractBeforeAfterRule.java:45)
	at com.carrotsearch.randomizedtesting.rules.StatementAdapter.evaluate(StatementAdapter.java:36)
	at org.apache.lucene.util.TestRuleStoreClassName$1.evaluate(TestRuleStoreClassName.java:41)
	at com.carrotsearch.randomizedtesting.rules.NoShadowingOrOverridesOnMethodsRule$1.evaluate(NoShadowingOrOverridesOnMethodsRule.java:40)
	at com.carrotsearch.randomizedtesting.rules.NoShadowingOrOverridesOnMethodsRule$1.evaluate(NoShadowingOrOverridesOnMethodsRule.java:40)
	at com.carrotsearch.randomizedtesting.rules.StatementAdapter.evaluate(StatementAdapter.java:36)
	at com.carrotsearch.randomizedtesting.rules.StatementAdapter.evaluate(StatementAdapter.java:36)
	at org.apache.lucene.util.TestRuleAssertionsRequired$1.evaluate(TestRuleAssertionsRequired.java:53)
	at org.apache.lucene.util.TestRuleMarkFailure$1.evaluate(TestRuleMarkFailure.java:47)
	at org.apache.lucene.util.TestRuleIgnoreAfterMaxFailures$1.evaluate(TestRuleIgnoreAfterMaxFailures.java:64)
	at org.apache.lucene.util.TestRuleIgnoreTestSuites$1.evaluate(TestRuleIgnoreTestSuites.java:54)
	at com.carrotsearch.randomizedtesting.rules.StatementAdapter.evaluate(StatementAdapter.java:36)
	at com.carrotsearch.randomizedtesting.ThreadLeakControl$StatementRunner.run(ThreadLeakControl.java:368)
	at java.base/java.lang.Thread.run(Thread.java:834)


FAILED:  org.apache.solr.cloud.autoscaling.ComputePlanActionTest.testNodeLostTriggerWithDeleteNodePreferredOp

Error Message:
Timed out waiting for replicas of new collection to be active null Live Nodes: [127.0.0.1:34903_solr, 127.0.0.1:45059_solr] Last available state: null

Stack Trace:
java.lang.AssertionError: Timed out waiting for replicas of new collection to be active
null
Live Nodes: [127.0.0.1:34903_solr, 127.0.0.1:45059_solr]
Last available state: null
	at __randomizedtesting.SeedInfo.seed([16F3679107374147:895CC372708FD82E]:0)
	at org.junit.Assert.fail(Assert.java:93)
	at org.apache.solr.cloud.SolrCloudTestCase.waitForState(SolrCloudTestCase.java:280)
	at org.apache.solr.cloud.autoscaling.ComputePlanActionTest.testNodeLostTriggerWithDeleteNodePreferredOp(ComputePlanActionTest.java:655)
	at java.base/jdk.internal.reflect.NativeMethodAccessorImpl.invoke0(Native Method)
	at java.base/jdk.internal.reflect.NativeMethodAccessorImpl.invoke(NativeMethodAccessorImpl.java:62)
	at java.base/jdk.internal.reflect.DelegatingMethodAccessorImpl.invoke(DelegatingMethodAccessorImpl.java:43)
	at java.base/java.lang.reflect.Method.invoke(Method.java:566)
	at com.carrotsearch.randomizedtesting.RandomizedRunner.invoke(RandomizedRunner.java:1742)
	at com.carrotsearch.randomizedtesting.RandomizedRunner$8.evaluate(RandomizedRunner.java:935)
	at com.carrotsearch.randomizedtesting.RandomizedRunner$9.evaluate(RandomizedRunner.java:971)
	at com.carrotsearch.randomizedtesting.RandomizedRunner$10.evaluate(RandomizedRunner.java:985)
	at com.carrotsearch.randomizedtesting.rules.SystemPropertiesRestoreRule$1.evaluate(SystemPropertiesRestoreRule.java:57)
	at org.apache.lucene.util.TestRuleSetupTeardownChained$1.evaluate(TestRuleSetupTeardownChained.java:49)
	at org.apache.lucene.util.AbstractBeforeAfterRule$1.evaluate(AbstractBeforeAfterRule.java:45)
	at org.apache.lucene.util.TestRuleThreadAndTestName$1.evaluate(TestRuleThreadAndTestName.java:48)
	at org.apache.lucene.util.TestRuleIgnoreAfterMaxFailures$1.evaluate(TestRuleIgnoreAfterMaxFailures.java:64)
	at org.apache.lucene.util.TestRuleMarkFailure$1.evaluate(TestRuleMarkFailure.java:47)
	at com.carrotsearch.randomizedtesting.rules.StatementAdapter.evaluate(StatementAdapter.java:36)
	at com.carrotsearch.randomizedtesting.ThreadLeakControl$StatementRunner.run(ThreadLeakControl.java:368)
	at com.carrotsearch.randomizedtesting.ThreadLeakControl.forkTimeoutingTask(ThreadLeakControl.java:817)
	at com.carrotsearch.randomizedtesting.ThreadLeakControl$3.evaluate(ThreadLeakControl.java:468)
	at com.carrotsearch.randomizedtesting.RandomizedRunner.runSingleTest(RandomizedRunner.java:944)
	at com.carrotsearch.randomizedtesting.RandomizedRunner$5.evaluate(RandomizedRunner.java:830)
	at com.carrotsearch.randomizedtesting.RandomizedRunner$6.evaluate(RandomizedRunner.java:880)
	at com.carrotsearch.randomizedtesting.RandomizedRunner$7.evaluate(RandomizedRunner.java:891)
	at com.carrotsearch.randomizedtesting.rules.StatementAdapter.evaluate(StatementAdapter.java:36)
	at com.carrotsearch.randomizedtesting.rules.SystemPropertiesRestoreRule$1.evaluate(SystemPropertiesRestoreRule.java:57)
	at org.apache.lucene.util.AbstractBeforeAfterRule$1.evaluate(AbstractBeforeAfterRule.java:45)
	at com.carrotsearch.randomizedtesting.rules.StatementAdapter.evaluate(StatementAdapter.java:36)
	at org.apache.lucene.util.TestRuleStoreClassName$1.evaluate(TestRuleStoreClassName.java:41)
	at com.carrotsearch.randomizedtesting.rules.NoShadowingOrOverridesOnMethodsRule$1.evaluate(NoShadowingOrOverridesOnMethodsRule.java:40)
	at com.carrotsearch.randomizedtesting.rules.NoShadowingOrOverridesOnMethodsRule$1.evaluate(NoShadowingOrOverridesOnMethodsRule.java:40)
	at com.carrotsearch.randomizedtesting.rules.StatementAdapter.evaluate(StatementAdapter.java:36)
	at com.carrotsearch.randomizedtesting.rules.StatementAdapter.evaluate(StatementAdapter.java:36)
	at org.apache.lucene.util.TestRuleAssertionsRequired$1.evaluate(TestRuleAssertionsRequired.java:53)
	at org.apache.lucene.util.TestRuleMarkFailure$1.evaluate(TestRuleMarkFailure.java:47)
	at org.apache.lucene.util.TestRuleIgnoreAfterMaxFailures$1.evaluate(TestRuleIgnoreAfterMaxFailures.java:64)
	at org.apache.lucene.util.TestRuleIgnoreTestSuites$1.evaluate(TestRuleIgnoreTestSuites.java:54)
	at com.carrotsearch.randomizedtesting.rules.StatementAdapter.evaluate(StatementAdapter.java:36)
	at com.carrotsearch.randomizedtesting.ThreadLeakControl$StatementRunner.run(ThreadLeakControl.java:368)
	at java.base/java.lang.Thread.run(Thread.java:834)


FAILED:  org.apache.solr.cloud.autoscaling.ComputePlanActionTest.testNodeLostTriggerWithDeleteNodePreferredOp

Error Message:
Timed out waiting for replicas of new collection to be active null Live Nodes: [127.0.0.1:40753_solr, 127.0.0.1:42733_solr] Last available state: null

Stack Trace:
java.lang.AssertionError: Timed out waiting for replicas of new collection to be active
null
Live Nodes: [127.0.0.1:40753_solr, 127.0.0.1:42733_solr]
Last available state: null
	at __randomizedtesting.SeedInfo.seed([16F3679107374147:895CC372708FD82E]:0)
	at org.junit.Assert.fail(Assert.java:93)
	at org.apache.solr.cloud.SolrCloudTestCase.waitForState(SolrCloudTestCase.java:280)
	at org.apache.solr.cloud.autoscaling.ComputePlanActionTest.testNodeLostTriggerWithDeleteNodePreferredOp(ComputePlanActionTest.java:655)
	at java.base/jdk.internal.reflect.NativeMethodAccessorImpl.invoke0(Native Method)
	at java.base/jdk.internal.reflect.NativeMethodAccessorImpl.invoke(NativeMethodAccessorImpl.java:62)
	at java.base/jdk.internal.reflect.DelegatingMethodAccessorImpl.invoke(DelegatingMethodAccessorImpl.java:43)
	at java.base/java.lang.reflect.Method.invoke(Method.java:566)
	at com.carrotsearch.randomizedtesting.RandomizedRunner.invoke(RandomizedRunner.java:1742)
	at com.carrotsearch.randomizedtesting.RandomizedRunner$8.evaluate(RandomizedRunner.java:935)
	at com.carrotsearch.randomizedtesting.RandomizedRunner$9.evaluate(RandomizedRunner.java:971)
	at com.carrotsearch.randomizedtesting.RandomizedRunner$10.evaluate(RandomizedRunner.java:985)
	at com.carrotsearch.randomizedtesting.rules.SystemPropertiesRestoreRule$1.evaluate(SystemPropertiesRestoreRule.java:57)
	at org.apache.lucene.util.TestRuleSetupTeardownChained$1.evaluate(TestRuleSetupTeardownChained.java:49)
	at org.apache.lucene.util.AbstractBeforeAfterRule$1.evaluate(AbstractBeforeAfterRule.java:45)
	at org.apache.lucene.util.TestRuleThreadAndTestName$1.evaluate(TestRuleThreadAndTestName.java:48)
	at org.apache.lucene.util.TestRuleIgnoreAfterMaxFailures$1.evaluate(TestRuleIgnoreAfterMaxFailures.java:64)
	at org.apache.lucene.util.TestRuleMarkFailure$1.evaluate(TestRuleMarkFailure.java:47)
	at com.carrotsearch.randomizedtesting.rules.StatementAdapter.evaluate(StatementAdapter.java:36)
	at com.carrotsearch.randomizedtesting.ThreadLeakControl$StatementRunner.run(ThreadLeakControl.java:368)
	at com.carrotsearch.randomizedtesting.ThreadLeakControl.forkTimeoutingTask(ThreadLeakControl.java:817)
	at com.carrotsearch.randomizedtesting.ThreadLeakControl$3.evaluate(ThreadLeakControl.java:468)
	at com.carrotsearch.randomizedtesting.RandomizedRunner.runSingleTest(RandomizedRunner.java:944)
	at com.carrotsearch.randomizedtesting.RandomizedRunner$5.evaluate(RandomizedRunner.java:830)
	at com.carrotsearch.randomizedtesting.RandomizedRunner$6.evaluate(RandomizedRunner.java:880)
	at com.carrotsearch.randomizedtesting.RandomizedRunner$7.evaluate(RandomizedRunner.java:891)
	at com.carrotsearch.randomizedtesting.rules.StatementAdapter.evaluate(StatementAdapter.java:36)
	at com.carrotsearch.randomizedtesting.rules.SystemPropertiesRestoreRule$1.evaluate(SystemPropertiesRestoreRule.java:57)
	at org.apache.lucene.util.AbstractBeforeAfterRule$1.evaluate(AbstractBeforeAfterRule.java:45)
	at com.carrotsearch.randomizedtesting.rules.StatementAdapter.evaluate(StatementAdapter.java:36)
	at org.apache.lucene.util.TestRuleStoreClassName$1.evaluate(TestRuleStoreClassName.java:41)
	at com.carrotsearch.randomizedtesting.rules.NoShadowingOrOverridesOnMethodsRule$1.evaluate(NoShadowingOrOverridesOnMethodsRule.java:40)
	at com.carrotsearch.randomizedtesting.rules.NoShadowingOrOverridesOnMethodsRule$1.evaluate(NoShadowingOrOverridesOnMethodsRule.java:40)
	at com.carrotsearch.randomizedtesting.rules.StatementAdapter.evaluate(StatementAdapter.java:36)
	at com.carrotsearch.randomizedtesting.rules.StatementAdapter.evaluate(StatementAdapter.java:36)
	at org.apache.lucene.util.TestRuleAssertionsRequired$1.evaluate(TestRuleAssertionsRequired.java:53)
	at org.apache.lucene.util.TestRuleMarkFailure$1.evaluate(TestRuleMarkFailure.java:47)
	at org.apache.lucene.util.TestRuleIgnoreAfterMaxFailures$1.evaluate(TestRuleIgnoreAfterMaxFailures.java:64)
	at org.apache.lucene.util.TestRuleIgnoreTestSuites$1.evaluate(TestRuleIgnoreTestSuites.java:54)
	at com.carrotsearch.randomizedtesting.rules.StatementAdapter.evaluate(StatementAdapter.java:36)
	at com.carrotsearch.randomizedtesting.ThreadLeakControl$StatementRunner.run(ThreadLeakControl.java:368)
	at java.base/java.lang.Thread.run(Thread.java:834)


FAILED:  org.apache.solr.cloud.autoscaling.ComputePlanActionTest.testNodeAdded

Error Message:
Timed out waiting for replicas of new collection to be active null Live Nodes: [127.0.0.1:41991_solr] Last available state: null

Stack Trace:
java.lang.AssertionError: Timed out waiting for replicas of new collection to be active
null
Live Nodes: [127.0.0.1:41991_solr]
Last available state: null
	at __randomizedtesting.SeedInfo.seed([16F3679107374147:733031E6A594E944]:0)
	at org.junit.Assert.fail(Assert.java:93)
	at org.apache.solr.cloud.SolrCloudTestCase.waitForState(SolrCloudTestCase.java:280)
	at org.apache.solr.cloud.autoscaling.ComputePlanActionTest.testNodeAdded(ComputePlanActionTest.java:359)
	at java.base/jdk.internal.reflect.NativeMethodAccessorImpl.invoke0(Native Method)
	at java.base/jdk.internal.reflect.NativeMethodAccessorImpl.invoke(NativeMethodAccessorImpl.java:62)
	at java.base/jdk.internal.reflect.DelegatingMethodAccessorImpl.invoke(DelegatingMethodAccessorImpl.java:43)
	at java.base/java.lang.reflect.Method.invoke(Method.java:566)
	at com.carrotsearch.randomizedtesting.RandomizedRunner.invoke(RandomizedRunner.java:1742)
	at com.carrotsearch.randomizedtesting.RandomizedRunner$8.evaluate(RandomizedRunner.java:935)
	at com.carrotsearch.randomizedtesting.RandomizedRunner$9.evaluate(RandomizedRunner.java:971)
	at com.carrotsearch.randomizedtesting.RandomizedRunner$10.evaluate(RandomizedRunner.java:985)
	at com.carrotsearch.randomizedtesting.rules.SystemPropertiesRestoreRule$1.evaluate(SystemPropertiesRestoreRule.java:57)
	at org.apache.lucene.util.TestRuleSetupTeardownChained$1.evaluate(TestRuleSetupTeardownChained.java:49)
	at org.apache.lucene.util.AbstractBeforeAfterRule$1.evaluate(AbstractBeforeAfterRule.java:45)
	at org.apache.lucene.util.TestRuleThreadAndTestName$1.evaluate(TestRuleThreadAndTestName.java:48)
	at org.apache.lucene.util.TestRuleIgnoreAfterMaxFailures$1.evaluate(TestRuleIgnoreAfterMaxFailures.java:64)
	at org.apache.lucene.util.TestRuleMarkFailure$1.evaluate(TestRuleMarkFailure.java:47)
	at com.carrotsearch.randomizedtesting.rules.StatementAdapter.evaluate(StatementAdapter.java:36)
	at com.carrotsearch.randomizedtesting.ThreadLeakControl$StatementRunner.run(ThreadLeakControl.java:368)
	at com.carrotsearch.randomizedtesting.ThreadLeakControl.forkTimeoutingTask(ThreadLeakControl.java:817)
	at com.carrotsearch.randomizedtesting.ThreadLeakControl$3.evaluate(ThreadLeakControl.java:468)
	at com.carrotsearch.randomizedtesting.RandomizedRunner.runSingleTest(RandomizedRunner.java:944)
	at com.carrotsearch.randomizedtesting.RandomizedRunner$5.evaluate(RandomizedRunner.java:830)
	at com.carrotsearch.randomizedtesting.RandomizedRunner$6.evaluate(RandomizedRunner.java:880)
	at com.carrotsearch.randomizedtesting.RandomizedRunner$7.evaluate(RandomizedRunner.java:891)
	at com.carrotsearch.randomizedtesting.rules.StatementAdapter.evaluate(StatementAdapter.java:36)
	at com.carrotsearch.randomizedtesting.rules.SystemPropertiesRestoreRule$1.evaluate(SystemPropertiesRestoreRule.java:57)
	at org.apache.lucene.util.AbstractBeforeAfterRule$1.evaluate(AbstractBeforeAfterRule.java:45)
	at com.carrotsearch.randomizedtesting.rules.StatementAdapter.evaluate(StatementAdapter.java:36)
	at org.apache.lucene.util.TestRuleStoreClassName$1.evaluate(TestRuleStoreClassName.java:41)
	at com.carrotsearch.randomizedtesting.rules.NoShadowingOrOverridesOnMethodsRule$1.evaluate(NoShadowingOrOverridesOnMethodsRule.java:40)
	at com.carrotsearch.randomizedtesting.rules.NoShadowingOrOverridesOnMethodsRule$1.evaluate(NoShadowingOrOverridesOnMethodsRule.java:40)
	at com.carrotsearch.randomizedtesting.rules.StatementAdapter.evaluate(StatementAdapter.java:36)
	at com.carrotsearch.randomizedtesting.rules.StatementAdapter.evaluate(StatementAdapter.java:36)
	at org.apache.lucene.util.TestRuleAssertionsRequired$1.evaluate(TestRuleAssertionsRequired.java:53)
	at org.apache.lucene.util.TestRuleMarkFailure$1.evaluate(TestRuleMarkFailure.java:47)
	at org.apache.lucene.util.TestRuleIgnoreAfterMaxFailures$1.evaluate(TestRuleIgnoreAfterMaxFailures.java:64)
	at org.apache.lucene.util.TestRuleIgnoreTestSuites$1.evaluate(TestRuleIgnoreTestSuites.java:54)
	at com.carrotsearch.randomizedtesting.rules.StatementAdapter.evaluate(StatementAdapter.java:36)
	at com.carrotsearch.randomizedtesting.ThreadLeakControl$StatementRunner.run(ThreadLeakControl.java:368)
	at java.base/java.lang.Thread.run(Thread.java:834)


FAILED:  org.apache.solr.cloud.autoscaling.ComputePlanActionTest.testNodeAdded

Error Message:
Timed out waiting for replicas of new collection to be active null Live Nodes: [127.0.0.1:42175_solr] Last available state: null

Stack Trace:
java.lang.AssertionError: Timed out waiting for replicas of new collection to be active
null
Live Nodes: [127.0.0.1:42175_solr]
Last available state: null
	at __randomizedtesting.SeedInfo.seed([16F3679107374147:733031E6A594E944]:0)
	at org.junit.Assert.fail(Assert.java:93)
	at org.apache.solr.cloud.SolrCloudTestCase.waitForState(SolrCloudTestCase.java:280)
	at org.apache.solr.cloud.autoscaling.ComputePlanActionTest.testNodeAdded(ComputePlanActionTest.java:359)
	at java.base/jdk.internal.reflect.NativeMethodAccessorImpl.invoke0(Native Method)
	at java.base/jdk.internal.reflect.NativeMethodAccessorImpl.invoke(NativeMethodAccessorImpl.java:62)
	at java.base/jdk.internal.reflect.DelegatingMethodAccessorImpl.invoke(DelegatingMethodAccessorImpl.java:43)
	at java.base/java.lang.reflect.Method.invoke(Method.java:566)
	at com.carrotsearch.randomizedtesting.RandomizedRunner.invoke(RandomizedRunner.java:1742)
	at com.carrotsearch.randomizedtesting.RandomizedRunner$8.evaluate(RandomizedRunner.java:935)
	at com.carrotsearch.randomizedtesting.RandomizedRunner$9.evaluate(RandomizedRunner.java:971)
	at com.carrotsearch.randomizedtesting.RandomizedRunner$10.evaluate(RandomizedRunner.java:985)
	at com.carrotsearch.randomizedtesting.rules.SystemPropertiesRestoreRule$1.evaluate(SystemPropertiesRestoreRule.java:57)
	at org.apache.lucene.util.TestRuleSetupTeardownChained$1.evaluate(TestRuleSetupTeardownChained.java:49)
	at org.apache.lucene.util.AbstractBeforeAfterRule$1.evaluate(AbstractBeforeAfterRule.java:45)
	at org.apache.lucene.util.TestRuleThreadAndTestName$1.evaluate(TestRuleThreadAndTestName.java:48)
	at org.apache.lucene.util.TestRuleIgnoreAfterMaxFailures$1.evaluate(TestRuleIgnoreAfterMaxFailures.java:64)
	at org.apache.lucene.util.TestRuleMarkFailure$1.evaluate(TestRuleMarkFailure.java:47)
	at com.carrotsearch.randomizedtesting.rules.StatementAdapter.evaluate(StatementAdapter.java:36)
	at com.carrotsearch.randomizedtesting.ThreadLeakControl$StatementRunner.run(ThreadLeakControl.java:368)
	at com.carrotsearch.randomizedtesting.ThreadLeakControl.forkTimeoutingTask(ThreadLeakControl.java:817)
	at com.carrotsearch.randomizedtesting.ThreadLeakControl$3.evaluate(ThreadLeakControl.java:468)
	at com.carrotsearch.randomizedtesting.RandomizedRunner.runSingleTest(RandomizedRunner.java:944)
	at com.carrotsearch.randomizedtesting.RandomizedRunner$5.evaluate(RandomizedRunner.java:830)
	at com.carrotsearch.randomizedtesting.RandomizedRunner$6.evaluate(RandomizedRunner.java:880)
	at com.carrotsearch.randomizedtesting.RandomizedRunner$7.evaluate(RandomizedRunner.java:891)
	at com.carrotsearch.randomizedtesting.rules.StatementAdapter.evaluate(StatementAdapter.java:36)
	at com.carrotsearch.randomizedtesting.rules.SystemPropertiesRestoreRule$1.evaluate(SystemPropertiesRestoreRule.java:57)
	at org.apache.lucene.util.AbstractBeforeAfterRule$1.evaluate(AbstractBeforeAfterRule.java:45)
	at com.carrotsearch.randomizedtesting.rules.StatementAdapter.evaluate(StatementAdapter.java:36)
	at org.apache.lucene.util.TestRuleStoreClassName$1.evaluate(TestRuleStoreClassName.java:41)
	at com.carrotsearch.randomizedtesting.rules.NoShadowingOrOverridesOnMethodsRule$1.evaluate(NoShadowingOrOverridesOnMethodsRule.java:40)
	at com.carrotsearch.randomizedtesting.rules.NoShadowingOrOverridesOnMethodsRule$1.evaluate(NoShadowingOrOverridesOnMethodsRule.java:40)
	at com.carrotsearch.randomizedtesting.rules.StatementAdapter.evaluate(StatementAdapter.java:36)
	at com.carrotsearch.randomizedtesting.rules.StatementAdapter.evaluate(StatementAdapter.java:36)
	at org.apache.lucene.util.TestRuleAssertionsRequired$1.evaluate(TestRuleAssertionsRequired.java:53)
	at org.apache.lucene.util.TestRuleMarkFailure$1.evaluate(TestRuleMarkFailure.java:47)
	at org.apache.lucene.util.TestRuleIgnoreAfterMaxFailures$1.evaluate(TestRuleIgnoreAfterMaxFailures.java:64)
	at org.apache.lucene.util.TestRuleIgnoreTestSuites$1.evaluate(TestRuleIgnoreTestSuites.java:54)
	at com.carrotsearch.randomizedtesting.rules.StatementAdapter.evaluate(StatementAdapter.java:36)
	at com.carrotsearch.randomizedtesting.ThreadLeakControl$StatementRunner.run(ThreadLeakControl.java:368)
	at java.base/java.lang.Thread.run(Thread.java:834)


FAILED:  org.apache.solr.cloud.cdcr.CdcrBootstrapTest.testBootstrapWithSourceCluster

Error Message:
Error from server at https://127.0.0.1:40077/solr: create the collection time out:180s

Stack Trace:
org.apache.solr.client.solrj.impl.HttpSolrClient$RemoteSolrException: Error from server at https://127.0.0.1:40077/solr: create the collection time out:180s
	at __randomizedtesting.SeedInfo.seed([16F3679107374147:CFA536550453520D]:0)
	at org.apache.solr.client.solrj.impl.HttpSolrClient.executeMethod(HttpSolrClient.java:643)
	at org.apache.solr.client.solrj.impl.HttpSolrClient.request(HttpSolrClient.java:255)
	at org.apache.solr.client.solrj.impl.HttpSolrClient.request(HttpSolrClient.java:244)
	at org.apache.solr.client.solrj.impl.LBHttpSolrClient.doRequest(LBHttpSolrClient.java:483)
	at org.apache.solr.client.solrj.impl.LBHttpSolrClient.request(LBHttpSolrClient.java:413)
	at org.apache.solr.client.solrj.impl.CloudSolrClient.sendRequest(CloudSolrClient.java:1107)
	at org.apache.solr.client.solrj.impl.CloudSolrClient.requestWithRetryOnStaleState(CloudSolrClient.java:884)
	at org.apache.solr.client.solrj.impl.CloudSolrClient.request(CloudSolrClient.java:817)
	at org.apache.solr.client.solrj.SolrRequest.process(SolrRequest.java:194)
	at org.apache.solr.client.solrj.SolrRequest.process(SolrRequest.java:211)
	at org.apache.solr.cloud.cdcr.CdcrBootstrapTest.testBootstrapWithSourceCluster(CdcrBootstrapTest.java:177)
	at java.base/jdk.internal.reflect.NativeMethodAccessorImpl.invoke0(Native Method)
	at java.base/jdk.internal.reflect.NativeMethodAccessorImpl.invoke(NativeMethodAccessorImpl.java:62)
	at java.base/jdk.internal.reflect.DelegatingMethodAccessorImpl.invoke(DelegatingMethodAccessorImpl.java:43)
	at java.base/java.lang.reflect.Method.invoke(Method.java:566)
	at com.carrotsearch.randomizedtesting.RandomizedRunner.invoke(RandomizedRunner.java:1742)
	at com.carrotsearch.randomizedtesting.RandomizedRunner$8.evaluate(RandomizedRunner.java:935)
	at com.carrotsearch.randomizedtesting.RandomizedRunner$9.evaluate(RandomizedRunner.java:971)
	at com.carrotsearch.randomizedtesting.RandomizedRunner$10.evaluate(RandomizedRunner.java:985)
	at com.carrotsearch.randomizedtesting.rules.SystemPropertiesRestoreRule$1.evaluate(SystemPropertiesRestoreRule.java:57)
	at org.apache.lucene.util.TestRuleSetupTeardownChained$1.evaluate(TestRuleSetupTeardownChained.java:49)
	at org.apache.lucene.util.AbstractBeforeAfterRule$1.evaluate(AbstractBeforeAfterRule.java:45)
	at org.apache.lucene.util.TestRuleThreadAndTestName$1.evaluate(TestRuleThreadAndTestName.java:48)
	at org.apache.lucene.util.TestRuleIgnoreAfterMaxFailures$1.evaluate(TestRuleIgnoreAfterMaxFailures.java:64)
	at org.apache.lucene.util.TestRuleMarkFailure$1.evaluate(TestRuleMarkFailure.java:47)
	at com.carrotsearch.randomizedtesting.rules.StatementAdapter.evaluate(StatementAdapter.java:36)
	at com.carrotsearch.randomizedtesting.ThreadLeakControl$StatementRunner.run(ThreadLeakControl.java:368)
	at com.carrotsearch.randomizedtesting.ThreadLeakControl.forkTimeoutingTask(ThreadLeakControl.java:817)
	at com.carrotsearch.randomizedtesting.ThreadLeakControl$3.evaluate(ThreadLeakControl.java:468)
	at com.carrotsearch.randomizedtesting.RandomizedRunner.runSingleTest(RandomizedRunner.java:944)
	at com.carrotsearch.randomizedtesting.RandomizedRunner$5.evaluate(RandomizedRunner.java:830)
	at com.carrotsearch.randomizedtesting.RandomizedRunner$6.evaluate(RandomizedRunner.java:880)
	at com.carrotsearch.randomizedtesting.RandomizedRunner$7.evaluate(RandomizedRunner.java:891)
	at com.carrotsearch.randomizedtesting.rules.StatementAdapter.evaluate(StatementAdapter.java:36)
	at com.carrotsearch.randomizedtesting.rules.SystemPropertiesRestoreRule$1.evaluate(SystemPropertiesRestoreRule.java:57)
	at org.apache.lucene.util.AbstractBeforeAfterRule$1.evaluate(AbstractBeforeAfterRule.java:45)
	at com.carrotsearch.randomizedtesting.rules.StatementAdapter.evaluate(StatementAdapter.java:36)
	at org.apache.lucene.util.TestRuleStoreClassName$1.evaluate(TestRuleStoreClassName.java:41)
	at com.carrotsearch.randomizedtesting.rules.NoShadowingOrOverridesOnMethodsRule$1.evaluate(NoShadowingOrOverridesOnMethodsRule.java:40)
	at com.carrotsearch.randomizedtesting.rules.NoShadowingOrOverridesOnMethodsRule$1.evaluate(NoShadowingOrOverridesOnMethodsRule.java:40)
	at com.carrotsearch.randomizedtesting.rules.StatementAdapter.evaluate(StatementAdapter.java:36)
	at com.carrotsearch.randomizedtesting.rules.StatementAdapter.evaluate(StatementAdapter.java:36)
	at org.apache.lucene.util.TestRuleAssertionsRequired$1.evaluate(TestRuleAssertionsRequired.java:53)
	at org.apache.lucene.util.TestRuleMarkFailure$1.evaluate(TestRuleMarkFailure.java:47)
	at org.apache.lucene.util.TestRuleIgnoreAfterMaxFailures$1.evaluate(TestRuleIgnoreAfterMaxFailures.java:64)
	at org.apache.lucene.util.TestRuleIgnoreTestSuites$1.evaluate(TestRuleIgnoreTestSuites.java:54)
	at com.carrotsearch.randomizedtesting.rules.StatementAdapter.evaluate(StatementAdapter.java:36)
	at com.carrotsearch.randomizedtesting.ThreadLeakControl$StatementRunner.run(ThreadLeakControl.java:368)
	at java.base/java.lang.Thread.run(Thread.java:834)


FAILED:  org.apache.solr.cloud.cdcr.CdcrOpsAndBoundariesTest.testTargetCollectionNotAvailable

Error Message:
Error from server at https://127.0.0.1:45393/solr: create the collection time out:180s

Stack Trace:
org.apache.solr.client.solrj.impl.HttpSolrClient$RemoteSolrException: Error from server at https://127.0.0.1:45393/solr: create the collection time out:180s
	at __randomizedtesting.SeedInfo.seed([16F3679107374147:F0673DE20C682C6F]:0)
	at org.apache.solr.client.solrj.impl.HttpSolrClient.executeMethod(HttpSolrClient.java:643)
	at org.apache.solr.client.solrj.impl.HttpSolrClient.request(HttpSolrClient.java:255)
	at org.apache.solr.client.solrj.impl.HttpSolrClient.request(HttpSolrClient.java:244)
	at org.apache.solr.client.solrj.impl.LBHttpSolrClient.doRequest(LBHttpSolrClient.java:483)
	at org.apache.solr.client.solrj.impl.LBHttpSolrClient.request(LBHttpSolrClient.java:413)
	at org.apache.solr.client.solrj.impl.CloudSolrClient.sendRequest(CloudSolrClient.java:1107)
	at org.apache.solr.client.solrj.impl.CloudSolrClient.requestWithRetryOnStaleState(CloudSolrClient.java:884)
	at org.apache.solr.client.solrj.impl.CloudSolrClient.request(CloudSolrClient.java:817)
	at org.apache.solr.client.solrj.SolrRequest.process(SolrRequest.java:194)
	at org.apache.solr.client.solrj.SolrRequest.process(SolrRequest.java:211)
	at org.apache.solr.cloud.cdcr.CdcrOpsAndBoundariesTest.createTargetCollection(CdcrOpsAndBoundariesTest.java:297)
	at org.apache.solr.cloud.cdcr.CdcrOpsAndBoundariesTest.createCollections(CdcrOpsAndBoundariesTest.java:312)
	at org.apache.solr.cloud.cdcr.CdcrOpsAndBoundariesTest.testTargetCollectionNotAvailable(CdcrOpsAndBoundariesTest.java:123)
	at java.base/jdk.internal.reflect.NativeMethodAccessorImpl.invoke0(Native Method)
	at java.base/jdk.internal.reflect.NativeMethodAccessorImpl.invoke(NativeMethodAccessorImpl.java:62)
	at java.base/jdk.internal.reflect.DelegatingMethodAccessorImpl.invoke(DelegatingMethodAccessorImpl.java:43)
	at java.base/java.lang.reflect.Method.invoke(Method.java:566)
	at com.carrotsearch.randomizedtesting.RandomizedRunner.invoke(RandomizedRunner.java:1742)
	at com.carrotsearch.randomizedtesting.RandomizedRunner$8.evaluate(RandomizedRunner.java:935)
	at com.carrotsearch.randomizedtesting.RandomizedRunner$9.evaluate(RandomizedRunner.java:971)
	at com.carrotsearch.randomizedtesting.RandomizedRunner$10.evaluate(RandomizedRunner.java:985)
	at com.carrotsearch.randomizedtesting.rules.SystemPropertiesRestoreRule$1.evaluate(SystemPropertiesRestoreRule.java:57)
	at org.apache.lucene.util.TestRuleSetupTeardownChained$1.evaluate(TestRuleSetupTeardownChained.java:49)
	at org.apache.lucene.util.AbstractBeforeAfterRule$1.evaluate(AbstractBeforeAfterRule.java:45)
	at org.apache.lucene.util.TestRuleThreadAndTestName$1.evaluate(TestRuleThreadAndTestName.java:48)
	at org.apache.lucene.util.TestRuleIgnoreAfterMaxFailures$1.evaluate(TestRuleIgnoreAfterMaxFailures.java:64)
	at org.apache.lucene.util.TestRuleMarkFailure$1.evaluate(TestRuleMarkFailure.java:47)
	at com.carrotsearch.randomizedtesting.rules.StatementAdapter.evaluate(StatementAdapter.java:36)
	at com.carrotsearch.randomizedtesting.ThreadLeakControl$StatementRunner.run(ThreadLeakControl.java:368)
	at com.carrotsearch.randomizedtesting.ThreadLeakControl.forkTimeoutingTask(ThreadLeakControl.java:817)
	at com.carrotsearch.randomizedtesting.ThreadLeakControl$3.evaluate(ThreadLeakControl.java:468)
	at com.carrotsearch.randomizedtesting.RandomizedRunner.runSingleTest(RandomizedRunner.java:944)
	at com.carrotsearch.randomizedtesting.RandomizedRunner$5.evaluate(RandomizedRunner.java:830)
	at com.carrotsearch.randomizedtesting.RandomizedRunner$6.evaluate(RandomizedRunner.java:880)
	at com.carrotsearch.randomizedtesting.RandomizedRunner$7.evaluate(RandomizedRunner.java:891)
	at com.carrotsearch.randomizedtesting.rules.StatementAdapter.evaluate(StatementAdapter.java:36)
	at com.carrotsearch.randomizedtesting.rules.SystemPropertiesRestoreRule$1.evaluate(SystemPropertiesRestoreRule.java:57)
	at org.apache.lucene.util.AbstractBeforeAfterRule$1.evaluate(AbstractBeforeAfterRule.java:45)
	at com.carrotsearch.randomizedtesting.rules.StatementAdapter.evaluate(StatementAdapter.java:36)
	at org.apache.lucene.util.TestRuleStoreClassName$1.evaluate(TestRuleStoreClassName.java:41)
	at com.carrotsearch.randomizedtesting.rules.NoShadowingOrOverridesOnMethodsRule$1.evaluate(NoShadowingOrOverridesOnMethodsRule.java:40)
	at com.carrotsearch.randomizedtesting.rules.NoShadowingOrOverridesOnMethodsRule$1.evaluate(NoShadowingOrOverridesOnMethodsRule.java:40)
	at com.carrotsearch.randomizedtesting.rules.StatementAdapter.evaluate(StatementAdapter.java:36)
	at com.carrotsearch.randomizedtesting.rules.StatementAdapter.evaluate(StatementAdapter.java:36)
	at org.apache.lucene.util.TestRuleAssertionsRequired$1.evaluate(TestRuleAssertionsRequired.java:53)
	at org.apache.lucene.util.TestRuleMarkFailure$1.evaluate(TestRuleMarkFailure.java:47)
	at org.apache.lucene.util.TestRuleIgnoreAfterMaxFailures$1.evaluate(TestRuleIgnoreAfterMaxFailures.java:64)
	at org.apache.lucene.util.TestRuleIgnoreTestSuites$1.evaluate(TestRuleIgnoreTestSuites.java:54)
	at com.carrotsearch.randomizedtesting.rules.StatementAdapter.evaluate(StatementAdapter.java:36)
	at com.carrotsearch.randomizedtesting.ThreadLeakControl$StatementRunner.run(ThreadLeakControl.java:368)
	at java.base/java.lang.Thread.run(Thread.java:834)




Build Log:
[...truncated 14466 lines...]
   [junit4] Suite: org.apache.solr.cloud.autoscaling.ComputePlanActionTest
   [junit4]   2> 2478542 INFO  (SUITE-ComputePlanActionTest-seed#[16F3679107374147]-worker) [    ] o.a.s.SolrTestCaseJ4 SecureRandom sanity checks: test.solr.allowed.securerandom=null & java.security.egd=file:/dev/./urandom
   [junit4]   2> Creating dataDir: /home/jenkins/workspace/Lucene-Solr-master-Linux/solr/build/solr-core/test/J1/temp/solr.cloud.autoscaling.ComputePlanActionTest_16F3679107374147-001/init-core-data-001
   [junit4]   2> 2478542 WARN  (SUITE-ComputePlanActionTest-seed#[16F3679107374147]-worker) [    ] o.a.s.SolrTestCaseJ4 startTrackingSearchers: numOpens=1 numCloses=1
   [junit4]   2> 2478543 INFO  (SUITE-ComputePlanActionTest-seed#[16F3679107374147]-worker) [    ] o.a.s.SolrTestCaseJ4 Using PointFields (NUMERIC_POINTS_SYSPROP=true) w/NUMERIC_DOCVALUES_SYSPROP=true
   [junit4]   2> 2478543 INFO  (SUITE-ComputePlanActionTest-seed#[16F3679107374147]-worker) [    ] o.a.s.SolrTestCaseJ4 Randomized ssl (true) and clientAuth (false) via: @org.apache.solr.util.RandomizeSSL(reason="", ssl=0.0/0.0, value=0.0/0.0, clientAuth=0.0/0.0)
   [junit4]   2> 2478543 INFO  (SUITE-ComputePlanActionTest-seed#[16F3679107374147]-worker) [    ] o.a.s.c.MiniSolrCloudCluster Starting cluster of 1 servers in /home/jenkins/workspace/Lucene-Solr-master-Linux/solr/build/solr-core/test/J1/temp/solr.cloud.autoscaling.ComputePlanActionTest_16F3679107374147-001/tempDir-001
   [junit4]   2> 2478543 INFO  (SUITE-ComputePlanActionTest-seed#[16F3679107374147]-worker) [    ] o.a.s.c.ZkTestServer STARTING ZK TEST SERVER
   [junit4]   2> 2478544 INFO  (Thread-7138) [    ] o.a.s.c.ZkTestServer client port:0.0.0.0/0.0.0.0:0
   [junit4]   2> 2478544 INFO  (Thread-7138) [    ] o.a.s.c.ZkTestServer Starting server
   [junit4]   2> 2478545 ERROR (Thread-7138) [    ] o.a.z.s.ZooKeeperServer ZKShutdownHandler is not registered, so ZooKeeper server won't take any action on ERROR or SHUTDOWN server state changes
   [junit4]   2> 2478644 INFO  (SUITE-ComputePlanActionTest-seed#[16F3679107374147]-worker) [    ] o.a.s.c.ZkTestServer start zk server on port:40761
   [junit4]   2> 2478645 INFO  (zkConnectionManagerCallback-12297-thread-1) [    ] o.a.s.c.c.ConnectionManager zkClient has connected
   [junit4]   2> 2478648 INFO  (jetty-launcher-12294-thread-1) [    ] o.e.j.s.Server jetty-9.4.11.v20180605; built: 2018-06-05T18:24:03.829Z; git: d5fc0523cfa96bfebfbda19606cad384d772f04c; jvm 11+28
   [junit4]   2> 2478648 INFO  (jetty-launcher-12294-thread-1) [    ] o.e.j.s.session DefaultSessionIdManager workerName=node0
   [junit4]   2> 2478648 INFO  (jetty-launcher-12294-thread-1) [    ] o.e.j.s.session No SessionScavenger set, using defaults
   [junit4]   2> 2478648 INFO  (jetty-launcher-12294-thread-1) [    ] o.e.j.s.session node0 Scavenging every 600000ms
   [junit4]   2> 2478648 INFO  (jetty-launcher-12294-thread-1) [    ] o.e.j.s.h.ContextHandler Started o.e.j.s.ServletContextHandler@525177d6{/solr,null,AVAILABLE}
   [junit4]   2> 2478649 INFO  (jetty-launcher-12294-thread-1) [    ] o.e.j.s.AbstractConnector Started ServerConnector@60262d26{SSL,[ssl, http/1.1]}{127.0.0.1:43463}
   [junit4]   2> 2478649 INFO  (jetty-launcher-12294-thread-1) [    ] o.e.j.s.Server Started @2478680ms
   [junit4]   2> 2478649 INFO  (jetty-launcher-12294-thread-1) [    ] o.a.s.c.s.e.JettySolrRunner Jetty properties: {hostContext=/solr, hostPort=43463}
   [junit4]   2> 2478649 ERROR (jetty-launcher-12294-thread-1) [    ] o.a.s.u.StartupLoggingUtils Missing Java Option solr.log.dir. Logging may be missing or incomplete.
   [junit4]   2> 2478649 INFO  (jetty-launcher-12294-thread-1) [    ] o.a.s.s.SolrDispatchFilter Using logger factory org.apache.logging.slf4j.Log4jLoggerFactory
   [junit4]   2> 2478649 INFO  (jetty-launcher-12294-thread-1) [    ] o.a.s.s.SolrDispatchFilter  ___      _       Welcome to Apache Solr™ version 8.0.0
   [junit4]   2> 2478649 INFO  (jetty-launcher-12294-thread-1) [    ] o.a.s.s.SolrDispatchFilter / __| ___| |_ _   Starting in cloud mode on port null
   [junit4]   2> 2478649 INFO  (jetty-launcher-12294-thread-1) [    ] o.a.s.s.SolrDispatchFilter \__ \/ _ \ | '_|  Install dir: null
   [junit4]   2> 2478649 INFO  (jetty-launcher-12294-thread-1) [    ] o.a.s.s.SolrDispatchFilter |___/\___/_|_|    Start time: 2018-09-15T09:37:25.536864Z
   [junit4]   2> 2478650 INFO  (zkConnectionManagerCallback-12299-thread-1) [    ] o.a.s.c.c.ConnectionManager zkClient has connected
   [junit4]   2> 2478650 INFO  (jetty-launcher-12294-thread-1) [    ] o.a.s.s.SolrDispatchFilter solr.xml found in ZooKeeper. Loading...
   [junit4]   2> 2478902 INFO  (jetty-launcher-12294-thread-1) [    ] o.a.s.c.ZkContainer Zookeeper client=127.0.0.1:40761/solr
   [junit4]   2> 2478902 INFO  (zkConnectionManagerCallback-12303-thread-1) [    ] o.a.s.c.c.ConnectionManager zkClient has connected
   [junit4]   2> 2478904 INFO  (zkConnectionManagerCallback-12305-thread-1) [    ] o.a.s.c.c.ConnectionManager zkClient has connected
   [junit4]   2> 2478934 INFO  (jetty-launcher-12294-thread-1) [n:127.0.0.1:43463_solr    ] o.a.s.c.OverseerElectionContext I am going to be the leader 127.0.0.1:43463_solr
   [junit4]   2> 2478934 INFO  (jetty-launcher-12294-thread-1) [n:127.0.0.1:43463_solr    ] o.a.s.c.Overseer Overseer (id=72227982595588099-127.0.0.1:43463_solr-n_0000000000) starting
   [junit4]   2> 2478937 INFO  (zkConnectionManagerCallback-12312-thread-1) [    ] o.a.s.c.c.ConnectionManager zkClient has connected
   [junit4]   2> 2478938 INFO  (jetty-launcher-12294-thread-1) [n:127.0.0.1:43463_solr    ] o.a.s.c.s.i.ZkClientClusterStateProvider Cluster at 127.0.0.1:40761/solr ready
   [junit4]   2> 2478938 INFO  (OverseerStateUpdate-72227982595588099-127.0.0.1:43463_solr-n_0000000000) [n:127.0.0.1:43463_solr    ] o.a.s.c.Overseer Starting to work on the main queue : 127.0.0.1:43463_solr
   [junit4]   2> 2478938 DEBUG (OverseerAutoScalingTriggerThread-72227982595588099-127.0.0.1:43463_solr-n_0000000000) [    ] o.a.s.c.a.OverseerTriggerThread Adding .auto_add_replicas and .scheduled_maintenance triggers
   [junit4]   2> 2478938 INFO  (jetty-launcher-12294-thread-1) [n:127.0.0.1:43463_solr    ] o.a.s.c.ZkController Register node as live in ZooKeeper:/live_nodes/127.0.0.1:43463_solr
   [junit4]   2> 2478939 DEBUG (OverseerAutoScalingTriggerThread-72227982595588099-127.0.0.1:43463_solr-n_0000000000) [    ] o.a.s.c.a.OverseerTriggerThread Refreshing /autoscaling.json with znode version 1
   [junit4]   2> 2478939 INFO  (zkCallback-12304-thread-1) [    ] o.a.s.c.c.ZkStateReader Updated live nodes from ZooKeeper... (0) -> (1)
   [junit4]   2> 2478939 INFO  (zkCallback-12311-thread-1) [    ] o.a.s.c.c.ZkStateReader Updated live nodes from ZooKeeper... (0) -> (1)
   [junit4]   2> 2478939 DEBUG (OverseerAutoScalingTriggerThread-72227982595588099-127.0.0.1:43463_solr-n_0000000000) [    ] o.a.s.c.a.OverseerTriggerThread Current znodeVersion 1, lastZnodeVersion -1
   [junit4]   2> 2478939 DEBUG (OverseerAutoScalingTriggerThread-72227982595588099-127.0.0.1:43463_solr-n_0000000000) [    ] o.a.s.c.a.OverseerTriggerThread Processed trigger updates upto znodeVersion 1
   [junit4]   2> 2478940 DEBUG (OverseerAutoScalingTriggerThread-72227982595588099-127.0.0.1:43463_solr-n_0000000000) [    ] o.a.s.c.a.NodeLostTrigger NodeLostTrigger .auto_add_replicas - Initial livenodes: [127.0.0.1:43463_solr]
   [junit4]   2> 2478940 DEBUG (OverseerAutoScalingTriggerThread-72227982595588099-127.0.0.1:43463_solr-n_0000000000) [    ] o.a.s.c.a.OverseerTriggerThread -- clean old nodeAdded markers
   [junit4]   2> 2478940 DEBUG (OverseerAutoScalingTriggerThread-72227982595588099-127.0.0.1:43463_solr-n_0000000000) [    ] o.a.s.c.a.OverseerTriggerThread Current znodeVersion 1, lastZnodeVersion 1
   [junit4]   2> 2478940 DEBUG (ScheduledTrigger-10510-thread-1) [    ] o.a.s.c.a.NodeLostTrigger Running NodeLostTrigger: .auto_add_replicas with currently live nodes: 1
   [junit4]   2> 2478947 INFO  (jetty-launcher-12294-thread-1) [n:127.0.0.1:43463_solr    ] o.a.s.h.a.MetricsHistoryHandler No .system collection, keeping metrics history in memory.
   [junit4]   2> 2478966 INFO  (jetty-launcher-12294-thread-1) [n:127.0.0.1:43463_solr    ] o.a.s.m.r.SolrJmxReporter JMX monitoring for 'solr_43463.solr.node' (registry 'solr.node') enabled at server: com.sun.jmx.mbeanserver.JmxMBeanServer@7b2467a5
   [junit4]   2> 2478971 INFO  (jetty-launcher-12294-thread-1) [n:127.0.0.1:43463_solr    ] o.a.s.m.r.SolrJmxReporter JMX monitoring for 'solr_43463.solr.jvm' (registry 'solr.jvm') enabled at server: com.sun.jmx.mbeanserver.JmxMBeanServer@7b2467a5
   [junit4]   2> 2478971 INFO  (jetty-launcher-12294-thread-1) [n:127.0.0.1:43463_solr    ] o.a.s.m.r.SolrJmxReporter JMX monitoring for 'solr_43463.solr.jetty' (registry 'solr.jetty') enabled at server: com.sun.jmx.mbeanserver.JmxMBeanServer@7b2467a5
   [junit4]   2> 2478972 INFO  (jetty-launcher-12294-thread-1) [n:127.0.0.1:43463_solr    ] o.a.s.c.CorePropertiesLocator Found 0 core definitions underneath /home/jenkins/workspace/Lucene-Solr-master-Linux/solr/build/solr-core/test/J1/temp/solr.cloud.autoscaling.ComputePlanActionTest_16F3679107374147-001/tempDir-001/node1/.
   [junit4]   2> 2478979 INFO  (zkConnectionManagerCallback-12315-thread-1) [    ] o.a.s.c.c.ConnectionManager zkClient has connected
   [junit4]   2> 2478981 INFO  (zkConnectionManagerCallback-12320-thread-1) [    ] o.a.s.c.c.ConnectionManager zkClient has connected
   [junit4]   2> 2478982 INFO  (SUITE-ComputePlanActionTest-seed#[16F3679107374147]-worker) [    ] o.a.s.c.c.ZkStateReader Updated live nodes from ZooKeeper... (0) -> (1)
   [junit4]   2> 2478983 INFO  (SUITE-ComputePlanActionTest-seed#[16F3679107374147]-worker) [    ] o.a.s.c.s.i.ZkClientClusterStateProvider Cluster at 127.0.0.1:40761/solr ready
   [junit4] IGNOR/A 0.00s J1 | ComputePlanActionTest.testNodeWithMultipleReplicasLost
   [junit4]    > Assumption #1: 'badapple' test group is disabled (@BadApple(bugUrl="https://issues.apache.org/jira/browse/SOLR-12028"))
   [junit4]   2> 2478988 INFO  (TEST-ComputePlanActionTest.testNodeLost-seed#[16F3679107374147]) [    ] o.a.s.SolrTestCaseJ4 ###Starting testNodeLost
   [junit4]   2> 2478989 DEBUG (zkCallback-12311-thread-1) [    ] o.a.s.c.a.OverseerTriggerThread Refreshing /autoscaling.json with znode version 2
   [junit4]   2> 2478989 DEBUG (OverseerAutoScalingTriggerThread-72227982595588099-127.0.0.1:43463_solr-n_0000000000) [    ] o.a.s.c.a.OverseerTriggerThread Processed trigger updates upto znodeVersion 2
   [junit4]   2> 2478990 INFO  (TEST-ComputePlanActionTest.testNodeLost-seed#[16F3679107374147]) [    ] o.a.s.c.c.ZkStateReader Updated live nodes from ZooKeeper... (0) -> (1)
   [junit4]   2> 2478990 DEBUG (OverseerAutoScalingTriggerThread-72227982595588099-127.0.0.1:43463_solr-n_0000000000) [    ] o.a.s.c.a.OverseerTriggerThread -- clean old nodeLost markers
   [junit4]   2> 2478990 DEBUG (OverseerAutoScalingTriggerThread-72227982595588099-127.0.0.1:43463_solr-n_0000000000) [    ] o.a.s.c.a.OverseerTriggerThread -- clean old nodeAdded markers
   [junit4]   2> 2478991 DEBUG (OverseerAutoScalingTriggerThread-72227982595588099-127.0.0.1:43463_solr-n_0000000000) [    ] o.a.s.c.a.OverseerTriggerThread Current znodeVersion 2, lastZnodeVersion 2
   [junit4]   2> 2479006 INFO  (qtp1704173023-37578) [n:127.0.0.1:43463_solr    ] o.a.s.s.HttpSolrCall [admin] webapp=null path=/admin/metrics params={prefix=CONTAINER.fs.usableSpace,CORE.coreName&wt=javabin&version=2&group=solr.node,solr.core} status=0 QTime=0
   [junit4]   2> 2479006 DEBUG (qtp1704173023-37577) [n:127.0.0.1:43463_solr    ] o.a.s.c.a.AutoScalingHandler Verified autoscaling configuration
   [junit4]   2> 2479006 INFO  (qtp1704173023-37577) [n:127.0.0.1:43463_solr    ] o.a.s.s.HttpSolrCall [admin] webapp=null path=/cluster/autoscaling params={wt=javabin&version=2} status=0 QTime=8
   [junit4]   2> 2479007 DEBUG (zkCallback-12311-thread-1) [    ] o.a.s.c.a.OverseerTriggerThread Refreshing /autoscaling.json with znode version 3
   [junit4]   2> 2479007 DEBUG (OverseerAutoScalingTriggerThread-72227982595588099-127.0.0.1:43463_solr-n_0000000000) [    ] o.a.s.c.a.OverseerTriggerThread Processed trigger updates upto znodeVersion 3
   [junit4]   2> 2479007 DEBUG (OverseerAutoScalingTriggerThread-72227982595588099-127.0.0.1:43463_solr-n_0000000000) [    ] o.a.s.c.a.OverseerTriggerThread -- clean old nodeLost markers
   [junit4]   2> 2479007 DEBUG (OverseerAutoScalingTriggerThread-72227982595588099-127.0.0.1:43463_solr-n_0000000000) [    ] o.a.s.c.a.OverseerTriggerThread -- clean old nodeAdded markers
   [junit4]   2> 2479007 DEBUG (OverseerAutoScalingTriggerThread-72227982595588099-127.0.0.1:43463_solr-n_0000000000) [    ] o.a.s.c.a.OverseerTriggerThread Current znodeVersion 3, lastZnodeVersion 3
   [junit4]   2> 2479008 INFO  (qtp1704173023-37619) [n:127.0.0.1:43463_solr    ] o.a.s.s.HttpSolrCall [admin] webapp=null path=/admin/metrics params={prefix=CONTAINER.fs.usableSpace,CORE.coreName&wt=javabin&version=2&group=solr.node,solr.core} status=0 QTime=0
   [junit4]   2> 2479008 DEBUG (qtp1704173023-37576) [n:127.0.0.1:43463_solr    ] o.a.s.c.a.AutoScalingHandler Verified autoscaling configuration
   [junit4]   2> 2479009 INFO  (qtp1704173023-37576) [n:127.0.0.1:43463_solr    ] o.a.s.s.HttpSolrCall [admin] webapp=null path=/admin/autoscaling params={wt=javabin&version=2} status=0 QTime=1
   [junit4]   2> 2479009 DEBUG (zkCallback-12311-thread-1) [    ] o.a.s.c.a.OverseerTriggerThread Refreshing /autoscaling.json with znode version 4
   [junit4]   2> 2479009 DEBUG (OverseerAutoScalingTriggerThread-72227982595588099-127.0.0.1:43463_solr-n_0000000000) [    ] o.a.s.c.a.OverseerTriggerThread Processed trigger updates upto znodeVersion 4
   [junit4]   2> 2479009 DEBUG (OverseerAutoScalingTriggerThread-72227982595588099-127.0.0.1:43463_solr-n_0000000000) [    ] o.a.s.c.a.OverseerTriggerThread -- clean old nodeLost markers
   [junit4]   2> 2479009 DEBUG (OverseerAutoScalingTriggerThread-72227982595588099-127.0.0.1:43463_solr-n_0000000000) [    ] o.a.s.c.a.OverseerTriggerThread -- clean old nodeAdded markers
   [junit4]   2> 2479009 DEBUG (OverseerAutoScalingTriggerThread-72227982595588099-127.0.0.1:43463_solr-n_0000000000) [    ] o.a.s.c.a.OverseerTriggerThread Current znodeVersion 4, lastZnodeVersion 4
   [junit4]   2> 2479010 INFO  (TEST-ComputePlanActionTest.testNodeLost-seed#[16F3679107374147]) [    ] o.e.j.s.Server jetty-9.4.11.v20180605; built: 2018-06-05T18:24:03.829Z; git: d5fc0523cfa96bfebfbda19606cad384d772f04c; jvm 11+28
   [junit4]   2> 2479011 INFO  (TEST-ComputePlanActionTest.testNodeLost-seed#[16F3679107374147]) [    ] o.e.j.s.session DefaultSessionIdManager workerName=node0
   [junit4]   2> 2479011 INFO  (TEST-ComputePlanActionTest.testNodeLost-seed#[16F3679107374147]) [    ] o.e.j.s.session No SessionScavenger set, using defaults
   [junit4]   2> 2479011 INFO  (TEST-ComputePlanActionTest.testNodeLost-seed#[16F3679107374147]) [    ] o.e.j.s.session node0 Scavenging every 660000ms
   [junit4]   2> 2479011 INFO  (TEST-ComputePlanActionTest.testNodeLost-seed#[16F3679107374147]) [    ] o.e.j.s.h.ContextHandler Started o.e.j.s.ServletContextHandler@2890f9d{/solr,null,AVAILABLE}
   [junit4]   2> 2479011 INFO  (TEST-ComputePlanActionTest.testNodeLost-seed#[16F3679107374147]) [    ] o.e.j.s.AbstractConnector Started ServerConnector@39642c7d{SSL,[ssl, http/1.1]}{127.0.0.1:41919}
   [junit4]   2> 2479011 INFO  (TEST-ComputePlanActionTest.testNodeLost-seed#[16F3679107374147]) [    ] o.e.j.s.Server Started @2479043ms
   [junit4]   2> 2479011 INFO  (TEST-ComputePlanActionTest.testNodeLost-seed#[16F3679107374147]) [    ] o.a.s.c.s.e.JettySolrRunner Jetty properties: {hostContext=/solr, hostPort=41919}
   [junit4]   2> 2479012 ERROR (TEST-ComputePlanActionTest.testNodeLost-seed#[16F3679107374147]) [    ] o.a.s.u.StartupLoggingUtils Missing Java Option solr.log.dir. Logging may be missing or incomplete.
   [junit4]   2> 2479012 INFO  (TEST-ComputePlanActionTest.testNodeLost-seed#[16F3679107374147]) [    ] o.a.s.s.SolrDispatchFilter Using logger factory org.apache.logging.slf4j.Log4jLoggerFactory
   [junit4]   2> 2479012 INFO  (TEST-ComputePlanActionTest.testNodeLost-seed#[16F3679107374147]) [    ] o.a.s.s.SolrDispatchFilter  ___      _       Welcome to Apache Solr™ version 8.0.0
   [junit4]   2> 2479012 INFO  (TEST-ComputePlanActionTest.testNodeLost-seed#[16F3679107374147]) [    ] o.a.s.s.SolrDispatchFilter / __| ___| |_ _   Starting in cloud mode on port null
   [junit4]   2> 2479012 INFO  (TEST-ComputePlanActionTest.testNodeLost-seed#[16F3679107374147]) [    ] o.a.s.s.SolrDispatchFilter \__ \/ _ \ | '_|  Install dir: null
   [junit4]   2> 2479012 INFO  (TEST-ComputePlanActionTest.testNodeLost-seed#[16F3679107374147]) [    ] o.a.s.s.SolrDispatchFilter |___/\___/_|_|    Start time: 2018-09-15T09:37:25.899229Z
   [junit4]   2> 2479013 INFO  (zkConnectionManagerCallback-12324-thread-1) [    ] o.a.s.c.c.ConnectionManager zkClient has connected
   [junit4]   2> 2479013 INFO  (TEST-ComputePlanActionTest.testNodeLost-seed#[16F3679107374147]) [    ] o.a.s.s.SolrDispatchFilter solr.xml found in ZooKeeper. Loading...
   [junit4]   2> 2479089 INFO  (TEST-ComputePlanActionTest.testNodeLost-seed#[16F3679107374147]) [    ] o.a.s.c.ZkContainer Zookeeper client=127.0.0.1:40761/solr
   [junit4]   2> 2479090 INFO  (zkConnectionManagerCallback-12328-thread-1) [    ] o.a.s.c.c.ConnectionManager zkClient has connected
   [junit4]   2> 2479092 INFO  (zkConnectionManagerCallback-12330-thread-1) [    ] o.a.s.c.c.ConnectionManager zkClient has connected
   [junit4]   2> 2479094 INFO  (TEST-ComputePlanActionTest.testNodeLost-seed#[16F3679107374147]) [n:127.0.0.1:41919_solr    ] o.a.s.c.c.ZkStateReader Updated live nodes from ZooKeeper... (0) -> (1)
   [junit4]   2> 2479096 INFO  (TEST-ComputePlanActionTest.testNodeLost-seed#[16F3679107374147]) [n:127.0.0.1:41919_solr    ] o.a.s.c.TransientSolrCoreCacheDefault Allocating transient cache for 2147483647 transient cores
   [junit4]   2> 2479096 INFO  (TEST-ComputePlanActionTest.testNodeLost-seed#[16F3679107374147]) [n:127.0.0.1:41919_solr    ] o.a.s.c.ZkController Register node as live in ZooKeeper:/live_nodes/127.0.0.1:41919_solr
   [junit4]   2> 2479096 DEBUG (OverseerStateUpdate-72227982595588099-127.0.0.1:43463_solr-n_0000000000) [n:127.0.0.1:43463_solr    ] o.a.s.c.Overseer processMessage: queueSize: 1, message = {
   [junit4]   2>   "operation":"downnode",
   [junit4]   2>   "node_name":"127.0.0.1:41919_solr"} current state version: 0
   [junit4]   2> 2479096 DEBUG (OverseerStateUpdate-72227982595588099-127.0.0.1:43463_solr-n_0000000000) [n:127.0.0.1:43463_solr    ] o.a.s.c.o.NodeMutator DownNode state invoked for node: 127.0.0.1:41919_solr
   [junit4]   2> 2479096 INFO  (zkCallback-12311-thread-1) [    ] o.a.s.c.c.ZkStateReader Updated live nodes from ZooKeeper... (1) -> (2)
   [junit4]   2> 2479096 INFO  (zkCallback-12319-thread-2) [    ] o.a.s.c.c.ZkStateReader Updated live nodes from ZooKeeper... (1) -> (2)
   [junit4]   2> 2479096 INFO  (zkCallback-12319-thread-1) [    ] o.a.s.c.c.ZkStateReader Updated live nodes from ZooKeeper... (1) -> (2)
   [junit4]   2> 2479096 INFO  (zkCallback-12304-thread-1) [    ] o.a.s.c.c.ZkStateReader Updated live nodes from ZooKeeper... (1) -> (2)
   [junit4]   2> 2479096 INFO  (zkCallback-12329-thread-1) [    ] o.a.s.c.c.ZkStateReader Updated live nodes from ZooKeeper... (1) -> (2)
   [junit4]   2> 2479111 INFO  (zkConnectionManagerCallback-12337-thread-1) [    ] o.a.s.c.c.ConnectionManager zkClient has connected
   [junit4]   2> 2479112 INFO  (TEST-ComputePlanActionTest.testNodeLost-seed#[16F3679107374147]) [n:127.0.0.1:41919_solr    ] o.a.s.c.c.ZkStateReader Updated live nodes from ZooKeeper... (0) -> (2)
   [junit4]   2> 2479112 INFO  (TEST-ComputePlanActionTest.testNodeLost-seed#[16F3679107374147]) [n:127.0.0.1:41919_solr    ] o.a.s.c.s.i.ZkClientClusterStateProvider Cluster at 127.0.0.1:40761/solr ready
   [junit4]   2> 2479112 INFO  (TEST-ComputePlanActionTest.testNodeLost-seed#[16F3679107374147]) [n:127.0.0.1:41919_solr    ] o.a.s.h.a.MetricsHistoryHandler No .system collection, keeping metrics history in memory.
   [junit4]   2> 2479123 INFO  (TEST-ComputePlanActionTest.testNodeLost-seed#[16F3679107374147]) [n:127.0.0.1:41919_solr    ] o.a.s.m.r.SolrJmxReporter JMX monitoring for 'solr_41919.solr.node' (registry 'solr.node') enabled at server: com.sun.jmx.mbeanserver.JmxMBeanServer@7b2467a5
   [junit4]   2> 2479129 INFO  (TEST-ComputePlanActionTest.testNodeLost-seed#[16F3679107374147]) [n:127.0.0.1:41919_solr    ] o.a.s.m.r.SolrJmxReporter JMX monitoring for 'solr_41919.solr.jvm' (registry 'solr.jvm') enabled at server: com.sun.jmx.mbeanserver.JmxMBeanServer@7b2467a5
   [junit4]   2> 2479129 INFO  (TEST-ComputePlanActionTest.testNodeLost-seed#[16F3679107374147]) [n:127.0.0.1:41919_solr    ] o.a.s.m.r.SolrJmxReporter JMX monitoring for 'solr_41919.solr.jetty' (registry 'solr.jetty') enabled at server: com.sun.jmx.mbeanserver.JmxMBeanServer@7b2467a5
   [junit4]   2> 2479130 INFO  (TEST-ComputePlanActionTest.testNodeLost-seed#[16F3679107374147]) [n:127.0.0.1:41919_solr    ] o.a.s.c.CorePropertiesLocator Found 0 core definitions underneath /home/jenkins/workspace/Lucene-Solr-master-Linux/solr/build/solr-core/test/J1/temp/solr.cloud.autoscaling.ComputePlanActionTest_16F3679107374147-001/tempDir-001/node2/.
   [junit4]   2> 2479161 INFO  (qtp1704173023-37576) [n:127.0.0.1:43463_solr    ] o.a.s.s.HttpSolrCall [admin] webapp=null path=/admin/metrics params={prefix=CONTAINER.fs.usableSpace,CONTAINER.fs.totalSpace,CORE.coreName&wt=javabin&version=2&group=solr.node,solr.core} status=0 QTime=0
   [junit4]   2> 2479167 INFO  (qtp851899439-37625) [n:127.0.0.1:41919_solr    ] o.a.s.s.HttpSolrCall [admin] webapp=null path=/admin/metrics params={prefix=CONTAINER.fs.usableSpace,CONTAINER.fs.totalSpace,CORE.coreName&wt=javabin&version=2&group=solr.node,solr.core} status=0 QTime=0
   [junit4]   2> 2479168 DEBUG (qtp851899439-37621) [n:127.0.0.1:41919_solr    ] o.a.s.c.a.AutoScalingHandler Verified autoscaling configuration
   [junit4]   2> 2479168 INFO  (qtp851899439-37621) [n:127.0.0.1:41919_solr    ] o.a.s.s.HttpSolrCall [admin] webapp=null path=/admin/autoscaling params={wt=javabin&version=2} status=0 QTime=15
   [junit4]   2> 2479168 DEBUG (zkCallback-12311-thread-1) [    ] o.a.s.c.a.OverseerTriggerThread Refreshing /autoscaling.json with znode version 5
   [junit4]   2> 2479169 INFO  (qtp851899439-37626) [n:127.0.0.1:41919_solr    ] o.a.s.h.a.CollectionsHandler Invoked Collection Action :create with params collection.configName=conf&name=testNodeLost&nrtReplicas=2&action=CREATE&numShards=1&wt=javabin&version=2 and sendToOCPQueue=true
   [junit4]   2> 2479169 DEBUG (OverseerAutoScalingTriggerThread-72227982595588099-127.0.0.1:43463_solr-n_0000000000) [    ] o.a.s.c.a.OverseerTriggerThread Processed trigger updates upto znodeVersion 5
   [junit4]   2> 2479170 DEBUG (OverseerAutoScalingTriggerThread-72227982595588099-127.0.0.1:43463_solr-n_0000000000) [    ] o.a.s.c.a.NodeLostTrigger NodeLostTrigger node_lost_trigger - Initial livenodes: [127.0.0.1:43463_solr, 127.0.0.1:41919_solr]
   [junit4]   2> 2479170 DEBUG (OverseerAutoScalingTriggerThread-72227982595588099-127.0.0.1:43463_solr-n_0000000000) [    ] o.a.s.c.a.OverseerTriggerThread -- clean old nodeAdded markers
   [junit4]   2> 2479171 DEBUG (OverseerAutoScalingTriggerThread-72227982595588099-127.0.0.1:43463_solr-n_0000000000) [    ] o.a.s.c.a.OverseerTriggerThread Current znodeVersion 5, lastZnodeVersion 5
   [junit4]   2> 2479171 INFO  (OverseerThreadFactory-10512-thread-1-processing-n:127.0.0.1:43463_solr) [n:127.0.0.1:43463_solr    ] o.a.s.c.a.c.CreateCollectionCmd Create collection testNodeLost
   [junit4]   2> 2479171 DEBUG (ScheduledTrigger-10510-thread-2) [    ] o.a.s.c.a.NodeLostTrigger Running NodeLostTrigger: node_lost_trigger with currently live nodes: 2
   [junit4]   2> 2479172 DEBUG (OverseerStateUpdate-72227982595588099-127.0.0.1:43463_solr-n_0000000000) [n:127.0.0.1:43463_solr    ] o.a.s.c.Overseer processMessage: queueSize: 2, message = {
   [junit4]   2>   "name":"testNodeLost",
   [junit4]   2>   "fromApi":"true",
   [junit4]   2>   "collection.configName":"conf",
   [junit4]   2>   "numShards":"1",
   [junit4]   2>   "nrtReplicas":"2",
   [junit4]   2>   "stateFormat":"2",
   [junit4]   2>   "replicationFactor":"2",
   [junit4]   2>   "operation":"create"} current state version: 0
   [junit4]   2> 2479172 DEBUG (OverseerStateUpdate-72227982595588099-127.0.0.1:43463_solr-n_0000000000) [n:127.0.0.1:43463_solr    ] o.a.s.c.o.ClusterStateMutator building a new cName: testNodeLost
   [junit4]   2> 2479172 DEBUG (OverseerStateUpdate-72227982595588099-127.0.0.1:43463_solr-n_0000000000) [n:127.0.0.1:43463_solr    ] o.a.s.c.o.ZkStateWriter going to create_collection /collections/testNodeLost/state.json
   [junit4]   2> 2479275 INFO  (qtp1704173023-37578) [n:127.0.0.1:43463_solr    ] o.a.s.s.HttpSolrCall [admin] webapp=null path=/admin/metrics params={prefix=CONTAINER.fs.usableSpace,CONTAINER.fs.totalSpace,CORE.coreName&wt=javabin&version=2&group=solr.node,solr.core} status=0 QTime=0
   [junit4]   2> 2479282 INFO  (qtp851899439-37627) [n:127.0.0.1:41919_solr    ] o.a.s.s.HttpSolrCall [admin] webapp=null path=/admin/metrics params={prefix=CONTAINER.fs.usableSpace,CONTAINER.fs.totalSpace,CORE.coreName&wt=javabin&version=2&group=solr.node,solr.core} status=0 QTime=0
   [junit4]   2> 2479284 INFO  (OverseerThreadFactory-10512-thread-1-processing-n:127.0.0.1:43463_solr) [n:127.0.0.1:43463_solr    ] o.a.s.c.s.c.a.PolicyHelper returnSession, curr-time 2599923799 sessionWrapper.createTime 2599923798212388, this.sessionWrapper.createTime 2599923798212388 
   [junit4]   2> 2479285 DEBUG (OverseerStateUpdate-72227982595588099-127.0.0.1:43463_solr-n_0000000000) [n:127.0.0.1:43463_solr    ] o.a.s.c.Overseer processMessage: queueSize: 1, message = {
   [junit4]   2>   "operation":"ADDREPLICA",
   [junit4]   2>   "collection":"testNodeLost",
   [junit4]   2>   "shard":"shard1",
   [junit4]   2>   "core":"testNodeLost_shard1_replica_n1",
   [junit4]   2>   "state":"down",
   [junit4]   2>   "base_url":"https://127.0.0.1:41919/solr",
   [junit4]   2>   "type":"NRT",
   [junit4]   2>   "waitForFinalState":"false"} current state version: 0
   [junit4]   2> 2479286 INFO  (OverseerStateUpdate-72227982595588099-127.0.0.1:43463_solr-n_0000000000) [n:127.0.0.1:43463_solr    ] o.a.s.c.o.SliceMutator createReplica() {
   [junit4]   2>   "operation":"ADDREPLICA",
   [junit4]   2>   "collection":"testNodeLost",
   [junit4]   2>   "shard":"shard1",
   [junit4]   2>   "core":"testNodeLost_shard1_replica_n1",
   [junit4]   2>   "state":"down",
   [junit4]   2>   "base_url":"https://127.0.0.1:41919/solr",
   [junit4]   2>   "type":"NRT",
   [junit4]   2>   "waitForFinalState":"false"} 
   [junit4]   2> 2479286 DEBUG (OverseerStateUpdate-72227982595588099-127.0.0.1:43463_solr-n_0000000000) [n:127.0.0.1:43463_solr    ] o.a.s.c.o.SliceMutator Old Slice: shard1:{
   [junit4]   2>   "range":"80000000-7fffffff",
   [junit4]   2>   "state":"active",
   [junit4]   2>   "replicas":{}}
   [junit4]   2> 2479286 DEBUG (OverseerStateUpdate-72227982595588099-127.0.0.1:43463_solr-n_0000000000) [n:127.0.0.1:43463_solr    ] o.a.s.c.o.SliceMutator New Slice: shard1:{
   [junit4]   2>   "range":"80000000-7fffffff",
   [junit4]   2>   "state":"active",
   [junit4]   2>   "replicas":{"core_node3":{
   [junit4]   2>       "core":"testNodeLost_shard1_replica_n1",
   [junit4]   2>       "base_url":"https://127.0.0.1:41919/solr",
   [junit4]   2>       "state":"down",
   [junit4]   2>       "node_name":null,
   [junit4]   2>       "type":"NRT"}}}
   [junit4]   2> 2479286 DEBUG (OverseerStateUpdate-72227982595588099-127.0.0.1:43463_solr-n_0000000000) [n:127.0.0.1:43463_solr    ] o.a.s.c.Overseer processMessage: queueSize: 2, message = {
   [junit4]   2>   "operation":"ADDREPLICA",
   [junit4]   2>   "collection":"testNodeLost",
   [junit4]   2>   "shard":"shard1",
   [junit4]   2>   "core":"testNodeLost_shard1_replica_n2",
   [junit4]   2>   "state":"down",
   [junit4]   2>   "base_url":"https://127.0.0.1:43463/solr",
   [junit4]   2>   "type":"NRT",
   [junit4]   2>   "waitForFinalState":"false"} current state version: 0
   [junit4]   2> 2479286 INFO  (OverseerStateUpdate-72227982595588099-127.0.0.1:43463_solr-n_0000000000) [n:127.0.0.1:43463_solr    ] o.a.s.c.o.SliceMutator createReplica() {
   [junit4]   2>   "operation":"ADDREPLICA",
   [junit4]   2>   "collection":"testNodeLost",
   [junit4]   2>   "shard":"shard1",
   [junit4]   2>   "core":"testNodeLost_shard1_replica_n2",
   [junit4]   2>   "state":"down",
   [junit4]   2>   "base_url":"https://127.0.0.1:43463/solr",
   [junit4]   2>   "type":"NRT",
   [junit4]   2>   "waitForFinalState":"false"} 
   [junit4]   2> 2479287 DEBUG (OverseerStateUpdate-72227982595588099-127.0.0.1:43463_solr-n_0000000000) [n:127.0.0.1:43463_solr    ] o.a.s.c.o.SliceMutator Old Slice: shard1:{
   [junit4]   2>   "range":"80000000-7fffffff",
   [junit4]   2>   "state":"active",
   [junit4]   2>   "replicas":{"core_node3":{
   [junit4]   2>       "core":"testNodeLost_shard1_replica_n1",
   [junit4]   2>       "base_url":"https://127.0.0.1:41919/solr",
   [junit4]   2>       "state":"down",
   [junit4]   2>       "node_name":null,
   [junit4]   2>       "type":"NRT"}}}
   [junit4]   2> 2479287 DEBUG (OverseerStateUpdate-72227982595588099-127.0.0.1:43463_solr-n_0000000000) [n:127.0.0.1:43463_solr    ] o.a.s.c.o.SliceMutator New Slice: shard1:{
   [junit4]   2>   "range":"80000000-7fffffff",
   [junit4]   2>   "state":"active",
   [junit4]   2>   "replicas":{
   [junit4]   2>     "core_node3":{
   [junit4]   2>       "core":"testNodeLost_shard1_replica_n1",
   [junit4]   2>       "base_url":"https://127.0.0.1:41919/solr",
   [junit4]   2>       "state":"down",
   [junit4]   2>       "node_name":null,
   [junit4]   2>       "type":"NRT"},
   [junit4]   2>     "core_node4":{
   [junit4]   2>       "core":"testNodeLost_shard1_replica_n2",
   [junit4]   2>       "base_url":"https://127.0.0.1:43463/solr",
   [junit4]   2>       "state":"down",
   [junit4]   2>       "node_name":null,
   [junit4]   2>       "type":"NRT"}}}
   [junit4]   2> 2479387 DEBUG (OverseerStateUpdate-72227982595588099-127.0.0.1:43463_solr-n_0000000000) [n:127.0.0.1:43463_solr    ] o.a.s.c.o.ZkStateWriter going to update_collection /collections/testNodeLost/state.json version: 0
   [junit4]   2> 2479495 INFO  (qtp851899439-37627) [n:127.0.0.1:41919_solr    x:testNodeLost_shard1_replica_n1] o.a.s.h.a.CoreAdminOperation core create command qt=/admin/cores&coreNodeName=core_node3&collection.configName=conf&newCollection=true&name=testNodeLost_shard1_replica_n1&action=CREATE&numShards=1&collection=testNodeLost&shard=shard1&wt=javabin&version=2&replicaType=NRT
   [junit4]   2> 2479495 INFO  (qtp1704173023-37578) [n:127.0.0.1:43463_solr    x:testNodeLost_shard1_replica_n2] o.a.s.h.a.CoreAdminOperation core create command qt=/admin/cores&coreNodeName=core_node4&collection.configName=conf&newCollection=true&name=testNodeLost_shard1_replica_n2&action=CREATE&numShards=1&collection=testNodeLost&shard=shard1&wt=javabin&version=2&replicaType=NRT
   [junit4]   2> 2479495 INFO  (qtp1704173023-37578) [n:127.0.0.1:43463_solr    x:testNodeLost_shard1_replica_n2] o.a.s.c.TransientSolrCoreCacheDefault Allocating transient cache for 2147483647 transient cores
   [junit4]   2> 2479498 DEBUG (OverseerStateUpdate-72227982595588099-127.0.0.1:43463_solr-n_0000000000) [n:127.0.0.1:43463_solr    ] o.a.s.c.Overseer processMessage: queueSize: 2, message = {
   [junit4]   2>   "core":"testNodeLost_shard1_replica_n2",
   [junit4]   2>   "core_node_name":"core_node4",
   [junit4]   2>   "roles":null,
   [junit4]   2>   "base_url":"https://127.0.0.1:43463/solr",
   [junit4]   2>   "node_name":"127.0.0.1:43463_solr",
   [junit4]   2>   "numShards":"1",
   [junit4]   2>   "state":"down",
   [junit4]   2>   "shard":"shard1",
   [junit4]   2>   "collection":"testNodeLost",
   [junit4]   2>   "type":"NRT",
   [junit4]   2>   "force_set_state":"false",
   [junit4]   2>   "operation":"state"} current state version: 0
   [junit4]   2> 2479498 DEBUG (OverseerStateUpdate-72227982595588099-127.0.0.1:43463_solr-n_0000000000) [n:127.0.0.1:43463_solr    ] o.a.s.c.o.ReplicaMutator Update state numShards=1 message={
   [junit4]   2>   "core":"testNodeLost_shard1_replica_n2",
   [junit4]   2>   "core_node_name":"core_node4",
   [junit4]   2>   "roles":null,
   [junit4]   2>   "base_url":"https://127.0.0.1:43463/solr",
   [junit4]   2>   "node_name":"127.0.0.1:43463_solr",
   [junit4]   2>   "numShards":"1",
   [junit4]   2>   "state":"down",
   [junit4]   2>   "shard":"shard1",
   [junit4]   2>   "collection":"testNodeLost",
   [junit4]   2>   "type":"NRT",
   [junit4]   2>   "force_set_state":"false",
   [junit4]   2>   "operation":"state"}
   [junit4]   2> 2479498 DEBUG (OverseerStateUpdate-72227982595588099-127.0.0.1:43463_solr-n_0000000000) [n:127.0.0.1:43463_solr    ] o.a.s.c.o.ReplicaMutator Will update state for replica: core_node4:{"core":"testNodeLost_shard1_replica_n2","base_url":"https://127.0.0.1:43463/solr","node_name":"127.0.0.1:43463_solr","state":"down","type":"NRT","force_set_state":"false"}
   [junit4]   2> 2479498 DEBUG (OverseerStateUpdate-72227982595588099-127.0.0.1:43463_solr-n_0000000000) [n:127.0.0.1:43463_solr    ] o.a.s.c.o.ReplicaMutator Collection is now: DocCollection(testNodeLost//collections/testNodeLost/state.json/1)={
   [junit4]   2>   "pullReplicas":"0",
   [junit4]   2>   "replicationFactor":"2",
   [junit4]   2>   "router":{"name":"compositeId"},
   [junit4]   2>   "maxShardsPerNode":"1",
   [junit4]   2>   "autoAddReplicas":"false",
   [junit4]   2>   "nrtReplicas":"2",
   [junit4]   2>   "tlogReplicas":"0",
   [junit4]   2>   "shards":{"shard1":{
   [junit4]   2>       "range":"80000000-7fffffff",
   [junit4]   2>       "state":"active",
   [junit4]   2>       "replicas":{
   [junit4]   2>         "core_node3":{
   [junit4]   2>           "core":"testNodeLost_shard1_replica_n1",
   [junit4]   2>           "base_url":"https://127.0.0.1:41919/solr",
   [junit4]   2>           "state":"down",
   [junit4]   2>           "node_name":null,
   [junit4]   2>           "type":"NRT"},
   [junit4]   2>         "core_node4":{
   [junit4]   2>           "core":"testNodeLost_shard1_replica_n2",
   [junit4]   2>           "base_url":"https://127.0.0.1:43463/solr",
   [junit4]   2>           "node_name":"127.0.0.1:43463_solr",
   [junit4]   2>           "state":"down",
   [junit4]   2>           "type":"NRT",
   [junit4]   2>           "force_set_state":"false"}}}}}
   [junit4]   2> 2479498 DEBUG (OverseerStateUpdate-72227982595588099-127.0.0.1:43463_solr-n_0000000000) [n:127.0.0.1:43463_solr    ] o.a.s.c.Overseer processMessage: queueSize: 2, message = {
   [junit4]   2>   "core":"testNodeLost_shard1_replica_n1",
   [junit4]   2>   "core_node_name":"core_node3",
   [junit4]   2>   "roles":null,
   [junit4]   2>   "base_url":"https://127.0.0.1:41919/solr",
   [junit4]   2>   "node_name":"127.0.0.1:41919_solr",
   [junit4]   2>   "numShards":"1",
   [junit4]   2>   "state":"down",
   [junit4]   2>   "shard":"shard1",
   [junit4]   2>   "collection":"testNodeLost",
   [junit4]   2>   "type":"NRT",
   [junit4]   2>   "force_set_state":"false",
   [junit4]   2>   "operation":"state"} current state version: 0
   [junit4]   2> 2479498 DEBUG (OverseerStateUpdate-72227982595588099-127.0.0.1:43463_solr-n_0000000000) [n:127.0.0.1:43463_solr    ] o.a.s.c.o.ReplicaMutator Update state numShards=1 message={
   [junit4]   2>   "core":"testNodeLost_shard1_replica_n1",
   [junit4]   2>   "core_node_name":"core_node3",
   [junit4]   2>   "roles":null,
   [junit4]   2>   "base_url":"https://127.0.0.1:41919/solr",
   [junit4]   2>   "node_name":"127.0.0.1:41919_solr",
   [junit4]   2>   "numShards":"1",
   [junit4]   2>   "state":"down",
   [junit4]   2>   "shard":"shard1",
   [junit4]   2>   "collection":"testNodeLost",
   [junit4]   2>   "type":"NRT",
   [junit4]   2>   "force_set_state":"false",
   [junit4]   2>   "operation":"state"}
   [junit4]   2> 2479498 DEBUG (OverseerStateUpdate-72227982595588099-127.0.0.1:43463_solr-n_0000000000) [n:127.0.0.1:43463_solr    ] o.a.s.c.o.ReplicaMutator Will update state for replica: core_node3:{"core":"testNodeLost_shard1_replica_n1","base_url":"https://127.0.0.1:41919/solr","node_name":"127.0.0.1:41919_solr","state":"down","type":"NRT","force_set_state":"false"}
   [junit4]   2> 2479498 DEBUG (OverseerStateUpdate-72227982595588099-127.0.0.1:43463_solr-n_0000000000) [n:127.0.0.1:43463_solr    ] o.a.s.c.o.ReplicaMutator Collection is now: DocCollection(testNodeLost//collections/testNodeLost/state.json/1)={
   [junit4]   2>   "pullReplicas":"0",
   [junit4]   2>   "replicationFactor":"2",
   [junit4]   2>   "router":{"name":"compositeId"},
   [junit4]   2>   "maxShardsPerNode":"1",
   [junit4]   2>   "autoAddReplicas":"false",
   [junit4]   2>   "nrtReplicas":"2",
   [junit4]   2>   "tlogReplicas":"0",
   [junit4]   2>   "shards":{"shard1":{
   [junit4]   2>       "range":"80000000-7fffffff",
   [junit4]   2>       "state":"active",
   [junit4]   2>       "replicas":{
   [junit4]   2>         "core_node3":{
   [junit4]   2>           "core":"testNodeLost_shard1_replica_n1",
   [junit4]   2>           "base_url":"https://127.0.0.1:41919/solr",
   [junit4]   2>           "node_name":"127.0.0.1:41919_solr",
   [junit4]   2>           "state":"down",
   [junit4]   2>           "type":"NRT",
   [junit4]   2>           "force_set_state":"false"},
   [junit4]   2>         "core_node4":{
   [junit4]   2>           "core":"testNodeLost_shard1_replica_n2",
   [junit4]   2>           "base_url":"https://127.0.0.1:43463/solr",
   [junit4]   2>           "node_name":"127.0.0.1:43463_solr",
   [junit4]   2>           "state":"down",
   [junit4]   2>           "type":"NRT",
   [junit4]   2>           "force_set_state":"false"}}}}}
   [junit4]   2> 2479599 DEBUG (OverseerStateUpdate-72227982595588099-127.0.0.1:43463_solr-n_0000000000) [n:127.0.0.1:43463_solr    ] o.a.s.c.o.ZkStateWriter going to update_collection /collections/testNodeLost/state.json version: 1
   [junit4]  

[...truncated too long message...]

.1:39945_solr c:testSelected2 s:shard2 r:core_node7 x:testSelected2_shard2_replica_n4] o.a.s.m.SolrMetricManager Closing metric reporters for registry=solr.collection.testSelected2.shard2.leader, tag=6e83d62c
   [junit4]   2> 2055570 INFO  (jetty-closer-2075-thread-3) [    ] o.e.j.s.h.ContextHandler Stopped o.e.j.s.ServletContextHandler@36b075ac{/solr,null,UNAVAILABLE}
   [junit4]   2> 2055571 INFO  (jetty-closer-2075-thread-3) [    ] o.e.j.s.session node0 Stopped scavenging
   [junit4]   2> 2055574 ERROR (SUITE-ComputePlanActionTest-seed#[16F3679107374147]-worker) [    ] o.a.z.s.ZooKeeperServer ZKShutdownHandler is not registered, so ZooKeeper server won't take any action on ERROR or SHUTDOWN server state changes
   [junit4]   2> 2055574 INFO  (SUITE-ComputePlanActionTest-seed#[16F3679107374147]-worker) [    ] o.a.s.c.ZkTestServer connecting to 127.0.0.1:44745 44745
   [junit4]   2> 2055696 INFO  (Thread-1101) [    ] o.a.s.c.ZkTestServer connecting to 127.0.0.1:44745 44745
   [junit4]   2> 2055696 WARN  (Thread-1101) [    ] o.a.s.c.ZkTestServer Watch limit violations: 
   [junit4]   2> Maximum concurrent create/delete watches above limit:
   [junit4]   2> 
   [junit4]   2> 	38	/solr/aliases.json
   [junit4]   2> 	17	/solr/configs/conf
   [junit4]   2> 	15	/solr/security.json
   [junit4]   2> 	9	/solr/collections/testNodeWithMultipleReplicasLost/terms/shard2
   [junit4]   2> 	9	/solr/collections/testNodeWithMultipleReplicasLost/terms/shard1
   [junit4]   2> 	8	/solr/collections/testNodeLostTriggerWithDeleteNodePreferredOp_0/terms/shard3
   [junit4]   2> 	7	/solr/collections/testNodeLostTriggerWithDeleteNodePreferredOp_0/terms/shard2
   [junit4]   2> 	6	/solr/collections/testNodeLost/terms/shard1
   [junit4]   2> 	6	/solr/collections/testSelected2/terms/shard2
   [junit4]   2> 	6	/solr/collections/testNodeAddedTriggerWithAddReplicaPreferredOp_2Shard_2/terms/shard1
   [junit4]   2> 	5	/solr/collections/testNodeAddedTriggerWithAddReplicaPreferredOp_1Shard_1/terms/shard1
   [junit4]   2> 	5	/solr/collections/testNodeAddedTriggerWithAddReplicaPreferredOp_1Shard_3/terms/shard1
   [junit4]   2> 	5	/solr/collections/testNodeAddedTriggerWithAddReplicaPreferredOp_2Shard_3/terms/shard2
   [junit4]   2> 	5	/solr/collections/testNodeAddedTriggerWithAddReplicaPreferredOp_2Shard_4/terms/shard1
   [junit4]   2> 	5	/solr/collections/testNodeAddedTriggerWithAddReplicaPreferredOp_2Shard_3/terms/shard1
   [junit4]   2> 	5	/solr/collections/testNodeAddedTriggerWithAddReplicaPreferredOp_2Shard_4/terms/shard2
   [junit4]   2> 	5	/solr/collections/testSelected1/terms/shard2
   [junit4]   2> 	5	/solr/collections/testSelected2/terms/shard1
   [junit4]   2> 	5	/solr/collections/testSelected1/terms/shard1
   [junit4]   2> 	5	/solr/collections/testSelected3/terms/shard2
   [junit4]   2> 	5	/solr/collections/testSelected3/terms/shard1
   [junit4]   2> 	5	/solr/collections/testNodeAddedTriggerWithAddReplicaPreferredOp_2Shard_1/terms/shard1
   [junit4]   2> 	5	/solr/collections/testNodeAddedTriggerWithAddReplicaPreferredOp_2Shard_1/terms/shard2
   [junit4]   2> 	5	/solr/collections/testNodeAddedTriggerWithAddReplicaPreferredOp_2Shard_2/terms/shard2
   [junit4]   2> 	5	/solr/collections/testNodeAddedTriggerWithAddReplicaPreferredOp_1Shard_4/terms/shard1
   [junit4]   2> 	5	/solr/collections/testNodeAddedTriggerWithAddReplicaPreferredOp_1Shard_2/terms/shard1
   [junit4]   2> 	3	/solr/collections/testNodeLostTriggerWithDeleteNodePreferredOp_0/terms/shard1
   [junit4]   2> 	3	/solr/collections/testNodeAdded/terms/shard1
   [junit4]   2> 	2	/solr/collections/testNodeAddedTriggerWithAddReplicaPreferredOp_2Shard_0/terms/shard2
   [junit4]   2> 	2	/solr/collections/testNodeAddedTriggerWithAddReplicaPreferredOp_2Shard_0/terms/shard1
   [junit4]   2> 	2	/solr/collections/testNodeAddedTriggerWithAddReplicaPreferredOp_1Shard_0/terms/shard1
   [junit4]   2> 
   [junit4]   2> Maximum concurrent data watches above limit:
   [junit4]   2> 
   [junit4]   2> 	38	/solr/clusterstate.json
   [junit4]   2> 	38	/solr/clusterprops.json
   [junit4]   2> 	28	/solr/aliases.json
   [junit4]   2> 	7	/solr/autoscaling.json
   [junit4]   2> 	7	/solr/collections/testNodeWithMultipleReplicasLost/state.json
   [junit4]   2> 	7	/solr/collections/testNodeLostTriggerWithDeleteNodePreferredOp_0/state.json
   [junit4]   2> 	6	/solr/collections/testNodeAddedTriggerWithAddReplicaPreferredOp_2Shard_1/state.json
   [junit4]   2> 	6	/solr/collections/testNodeAddedTriggerWithAddReplicaPreferredOp_2Shard_2/state.json
   [junit4]   2> 	5	/solr/collections/testSelected1/state.json
   [junit4]   2> 	5	/solr/collections/testNodeAddedTriggerWithAddReplicaPreferredOp_2Shard_4/state.json
   [junit4]   2> 	5	/solr/collections/testSelected3/state.json
   [junit4]   2> 	5	/solr/collections/testNodeAddedTriggerWithAddReplicaPreferredOp_2Shard_3/state.json
   [junit4]   2> 	5	/solr/collections/testSelected2/state.json
   [junit4]   2> 	4	/solr/collections/testNodeAdded/state.json
   [junit4]   2> 	4	/solr/collections/testNodeAddedTriggerWithAddReplicaPreferredOp_2Shard_0/state.json
   [junit4]   2> 	3	/solr/collections/testNodeAddedTriggerWithAddReplicaPreferredOp_1Shard_4/state.json
   [junit4]   2> 	3	/solr/collections/testNodeAddedTriggerWithAddReplicaPreferredOp_1Shard_1/state.json
   [junit4]   2> 	3	/solr/collections/testNodeLost/state.json
   [junit4]   2> 	3	/solr/collections/testNodeAddedTriggerWithAddReplicaPreferredOp_1Shard_2/state.json
   [junit4]   2> 	3	/solr/collections/testNodeAddedTriggerWithAddReplicaPreferredOp_1Shard_3/state.json
   [junit4]   2> 	3	/solr/overseer_elect/election/72228229799608337-127.0.0.1:39281_solr-n_0000000003
   [junit4]   2> 	2	/solr/collections/testNodeWithMultipleReplicasLost/leader_elect/shard1/election/72228229799608329-core_node3-n_0000000000
   [junit4]   2> 	2	/solr/overseer_elect/election/72228229799608373-127.0.0.1:40753_solr-n_0000000011
   [junit4]   2> 	2	/solr/overseer_elect/election/72228229799608357-127.0.0.1:35603_solr-n_0000000007
   [junit4]   2> 	2	/solr/collections/testNodeAddedTriggerWithAddReplicaPreferredOp_1Shard_0/state.json
   [junit4]   2> 	2	/solr/overseer_elect/election/72228229799608329-127.0.0.1:46439_solr-n_0000000001
   [junit4]   2> 
   [junit4]   2> Maximum concurrent children watches above limit:
   [junit4]   2> 
   [junit4]   2> 	170	/solr/collections
   [junit4]   2> 	130	/solr/live_nodes
   [junit4]   2> 	7	/solr/overseer/queue
   [junit4]   2> 	7	/solr/autoscaling/events/.scheduled_maintenance
   [junit4]   2> 	7	/solr/autoscaling/events/.auto_add_replicas
   [junit4]   2> 	7	/solr/overseer/queue-work
   [junit4]   2> 	7	/solr/overseer/collection-queue-work
   [junit4]   2> 	2	/solr/autoscaling/events/node_lost_trigger
   [junit4]   2> 
   [junit4]   2> NOTE: leaving temporary files on disk at: /home/jenkins/workspace/Lucene-Solr-master-Linux/solr/build/solr-core/test/J2/temp/solr.cloud.autoscaling.ComputePlanActionTest_16F3679107374147-003
   [junit4]   2> Sep 15, 2018 10:42:37 AM com.carrotsearch.randomizedtesting.ThreadLeakControl checkThreadLeaks
   [junit4]   2> WARNING: Will linger awaiting termination of 1 leaked thread(s).
   [junit4]   2> NOTE: test params are: codec=Asserting(Lucene80): {}, docValues:{}, maxPointsInLeafNode=737, maxMBSortInHeap=6.1802075570813955, sim=Asserting(org.apache.lucene.search.similarities.AssertingSimilarity@69c1ae25), locale=xog-UG, timezone=Asia/Macau
   [junit4]   2> NOTE: Linux 4.15.0-32-generic amd64/Oracle Corporation 11 (64-bit)/cpus=8,threads=1,free=130606016,total=518979584
   [junit4]   2> NOTE: All tests run in this JVM: [CdcrBootstrapTest, CdcrBootstrapTest, ComputePlanActionTest, ComputePlanActionTest, CdcrOpsAndBoundariesTest, CdcrBootstrapTest, CdcrBootstrapTest, CdcrBootstrapTest, ComputePlanActionTest]
   [junit4] Completed [13/15 (5!)] on J2 in 140.04s, 7 tests, 1 failure <<< FAILURES!

[...truncated 44 lines...]
BUILD FAILED
/home/jenkins/workspace/Lucene-Solr-master-Linux/lucene/common-build.xml:1567: The following error occurred while executing this line:
/home/jenkins/workspace/Lucene-Solr-master-Linux/lucene/common-build.xml:1092: There were test failures: 15 suites, 80 tests, 8 failures [seed: 16F3679107374147]

Total time: 39 minutes 25 seconds

[repro] Setting last failure code to 256

[repro] Failures:
[repro]   0/5 failed: org.apache.solr.cloud.cdcr.CdcrBootstrapTest
[repro]   0/5 failed: org.apache.solr.cloud.cdcr.CdcrOpsAndBoundariesTest
[repro]   5/5 failed: org.apache.solr.cloud.autoscaling.ComputePlanActionTest
[repro] Exiting with code 256
+ mv lucene/build lucene/build.repro
+ mv solr/build solr/build.repro
+ mv lucene/build.orig lucene/build
+ mv solr/build.orig solr/build
Archiving artifacts
Setting ANT_1_8_2_HOME=/var/lib/jenkins/tools/hudson.tasks.Ant_AntInstallation/ANT_1.8.2
[WARNINGS] Parsing warnings in console log with parser Java Compiler (javac)
Setting ANT_1_8_2_HOME=/var/lib/jenkins/tools/hudson.tasks.Ant_AntInstallation/ANT_1.8.2
Setting ANT_1_8_2_HOME=/var/lib/jenkins/tools/hudson.tasks.Ant_AntInstallation/ANT_1.8.2
<Git Blamer> Using GitBlamer to create author and commit information for all warnings.
<Git Blamer> GIT_COMMIT=39733cbf5ff9d8587d418007bd13087a434a1aa2, workspace=/var/lib/jenkins/workspace/Lucene-Solr-master-Linux
[WARNINGS] Computing warning deltas based on reference build #22860
Recording test results
Setting ANT_1_8_2_HOME=/var/lib/jenkins/tools/hudson.tasks.Ant_AntInstallation/ANT_1.8.2
Build step 'Publish JUnit test result report' changed build result to UNSTABLE
Email was triggered for: Unstable (Test Failures)
Sending email for trigger: Unstable (Test Failures)
Setting ANT_1_8_2_HOME=/var/lib/jenkins/tools/hudson.tasks.Ant_AntInstallation/ANT_1.8.2
Setting ANT_1_8_2_HOME=/var/lib/jenkins/tools/hudson.tasks.Ant_AntInstallation/ANT_1.8.2
Setting ANT_1_8_2_HOME=/var/lib/jenkins/tools/hudson.tasks.Ant_AntInstallation/ANT_1.8.2
Setting ANT_1_8_2_HOME=/var/lib/jenkins/tools/hudson.tasks.Ant_AntInstallation/ANT_1.8.2

Mime
View raw message