lucene-dev mailing list archives

Site index · List index
Message view « Date » · « Thread »
Top « Date » · « Thread »
From Policeman Jenkins Server <jenk...@thetaphi.de>
Subject [JENKINS] Lucene-Solr-7.x-Linux (64bit/jdk-11) - Build # 2827 - Still Unstable!
Date Sat, 29 Sep 2018 10:16:06 GMT
Build: https://jenkins.thetaphi.de/job/Lucene-Solr-7.x-Linux/2827/
Java: 64bit/jdk-11 -XX:+UseCompressedOops -XX:+UseG1GC

10 tests failed.
FAILED:  org.apache.solr.cloud.rule.RulesTest.testPortRuleInPresenceOfClusterPolicy

Error Message:
Could not find collection : portRuleColl2

Stack Trace:
org.apache.solr.common.SolrException: Could not find collection : portRuleColl2
	at __randomizedtesting.SeedInfo.seed([60E535E50EE90E50:D9CDB965B9304418]:0)
	at org.apache.solr.common.cloud.ClusterState.getCollection(ClusterState.java:118)
	at org.apache.solr.cloud.SolrCloudTestCase.getCollectionState(SolrCloudTestCase.java:258)
	at org.apache.solr.cloud.rule.RulesTest.testPortRuleInPresenceOfClusterPolicy(RulesTest.java:119)
	at java.base/jdk.internal.reflect.NativeMethodAccessorImpl.invoke0(Native Method)
	at java.base/jdk.internal.reflect.NativeMethodAccessorImpl.invoke(NativeMethodAccessorImpl.java:62)
	at java.base/jdk.internal.reflect.DelegatingMethodAccessorImpl.invoke(DelegatingMethodAccessorImpl.java:43)
	at java.base/java.lang.reflect.Method.invoke(Method.java:566)
	at com.carrotsearch.randomizedtesting.RandomizedRunner.invoke(RandomizedRunner.java:1742)
	at com.carrotsearch.randomizedtesting.RandomizedRunner$8.evaluate(RandomizedRunner.java:935)
	at com.carrotsearch.randomizedtesting.RandomizedRunner$9.evaluate(RandomizedRunner.java:971)
	at com.carrotsearch.randomizedtesting.RandomizedRunner$10.evaluate(RandomizedRunner.java:985)
	at org.junit.rules.ExpectedException$ExpectedExceptionStatement.evaluate(ExpectedException.java:110)
	at com.carrotsearch.randomizedtesting.rules.SystemPropertiesRestoreRule$1.evaluate(SystemPropertiesRestoreRule.java:57)
	at org.apache.lucene.util.TestRuleSetupTeardownChained$1.evaluate(TestRuleSetupTeardownChained.java:49)
	at org.apache.lucene.util.AbstractBeforeAfterRule$1.evaluate(AbstractBeforeAfterRule.java:45)
	at org.apache.lucene.util.TestRuleThreadAndTestName$1.evaluate(TestRuleThreadAndTestName.java:48)
	at org.apache.lucene.util.TestRuleIgnoreAfterMaxFailures$1.evaluate(TestRuleIgnoreAfterMaxFailures.java:64)
	at org.apache.lucene.util.TestRuleMarkFailure$1.evaluate(TestRuleMarkFailure.java:47)
	at com.carrotsearch.randomizedtesting.rules.StatementAdapter.evaluate(StatementAdapter.java:36)
	at com.carrotsearch.randomizedtesting.ThreadLeakControl$StatementRunner.run(ThreadLeakControl.java:368)
	at com.carrotsearch.randomizedtesting.ThreadLeakControl.forkTimeoutingTask(ThreadLeakControl.java:817)
	at com.carrotsearch.randomizedtesting.ThreadLeakControl$3.evaluate(ThreadLeakControl.java:468)
	at com.carrotsearch.randomizedtesting.RandomizedRunner.runSingleTest(RandomizedRunner.java:944)
	at com.carrotsearch.randomizedtesting.RandomizedRunner$5.evaluate(RandomizedRunner.java:830)
	at com.carrotsearch.randomizedtesting.RandomizedRunner$6.evaluate(RandomizedRunner.java:880)
	at com.carrotsearch.randomizedtesting.RandomizedRunner$7.evaluate(RandomizedRunner.java:891)
	at com.carrotsearch.randomizedtesting.rules.StatementAdapter.evaluate(StatementAdapter.java:36)
	at com.carrotsearch.randomizedtesting.rules.SystemPropertiesRestoreRule$1.evaluate(SystemPropertiesRestoreRule.java:57)
	at org.apache.lucene.util.AbstractBeforeAfterRule$1.evaluate(AbstractBeforeAfterRule.java:45)
	at com.carrotsearch.randomizedtesting.rules.StatementAdapter.evaluate(StatementAdapter.java:36)
	at org.apache.lucene.util.TestRuleStoreClassName$1.evaluate(TestRuleStoreClassName.java:41)
	at com.carrotsearch.randomizedtesting.rules.NoShadowingOrOverridesOnMethodsRule$1.evaluate(NoShadowingOrOverridesOnMethodsRule.java:40)
	at com.carrotsearch.randomizedtesting.rules.NoShadowingOrOverridesOnMethodsRule$1.evaluate(NoShadowingOrOverridesOnMethodsRule.java:40)
	at com.carrotsearch.randomizedtesting.rules.StatementAdapter.evaluate(StatementAdapter.java:36)
	at com.carrotsearch.randomizedtesting.rules.StatementAdapter.evaluate(StatementAdapter.java:36)
	at org.apache.lucene.util.TestRuleAssertionsRequired$1.evaluate(TestRuleAssertionsRequired.java:53)
	at org.apache.lucene.util.TestRuleMarkFailure$1.evaluate(TestRuleMarkFailure.java:47)
	at org.apache.lucene.util.TestRuleIgnoreAfterMaxFailures$1.evaluate(TestRuleIgnoreAfterMaxFailures.java:64)
	at org.apache.lucene.util.TestRuleIgnoreTestSuites$1.evaluate(TestRuleIgnoreTestSuites.java:54)
	at com.carrotsearch.randomizedtesting.rules.StatementAdapter.evaluate(StatementAdapter.java:36)
	at com.carrotsearch.randomizedtesting.ThreadLeakControl$StatementRunner.run(ThreadLeakControl.java:368)
	at java.base/java.lang.Thread.run(Thread.java:834)


FAILED:  org.apache.solr.cloud.rule.RulesTest.testPortRuleInPresenceOfClusterPolicy

Error Message:
Could not find collection : portRuleColl2

Stack Trace:
org.apache.solr.common.SolrException: Could not find collection : portRuleColl2
	at __randomizedtesting.SeedInfo.seed([60E535E50EE90E50:D9CDB965B9304418]:0)
	at org.apache.solr.common.cloud.ClusterState.getCollection(ClusterState.java:118)
	at org.apache.solr.cloud.SolrCloudTestCase.getCollectionState(SolrCloudTestCase.java:258)
	at org.apache.solr.cloud.rule.RulesTest.testPortRuleInPresenceOfClusterPolicy(RulesTest.java:119)
	at java.base/jdk.internal.reflect.NativeMethodAccessorImpl.invoke0(Native Method)
	at java.base/jdk.internal.reflect.NativeMethodAccessorImpl.invoke(NativeMethodAccessorImpl.java:62)
	at java.base/jdk.internal.reflect.DelegatingMethodAccessorImpl.invoke(DelegatingMethodAccessorImpl.java:43)
	at java.base/java.lang.reflect.Method.invoke(Method.java:566)
	at com.carrotsearch.randomizedtesting.RandomizedRunner.invoke(RandomizedRunner.java:1742)
	at com.carrotsearch.randomizedtesting.RandomizedRunner$8.evaluate(RandomizedRunner.java:935)
	at com.carrotsearch.randomizedtesting.RandomizedRunner$9.evaluate(RandomizedRunner.java:971)
	at com.carrotsearch.randomizedtesting.RandomizedRunner$10.evaluate(RandomizedRunner.java:985)
	at org.junit.rules.ExpectedException$ExpectedExceptionStatement.evaluate(ExpectedException.java:110)
	at com.carrotsearch.randomizedtesting.rules.SystemPropertiesRestoreRule$1.evaluate(SystemPropertiesRestoreRule.java:57)
	at org.apache.lucene.util.TestRuleSetupTeardownChained$1.evaluate(TestRuleSetupTeardownChained.java:49)
	at org.apache.lucene.util.AbstractBeforeAfterRule$1.evaluate(AbstractBeforeAfterRule.java:45)
	at org.apache.lucene.util.TestRuleThreadAndTestName$1.evaluate(TestRuleThreadAndTestName.java:48)
	at org.apache.lucene.util.TestRuleIgnoreAfterMaxFailures$1.evaluate(TestRuleIgnoreAfterMaxFailures.java:64)
	at org.apache.lucene.util.TestRuleMarkFailure$1.evaluate(TestRuleMarkFailure.java:47)
	at com.carrotsearch.randomizedtesting.rules.StatementAdapter.evaluate(StatementAdapter.java:36)
	at com.carrotsearch.randomizedtesting.ThreadLeakControl$StatementRunner.run(ThreadLeakControl.java:368)
	at com.carrotsearch.randomizedtesting.ThreadLeakControl.forkTimeoutingTask(ThreadLeakControl.java:817)
	at com.carrotsearch.randomizedtesting.ThreadLeakControl$3.evaluate(ThreadLeakControl.java:468)
	at com.carrotsearch.randomizedtesting.RandomizedRunner.runSingleTest(RandomizedRunner.java:944)
	at com.carrotsearch.randomizedtesting.RandomizedRunner$5.evaluate(RandomizedRunner.java:830)
	at com.carrotsearch.randomizedtesting.RandomizedRunner$6.evaluate(RandomizedRunner.java:880)
	at com.carrotsearch.randomizedtesting.RandomizedRunner$7.evaluate(RandomizedRunner.java:891)
	at com.carrotsearch.randomizedtesting.rules.StatementAdapter.evaluate(StatementAdapter.java:36)
	at com.carrotsearch.randomizedtesting.rules.SystemPropertiesRestoreRule$1.evaluate(SystemPropertiesRestoreRule.java:57)
	at org.apache.lucene.util.AbstractBeforeAfterRule$1.evaluate(AbstractBeforeAfterRule.java:45)
	at com.carrotsearch.randomizedtesting.rules.StatementAdapter.evaluate(StatementAdapter.java:36)
	at org.apache.lucene.util.TestRuleStoreClassName$1.evaluate(TestRuleStoreClassName.java:41)
	at com.carrotsearch.randomizedtesting.rules.NoShadowingOrOverridesOnMethodsRule$1.evaluate(NoShadowingOrOverridesOnMethodsRule.java:40)
	at com.carrotsearch.randomizedtesting.rules.NoShadowingOrOverridesOnMethodsRule$1.evaluate(NoShadowingOrOverridesOnMethodsRule.java:40)
	at com.carrotsearch.randomizedtesting.rules.StatementAdapter.evaluate(StatementAdapter.java:36)
	at com.carrotsearch.randomizedtesting.rules.StatementAdapter.evaluate(StatementAdapter.java:36)
	at org.apache.lucene.util.TestRuleAssertionsRequired$1.evaluate(TestRuleAssertionsRequired.java:53)
	at org.apache.lucene.util.TestRuleMarkFailure$1.evaluate(TestRuleMarkFailure.java:47)
	at org.apache.lucene.util.TestRuleIgnoreAfterMaxFailures$1.evaluate(TestRuleIgnoreAfterMaxFailures.java:64)
	at org.apache.lucene.util.TestRuleIgnoreTestSuites$1.evaluate(TestRuleIgnoreTestSuites.java:54)
	at com.carrotsearch.randomizedtesting.rules.StatementAdapter.evaluate(StatementAdapter.java:36)
	at com.carrotsearch.randomizedtesting.ThreadLeakControl$StatementRunner.run(ThreadLeakControl.java:368)
	at java.base/java.lang.Thread.run(Thread.java:834)


FAILED:  org.apache.solr.cloud.api.collections.ShardSplitTest.test

Error Message:
DocCount on shard1_0 does not match expected:<4> but was:<0>

Stack Trace:
java.lang.AssertionError: DocCount on shard1_0 does not match expected:<4> but was:<0>
	at __randomizedtesting.SeedInfo.seed([60E535E50EE90E50:E8B10A3FA01563A8]:0)
	at org.junit.Assert.fail(Assert.java:93)
	at org.junit.Assert.failNotEquals(Assert.java:647)
	at org.junit.Assert.assertEquals(Assert.java:128)
	at org.junit.Assert.assertEquals(Assert.java:472)
	at org.apache.solr.cloud.api.collections.ShardSplitTest.splitByRouteKeyTest(ShardSplitTest.java:834)
	at org.apache.solr.cloud.api.collections.ShardSplitTest.test(ShardSplitTest.java:109)
	at java.base/jdk.internal.reflect.NativeMethodAccessorImpl.invoke0(Native Method)
	at java.base/jdk.internal.reflect.NativeMethodAccessorImpl.invoke(NativeMethodAccessorImpl.java:62)
	at java.base/jdk.internal.reflect.DelegatingMethodAccessorImpl.invoke(DelegatingMethodAccessorImpl.java:43)
	at java.base/java.lang.reflect.Method.invoke(Method.java:566)
	at com.carrotsearch.randomizedtesting.RandomizedRunner.invoke(RandomizedRunner.java:1742)
	at com.carrotsearch.randomizedtesting.RandomizedRunner$8.evaluate(RandomizedRunner.java:935)
	at com.carrotsearch.randomizedtesting.RandomizedRunner$9.evaluate(RandomizedRunner.java:971)
	at com.carrotsearch.randomizedtesting.RandomizedRunner$10.evaluate(RandomizedRunner.java:985)
	at org.apache.solr.BaseDistributedSearchTestCase$ShardsRepeatRule$ShardsFixedStatement.callStatement(BaseDistributedSearchTestCase.java:1008)
	at org.apache.solr.BaseDistributedSearchTestCase$ShardsRepeatRule$ShardsStatement.evaluate(BaseDistributedSearchTestCase.java:983)
	at com.carrotsearch.randomizedtesting.rules.SystemPropertiesRestoreRule$1.evaluate(SystemPropertiesRestoreRule.java:57)
	at org.apache.lucene.util.TestRuleSetupTeardownChained$1.evaluate(TestRuleSetupTeardownChained.java:49)
	at org.apache.lucene.util.AbstractBeforeAfterRule$1.evaluate(AbstractBeforeAfterRule.java:45)
	at org.apache.lucene.util.TestRuleThreadAndTestName$1.evaluate(TestRuleThreadAndTestName.java:48)
	at org.apache.lucene.util.TestRuleIgnoreAfterMaxFailures$1.evaluate(TestRuleIgnoreAfterMaxFailures.java:64)
	at org.apache.lucene.util.TestRuleMarkFailure$1.evaluate(TestRuleMarkFailure.java:47)
	at com.carrotsearch.randomizedtesting.rules.StatementAdapter.evaluate(StatementAdapter.java:36)
	at com.carrotsearch.randomizedtesting.ThreadLeakControl$StatementRunner.run(ThreadLeakControl.java:368)
	at com.carrotsearch.randomizedtesting.ThreadLeakControl.forkTimeoutingTask(ThreadLeakControl.java:817)
	at com.carrotsearch.randomizedtesting.ThreadLeakControl$3.evaluate(ThreadLeakControl.java:468)
	at com.carrotsearch.randomizedtesting.RandomizedRunner.runSingleTest(RandomizedRunner.java:944)
	at com.carrotsearch.randomizedtesting.RandomizedRunner$5.evaluate(RandomizedRunner.java:830)
	at com.carrotsearch.randomizedtesting.RandomizedRunner$6.evaluate(RandomizedRunner.java:880)
	at com.carrotsearch.randomizedtesting.RandomizedRunner$7.evaluate(RandomizedRunner.java:891)
	at com.carrotsearch.randomizedtesting.rules.StatementAdapter.evaluate(StatementAdapter.java:36)
	at com.carrotsearch.randomizedtesting.rules.SystemPropertiesRestoreRule$1.evaluate(SystemPropertiesRestoreRule.java:57)
	at org.apache.lucene.util.AbstractBeforeAfterRule$1.evaluate(AbstractBeforeAfterRule.java:45)
	at com.carrotsearch.randomizedtesting.rules.StatementAdapter.evaluate(StatementAdapter.java:36)
	at org.apache.lucene.util.TestRuleStoreClassName$1.evaluate(TestRuleStoreClassName.java:41)
	at com.carrotsearch.randomizedtesting.rules.NoShadowingOrOverridesOnMethodsRule$1.evaluate(NoShadowingOrOverridesOnMethodsRule.java:40)
	at com.carrotsearch.randomizedtesting.rules.NoShadowingOrOverridesOnMethodsRule$1.evaluate(NoShadowingOrOverridesOnMethodsRule.java:40)
	at com.carrotsearch.randomizedtesting.rules.StatementAdapter.evaluate(StatementAdapter.java:36)
	at com.carrotsearch.randomizedtesting.rules.StatementAdapter.evaluate(StatementAdapter.java:36)
	at org.apache.lucene.util.TestRuleAssertionsRequired$1.evaluate(TestRuleAssertionsRequired.java:53)
	at org.apache.lucene.util.TestRuleMarkFailure$1.evaluate(TestRuleMarkFailure.java:47)
	at org.apache.lucene.util.TestRuleIgnoreAfterMaxFailures$1.evaluate(TestRuleIgnoreAfterMaxFailures.java:64)
	at org.apache.lucene.util.TestRuleIgnoreTestSuites$1.evaluate(TestRuleIgnoreTestSuites.java:54)
	at com.carrotsearch.randomizedtesting.rules.StatementAdapter.evaluate(StatementAdapter.java:36)
	at com.carrotsearch.randomizedtesting.ThreadLeakControl$StatementRunner.run(ThreadLeakControl.java:368)
	at java.base/java.lang.Thread.run(Thread.java:834)


FAILED:  org.apache.solr.cloud.api.collections.ShardSplitTest.testSplitShardWithRuleLink

Error Message:
Error from server at https://127.0.0.1:43227: Unable to call distrib softCommit on: https://127.0.0.1:34941/shardSplitWithRule_link_shard1_replica_n1/

Stack Trace:
org.apache.solr.client.solrj.impl.HttpSolrClient$RemoteSolrException: Error from server at https://127.0.0.1:43227: Unable to call distrib softCommit on: https://127.0.0.1:34941/shardSplitWithRule_link_shard1_replica_n1/
	at __randomizedtesting.SeedInfo.seed([60E535E50EE90E50:6AF9807E847568F5]:0)
	at org.apache.solr.client.solrj.impl.HttpSolrClient.executeMethod(HttpSolrClient.java:643)
	at org.apache.solr.client.solrj.impl.HttpSolrClient.request(HttpSolrClient.java:255)
	at org.apache.solr.client.solrj.impl.HttpSolrClient.request(HttpSolrClient.java:244)
	at org.apache.solr.client.solrj.impl.LBHttpSolrClient.doRequest(LBHttpSolrClient.java:483)
	at org.apache.solr.client.solrj.impl.LBHttpSolrClient.request(LBHttpSolrClient.java:413)
	at org.apache.solr.client.solrj.impl.CloudSolrClient.sendRequest(CloudSolrClient.java:1107)
	at org.apache.solr.client.solrj.impl.CloudSolrClient.requestWithRetryOnStaleState(CloudSolrClient.java:884)
	at org.apache.solr.client.solrj.impl.CloudSolrClient.request(CloudSolrClient.java:817)
	at org.apache.solr.client.solrj.SolrRequest.process(SolrRequest.java:194)
	at org.apache.solr.client.solrj.SolrRequest.process(SolrRequest.java:211)
	at org.apache.solr.cloud.api.collections.ShardSplitTest.doSplitShardWithRule(ShardSplitTest.java:571)
	at org.apache.solr.cloud.api.collections.ShardSplitTest.testSplitShardWithRuleLink(ShardSplitTest.java:550)
	at java.base/jdk.internal.reflect.NativeMethodAccessorImpl.invoke0(Native Method)
	at java.base/jdk.internal.reflect.NativeMethodAccessorImpl.invoke(NativeMethodAccessorImpl.java:62)
	at java.base/jdk.internal.reflect.DelegatingMethodAccessorImpl.invoke(DelegatingMethodAccessorImpl.java:43)
	at java.base/java.lang.reflect.Method.invoke(Method.java:566)
	at com.carrotsearch.randomizedtesting.RandomizedRunner.invoke(RandomizedRunner.java:1742)
	at com.carrotsearch.randomizedtesting.RandomizedRunner$8.evaluate(RandomizedRunner.java:935)
	at com.carrotsearch.randomizedtesting.RandomizedRunner$9.evaluate(RandomizedRunner.java:971)
	at com.carrotsearch.randomizedtesting.RandomizedRunner$10.evaluate(RandomizedRunner.java:985)
	at org.apache.solr.BaseDistributedSearchTestCase$ShardsRepeatRule$ShardsFixedStatement.callStatement(BaseDistributedSearchTestCase.java:1008)
	at org.apache.solr.BaseDistributedSearchTestCase$ShardsRepeatRule$ShardsStatement.evaluate(BaseDistributedSearchTestCase.java:983)
	at com.carrotsearch.randomizedtesting.rules.SystemPropertiesRestoreRule$1.evaluate(SystemPropertiesRestoreRule.java:57)
	at org.apache.lucene.util.TestRuleSetupTeardownChained$1.evaluate(TestRuleSetupTeardownChained.java:49)
	at org.apache.lucene.util.AbstractBeforeAfterRule$1.evaluate(AbstractBeforeAfterRule.java:45)
	at org.apache.lucene.util.TestRuleThreadAndTestName$1.evaluate(TestRuleThreadAndTestName.java:48)
	at org.apache.lucene.util.TestRuleIgnoreAfterMaxFailures$1.evaluate(TestRuleIgnoreAfterMaxFailures.java:64)
	at org.apache.lucene.util.TestRuleMarkFailure$1.evaluate(TestRuleMarkFailure.java:47)
	at com.carrotsearch.randomizedtesting.rules.StatementAdapter.evaluate(StatementAdapter.java:36)
	at com.carrotsearch.randomizedtesting.ThreadLeakControl$StatementRunner.run(ThreadLeakControl.java:368)
	at com.carrotsearch.randomizedtesting.ThreadLeakControl.forkTimeoutingTask(ThreadLeakControl.java:817)
	at com.carrotsearch.randomizedtesting.ThreadLeakControl$3.evaluate(ThreadLeakControl.java:468)
	at com.carrotsearch.randomizedtesting.RandomizedRunner.runSingleTest(RandomizedRunner.java:944)
	at com.carrotsearch.randomizedtesting.RandomizedRunner$5.evaluate(RandomizedRunner.java:830)
	at com.carrotsearch.randomizedtesting.RandomizedRunner$6.evaluate(RandomizedRunner.java:880)
	at com.carrotsearch.randomizedtesting.RandomizedRunner$7.evaluate(RandomizedRunner.java:891)
	at com.carrotsearch.randomizedtesting.rules.StatementAdapter.evaluate(StatementAdapter.java:36)
	at com.carrotsearch.randomizedtesting.rules.SystemPropertiesRestoreRule$1.evaluate(SystemPropertiesRestoreRule.java:57)
	at org.apache.lucene.util.AbstractBeforeAfterRule$1.evaluate(AbstractBeforeAfterRule.java:45)
	at com.carrotsearch.randomizedtesting.rules.StatementAdapter.evaluate(StatementAdapter.java:36)
	at org.apache.lucene.util.TestRuleStoreClassName$1.evaluate(TestRuleStoreClassName.java:41)
	at com.carrotsearch.randomizedtesting.rules.NoShadowingOrOverridesOnMethodsRule$1.evaluate(NoShadowingOrOverridesOnMethodsRule.java:40)
	at com.carrotsearch.randomizedtesting.rules.NoShadowingOrOverridesOnMethodsRule$1.evaluate(NoShadowingOrOverridesOnMethodsRule.java:40)
	at com.carrotsearch.randomizedtesting.rules.StatementAdapter.evaluate(StatementAdapter.java:36)
	at com.carrotsearch.randomizedtesting.rules.StatementAdapter.evaluate(StatementAdapter.java:36)
	at org.apache.lucene.util.TestRuleAssertionsRequired$1.evaluate(TestRuleAssertionsRequired.java:53)
	at org.apache.lucene.util.TestRuleMarkFailure$1.evaluate(TestRuleMarkFailure.java:47)
	at org.apache.lucene.util.TestRuleIgnoreAfterMaxFailures$1.evaluate(TestRuleIgnoreAfterMaxFailures.java:64)
	at org.apache.lucene.util.TestRuleIgnoreTestSuites$1.evaluate(TestRuleIgnoreTestSuites.java:54)
	at com.carrotsearch.randomizedtesting.rules.StatementAdapter.evaluate(StatementAdapter.java:36)
	at com.carrotsearch.randomizedtesting.ThreadLeakControl$StatementRunner.run(ThreadLeakControl.java:368)
	at java.base/java.lang.Thread.run(Thread.java:834)


FAILED:  org.apache.solr.cloud.api.collections.ShardSplitTest.test

Error Message:
DocCount on shard1_1 does not match expected:<4> but was:<0>

Stack Trace:
java.lang.AssertionError: DocCount on shard1_1 does not match expected:<4> but was:<0>
	at __randomizedtesting.SeedInfo.seed([60E535E50EE90E50:E8B10A3FA01563A8]:0)
	at org.junit.Assert.fail(Assert.java:93)
	at org.junit.Assert.failNotEquals(Assert.java:647)
	at org.junit.Assert.assertEquals(Assert.java:128)
	at org.junit.Assert.assertEquals(Assert.java:472)
	at org.apache.solr.cloud.api.collections.ShardSplitTest.splitByRouteKeyTest(ShardSplitTest.java:835)
	at org.apache.solr.cloud.api.collections.ShardSplitTest.test(ShardSplitTest.java:109)
	at java.base/jdk.internal.reflect.NativeMethodAccessorImpl.invoke0(Native Method)
	at java.base/jdk.internal.reflect.NativeMethodAccessorImpl.invoke(NativeMethodAccessorImpl.java:62)
	at java.base/jdk.internal.reflect.DelegatingMethodAccessorImpl.invoke(DelegatingMethodAccessorImpl.java:43)
	at java.base/java.lang.reflect.Method.invoke(Method.java:566)
	at com.carrotsearch.randomizedtesting.RandomizedRunner.invoke(RandomizedRunner.java:1742)
	at com.carrotsearch.randomizedtesting.RandomizedRunner$8.evaluate(RandomizedRunner.java:935)
	at com.carrotsearch.randomizedtesting.RandomizedRunner$9.evaluate(RandomizedRunner.java:971)
	at com.carrotsearch.randomizedtesting.RandomizedRunner$10.evaluate(RandomizedRunner.java:985)
	at org.apache.solr.BaseDistributedSearchTestCase$ShardsRepeatRule$ShardsFixedStatement.callStatement(BaseDistributedSearchTestCase.java:1008)
	at org.apache.solr.BaseDistributedSearchTestCase$ShardsRepeatRule$ShardsStatement.evaluate(BaseDistributedSearchTestCase.java:983)
	at com.carrotsearch.randomizedtesting.rules.SystemPropertiesRestoreRule$1.evaluate(SystemPropertiesRestoreRule.java:57)
	at org.apache.lucene.util.TestRuleSetupTeardownChained$1.evaluate(TestRuleSetupTeardownChained.java:49)
	at org.apache.lucene.util.AbstractBeforeAfterRule$1.evaluate(AbstractBeforeAfterRule.java:45)
	at org.apache.lucene.util.TestRuleThreadAndTestName$1.evaluate(TestRuleThreadAndTestName.java:48)
	at org.apache.lucene.util.TestRuleIgnoreAfterMaxFailures$1.evaluate(TestRuleIgnoreAfterMaxFailures.java:64)
	at org.apache.lucene.util.TestRuleMarkFailure$1.evaluate(TestRuleMarkFailure.java:47)
	at com.carrotsearch.randomizedtesting.rules.StatementAdapter.evaluate(StatementAdapter.java:36)
	at com.carrotsearch.randomizedtesting.ThreadLeakControl$StatementRunner.run(ThreadLeakControl.java:368)
	at com.carrotsearch.randomizedtesting.ThreadLeakControl.forkTimeoutingTask(ThreadLeakControl.java:817)
	at com.carrotsearch.randomizedtesting.ThreadLeakControl$3.evaluate(ThreadLeakControl.java:468)
	at com.carrotsearch.randomizedtesting.RandomizedRunner.runSingleTest(RandomizedRunner.java:944)
	at com.carrotsearch.randomizedtesting.RandomizedRunner$5.evaluate(RandomizedRunner.java:830)
	at com.carrotsearch.randomizedtesting.RandomizedRunner$6.evaluate(RandomizedRunner.java:880)
	at com.carrotsearch.randomizedtesting.RandomizedRunner$7.evaluate(RandomizedRunner.java:891)
	at com.carrotsearch.randomizedtesting.rules.StatementAdapter.evaluate(StatementAdapter.java:36)
	at com.carrotsearch.randomizedtesting.rules.SystemPropertiesRestoreRule$1.evaluate(SystemPropertiesRestoreRule.java:57)
	at org.apache.lucene.util.AbstractBeforeAfterRule$1.evaluate(AbstractBeforeAfterRule.java:45)
	at com.carrotsearch.randomizedtesting.rules.StatementAdapter.evaluate(StatementAdapter.java:36)
	at org.apache.lucene.util.TestRuleStoreClassName$1.evaluate(TestRuleStoreClassName.java:41)
	at com.carrotsearch.randomizedtesting.rules.NoShadowingOrOverridesOnMethodsRule$1.evaluate(NoShadowingOrOverridesOnMethodsRule.java:40)
	at com.carrotsearch.randomizedtesting.rules.NoShadowingOrOverridesOnMethodsRule$1.evaluate(NoShadowingOrOverridesOnMethodsRule.java:40)
	at com.carrotsearch.randomizedtesting.rules.StatementAdapter.evaluate(StatementAdapter.java:36)
	at com.carrotsearch.randomizedtesting.rules.StatementAdapter.evaluate(StatementAdapter.java:36)
	at org.apache.lucene.util.TestRuleAssertionsRequired$1.evaluate(TestRuleAssertionsRequired.java:53)
	at org.apache.lucene.util.TestRuleMarkFailure$1.evaluate(TestRuleMarkFailure.java:47)
	at org.apache.lucene.util.TestRuleIgnoreAfterMaxFailures$1.evaluate(TestRuleIgnoreAfterMaxFailures.java:64)
	at org.apache.lucene.util.TestRuleIgnoreTestSuites$1.evaluate(TestRuleIgnoreTestSuites.java:54)
	at com.carrotsearch.randomizedtesting.rules.StatementAdapter.evaluate(StatementAdapter.java:36)
	at com.carrotsearch.randomizedtesting.ThreadLeakControl$StatementRunner.run(ThreadLeakControl.java:368)
	at java.base/java.lang.Thread.run(Thread.java:834)


FAILED:  org.apache.solr.cloud.api.collections.ShardSplitTest.test

Error Message:
DocCount on shard1_2 does not match expected:<7> but was:<0>

Stack Trace:
java.lang.AssertionError: DocCount on shard1_2 does not match expected:<7> but was:<0>
	at __randomizedtesting.SeedInfo.seed([60E535E50EE90E50:E8B10A3FA01563A8]:0)
	at org.junit.Assert.fail(Assert.java:93)
	at org.junit.Assert.failNotEquals(Assert.java:647)
	at org.junit.Assert.assertEquals(Assert.java:128)
	at org.junit.Assert.assertEquals(Assert.java:472)
	at org.apache.solr.cloud.api.collections.ShardSplitTest.splitByRouteKeyTest(ShardSplitTest.java:836)
	at org.apache.solr.cloud.api.collections.ShardSplitTest.test(ShardSplitTest.java:109)
	at java.base/jdk.internal.reflect.NativeMethodAccessorImpl.invoke0(Native Method)
	at java.base/jdk.internal.reflect.NativeMethodAccessorImpl.invoke(NativeMethodAccessorImpl.java:62)
	at java.base/jdk.internal.reflect.DelegatingMethodAccessorImpl.invoke(DelegatingMethodAccessorImpl.java:43)
	at java.base/java.lang.reflect.Method.invoke(Method.java:566)
	at com.carrotsearch.randomizedtesting.RandomizedRunner.invoke(RandomizedRunner.java:1742)
	at com.carrotsearch.randomizedtesting.RandomizedRunner$8.evaluate(RandomizedRunner.java:935)
	at com.carrotsearch.randomizedtesting.RandomizedRunner$9.evaluate(RandomizedRunner.java:971)
	at com.carrotsearch.randomizedtesting.RandomizedRunner$10.evaluate(RandomizedRunner.java:985)
	at org.apache.solr.BaseDistributedSearchTestCase$ShardsRepeatRule$ShardsFixedStatement.callStatement(BaseDistributedSearchTestCase.java:1008)
	at org.apache.solr.BaseDistributedSearchTestCase$ShardsRepeatRule$ShardsStatement.evaluate(BaseDistributedSearchTestCase.java:983)
	at com.carrotsearch.randomizedtesting.rules.SystemPropertiesRestoreRule$1.evaluate(SystemPropertiesRestoreRule.java:57)
	at org.apache.lucene.util.TestRuleSetupTeardownChained$1.evaluate(TestRuleSetupTeardownChained.java:49)
	at org.apache.lucene.util.AbstractBeforeAfterRule$1.evaluate(AbstractBeforeAfterRule.java:45)
	at org.apache.lucene.util.TestRuleThreadAndTestName$1.evaluate(TestRuleThreadAndTestName.java:48)
	at org.apache.lucene.util.TestRuleIgnoreAfterMaxFailures$1.evaluate(TestRuleIgnoreAfterMaxFailures.java:64)
	at org.apache.lucene.util.TestRuleMarkFailure$1.evaluate(TestRuleMarkFailure.java:47)
	at com.carrotsearch.randomizedtesting.rules.StatementAdapter.evaluate(StatementAdapter.java:36)
	at com.carrotsearch.randomizedtesting.ThreadLeakControl$StatementRunner.run(ThreadLeakControl.java:368)
	at com.carrotsearch.randomizedtesting.ThreadLeakControl.forkTimeoutingTask(ThreadLeakControl.java:817)
	at com.carrotsearch.randomizedtesting.ThreadLeakControl$3.evaluate(ThreadLeakControl.java:468)
	at com.carrotsearch.randomizedtesting.RandomizedRunner.runSingleTest(RandomizedRunner.java:944)
	at com.carrotsearch.randomizedtesting.RandomizedRunner$5.evaluate(RandomizedRunner.java:830)
	at com.carrotsearch.randomizedtesting.RandomizedRunner$6.evaluate(RandomizedRunner.java:880)
	at com.carrotsearch.randomizedtesting.RandomizedRunner$7.evaluate(RandomizedRunner.java:891)
	at com.carrotsearch.randomizedtesting.rules.StatementAdapter.evaluate(StatementAdapter.java:36)
	at com.carrotsearch.randomizedtesting.rules.SystemPropertiesRestoreRule$1.evaluate(SystemPropertiesRestoreRule.java:57)
	at org.apache.lucene.util.AbstractBeforeAfterRule$1.evaluate(AbstractBeforeAfterRule.java:45)
	at com.carrotsearch.randomizedtesting.rules.StatementAdapter.evaluate(StatementAdapter.java:36)
	at org.apache.lucene.util.TestRuleStoreClassName$1.evaluate(TestRuleStoreClassName.java:41)
	at com.carrotsearch.randomizedtesting.rules.NoShadowingOrOverridesOnMethodsRule$1.evaluate(NoShadowingOrOverridesOnMethodsRule.java:40)
	at com.carrotsearch.randomizedtesting.rules.NoShadowingOrOverridesOnMethodsRule$1.evaluate(NoShadowingOrOverridesOnMethodsRule.java:40)
	at com.carrotsearch.randomizedtesting.rules.StatementAdapter.evaluate(StatementAdapter.java:36)
	at com.carrotsearch.randomizedtesting.rules.StatementAdapter.evaluate(StatementAdapter.java:36)
	at org.apache.lucene.util.TestRuleAssertionsRequired$1.evaluate(TestRuleAssertionsRequired.java:53)
	at org.apache.lucene.util.TestRuleMarkFailure$1.evaluate(TestRuleMarkFailure.java:47)
	at org.apache.lucene.util.TestRuleIgnoreAfterMaxFailures$1.evaluate(TestRuleIgnoreAfterMaxFailures.java:64)
	at org.apache.lucene.util.TestRuleIgnoreTestSuites$1.evaluate(TestRuleIgnoreTestSuites.java:54)
	at com.carrotsearch.randomizedtesting.rules.StatementAdapter.evaluate(StatementAdapter.java:36)
	at com.carrotsearch.randomizedtesting.ThreadLeakControl$StatementRunner.run(ThreadLeakControl.java:368)
	at java.base/java.lang.Thread.run(Thread.java:834)


FAILED:  org.apache.solr.cloud.api.collections.ShardSplitTest.test

Error Message:
expected:<12> but was:<0>

Stack Trace:
java.lang.AssertionError: expected:<12> but was:<0>
	at __randomizedtesting.SeedInfo.seed([60E535E50EE90E50:E8B10A3FA01563A8]:0)
	at org.junit.Assert.fail(Assert.java:93)
	at org.junit.Assert.failNotEquals(Assert.java:647)
	at org.junit.Assert.assertEquals(Assert.java:128)
	at org.junit.Assert.assertEquals(Assert.java:472)
	at org.junit.Assert.assertEquals(Assert.java:456)
	at org.apache.solr.cloud.api.collections.ShardSplitTest.splitByRouteFieldTest(ShardSplitTest.java:765)
	at org.apache.solr.cloud.api.collections.ShardSplitTest.test(ShardSplitTest.java:108)
	at java.base/jdk.internal.reflect.NativeMethodAccessorImpl.invoke0(Native Method)
	at java.base/jdk.internal.reflect.NativeMethodAccessorImpl.invoke(NativeMethodAccessorImpl.java:62)
	at java.base/jdk.internal.reflect.DelegatingMethodAccessorImpl.invoke(DelegatingMethodAccessorImpl.java:43)
	at java.base/java.lang.reflect.Method.invoke(Method.java:566)
	at com.carrotsearch.randomizedtesting.RandomizedRunner.invoke(RandomizedRunner.java:1742)
	at com.carrotsearch.randomizedtesting.RandomizedRunner$8.evaluate(RandomizedRunner.java:935)
	at com.carrotsearch.randomizedtesting.RandomizedRunner$9.evaluate(RandomizedRunner.java:971)
	at com.carrotsearch.randomizedtesting.RandomizedRunner$10.evaluate(RandomizedRunner.java:985)
	at org.apache.solr.BaseDistributedSearchTestCase$ShardsRepeatRule$ShardsFixedStatement.callStatement(BaseDistributedSearchTestCase.java:1008)
	at org.apache.solr.BaseDistributedSearchTestCase$ShardsRepeatRule$ShardsStatement.evaluate(BaseDistributedSearchTestCase.java:983)
	at com.carrotsearch.randomizedtesting.rules.SystemPropertiesRestoreRule$1.evaluate(SystemPropertiesRestoreRule.java:57)
	at org.apache.lucene.util.TestRuleSetupTeardownChained$1.evaluate(TestRuleSetupTeardownChained.java:49)
	at org.apache.lucene.util.AbstractBeforeAfterRule$1.evaluate(AbstractBeforeAfterRule.java:45)
	at org.apache.lucene.util.TestRuleThreadAndTestName$1.evaluate(TestRuleThreadAndTestName.java:48)
	at org.apache.lucene.util.TestRuleIgnoreAfterMaxFailures$1.evaluate(TestRuleIgnoreAfterMaxFailures.java:64)
	at org.apache.lucene.util.TestRuleMarkFailure$1.evaluate(TestRuleMarkFailure.java:47)
	at com.carrotsearch.randomizedtesting.rules.StatementAdapter.evaluate(StatementAdapter.java:36)
	at com.carrotsearch.randomizedtesting.ThreadLeakControl$StatementRunner.run(ThreadLeakControl.java:368)
	at com.carrotsearch.randomizedtesting.ThreadLeakControl.forkTimeoutingTask(ThreadLeakControl.java:817)
	at com.carrotsearch.randomizedtesting.ThreadLeakControl$3.evaluate(ThreadLeakControl.java:468)
	at com.carrotsearch.randomizedtesting.RandomizedRunner.runSingleTest(RandomizedRunner.java:944)
	at com.carrotsearch.randomizedtesting.RandomizedRunner$5.evaluate(RandomizedRunner.java:830)
	at com.carrotsearch.randomizedtesting.RandomizedRunner$6.evaluate(RandomizedRunner.java:880)
	at com.carrotsearch.randomizedtesting.RandomizedRunner$7.evaluate(RandomizedRunner.java:891)
	at com.carrotsearch.randomizedtesting.rules.StatementAdapter.evaluate(StatementAdapter.java:36)
	at com.carrotsearch.randomizedtesting.rules.SystemPropertiesRestoreRule$1.evaluate(SystemPropertiesRestoreRule.java:57)
	at org.apache.lucene.util.AbstractBeforeAfterRule$1.evaluate(AbstractBeforeAfterRule.java:45)
	at com.carrotsearch.randomizedtesting.rules.StatementAdapter.evaluate(StatementAdapter.java:36)
	at org.apache.lucene.util.TestRuleStoreClassName$1.evaluate(TestRuleStoreClassName.java:41)
	at com.carrotsearch.randomizedtesting.rules.NoShadowingOrOverridesOnMethodsRule$1.evaluate(NoShadowingOrOverridesOnMethodsRule.java:40)
	at com.carrotsearch.randomizedtesting.rules.NoShadowingOrOverridesOnMethodsRule$1.evaluate(NoShadowingOrOverridesOnMethodsRule.java:40)
	at com.carrotsearch.randomizedtesting.rules.StatementAdapter.evaluate(StatementAdapter.java:36)
	at com.carrotsearch.randomizedtesting.rules.StatementAdapter.evaluate(StatementAdapter.java:36)
	at org.apache.lucene.util.TestRuleAssertionsRequired$1.evaluate(TestRuleAssertionsRequired.java:53)
	at org.apache.lucene.util.TestRuleMarkFailure$1.evaluate(TestRuleMarkFailure.java:47)
	at org.apache.lucene.util.TestRuleIgnoreAfterMaxFailures$1.evaluate(TestRuleIgnoreAfterMaxFailures.java:64)
	at org.apache.lucene.util.TestRuleIgnoreTestSuites$1.evaluate(TestRuleIgnoreTestSuites.java:54)
	at com.carrotsearch.randomizedtesting.rules.StatementAdapter.evaluate(StatementAdapter.java:36)
	at com.carrotsearch.randomizedtesting.ThreadLeakControl$StatementRunner.run(ThreadLeakControl.java:368)
	at java.base/java.lang.Thread.run(Thread.java:834)


FAILED:  org.apache.solr.cloud.cdcr.CdcrBootstrapTest.testConvertClusterToCdcrAndBootstrap

Error Message:
Collection not found: cdcr-target

Stack Trace:
org.apache.solr.common.SolrException: Collection not found: cdcr-target
	at __randomizedtesting.SeedInfo.seed([60E535E50EE90E50:B7321A92BAB69617]:0)
	at org.apache.solr.client.solrj.impl.CloudSolrClient.requestWithRetryOnStaleState(CloudSolrClient.java:851)
	at org.apache.solr.client.solrj.impl.CloudSolrClient.request(CloudSolrClient.java:817)
	at org.apache.solr.client.solrj.SolrRequest.process(SolrRequest.java:194)
	at org.apache.solr.client.solrj.SolrClient.query(SolrClient.java:942)
	at org.apache.solr.client.solrj.SolrClient.query(SolrClient.java:957)
	at org.apache.solr.cloud.cdcr.CdcrTestsUtil.invokeCdcrAction(CdcrTestsUtil.java:83)
	at org.apache.solr.cloud.cdcr.CdcrTestsUtil.cdcrStart(CdcrTestsUtil.java:60)
	at org.apache.solr.cloud.cdcr.CdcrBootstrapTest.testConvertClusterToCdcrAndBootstrap(CdcrBootstrapTest.java:116)
	at java.base/jdk.internal.reflect.NativeMethodAccessorImpl.invoke0(Native Method)
	at java.base/jdk.internal.reflect.NativeMethodAccessorImpl.invoke(NativeMethodAccessorImpl.java:62)
	at java.base/jdk.internal.reflect.DelegatingMethodAccessorImpl.invoke(DelegatingMethodAccessorImpl.java:43)
	at java.base/java.lang.reflect.Method.invoke(Method.java:566)
	at com.carrotsearch.randomizedtesting.RandomizedRunner.invoke(RandomizedRunner.java:1742)
	at com.carrotsearch.randomizedtesting.RandomizedRunner$8.evaluate(RandomizedRunner.java:935)
	at com.carrotsearch.randomizedtesting.RandomizedRunner$9.evaluate(RandomizedRunner.java:971)
	at com.carrotsearch.randomizedtesting.RandomizedRunner$10.evaluate(RandomizedRunner.java:985)
	at com.carrotsearch.randomizedtesting.rules.SystemPropertiesRestoreRule$1.evaluate(SystemPropertiesRestoreRule.java:57)
	at org.apache.lucene.util.TestRuleSetupTeardownChained$1.evaluate(TestRuleSetupTeardownChained.java:49)
	at org.apache.lucene.util.AbstractBeforeAfterRule$1.evaluate(AbstractBeforeAfterRule.java:45)
	at org.apache.lucene.util.TestRuleThreadAndTestName$1.evaluate(TestRuleThreadAndTestName.java:48)
	at org.apache.lucene.util.TestRuleIgnoreAfterMaxFailures$1.evaluate(TestRuleIgnoreAfterMaxFailures.java:64)
	at org.apache.lucene.util.TestRuleMarkFailure$1.evaluate(TestRuleMarkFailure.java:47)
	at com.carrotsearch.randomizedtesting.rules.StatementAdapter.evaluate(StatementAdapter.java:36)
	at com.carrotsearch.randomizedtesting.ThreadLeakControl$StatementRunner.run(ThreadLeakControl.java:368)
	at com.carrotsearch.randomizedtesting.ThreadLeakControl.forkTimeoutingTask(ThreadLeakControl.java:817)
	at com.carrotsearch.randomizedtesting.ThreadLeakControl$3.evaluate(ThreadLeakControl.java:468)
	at com.carrotsearch.randomizedtesting.RandomizedRunner.runSingleTest(RandomizedRunner.java:944)
	at com.carrotsearch.randomizedtesting.RandomizedRunner$5.evaluate(RandomizedRunner.java:830)
	at com.carrotsearch.randomizedtesting.RandomizedRunner$6.evaluate(RandomizedRunner.java:880)
	at com.carrotsearch.randomizedtesting.RandomizedRunner$7.evaluate(RandomizedRunner.java:891)
	at com.carrotsearch.randomizedtesting.rules.StatementAdapter.evaluate(StatementAdapter.java:36)
	at com.carrotsearch.randomizedtesting.rules.SystemPropertiesRestoreRule$1.evaluate(SystemPropertiesRestoreRule.java:57)
	at org.apache.lucene.util.AbstractBeforeAfterRule$1.evaluate(AbstractBeforeAfterRule.java:45)
	at com.carrotsearch.randomizedtesting.rules.StatementAdapter.evaluate(StatementAdapter.java:36)
	at org.apache.lucene.util.TestRuleStoreClassName$1.evaluate(TestRuleStoreClassName.java:41)
	at com.carrotsearch.randomizedtesting.rules.NoShadowingOrOverridesOnMethodsRule$1.evaluate(NoShadowingOrOverridesOnMethodsRule.java:40)
	at com.carrotsearch.randomizedtesting.rules.NoShadowingOrOverridesOnMethodsRule$1.evaluate(NoShadowingOrOverridesOnMethodsRule.java:40)
	at com.carrotsearch.randomizedtesting.rules.StatementAdapter.evaluate(StatementAdapter.java:36)
	at com.carrotsearch.randomizedtesting.rules.StatementAdapter.evaluate(StatementAdapter.java:36)
	at org.apache.lucene.util.TestRuleAssertionsRequired$1.evaluate(TestRuleAssertionsRequired.java:53)
	at org.apache.lucene.util.TestRuleMarkFailure$1.evaluate(TestRuleMarkFailure.java:47)
	at org.apache.lucene.util.TestRuleIgnoreAfterMaxFailures$1.evaluate(TestRuleIgnoreAfterMaxFailures.java:64)
	at org.apache.lucene.util.TestRuleIgnoreTestSuites$1.evaluate(TestRuleIgnoreTestSuites.java:54)
	at com.carrotsearch.randomizedtesting.rules.StatementAdapter.evaluate(StatementAdapter.java:36)
	at com.carrotsearch.randomizedtesting.ThreadLeakControl$StatementRunner.run(ThreadLeakControl.java:368)
	at java.base/java.lang.Thread.run(Thread.java:834)


FAILED:  org.apache.solr.cloud.cdcr.CdcrBootstrapTest.testConvertClusterToCdcrAndBootstrap

Error Message:
Collection not found: cdcr-target

Stack Trace:
org.apache.solr.common.SolrException: Collection not found: cdcr-target
	at __randomizedtesting.SeedInfo.seed([60E535E50EE90E50:B7321A92BAB69617]:0)
	at org.apache.solr.client.solrj.impl.CloudSolrClient.requestWithRetryOnStaleState(CloudSolrClient.java:851)
	at org.apache.solr.client.solrj.impl.CloudSolrClient.request(CloudSolrClient.java:817)
	at org.apache.solr.client.solrj.SolrRequest.process(SolrRequest.java:194)
	at org.apache.solr.client.solrj.SolrClient.query(SolrClient.java:942)
	at org.apache.solr.client.solrj.SolrClient.query(SolrClient.java:957)
	at org.apache.solr.cloud.cdcr.CdcrTestsUtil.invokeCdcrAction(CdcrTestsUtil.java:83)
	at org.apache.solr.cloud.cdcr.CdcrTestsUtil.cdcrStart(CdcrTestsUtil.java:60)
	at org.apache.solr.cloud.cdcr.CdcrBootstrapTest.testConvertClusterToCdcrAndBootstrap(CdcrBootstrapTest.java:116)
	at java.base/jdk.internal.reflect.NativeMethodAccessorImpl.invoke0(Native Method)
	at java.base/jdk.internal.reflect.NativeMethodAccessorImpl.invoke(NativeMethodAccessorImpl.java:62)
	at java.base/jdk.internal.reflect.DelegatingMethodAccessorImpl.invoke(DelegatingMethodAccessorImpl.java:43)
	at java.base/java.lang.reflect.Method.invoke(Method.java:566)
	at com.carrotsearch.randomizedtesting.RandomizedRunner.invoke(RandomizedRunner.java:1742)
	at com.carrotsearch.randomizedtesting.RandomizedRunner$8.evaluate(RandomizedRunner.java:935)
	at com.carrotsearch.randomizedtesting.RandomizedRunner$9.evaluate(RandomizedRunner.java:971)
	at com.carrotsearch.randomizedtesting.RandomizedRunner$10.evaluate(RandomizedRunner.java:985)
	at com.carrotsearch.randomizedtesting.rules.SystemPropertiesRestoreRule$1.evaluate(SystemPropertiesRestoreRule.java:57)
	at org.apache.lucene.util.TestRuleSetupTeardownChained$1.evaluate(TestRuleSetupTeardownChained.java:49)
	at org.apache.lucene.util.AbstractBeforeAfterRule$1.evaluate(AbstractBeforeAfterRule.java:45)
	at org.apache.lucene.util.TestRuleThreadAndTestName$1.evaluate(TestRuleThreadAndTestName.java:48)
	at org.apache.lucene.util.TestRuleIgnoreAfterMaxFailures$1.evaluate(TestRuleIgnoreAfterMaxFailures.java:64)
	at org.apache.lucene.util.TestRuleMarkFailure$1.evaluate(TestRuleMarkFailure.java:47)
	at com.carrotsearch.randomizedtesting.rules.StatementAdapter.evaluate(StatementAdapter.java:36)
	at com.carrotsearch.randomizedtesting.ThreadLeakControl$StatementRunner.run(ThreadLeakControl.java:368)
	at com.carrotsearch.randomizedtesting.ThreadLeakControl.forkTimeoutingTask(ThreadLeakControl.java:817)
	at com.carrotsearch.randomizedtesting.ThreadLeakControl$3.evaluate(ThreadLeakControl.java:468)
	at com.carrotsearch.randomizedtesting.RandomizedRunner.runSingleTest(RandomizedRunner.java:944)
	at com.carrotsearch.randomizedtesting.RandomizedRunner$5.evaluate(RandomizedRunner.java:830)
	at com.carrotsearch.randomizedtesting.RandomizedRunner$6.evaluate(RandomizedRunner.java:880)
	at com.carrotsearch.randomizedtesting.RandomizedRunner$7.evaluate(RandomizedRunner.java:891)
	at com.carrotsearch.randomizedtesting.rules.StatementAdapter.evaluate(StatementAdapter.java:36)
	at com.carrotsearch.randomizedtesting.rules.SystemPropertiesRestoreRule$1.evaluate(SystemPropertiesRestoreRule.java:57)
	at org.apache.lucene.util.AbstractBeforeAfterRule$1.evaluate(AbstractBeforeAfterRule.java:45)
	at com.carrotsearch.randomizedtesting.rules.StatementAdapter.evaluate(StatementAdapter.java:36)
	at org.apache.lucene.util.TestRuleStoreClassName$1.evaluate(TestRuleStoreClassName.java:41)
	at com.carrotsearch.randomizedtesting.rules.NoShadowingOrOverridesOnMethodsRule$1.evaluate(NoShadowingOrOverridesOnMethodsRule.java:40)
	at com.carrotsearch.randomizedtesting.rules.NoShadowingOrOverridesOnMethodsRule$1.evaluate(NoShadowingOrOverridesOnMethodsRule.java:40)
	at com.carrotsearch.randomizedtesting.rules.StatementAdapter.evaluate(StatementAdapter.java:36)
	at com.carrotsearch.randomizedtesting.rules.StatementAdapter.evaluate(StatementAdapter.java:36)
	at org.apache.lucene.util.TestRuleAssertionsRequired$1.evaluate(TestRuleAssertionsRequired.java:53)
	at org.apache.lucene.util.TestRuleMarkFailure$1.evaluate(TestRuleMarkFailure.java:47)
	at org.apache.lucene.util.TestRuleIgnoreAfterMaxFailures$1.evaluate(TestRuleIgnoreAfterMaxFailures.java:64)
	at org.apache.lucene.util.TestRuleIgnoreTestSuites$1.evaluate(TestRuleIgnoreTestSuites.java:54)
	at com.carrotsearch.randomizedtesting.rules.StatementAdapter.evaluate(StatementAdapter.java:36)
	at com.carrotsearch.randomizedtesting.ThreadLeakControl$StatementRunner.run(ThreadLeakControl.java:368)
	at java.base/java.lang.Thread.run(Thread.java:834)


FAILED:  org.apache.solr.cloud.cdcr.CdcrBootstrapTest.testConvertClusterToCdcrAndBootstrap

Error Message:
Collection not found: cdcr-target

Stack Trace:
org.apache.solr.common.SolrException: Collection not found: cdcr-target
	at __randomizedtesting.SeedInfo.seed([60E535E50EE90E50:B7321A92BAB69617]:0)
	at org.apache.solr.client.solrj.impl.CloudSolrClient.requestWithRetryOnStaleState(CloudSolrClient.java:851)
	at org.apache.solr.client.solrj.impl.CloudSolrClient.request(CloudSolrClient.java:817)
	at org.apache.solr.client.solrj.SolrRequest.process(SolrRequest.java:194)
	at org.apache.solr.client.solrj.SolrClient.query(SolrClient.java:942)
	at org.apache.solr.client.solrj.SolrClient.query(SolrClient.java:957)
	at org.apache.solr.cloud.cdcr.CdcrTestsUtil.invokeCdcrAction(CdcrTestsUtil.java:83)
	at org.apache.solr.cloud.cdcr.CdcrTestsUtil.cdcrStart(CdcrTestsUtil.java:60)
	at org.apache.solr.cloud.cdcr.CdcrBootstrapTest.testConvertClusterToCdcrAndBootstrap(CdcrBootstrapTest.java:116)
	at java.base/jdk.internal.reflect.NativeMethodAccessorImpl.invoke0(Native Method)
	at java.base/jdk.internal.reflect.NativeMethodAccessorImpl.invoke(NativeMethodAccessorImpl.java:62)
	at java.base/jdk.internal.reflect.DelegatingMethodAccessorImpl.invoke(DelegatingMethodAccessorImpl.java:43)
	at java.base/java.lang.reflect.Method.invoke(Method.java:566)
	at com.carrotsearch.randomizedtesting.RandomizedRunner.invoke(RandomizedRunner.java:1742)
	at com.carrotsearch.randomizedtesting.RandomizedRunner$8.evaluate(RandomizedRunner.java:935)
	at com.carrotsearch.randomizedtesting.RandomizedRunner$9.evaluate(RandomizedRunner.java:971)
	at com.carrotsearch.randomizedtesting.RandomizedRunner$10.evaluate(RandomizedRunner.java:985)
	at com.carrotsearch.randomizedtesting.rules.SystemPropertiesRestoreRule$1.evaluate(SystemPropertiesRestoreRule.java:57)
	at org.apache.lucene.util.TestRuleSetupTeardownChained$1.evaluate(TestRuleSetupTeardownChained.java:49)
	at org.apache.lucene.util.AbstractBeforeAfterRule$1.evaluate(AbstractBeforeAfterRule.java:45)
	at org.apache.lucene.util.TestRuleThreadAndTestName$1.evaluate(TestRuleThreadAndTestName.java:48)
	at org.apache.lucene.util.TestRuleIgnoreAfterMaxFailures$1.evaluate(TestRuleIgnoreAfterMaxFailures.java:64)
	at org.apache.lucene.util.TestRuleMarkFailure$1.evaluate(TestRuleMarkFailure.java:47)
	at com.carrotsearch.randomizedtesting.rules.StatementAdapter.evaluate(StatementAdapter.java:36)
	at com.carrotsearch.randomizedtesting.ThreadLeakControl$StatementRunner.run(ThreadLeakControl.java:368)
	at com.carrotsearch.randomizedtesting.ThreadLeakControl.forkTimeoutingTask(ThreadLeakControl.java:817)
	at com.carrotsearch.randomizedtesting.ThreadLeakControl$3.evaluate(ThreadLeakControl.java:468)
	at com.carrotsearch.randomizedtesting.RandomizedRunner.runSingleTest(RandomizedRunner.java:944)
	at com.carrotsearch.randomizedtesting.RandomizedRunner$5.evaluate(RandomizedRunner.java:830)
	at com.carrotsearch.randomizedtesting.RandomizedRunner$6.evaluate(RandomizedRunner.java:880)
	at com.carrotsearch.randomizedtesting.RandomizedRunner$7.evaluate(RandomizedRunner.java:891)
	at com.carrotsearch.randomizedtesting.rules.StatementAdapter.evaluate(StatementAdapter.java:36)
	at com.carrotsearch.randomizedtesting.rules.SystemPropertiesRestoreRule$1.evaluate(SystemPropertiesRestoreRule.java:57)
	at org.apache.lucene.util.AbstractBeforeAfterRule$1.evaluate(AbstractBeforeAfterRule.java:45)
	at com.carrotsearch.randomizedtesting.rules.StatementAdapter.evaluate(StatementAdapter.java:36)
	at org.apache.lucene.util.TestRuleStoreClassName$1.evaluate(TestRuleStoreClassName.java:41)
	at com.carrotsearch.randomizedtesting.rules.NoShadowingOrOverridesOnMethodsRule$1.evaluate(NoShadowingOrOverridesOnMethodsRule.java:40)
	at com.carrotsearch.randomizedtesting.rules.NoShadowingOrOverridesOnMethodsRule$1.evaluate(NoShadowingOrOverridesOnMethodsRule.java:40)
	at com.carrotsearch.randomizedtesting.rules.StatementAdapter.evaluate(StatementAdapter.java:36)
	at com.carrotsearch.randomizedtesting.rules.StatementAdapter.evaluate(StatementAdapter.java:36)
	at org.apache.lucene.util.TestRuleAssertionsRequired$1.evaluate(TestRuleAssertionsRequired.java:53)
	at org.apache.lucene.util.TestRuleMarkFailure$1.evaluate(TestRuleMarkFailure.java:47)
	at org.apache.lucene.util.TestRuleIgnoreAfterMaxFailures$1.evaluate(TestRuleIgnoreAfterMaxFailures.java:64)
	at org.apache.lucene.util.TestRuleIgnoreTestSuites$1.evaluate(TestRuleIgnoreTestSuites.java:54)
	at com.carrotsearch.randomizedtesting.rules.StatementAdapter.evaluate(StatementAdapter.java:36)
	at com.carrotsearch.randomizedtesting.ThreadLeakControl$StatementRunner.run(ThreadLeakControl.java:368)
	at java.base/java.lang.Thread.run(Thread.java:834)




Build Log:
[...truncated 13489 lines...]
   [junit4] Suite: org.apache.solr.cloud.cdcr.CdcrBootstrapTest
   [junit4]   2> 890842 INFO  (SUITE-CdcrBootstrapTest-seed#[60E535E50EE90E50]-worker) [    ] o.a.s.SolrTestCaseJ4 SecureRandom sanity checks: test.solr.allowed.securerandom=null & java.security.egd=file:/dev/./urandom
   [junit4]   2> Creating dataDir: /home/jenkins/workspace/Lucene-Solr-7.x-Linux/solr/build/solr-core/test/J0/temp/solr.cloud.cdcr.CdcrBootstrapTest_60E535E50EE90E50-001/init-core-data-001
   [junit4]   2> 890843 WARN  (SUITE-CdcrBootstrapTest-seed#[60E535E50EE90E50]-worker) [    ] o.a.s.SolrTestCaseJ4 startTrackingSearchers: numOpens=23 numCloses=23
   [junit4]   2> 890843 INFO  (SUITE-CdcrBootstrapTest-seed#[60E535E50EE90E50]-worker) [    ] o.a.s.SolrTestCaseJ4 Using TrieFields (NUMERIC_POINTS_SYSPROP=false) w/NUMERIC_DOCVALUES_SYSPROP=true
   [junit4]   2> 890844 INFO  (SUITE-CdcrBootstrapTest-seed#[60E535E50EE90E50]-worker) [    ] o.a.s.SolrTestCaseJ4 Randomized ssl (true) and clientAuth (false) via: @org.apache.solr.util.RandomizeSSL(reason="", ssl=0.0/0.0, value=0.0/0.0, clientAuth=0.0/0.0)
   [junit4]   2> 890845 INFO  (TEST-CdcrBootstrapTest.testConvertClusterToCdcrAndBootstrap-seed#[60E535E50EE90E50]) [    ] o.a.s.SolrTestCaseJ4 ###Starting testConvertClusterToCdcrAndBootstrap
   [junit4]   2> 890845 INFO  (TEST-CdcrBootstrapTest.testConvertClusterToCdcrAndBootstrap-seed#[60E535E50EE90E50]) [    ] o.a.s.c.MiniSolrCloudCluster Starting cluster of 1 servers in /home/jenkins/workspace/Lucene-Solr-7.x-Linux/solr/build/solr-core/test/J0/temp/solr.cloud.cdcr.CdcrBootstrapTest_60E535E50EE90E50-001/cdcr-target-001
   [junit4]   2> 890845 INFO  (TEST-CdcrBootstrapTest.testConvertClusterToCdcrAndBootstrap-seed#[60E535E50EE90E50]) [    ] o.a.s.c.ZkTestServer STARTING ZK TEST SERVER
   [junit4]   2> 890845 INFO  (Thread-2789) [    ] o.a.s.c.ZkTestServer client port:0.0.0.0/0.0.0.0:0
   [junit4]   2> 890845 INFO  (Thread-2789) [    ] o.a.s.c.ZkTestServer Starting server
   [junit4]   2> 890847 ERROR (Thread-2789) [    ] o.a.z.s.ZooKeeperServer ZKShutdownHandler is not registered, so ZooKeeper server won't take any action on ERROR or SHUTDOWN server state changes
   [junit4]   2> 890945 INFO  (TEST-CdcrBootstrapTest.testConvertClusterToCdcrAndBootstrap-seed#[60E535E50EE90E50]) [    ] o.a.s.c.ZkTestServer start zk server on port:36607
   [junit4]   2> 890947 INFO  (zkConnectionManagerCallback-2873-thread-1) [    ] o.a.s.c.c.ConnectionManager zkClient has connected
   [junit4]   2> 890950 INFO  (jetty-launcher-2870-thread-1) [    ] o.e.j.s.Server jetty-9.4.11.v20180605; built: 2018-06-05T18:24:03.829Z; git: d5fc0523cfa96bfebfbda19606cad384d772f04c; jvm 11+28
   [junit4]   2> 890953 INFO  (jetty-launcher-2870-thread-1) [    ] o.e.j.s.session DefaultSessionIdManager workerName=node0
   [junit4]   2> 890953 INFO  (jetty-launcher-2870-thread-1) [    ] o.e.j.s.session No SessionScavenger set, using defaults
   [junit4]   2> 890953 INFO  (jetty-launcher-2870-thread-1) [    ] o.e.j.s.session node0 Scavenging every 600000ms
   [junit4]   2> 890954 INFO  (jetty-launcher-2870-thread-1) [    ] o.e.j.s.h.ContextHandler Started o.e.j.s.ServletContextHandler@140174bc{/solr,null,AVAILABLE}
   [junit4]   2> 890955 INFO  (jetty-launcher-2870-thread-1) [    ] o.e.j.s.AbstractConnector Started ServerConnector@7e23f418{SSL,[ssl, http/1.1]}{127.0.0.1:34663}
   [junit4]   2> 890955 INFO  (jetty-launcher-2870-thread-1) [    ] o.e.j.s.Server Started @890987ms
   [junit4]   2> 890955 INFO  (jetty-launcher-2870-thread-1) [    ] o.a.s.c.s.e.JettySolrRunner Jetty properties: {hostContext=/solr, hostPort=34663}
   [junit4]   2> 890955 ERROR (jetty-launcher-2870-thread-1) [    ] o.a.s.u.StartupLoggingUtils Missing Java Option solr.log.dir. Logging may be missing or incomplete.
   [junit4]   2> 890955 INFO  (jetty-launcher-2870-thread-1) [    ] o.a.s.s.SolrDispatchFilter Using logger factory org.apache.logging.slf4j.Log4jLoggerFactory
   [junit4]   2> 890955 INFO  (jetty-launcher-2870-thread-1) [    ] o.a.s.s.SolrDispatchFilter  ___      _       Welcome to Apache Solr™ version 7.6.0
   [junit4]   2> 890955 INFO  (jetty-launcher-2870-thread-1) [    ] o.a.s.s.SolrDispatchFilter / __| ___| |_ _   Starting in cloud mode on port null
   [junit4]   2> 890955 INFO  (jetty-launcher-2870-thread-1) [    ] o.a.s.s.SolrDispatchFilter \__ \/ _ \ | '_|  Install dir: null
   [junit4]   2> 890955 INFO  (jetty-launcher-2870-thread-1) [    ] o.a.s.s.SolrDispatchFilter |___/\___/_|_|    Start time: 2018-09-29T09:02:46.487823Z
   [junit4]   2> 890956 INFO  (zkConnectionManagerCallback-2875-thread-1) [    ] o.a.s.c.c.ConnectionManager zkClient has connected
   [junit4]   2> 890957 INFO  (jetty-launcher-2870-thread-1) [    ] o.a.s.s.SolrDispatchFilter solr.xml found in ZooKeeper. Loading...
   [junit4]   2> 891038 INFO  (jetty-launcher-2870-thread-1) [    ] o.a.s.c.ZkContainer Zookeeper client=127.0.0.1:36607/solr
   [junit4]   2> 891039 INFO  (zkConnectionManagerCallback-2879-thread-1) [    ] o.a.s.c.c.ConnectionManager zkClient has connected
   [junit4]   2> 891040 INFO  (zkConnectionManagerCallback-2881-thread-1) [    ] o.a.s.c.c.ConnectionManager zkClient has connected
   [junit4]   2> 891072 INFO  (jetty-launcher-2870-thread-1) [n:127.0.0.1:34663_solr    ] o.a.s.c.OverseerElectionContext I am going to be the leader 127.0.0.1:34663_solr
   [junit4]   2> 891072 INFO  (jetty-launcher-2870-thread-1) [n:127.0.0.1:34663_solr    ] o.a.s.c.Overseer Overseer (id=72307118688305155-127.0.0.1:34663_solr-n_0000000000) starting
   [junit4]   2> 891075 INFO  (zkConnectionManagerCallback-2888-thread-1) [    ] o.a.s.c.c.ConnectionManager zkClient has connected
   [junit4]   2> 891076 INFO  (jetty-launcher-2870-thread-1) [n:127.0.0.1:34663_solr    ] o.a.s.c.s.i.ZkClientClusterStateProvider Cluster at 127.0.0.1:36607/solr ready
   [junit4]   2> 891076 INFO  (OverseerStateUpdate-72307118688305155-127.0.0.1:34663_solr-n_0000000000) [n:127.0.0.1:34663_solr    ] o.a.s.c.Overseer Starting to work on the main queue : 127.0.0.1:34663_solr
   [junit4]   2> 891076 INFO  (jetty-launcher-2870-thread-1) [n:127.0.0.1:34663_solr    ] o.a.s.c.ZkController Register node as live in ZooKeeper:/live_nodes/127.0.0.1:34663_solr
   [junit4]   2> 891077 INFO  (zkCallback-2880-thread-1) [    ] o.a.s.c.c.ZkStateReader Updated live nodes from ZooKeeper... (0) -> (1)
   [junit4]   2> 891077 INFO  (zkCallback-2887-thread-1) [    ] o.a.s.c.c.ZkStateReader Updated live nodes from ZooKeeper... (0) -> (1)
   [junit4]   2> 891090 INFO  (jetty-launcher-2870-thread-1) [n:127.0.0.1:34663_solr    ] o.a.s.h.a.MetricsHistoryHandler No .system collection, keeping metrics history in memory.
   [junit4]   2> 891107 INFO  (jetty-launcher-2870-thread-1) [n:127.0.0.1:34663_solr    ] o.a.s.m.r.SolrJmxReporter JMX monitoring for 'solr_34663.solr.node' (registry 'solr.node') enabled at server: com.sun.jmx.mbeanserver.JmxMBeanServer@39ea78c7
   [junit4]   2> 891115 INFO  (jetty-launcher-2870-thread-1) [n:127.0.0.1:34663_solr    ] o.a.s.m.r.SolrJmxReporter JMX monitoring for 'solr_34663.solr.jvm' (registry 'solr.jvm') enabled at server: com.sun.jmx.mbeanserver.JmxMBeanServer@39ea78c7
   [junit4]   2> 891115 INFO  (jetty-launcher-2870-thread-1) [n:127.0.0.1:34663_solr    ] o.a.s.m.r.SolrJmxReporter JMX monitoring for 'solr_34663.solr.jetty' (registry 'solr.jetty') enabled at server: com.sun.jmx.mbeanserver.JmxMBeanServer@39ea78c7
   [junit4]   2> 891116 INFO  (jetty-launcher-2870-thread-1) [n:127.0.0.1:34663_solr    ] o.a.s.c.CorePropertiesLocator Found 0 core definitions underneath /home/jenkins/workspace/Lucene-Solr-7.x-Linux/solr/build/solr-core/test/J0/temp/solr.cloud.cdcr.CdcrBootstrapTest_60E535E50EE90E50-001/cdcr-target-001/node1/.
   [junit4]   2> 891125 INFO  (zkConnectionManagerCallback-2891-thread-1) [    ] o.a.s.c.c.ConnectionManager zkClient has connected
   [junit4]   2> 891128 INFO  (zkConnectionManagerCallback-2894-thread-1) [    ] o.a.s.c.c.ConnectionManager zkClient has connected
   [junit4]   2> 891129 INFO  (TEST-CdcrBootstrapTest.testConvertClusterToCdcrAndBootstrap-seed#[60E535E50EE90E50]) [    ] o.a.s.c.c.CdcrBootstrapTest Target zkHost = 127.0.0.1:36607/solr
   [junit4]   2> 891129 INFO  (TEST-CdcrBootstrapTest.testConvertClusterToCdcrAndBootstrap-seed#[60E535E50EE90E50]) [    ] o.a.s.c.MiniSolrCloudCluster Starting cluster of 1 servers in /home/jenkins/workspace/Lucene-Solr-7.x-Linux/solr/build/solr-core/test/J0/temp/solr.cloud.cdcr.CdcrBootstrapTest_60E535E50EE90E50-001/cdcr-source-001
   [junit4]   2> 891129 INFO  (TEST-CdcrBootstrapTest.testConvertClusterToCdcrAndBootstrap-seed#[60E535E50EE90E50]) [    ] o.a.s.c.ZkTestServer STARTING ZK TEST SERVER
   [junit4]   2> 891129 INFO  (Thread-2799) [    ] o.a.s.c.ZkTestServer client port:0.0.0.0/0.0.0.0:0
   [junit4]   2> 891129 INFO  (Thread-2799) [    ] o.a.s.c.ZkTestServer Starting server
   [junit4]   2> 891135 ERROR (Thread-2799) [    ] o.a.z.s.ZooKeeperServer ZKShutdownHandler is not registered, so ZooKeeper server won't take any action on ERROR or SHUTDOWN server state changes
   [junit4]   2> 891229 INFO  (TEST-CdcrBootstrapTest.testConvertClusterToCdcrAndBootstrap-seed#[60E535E50EE90E50]) [    ] o.a.s.c.ZkTestServer start zk server on port:39807
   [junit4]   2> 891231 INFO  (zkConnectionManagerCallback-2898-thread-1) [    ] o.a.s.c.c.ConnectionManager zkClient has connected
   [junit4]   2> 891233 INFO  (jetty-launcher-2895-thread-1) [    ] o.e.j.s.Server jetty-9.4.11.v20180605; built: 2018-06-05T18:24:03.829Z; git: d5fc0523cfa96bfebfbda19606cad384d772f04c; jvm 11+28
   [junit4]   2> 891234 INFO  (jetty-launcher-2895-thread-1) [    ] o.e.j.s.session DefaultSessionIdManager workerName=node0
   [junit4]   2> 891234 INFO  (jetty-launcher-2895-thread-1) [    ] o.e.j.s.session No SessionScavenger set, using defaults
   [junit4]   2> 891234 INFO  (jetty-launcher-2895-thread-1) [    ] o.e.j.s.session node0 Scavenging every 660000ms
   [junit4]   2> 891234 INFO  (jetty-launcher-2895-thread-1) [    ] o.e.j.s.h.ContextHandler Started o.e.j.s.ServletContextHandler@5c5b9065{/solr,null,AVAILABLE}
   [junit4]   2> 891234 INFO  (jetty-launcher-2895-thread-1) [    ] o.e.j.s.AbstractConnector Started ServerConnector@20a27514{SSL,[ssl, http/1.1]}{127.0.0.1:46301}
   [junit4]   2> 891234 INFO  (jetty-launcher-2895-thread-1) [    ] o.e.j.s.Server Started @891266ms
   [junit4]   2> 891234 INFO  (jetty-launcher-2895-thread-1) [    ] o.a.s.c.s.e.JettySolrRunner Jetty properties: {hostContext=/solr, hostPort=46301}
   [junit4]   2> 891235 ERROR (jetty-launcher-2895-thread-1) [    ] o.a.s.u.StartupLoggingUtils Missing Java Option solr.log.dir. Logging may be missing or incomplete.
   [junit4]   2> 891235 INFO  (jetty-launcher-2895-thread-1) [    ] o.a.s.s.SolrDispatchFilter Using logger factory org.apache.logging.slf4j.Log4jLoggerFactory
   [junit4]   2> 891235 INFO  (jetty-launcher-2895-thread-1) [    ] o.a.s.s.SolrDispatchFilter  ___      _       Welcome to Apache Solr™ version 7.6.0
   [junit4]   2> 891235 INFO  (jetty-launcher-2895-thread-1) [    ] o.a.s.s.SolrDispatchFilter / __| ___| |_ _   Starting in cloud mode on port null
   [junit4]   2> 891235 INFO  (jetty-launcher-2895-thread-1) [    ] o.a.s.s.SolrDispatchFilter \__ \/ _ \ | '_|  Install dir: null
   [junit4]   2> 891235 INFO  (jetty-launcher-2895-thread-1) [    ] o.a.s.s.SolrDispatchFilter |___/\___/_|_|    Start time: 2018-09-29T09:02:46.767274Z
   [junit4]   2> 891236 INFO  (zkConnectionManagerCallback-2900-thread-1) [    ] o.a.s.c.c.ConnectionManager zkClient has connected
   [junit4]   2> 891236 INFO  (jetty-launcher-2895-thread-1) [    ] o.a.s.s.SolrDispatchFilter solr.xml found in ZooKeeper. Loading...
   [junit4]   2> 891284 INFO  (jetty-launcher-2895-thread-1) [    ] o.a.s.c.ZkContainer Zookeeper client=127.0.0.1:39807/solr
   [junit4]   2> 891285 INFO  (zkConnectionManagerCallback-2904-thread-1) [    ] o.a.s.c.c.ConnectionManager zkClient has connected
   [junit4]   2> 891286 INFO  (zkConnectionManagerCallback-2906-thread-1) [    ] o.a.s.c.c.ConnectionManager zkClient has connected
   [junit4]   2> 891324 INFO  (jetty-launcher-2895-thread-1) [n:127.0.0.1:46301_solr    ] o.a.s.c.OverseerElectionContext I am going to be the leader 127.0.0.1:46301_solr
   [junit4]   2> 891324 INFO  (jetty-launcher-2895-thread-1) [n:127.0.0.1:46301_solr    ] o.a.s.c.Overseer Overseer (id=72307118707245059-127.0.0.1:46301_solr-n_0000000000) starting
   [junit4]   2> 891328 INFO  (zkConnectionManagerCallback-2913-thread-1) [    ] o.a.s.c.c.ConnectionManager zkClient has connected
   [junit4]   2> 891329 INFO  (jetty-launcher-2895-thread-1) [n:127.0.0.1:46301_solr    ] o.a.s.c.s.i.ZkClientClusterStateProvider Cluster at 127.0.0.1:39807/solr ready
   [junit4]   2> 891329 INFO  (OverseerStateUpdate-72307118707245059-127.0.0.1:46301_solr-n_0000000000) [n:127.0.0.1:46301_solr    ] o.a.s.c.Overseer Starting to work on the main queue : 127.0.0.1:46301_solr
   [junit4]   2> 891330 INFO  (jetty-launcher-2895-thread-1) [n:127.0.0.1:46301_solr    ] o.a.s.c.ZkController Register node as live in ZooKeeper:/live_nodes/127.0.0.1:46301_solr
   [junit4]   2> 891330 INFO  (zkCallback-2912-thread-1) [    ] o.a.s.c.c.ZkStateReader Updated live nodes from ZooKeeper... (0) -> (1)
   [junit4]   2> 891335 INFO  (zkCallback-2905-thread-1) [    ] o.a.s.c.c.ZkStateReader Updated live nodes from ZooKeeper... (0) -> (1)
   [junit4]   2> 891338 INFO  (jetty-launcher-2895-thread-1) [n:127.0.0.1:46301_solr    ] o.a.s.h.a.MetricsHistoryHandler No .system collection, keeping metrics history in memory.
   [junit4]   2> 891348 INFO  (jetty-launcher-2895-thread-1) [n:127.0.0.1:46301_solr    ] o.a.s.m.r.SolrJmxReporter JMX monitoring for 'solr_46301.solr.node' (registry 'solr.node') enabled at server: com.sun.jmx.mbeanserver.JmxMBeanServer@39ea78c7
   [junit4]   2> 891353 INFO  (jetty-launcher-2895-thread-1) [n:127.0.0.1:46301_solr    ] o.a.s.m.r.SolrJmxReporter JMX monitoring for 'solr_46301.solr.jvm' (registry 'solr.jvm') enabled at server: com.sun.jmx.mbeanserver.JmxMBeanServer@39ea78c7
   [junit4]   2> 891353 INFO  (jetty-launcher-2895-thread-1) [n:127.0.0.1:46301_solr    ] o.a.s.m.r.SolrJmxReporter JMX monitoring for 'solr_46301.solr.jetty' (registry 'solr.jetty') enabled at server: com.sun.jmx.mbeanserver.JmxMBeanServer@39ea78c7
   [junit4]   2> 891354 INFO  (jetty-launcher-2895-thread-1) [n:127.0.0.1:46301_solr    ] o.a.s.c.CorePropertiesLocator Found 0 core definitions underneath /home/jenkins/workspace/Lucene-Solr-7.x-Linux/solr/build/solr-core/test/J0/temp/solr.cloud.cdcr.CdcrBootstrapTest_60E535E50EE90E50-001/cdcr-source-001/node1/.
   [junit4]   2> 891368 INFO  (zkConnectionManagerCallback-2916-thread-1) [    ] o.a.s.c.c.ConnectionManager zkClient has connected
   [junit4]   2> 891370 INFO  (zkConnectionManagerCallback-2919-thread-1) [    ] o.a.s.c.c.ConnectionManager zkClient has connected
   [junit4]   2> 891371 INFO  (zkConnectionManagerCallback-2921-thread-1) [    ] o.a.s.c.c.ConnectionManager zkClient has connected
   [junit4]   2> 891374 INFO  (zkConnectionManagerCallback-2925-thread-1) [    ] o.a.s.c.c.ConnectionManager zkClient has connected
   [junit4]   2> 891374 INFO  (TEST-CdcrBootstrapTest.testConvertClusterToCdcrAndBootstrap-seed#[60E535E50EE90E50]) [    ] o.a.s.c.c.ZkStateReader Updated live nodes from ZooKeeper... (0) -> (1)
   [junit4]   2> 891374 INFO  (TEST-CdcrBootstrapTest.testConvertClusterToCdcrAndBootstrap-seed#[60E535E50EE90E50]) [    ] o.a.s.c.s.i.ZkClientClusterStateProvider Cluster at 127.0.0.1:39807/solr ready
   [junit4]   2> 891383 INFO  (qtp1299774436-11610) [n:127.0.0.1:46301_solr    ] o.a.s.h.a.CollectionsHandler Invoked Collection Action :create with params collection.configName=cdcr-source&name=cdcr-source&nrtReplicas=1&action=CREATE&numShards=1&property.solr.directoryFactory=solr.StandardDirectoryFactory&wt=javabin&version=2 and sendToOCPQueue=true
   [junit4]   2> 891386 INFO  (OverseerThreadFactory-4939-thread-1-processing-n:127.0.0.1:46301_solr) [n:127.0.0.1:46301_solr    ] o.a.s.c.a.c.CreateCollectionCmd Create collection cdcr-source
   [junit4]   2> 891490 INFO  (OverseerStateUpdate-72307118707245059-127.0.0.1:46301_solr-n_0000000000) [n:127.0.0.1:46301_solr    ] o.a.s.c.o.SliceMutator createReplica() {
   [junit4]   2>   "operation":"ADDREPLICA",
   [junit4]   2>   "collection":"cdcr-source",
   [junit4]   2>   "shard":"shard1",
   [junit4]   2>   "core":"cdcr-source_shard1_replica_n1",
   [junit4]   2>   "state":"down",
   [junit4]   2>   "base_url":"https://127.0.0.1:46301/solr",
   [junit4]   2>   "type":"NRT",
   [junit4]   2>   "waitForFinalState":"false"} 
   [junit4]   2> 891699 INFO  (qtp1299774436-11659) [n:127.0.0.1:46301_solr    x:cdcr-source_shard1_replica_n1] o.a.s.h.a.CoreAdminOperation core create command qt=/admin/cores&collection.configName=cdcr-source&newCollection=true&collection=cdcr-source&version=2&replicaType=NRT&coreNodeName=core_node2&name=cdcr-source_shard1_replica_n1&action=CREATE&numShards=1&shard=shard1&property.solr.directoryFactory=solr.StandardDirectoryFactory&wt=javabin
   [junit4]   2> 891700 INFO  (qtp1299774436-11659) [n:127.0.0.1:46301_solr    x:cdcr-source_shard1_replica_n1] o.a.s.c.TransientSolrCoreCacheDefault Allocating transient cache for 2147483647 transient cores
   [junit4]   2> 892706 INFO  (qtp1299774436-11659) [n:127.0.0.1:46301_solr c:cdcr-source s:shard1 r:core_node2 x:cdcr-source_shard1_replica_n1] o.a.s.c.SolrConfig Using Lucene MatchVersion: 7.6.0
   [junit4]   2> 892710 INFO  (qtp1299774436-11659) [n:127.0.0.1:46301_solr c:cdcr-source s:shard1 r:core_node2 x:cdcr-source_shard1_replica_n1] o.a.s.s.IndexSchema [cdcr-source_shard1_replica_n1] Schema name=minimal
   [junit4]   2> 892710 INFO  (qtp1299774436-11659) [n:127.0.0.1:46301_solr c:cdcr-source s:shard1 r:core_node2 x:cdcr-source_shard1_replica_n1] o.a.s.s.IndexSchema Loaded schema minimal/1.1 with uniqueid field id
   [junit4]   2> 892710 INFO  (qtp1299774436-11659) [n:127.0.0.1:46301_solr c:cdcr-source s:shard1 r:core_node2 x:cdcr-source_shard1_replica_n1] o.a.s.c.CoreContainer Creating SolrCore 'cdcr-source_shard1_replica_n1' using configuration from collection cdcr-source, trusted=true
   [junit4]   2> 892711 INFO  (qtp1299774436-11659) [n:127.0.0.1:46301_solr c:cdcr-source s:shard1 r:core_node2 x:cdcr-source_shard1_replica_n1] o.a.s.m.r.SolrJmxReporter JMX monitoring for 'solr_46301.solr.core.cdcr-source.shard1.replica_n1' (registry 'solr.core.cdcr-source.shard1.replica_n1') enabled at server: com.sun.jmx.mbeanserver.JmxMBeanServer@39ea78c7
   [junit4]   2> 892711 INFO  (qtp1299774436-11659) [n:127.0.0.1:46301_solr c:cdcr-source s:shard1 r:core_node2 x:cdcr-source_shard1_replica_n1] o.a.s.c.SolrCore [[cdcr-source_shard1_replica_n1] ] Opening new SolrCore at [/home/jenkins/workspace/Lucene-Solr-7.x-Linux/solr/build/solr-core/test/J0/temp/solr.cloud.cdcr.CdcrBootstrapTest_60E535E50EE90E50-001/cdcr-source-001/node1/cdcr-source_shard1_replica_n1], dataDir=[/home/jenkins/workspace/Lucene-Solr-7.x-Linux/solr/build/solr-core/test/J0/temp/solr.cloud.cdcr.CdcrBootstrapTest_60E535E50EE90E50-001/cdcr-source-001/node1/./cdcr-source_shard1_replica_n1/data/]
   [junit4]   2> 892767 INFO  (qtp1299774436-11659) [n:127.0.0.1:46301_solr c:cdcr-source s:shard1 r:core_node2 x:cdcr-source_shard1_replica_n1] o.a.s.u.UpdateHandler Using UpdateLog implementation: org.apache.solr.update.UpdateLog
   [junit4]   2> 892767 INFO  (qtp1299774436-11659) [n:127.0.0.1:46301_solr c:cdcr-source s:shard1 r:core_node2 x:cdcr-source_shard1_replica_n1] o.a.s.u.UpdateLog Initializing UpdateLog: dataDir= defaultSyncLevel=FLUSH numRecordsToKeep=100 maxNumLogsToKeep=10 numVersionBuckets=65536
   [junit4]   2> 892769 INFO  (qtp1299774436-11659) [n:127.0.0.1:46301_solr c:cdcr-source s:shard1 r:core_node2 x:cdcr-source_shard1_replica_n1] o.a.s.u.CommitTracker Hard AutoCommit: disabled
   [junit4]   2> 892769 INFO  (qtp1299774436-11659) [n:127.0.0.1:46301_solr c:cdcr-source s:shard1 r:core_node2 x:cdcr-source_shard1_replica_n1] o.a.s.u.CommitTracker Soft AutoCommit: disabled
   [junit4]   2> 892771 INFO  (qtp1299774436-11659) [n:127.0.0.1:46301_solr c:cdcr-source s:shard1 r:core_node2 x:cdcr-source_shard1_replica_n1] o.a.s.s.SolrIndexSearcher Opening [Searcher@6420d21e[cdcr-source_shard1_replica_n1] main]
   [junit4]   2> 892772 INFO  (qtp1299774436-11659) [n:127.0.0.1:46301_solr c:cdcr-source s:shard1 r:core_node2 x:cdcr-source_shard1_replica_n1] o.a.s.r.ManagedResourceStorage Configured ZooKeeperStorageIO with znodeBase: /configs/cdcr-source
   [junit4]   2> 892772 INFO  (qtp1299774436-11659) [n:127.0.0.1:46301_solr c:cdcr-source s:shard1 r:core_node2 x:cdcr-source_shard1_replica_n1] o.a.s.r.ManagedResourceStorage Loaded null at path _rest_managed.json using ZooKeeperStorageIO:path=/configs/cdcr-source
   [junit4]   2> 892773 INFO  (qtp1299774436-11659) [n:127.0.0.1:46301_solr c:cdcr-source s:shard1 r:core_node2 x:cdcr-source_shard1_replica_n1] o.a.s.h.ReplicationHandler Commits will be reserved for 10000ms.
   [junit4]   2> 892773 INFO  (qtp1299774436-11659) [n:127.0.0.1:46301_solr c:cdcr-source s:shard1 r:core_node2 x:cdcr-source_shard1_replica_n1] o.a.s.u.UpdateLog Could not find max version in index or recent updates, using new clock 1612931943162183680
   [junit4]   2> 892774 INFO  (searcherExecutor-4944-thread-1-processing-n:127.0.0.1:46301_solr x:cdcr-source_shard1_replica_n1 c:cdcr-source s:shard1 r:core_node2) [n:127.0.0.1:46301_solr c:cdcr-source s:shard1 r:core_node2 x:cdcr-source_shard1_replica_n1] o.a.s.c.SolrCore [cdcr-source_shard1_replica_n1] Registered new searcher Searcher@6420d21e[cdcr-source_shard1_replica_n1] main{ExitableDirectoryReader(UninvertingDirectoryReader())}
   [junit4]   2> 892777 INFO  (qtp1299774436-11659) [n:127.0.0.1:46301_solr c:cdcr-source s:shard1 r:core_node2 x:cdcr-source_shard1_replica_n1] o.a.s.c.ZkShardTerms Successful update of terms at /collections/cdcr-source/terms/shard1 to Terms{values={core_node2=0}, version=0}
   [junit4]   2> 892778 INFO  (qtp1299774436-11659) [n:127.0.0.1:46301_solr c:cdcr-source s:shard1 r:core_node2 x:cdcr-source_shard1_replica_n1] o.a.s.c.ShardLeaderElectionContext Enough replicas found to continue.
   [junit4]   2> 892778 INFO  (qtp1299774436-11659) [n:127.0.0.1:46301_solr c:cdcr-source s:shard1 r:core_node2 x:cdcr-source_shard1_replica_n1] o.a.s.c.ShardLeaderElectionContext I may be the new leader - try and sync
   [junit4]   2> 892778 INFO  (qtp1299774436-11659) [n:127.0.0.1:46301_solr c:cdcr-source s:shard1 r:core_node2 x:cdcr-source_shard1_replica_n1] o.a.s.c.SyncStrategy Sync replicas to https://127.0.0.1:46301/solr/cdcr-source_shard1_replica_n1/
   [junit4]   2> 892778 INFO  (qtp1299774436-11659) [n:127.0.0.1:46301_solr c:cdcr-source s:shard1 r:core_node2 x:cdcr-source_shard1_replica_n1] o.a.s.c.SyncStrategy Sync Success - now sync replicas to me
   [junit4]   2> 892778 INFO  (qtp1299774436-11659) [n:127.0.0.1:46301_solr c:cdcr-source s:shard1 r:core_node2 x:cdcr-source_shard1_replica_n1] o.a.s.c.SyncStrategy https://127.0.0.1:46301/solr/cdcr-source_shard1_replica_n1/ has no replicas
   [junit4]   2> 892778 INFO  (qtp1299774436-11659) [n:127.0.0.1:46301_solr c:cdcr-source s:shard1 r:core_node2 x:cdcr-source_shard1_replica_n1] o.a.s.c.ShardLeaderElectionContext Found all replicas participating in election, clear LIR
   [junit4]   2> 892780 INFO  (qtp1299774436-11659) [n:127.0.0.1:46301_solr c:cdcr-source s:shard1 r:core_node2 x:cdcr-source_shard1_replica_n1] o.a.s.c.ShardLeaderElectionContext I am the new leader: https://127.0.0.1:46301/solr/cdcr-source_shard1_replica_n1/ shard1
   [junit4]   2> 892882 INFO  (qtp1299774436-11659) [n:127.0.0.1:46301_solr c:cdcr-source s:shard1 r:core_node2 x:cdcr-source_shard1_replica_n1] o.a.s.c.ZkController I am the leader, no recovery necessary
   [junit4]   2> 892883 INFO  (qtp1299774436-11659) [n:127.0.0.1:46301_solr c:cdcr-source s:shard1 r:core_node2 x:cdcr-source_shard1_replica_n1] o.a.s.s.HttpSolrCall [admin] webapp=null path=/admin/cores params={qt=/admin/cores&collection.configName=cdcr-source&newCollection=true&collection=cdcr-source&version=2&replicaType=NRT&coreNodeName=core_node2&name=cdcr-source_shard1_replica_n1&action=CREATE&numShards=1&shard=shard1&property.solr.directoryFactory=solr.StandardDirectoryFactory&wt=javabin} status=0 QTime=1184
   [junit4]   2> 892885 INFO  (qtp1299774436-11610) [n:127.0.0.1:46301_solr    ] o.a.s.h.a.CollectionsHandler Wait for new collection to be active for at most 30 seconds. Check all shard replicas
   [junit4]   2> 892983 INFO  (zkCallback-2905-thread-1) [    ] o.a.s.c.c.ZkStateReader A cluster state change: [WatchedEvent state:SyncConnected type:NodeDataChanged path:/collections/cdcr-source/state.json] for collection [cdcr-source] has occurred - updating... (live nodes size: [1])
   [junit4]   2> 893386 INFO  (OverseerCollectionConfigSetProcessor-72307118707245059-127.0.0.1:46301_solr-n_0000000000) [n:127.0.0.1:46301_solr    ] o.a.s.c.OverseerTaskQueue Response ZK path: /overseer/collection-queue-work/qnr-0000000000 doesn't exist.  Requestor may have disconnected from ZooKeeper
   [junit4]   2> 893885 INFO  (qtp1299774436-11610) [n:127.0.0.1:46301_solr    ] o.a.s.s.HttpSolrCall [admin] webapp=null path=/admin/collections params={collection.configName=cdcr-source&name=cdcr-source&nrtReplicas=1&action=CREATE&numShards=1&property.solr.directoryFactory=solr.StandardDirectoryFactory&wt=javabin&version=2} status=0 QTime=2501
   [junit4]   2> 893890 INFO  (qtp1299774436-11609) [n:127.0.0.1:46301_solr c:cdcr-source s:shard1 r:core_node2 x:cdcr-source_shard1_replica_n1] o.a.s.c.ZkShardTerms Successful update of terms at /collections/cdcr-source/terms/shard1 to Terms{values={core_node2=1}, version=1}
   [junit4]   2> 893890 INFO  (qtp1299774436-11609) [n:127.0.0.1:46301_solr c:cdcr-source s:shard1 r:core_node2 x:cdcr-source_shard1_replica_n1] o.a.s.u.p.LogUpdateProcessorFactory [cdcr-source_shard1_replica_n1]  webapp=/solr path=/update params={_stateVer_=cdcr-source:4&wt=javabin&version=2}{add=[source_0 (1612931944330297344), source_1 (1612931944331345920), source_2 (1612931944331345921), source_3 (1612931944332394496), source_4 (1612931944332394497), source_5 (1612931944332394498), source_6 (1612931944332394499), source_7 (1612931944332394500), source_8 (1612931944332394501), source_9 (1612931944332394502), ... (100 adds)]} 0 2
   [junit4]   2> 893891 INFO  (qtp1299774436-11610) [n:127.0.0.1:46301_solr c:cdcr-source s:shard1 r:core_node2 x:cdcr-source_shard1_replica_n1] o.a.s.u.DirectUpdateHandler2 start commit{_version_=1612931944334491648,optimize=false,openSearcher=true,waitSearcher=true,expungeDeletes=false,softCommit=false,prepareCommit=false}
   [junit4]   2> 893891 INFO  (qtp1299774436-11610) [n:127.0.0.1:46301_solr c:cdcr-source s:shard1 r:core_node2 x:cdcr-source_shard1_replica_n1] o.a.s.u.SolrIndexWriter Calling setCommitData with IW:org.apache.solr.update.SolrIndexWriter@7adb9b56 commitCommandVersion:1612931944334491648
   [junit4]   2> 894097 INFO  (qtp1299774436-11610) [n:127.0.0.1:46301_solr c:cdcr-source s:shard1 r:core_node2 x:cdcr-source_shard1_replica_n1] o.a.s.s.SolrIndexSearcher Opening [Searcher@bd9bbf7[cdcr-source_shard1_replica_n1] main]
   [junit4]   2> 894097 INFO  (qtp1299774436-11610) [n:127.0.0.1:46301_solr c:cdcr-source s:shard1 r:core_node2 x:cdcr-source_shard1_replica_n1] o.a.s.u.DirectUpdateHandler2 end_commit_flush
   [junit4]   2> 894099 INFO  (searcherExecutor-4944-thread-1-processing-n:127.0.0.1:46301_solr x:cdcr-source_shard1_replica_n1 c:cdcr-source s:shard1 r:core_node2) [n:127.0.0.1:46301_solr c:cdcr-source s:shard1 r:core_node2 x:cdcr-source_shard1_replica_n1] o.a.s.c.SolrCore [cdcr-source_shard1_replica_n1] Registered new searcher Searcher@bd9bbf7[cdcr-source_shard1_replica_n1] main{ExitableDirectoryReader(UninvertingDirectoryReader(Uninverting(_0(7.6.0):C100)))}
   [junit4]   2> 894099 INFO  (qtp1299774436-11610) [n:127.0.0.1:46301_solr c:cdcr-source s:shard1 r:core_node2 x:cdcr-source_shard1_replica_n1] o.a.s.u.p.LogUpdateProcessorFactory [cdcr-source_shard1_replica_n1]  webapp=/solr path=/update params={_stateVer_=cdcr-source:4&waitSearcher=true&commit=true&softCommit=false&wt=javabin&version=2}{commit=} 0 208
   [junit4]   2> 894101 INFO  (qtp1299774436-11609) [n:127.0.0.1:46301_solr c:cdcr-source s:shard1 r:core_node2 x:cdcr-source_shard1_replica_n1] o.a.s.u.p.LogUpdateProcessorFactory [cdcr-source_shard1_replica_n1]  webapp=/solr path=/update params={_stateVer_=cdcr-source:4&wt=javabin&version=2}{add=[source_100 (1612931944553644032), source_101 (1612931944553644033), source_102 (1612931944553644034), source_103 (1612931944553644035), source_104 (1612931944553644036), source_105 (1612931944553644037), source_106 (1612931944553644038), source_107 (1612931944553644039), source_108 (1612931944554692608), source_109 (1612931944554692609), ... (100 adds)]} 0 2
   [junit4]   2> 894102 INFO  (qtp1299774436-11610) [n:127.0.0.1:46301_solr c:cdcr-source s:shard1 r:core_node2 x:cdcr-source_shard1_replica_n1] o.a.s.u.DirectUpdateHandler2 start commit{_version_=1612931944555741184,optimize=false,openSearcher=true,waitSearcher=true,expungeDeletes=false,softCommit=false,prepareCommit=false}
   [junit4]   2> 894102 INFO  (qtp1299774436-11610) [n:127.0.0.1:46301_solr c:cdcr-source s:shard1 r:core_node2 x:cdcr-source_shard1_replica_n1] o.a.s.u.SolrIndexWriter Calling setCommitData with IW:org.apache.solr.update.SolrIndexWriter@7adb9b56 commitCommandVersion:1612931944555741184
   [junit4]   2> 894331 INFO  (qtp1299774436-11610) [n:127.0.0.1:46301_solr c:cdcr-source s:shard1 r:core_node2 x:cdcr-source_shard1_replica_n1] o.a.s.s.SolrIndexSearcher Opening [Searcher@2bde5144[cdcr-source_shard1_replica_n1] main]
   [junit4]   2> 894332 INFO  (qtp1299774436-11610) [n:127.0.0.1:46301_solr c:cdcr-source s:shard1 r:core_node2 x:cdcr-source_shard1_replica_n1] o.a.s.u.DirectUpdateHandler2 end_commit_flush
   [junit4]   2> 894333 INFO  (searcherExecutor-4944-thread-1-processing-n:127.0.0.1:46301_solr x:cdcr-source_shard1_replica_n1 c:cdcr-source s:shard1 r:core_node2) [n:127.0.0.1:46301_solr c:cdcr-source s:shard1 r:core_node2 x:cdcr-source_shard1_replica_n1] o.a.s.c.SolrCore [cdcr-source_shard1_replica_n1] Registered new searcher Searcher@2bde5144[cdcr-source_shard1_replica_n1] main{ExitableDirectoryReader(UninvertingDirectoryReader(Uninverting(_0(7.6.0):C100) Uninverting(_1(7.6.0):C100)))}
   [junit4]   2> 894333 INFO  (qtp1299774436-11610) [n:127.0.0.1:46301_solr c:cdcr-source s:shard1 r:core_node2 x:cdcr-source_shard1_replica_n1] o.a.s.u.p.LogUpdateProcessorFactory [cdcr-source_shard1_replica_n1]  webapp=/solr path=/update params={_stateVer_=cdcr-source:4&waitSearcher=true&commit=true&softCommit=false&wt=javabin&version=2}{commit=} 0 231
   [junit4]   2> 894336 INFO  (qtp1299774436-11609) [n:127.0.0.1:46301_solr c:cdcr-source s:shard1 r:core_node2 x:cdcr-source_shard1_replica_n1] o.a.s.u.p.LogUpdateProcessorFactory [cdcr-source_shard1_replica_n1]  webapp=/solr path=/update params={_stateVer_=cdcr-source:4&wt=javabin&version=2}{add=[source_200 (1612931944799010816), source_201 (1612931944800059392), source_202 (1612931944800059393), source_203 (1612931944800059394), source_204 (1612931944800059395), source_205 (1612931944800059396), source_206 (1612931944800059397), source_207 (1612931944800059398), source_208 (1612931944800059399), source_209 (1612931944800059400), ... (100 adds)]} 0 1
   [junit4]   2> 894336 INFO  (qtp1299774436-11610) [n:127.0.0.1:46301_solr c:cdcr-source s:shard1 r:core_node2 x:cdcr-source_shard1_replica_n1] o.a.s.u.DirectUpdateHandler2 start commit{_version_=1612931944801107981,optimize=false,openSearcher=true,waitSearcher=true,expungeDeletes=false,softCommit=false,prepareCommit=false}
   [junit4]   2> 894336 INFO  (qtp1299774436-11610) [n:127.0.0.1:46301_solr c:cdcr-source s:shard1 r:core_node2 x:cdcr-source_shard1_replica_n1] o.a.s.u.SolrIndexWriter Calling setCommitData with IW:org.apache.solr.update.SolrIndexWriter@7adb9b56 commitCommandVersion:1612931944801107981
   [junit4]   2> 894760 INFO  (qtp1299774436-11610) [n:127.0.0.1:46301_solr c:cdcr-source s:shard1 r:core_node2 x:cdcr-source_shard1_replica_n1] o.a.s.s.SolrIndexSearcher Opening [Searcher@ceea846[cdcr-source_shard1_replica_n1] main]
   [junit4]   2> 894761 INFO  (qtp1299774436-11610) [n:127.0.0.1:46301_solr c:cdcr-source s:shard1 r:core_node2 x:cdcr-source_shard1_replica_n1] o.a.s.u.DirectUpdateHandler2 end_commit_flush
   [junit4]   2> 894761 INFO  (searcherExecutor-4944-thread-1-processing-n:127.0.0.1:46301_solr x:cdcr-source_shard1_replica_n1 c:cdcr-source s:shard1 r:core_node2) [n:127.0.0.1:46301_solr c:cdcr-source s:shard1 r:core_node2 x:cdcr-source_shard1_replica_n1] o.a.s.c.SolrCore [cdcr-source_shard1_replica_n1] Registered new searcher Searcher@ceea846[cdcr-source_shard1_replica_n1] main{ExitableDirectoryReader(UninvertingDirectoryReader(Uninverting(_0(7.6.0):C100) Uninverting(_1(7.6.0):C100) Uninverting(_2(7.6.0):C100)))}
   [junit4]   2> 894762 INFO  (qtp1299774436-11610) [n:127.0.0.1:46301_solr c:cdcr-source s:shard1 r:core_node2 x:cdcr-source_shard1_replica_n1] o.a.s.u.p.LogUpdateProcessorFactory [cdcr-source_shard1_replica_n1]  webapp=/solr path=/update params={_stateVer_=cdcr-source:4&waitSearcher=true&commit=true&softCommit=false&wt=javabin&version=2}{commit=} 0 425
   [junit4]   2> 894764 INFO  (qtp1299774436-11609) [n:127.0.0.1:46301_solr c:cdcr-source s:shard1 r:core_node2 x:cdcr-source_shard1_replica_n1] o.a.s.u.p.LogUpdateProcessorFactory [cdcr-source_shard1_replica_n1]  webapp=/solr path=/update params={_stateVer_=cdcr-source:4&wt=javabin&version=2}{add=[source_300 (1612931945247801344), source_301 (1612931945248849920), source_302 (1612931945248849921), source_303 (1612931945248849922), source_304 (1612931945248849923), source_305 (1612931945248849924), source_306 (1612931945248849925), source_307 (1612931945248849926), source_308 (1612931945248849927), source_309 (1612931945248849928), ... (100 adds)]} 0 1
   [junit4]   2> 894765 INFO  (qtp1299774436-11610) [n:127.0.0.1:46301_solr c:cdcr-source s:shard1 r:core_node2 x:cdcr-source_shard1_replica_n1] o.a.s.u.DirectUpdateHandler2 start commit{_version_=1612931945250947072,optimize=false,openSearcher=true,waitSearcher=true,expungeDeletes=false,softCommit=false,prepareCommit=false}
   [junit4]   2> 894765 INFO  (qtp1299774436-11610) [n:127.0.0.1:46301_solr c:cdcr-source s:shard1 r:core_node2 x:cdcr-source_shard1_replica_n1] o.a.s.u.SolrIndexWriter Calling setCommitData with IW:org.apache.solr.update.SolrIndexWriter@7adb9b56 commitCommandVersion:1612931945250947072
   [junit4]   2> 895249 INFO  (qtp1299774436-11610) [n:127.0.0.1:46301_solr c:cdcr-source s:shard1 r:core_node2 x:cdcr-source_shard1_replica_n1] o.a.s.s.SolrIndexSearcher Opening [Searcher@4f3f8da5[cdcr-source_shard1_replica_n1] main]
   [junit4]   2> 895250 INFO  (qtp1299774436-11610) [n:127.0.0.1:46301_solr c:cdcr-source s:shard1 r:core_node2 x:cdcr-source_shard1_replica_n1] o.a.s.u.DirectUpdateHandler2 end_commit_flush
   [junit4]   2> 895251 INFO  (searcherExecutor-4944-thread-1-processing-n:127.0.0.1:46301_solr x:cdcr-source_shard1_replica_n1 c:cdcr-source s:shard1 r:core_node2) [n:127.0.0.1:46301_solr c:cdcr-source s:shard1 r:core_node2 x:cdcr-source_shard1_replica_n1] o.a.s.c.SolrCore [cdcr-source_shard1_replica_n1] Registered new searcher Searcher@4f3f8da5[cdcr-source_shard1_replica_n1] main{ExitableDirectoryReader(UninvertingDirectoryReader(Uninverting(_0(7.6.0):C100) Uninverting(_1(7.6.0):C100) Uninverting(_2(7.6.0):C100) Uninverting(_3(7.6.0):C100)))}
   [junit4]   2> 895251 INFO  (qtp1299774436-11610) [n:127.0.0.1:46301_solr c:cdcr-source s:shard1 r:core_node2 x:cdcr-source_shard1_replica_n1] o.a.s.u.p.LogUpdateProcessorFactory [cdcr-source_shard1_replica_n1]  webapp=/solr path=/update params={_stateVer_=cdcr-source:4&waitSearcher=true&commit=true&softCommit=false&wt=javabin&version=2}{commit=} 0 486
   [junit4]   2> 895255 INFO  (qtp1299774436-11609) [n:127.0.0.1:46301_solr c:cdcr-source s:shard1 r:core_node2 x:cdcr-source_shard1_replica_n1] o.a.s.u.p.LogUpdateProcessorFactory [cdcr-source_shard1_replica_n1]  webapp=/solr path=/update params={_stateVer_=cdcr-source:4&wt=javabin&version=2}{add=[source_400 (1612931945761603584), source_401 (1612931945762652160), source_402 (1612931945762652161), source_403 (1612931945762652162), source_404 (1612931945762652163), source_405 (1612931945762652164), source_406 (1612931945762652165), source_407 (1612931945762652166), source_408 (1612931945762652167), source_409 (1612931945762652168), ... (100 adds)]} 0 2
   [junit4]   2> 895255 INFO  (qtp1299774436-11610) [n:127.0.0.1:46301_solr c:cdcr-source s:shard1 r:core_node2 x:cdcr-source_shard1_replica_n1] o.a.s.u.DirectUpdateHandler2 start commit{_version_=1612931945764749314,optimize=false,openSearcher=true,waitSearcher=true,expungeDeletes=false,softCommit=false,prepareCommit=false}
   [junit4]   2> 895255 INFO  (qtp1299774436-11610) [n:127.0.0.1:46301_solr c:cdcr-source s:shard1 r:core_node2 x:cdcr-source_shard1_replica_n1] o.a.s.u.SolrIndexWriter Calling setCommitData with IW:org.apache.solr.update.SolrIndexWriter@7adb9b56 commitCommandVersion:1612931945764749314
   [junit4]   2> 895821 INFO  (qtp1299774436-11610) [n:127.0.0.1:46301_solr c:cdcr-source s:shard1 r:core_node2 x:cdcr-source_shard1_replica_n1] o.a.s.s.SolrIndexSearcher Opening [Searcher@41eeef12[cdcr-source_shard1_replica_n1] main]
   [junit4]   2> 895821 INFO  (qtp1299774436-11610) [n:127.0.0.1:46301_solr c:cdcr-source s:shard1 r:core_node2 x:cdcr-source_shard1_replica_n1] o.a.s.u.DirectUpdateHandler2 end_commit_flush
   [junit4]   2> 895822 INFO  (searcherExecutor-4944-thread-1-processing-n:127.0.0.1:46301_solr x:cdcr-source_shard1_replica_n1 c:cdcr-source s:shard1 r:core_node2) [n:127.0.0.1:46301_solr c:cdcr-source s:shard1 r:core_node2 x:cdcr-source_shard1_replica_n1] o.a.s.c.SolrCore [cdcr-source_shard1_replica_n1] Registered new searcher Searcher@41eeef12[cdcr-source_shard1_replica_n1] main{ExitableDirectoryReader(UninvertingDirectoryReader(Uninverting(_0(7.6.0):C100) Uninverting(_1(7.6.0):C100) Uninverting(_2(7.6.0):C100) Uninverting(_3(7.6.0):C100) Uninverting(_4(7.6.0):C100)))}
   [junit4]   2> 895822 INFO  (qtp1299774436-11610) [n:127.0.0.1:46301_solr c:cdcr-source s:shard1 r:core_node2 x:cdcr-source_shard1_replica_n1] o.a.s.u.p.LogUpdateProcessorFactory [cdcr-source_shard1_replica_n1]  webapp=/solr path=/update params={_stateVer_=cdcr-source:4&waitSearcher=true&commit=true&softCommit=false&wt=javabin&version=2}{commit=} 0 567
   [junit4]   2> 895825 INFO  (qtp1299774436-11609) [n:127.0.0.1:46301_solr c:cdcr-source s:shard1 r:core_node2 x:cdcr-source_shard1_replica_n1] o.a.s.u.p.LogUpdateProcessorFactory [cdcr-source_shard1_replica_n1]  webapp=/solr path=/update params={_stateVer_=cdcr-source:4&wt=javabin&version=2}{add=[source_500 (1612931946360340480), source_501 (1612931946361389056), source_502 (1612931946361389057), source_503 (1612931946361389058), source_504 (1612931946361389059), source_505 (1612931946361389060), source_506 (1612931946361389061), source_507 (1612931946361389062), source_508 (1612931946361389063), source_509 (1612931946361389064), ... (100 adds)]} 0 2
   [junit4]   2> 895826 INFO  (qtp1299774436-11610) [n:127.0.0.1:46301_solr c:cdcr-source s:shard1 r:core_node2 x:cdcr-source_shard1_replica_n1] o.a.s.u.DirectUpdateHandler2 start commit{_version_=1612931946363486208,optimize=false,openSearcher=true,waitSearcher=true,expungeDeletes=false,softCommit=false,prepareCommit=false}
   [junit4]   2> 895826 INFO  (qtp1299774436-11610) [n:127.0.0.1:46301_solr c:cdcr-source s:shard1 r:core_node2 x:cdcr-source_shard1_replica_n1] o.a.s.u.SolrIndexWriter Calling setCommitData with IW:org.apache.solr.update.SolrIndexWriter@7adb9b56 commitCommandVersion:1612931946363486208
   [junit4]   2> 897243 INFO  (qtp1299774436-11610) [n:127.0.0.1:46301_solr c:cdcr-source s:shard1 r:core_node2 x:cdcr-source_shard1_replica_n1] o.a.s.s.SolrIndexSearcher Opening [Searcher@870da72[cdcr-source_shard1_replica_n1] main]
   [junit4]   2> 897243 INFO  (qtp1299774436-11610) [n:127.0.0.1:46301_solr c:cdcr-source s:shard1 r:core_node2 x:cdcr-source_shard1_replica_n1] o.a.s.u.DirectUpdateHandler2 end_commit_flush
   [junit4]   2> 897244 INFO  (searcherExecutor-4944-thread-1-processing-n:127.0.0.1:46301_solr x:cdcr-source_shard1_replica_n1 c:cdcr-source s:shard1 r:core_node2) [n:127.0.0.1:46301_solr c:cdcr-source s:shard1 r:core_node2 x:cdcr-source_shard1_replica_n1] o.a.s.c.SolrCore [cdcr-source_shard1_replica_n1] Registered new searcher Searcher@870da72[cdcr-source_shard1_replica_n1] main{ExitableDirectoryReader(UninvertingDirectoryReader(Uninverting(_0(7.6.0):C100) Uninverting(_1(7.6.0):C100) Uninverting(_2(7.6.0):C100) Uninverting(_3(7.6.0):C100) Uninverting(_4(7.6.0):C100) Uninverting(_5(7.6.0):C100)))}
   [junit4]   2> 897244 INFO  (qtp1299774436-11610) [n:127.0.0.1:46301_solr c:cdcr-source s:shard1 r:core_node2 x:cdcr-source_shard1_replica_n1] o.a.s.u.p.LogUpdateProcessorFactory [cdcr-source_shard1_replica_n1]  webapp=/solr path=/update params={_stateVer_=cdcr-source:4&waitSearcher=true&commit=true&softCommit=false&wt=javabin&version=2}{commit=} 0 1418
   [junit4]   2> 897247 INFO  (qtp1299774436-11609) [n:127.0.0.1:46301_solr c:cdcr-source s:shard1 r:core_node2 x:cdcr-source_shard1_replica_n1] o.a.s.u.p.LogUpdateProcessorFactory [cdcr-source_shard1_replica_n1]  webapp=/solr path=/update params={_stateVer_=cdcr-source:4&wt=javabin&version=2}{add=[source_600 (1612931947851415552), source_601 (1612931947852464128), source_602 (1612931947852464129), source_603 (1612931947852464130), source_604 (1612931947852464131), source_605 (1612931947852464132), source_606 (1612931947852464133), source_607 (1612931947852464134), source_608 (1612931947852464135), source_609 (1612931947852464136), ... (100 adds)]} 0 2
   [junit4]   2> 897248 INFO  (qtp1299774436-11610) [n:127.0.0.1:46301_solr c:cdcr-source s:shard1 r:core_n

[...truncated too long message...]

.call(HttpSolrCall.java:496)
   [junit4]   2> 	at org.apache.solr.servlet.SolrDispatchFilter.doFilter(SolrDispatchFilter.java:377)
   [junit4]   2> 	at org.apache.solr.servlet.SolrDispatchFilter.doFilter(SolrDispatchFilter.java:323)
   [junit4]   2> 	at org.eclipse.jetty.servlet.ServletHandler$CachedChain.doFilter(ServletHandler.java:1642)
   [junit4]   2> 	at org.apache.solr.client.solrj.embedded.JettySolrRunner$DebugFilter.doFilter(JettySolrRunner.java:139)
   [junit4]   2> 	at org.eclipse.jetty.servlet.ServletHandler$CachedChain.doFilter(ServletHandler.java:1642)
   [junit4]   2> 	at org.eclipse.jetty.servlet.ServletHandler.doHandle(ServletHandler.java:533)
   [junit4]   2> 	at org.eclipse.jetty.server.handler.ScopedHandler.nextHandle(ScopedHandler.java:255)
   [junit4]   2> 	at org.eclipse.jetty.server.session.SessionHandler.doHandle(SessionHandler.java:1595)
   [junit4]   2> 	at org.eclipse.jetty.server.handler.ScopedHandler.nextHandle(ScopedHandler.java:255)
   [junit4]   2> 	at org.eclipse.jetty.server.handler.ContextHandler.doHandle(ContextHandler.java:1317)
   [junit4]   2> 	at org.eclipse.jetty.server.handler.ScopedHandler.nextScope(ScopedHandler.java:203)
   [junit4]   2> 	at org.eclipse.jetty.servlet.ServletHandler.doScope(ServletHandler.java:473)
   [junit4]   2> 	at org.eclipse.jetty.server.session.SessionHandler.doScope(SessionHandler.java:1564)
   [junit4]   2> 	at org.eclipse.jetty.server.handler.ScopedHandler.nextScope(ScopedHandler.java:201)
   [junit4]   2> 	at org.eclipse.jetty.server.handler.ContextHandler.doScope(ContextHandler.java:1219)
   [junit4]   2> 	at org.eclipse.jetty.server.handler.ScopedHandler.handle(ScopedHandler.java:144)
   [junit4]   2> 	at org.eclipse.jetty.server.handler.gzip.GzipHandler.handle(GzipHandler.java:724)
   [junit4]   2> 	at org.eclipse.jetty.server.handler.HandlerWrapper.handle(HandlerWrapper.java:132)
   [junit4]   2> 	at org.eclipse.jetty.server.Server.handle(Server.java:531)
   [junit4]   2> 	at org.eclipse.jetty.server.HttpChannel.handle(HttpChannel.java:352)
   [junit4]   2> 	at org.eclipse.jetty.server.HttpConnection.onFillable(HttpConnection.java:260)
   [junit4]   2> 	at org.eclipse.jetty.io.AbstractConnection$ReadCallback.succeeded(AbstractConnection.java:281)
   [junit4]   2> 	at org.eclipse.jetty.io.FillInterest.fillable(FillInterest.java:102)
   [junit4]   2> 	at org.eclipse.jetty.io.ssl.SslConnection.onFillable(SslConnection.java:291)
   [junit4]   2> 	at org.eclipse.jetty.io.ssl.SslConnection$3.succeeded(SslConnection.java:151)
   [junit4]   2> 	at org.eclipse.jetty.io.FillInterest.fillable(FillInterest.java:102)
   [junit4]   2> 	at org.eclipse.jetty.io.ChannelEndPoint$2.run(ChannelEndPoint.java:118)
   [junit4]   2> 	at org.eclipse.jetty.util.thread.strategy.EatWhatYouKill.runTask(EatWhatYouKill.java:333)
   [junit4]   2> 	at org.eclipse.jetty.util.thread.strategy.EatWhatYouKill.doProduce(EatWhatYouKill.java:310)
   [junit4]   2> 	at org.eclipse.jetty.util.thread.strategy.EatWhatYouKill.tryProduce(EatWhatYouKill.java:168)
   [junit4]   2> 	at org.eclipse.jetty.util.thread.strategy.EatWhatYouKill.run(EatWhatYouKill.java:126)
   [junit4]   2> 	at org.eclipse.jetty.util.thread.ReservedThreadExecutor$ReservedThread.run(ReservedThreadExecutor.java:366)
   [junit4]   2> 	at org.eclipse.jetty.util.thread.QueuedThreadPool.runJob(QueuedThreadPool.java:762)
   [junit4]   2> 	at org.eclipse.jetty.util.thread.QueuedThreadPool$2.run(QueuedThreadPool.java:680)
   [junit4]   2> 	at java.base/java.lang.Thread.run(Thread.java:834)
   [junit4]   2> 
   [junit4]   2> 1088674 INFO  (qtp1194395097-8546) [n:127.0.0.1:45019_    x:collection1_shard1_replica_n47] o.a.s.s.HttpSolrCall [admin] webapp=null path=/admin/cores params={nodeName=127.0.0.1:33471_&onlyIfLeaderActive=true&core=collection1_shard1_replica_n47&coreNodeName=core_node44&action=PREPRECOVERY&checkLive=true&state=recovering&onlyIfLeader=true&wt=javabin&version=2} status=400 QTime=3001
   [junit4]   2> 1088675 INFO  (TEST-ShardSplitTest.testSplitStaticIndexReplication-seed#[60E535E50EE90E50]) [    ] o.a.s.c.ChaosMonkey monkey: stop jetty! 36579
   [junit4]   2> 1088675 ERROR (TEST-ShardSplitTest.testSplitStaticIndexReplication-seed#[60E535E50EE90E50]) [    ] o.a.z.s.ZooKeeperServer ZKShutdownHandler is not registered, so ZooKeeper server won't take any action on ERROR or SHUTDOWN server state changes
   [junit4]   2> 1088676 INFO  (TEST-ShardSplitTest.testSplitStaticIndexReplication-seed#[60E535E50EE90E50]) [    ] o.a.s.c.ZkTestServer connecting to 127.0.0.1:38277 38277
   [junit4]   2> 1088871 INFO  (Thread-1296) [    ] o.a.s.c.ZkTestServer connecting to 127.0.0.1:38277 38277
   [junit4]   2> 1088872 WARN  (Thread-1296) [    ] o.a.s.c.ZkTestServer Watch limit violations: 
   [junit4]   2> Maximum concurrent create/delete watches above limit:
   [junit4]   2> 
   [junit4]   2> 	15	/solr/aliases.json
   [junit4]   2> 	12	/solr/collections/collection1/terms/shard1
   [junit4]   2> 	11	/solr/collections/testSplitStaticIndexReplication_rewrite/terms/shard1_0
   [junit4]   2> 	10	/solr/collections/collection1/state.json
   [junit4]   2> 	9	/solr/collections/collection1/terms/shard2
   [junit4]   2> 	6	/solr/security.json
   [junit4]   2> 	6	/solr/configs/conf1
   [junit4]   2> 	4	/solr/collections/testSplitStaticIndexReplication_rewrite/terms/shard1
   [junit4]   2> 	4	/solr/collections/testSplitStaticIndexReplication_rewrite/terms/shard1_1
   [junit4]   2> 	3	/solr/collections/control_collection/terms/shard1
   [junit4]   2> 
   [junit4]   2> Maximum concurrent data watches above limit:
   [junit4]   2> 
   [junit4]   2> 	15	/solr/clusterprops.json
   [junit4]   2> 	15	/solr/clusterstate.json
   [junit4]   2> 	11	/solr/collections/testSplitStaticIndexReplication_rewrite/state.json
   [junit4]   2> 	4	/solr/autoscaling.json
   [junit4]   2> 	2	/solr/overseer_elect/election/72307377908023307-127.0.0.1:33253_-n_0000000001
   [junit4]   2> 
   [junit4]   2> Maximum concurrent children watches above limit:
   [junit4]   2> 
   [junit4]   2> 	15	/solr/live_nodes
   [junit4]   2> 	15	/solr/collections
   [junit4]   2> 	4	/solr/overseer/queue
   [junit4]   2> 	4	/solr/autoscaling/events/.scheduled_maintenance
   [junit4]   2> 	4	/solr/autoscaling/events/.auto_add_replicas
   [junit4]   2> 	4	/solr/overseer/queue-work
   [junit4]   2> 	4	/solr/overseer/collection-queue-work
   [junit4]   2> 
   [junit4] OK      31.5s J0 | ShardSplitTest.testSplitStaticIndexReplication
   [junit4]   2> NOTE: leaving temporary files on disk at: /home/jenkins/workspace/Lucene-Solr-7.x-Linux/solr/build/solr-core/test/J0/temp/solr.cloud.api.collections.ShardSplitTest_60E535E50EE90E50-002
   [junit4]   2> Sep 29, 2018 10:09:13 AM com.carrotsearch.randomizedtesting.ThreadLeakControl checkThreadLeaks
   [junit4]   2> WARNING: Will linger awaiting termination of 1 leaked thread(s).
   [junit4]   2> NOTE: test params are: codec=Asserting(Lucene70): {rnd_b=FSTOrd50, shard_s=PostingsFormat(name=MockRandom), n_ti=PostingsFormat(name=MockRandom), a_t=PostingsFormat(name=MockRandom), a_i=FSTOrd50, foo_s=PostingsFormat(name=MockRandom), id=FSTOrd50}, docValues:{rnd_b=DocValuesFormat(name=Memory), shard_s=DocValuesFormat(name=Lucene70), _version_=DocValuesFormat(name=Lucene70), n_ti=DocValuesFormat(name=Lucene70), a_t=DocValuesFormat(name=Lucene70), a_i=DocValuesFormat(name=Memory), id=DocValuesFormat(name=Memory), foo_s=DocValuesFormat(name=Lucene70)}, maxPointsInLeafNode=1320, maxMBSortInHeap=5.5955523366854765, sim=RandomSimilarity(queryNorm=true): {}, locale=kl-GL, timezone=MIT
   [junit4]   2> NOTE: Linux 4.15.0-32-generic amd64/Oracle Corporation 11 (64-bit)/cpus=8,threads=1,free=334384712,total=536870912
   [junit4]   2> NOTE: All tests run in this JVM: [RulesTest, ShardSplitTest, ShardSplitTest]
   [junit4] Completed [15/15 (7!)] on J0 in 499.82s, 10 tests, 1 failure <<< FAILURES!

[...truncated 18 lines...]
BUILD FAILED
/home/jenkins/workspace/Lucene-Solr-7.x-Linux/lucene/common-build.xml:1567: The following error occurred while executing this line:
/home/jenkins/workspace/Lucene-Solr-7.x-Linux/lucene/common-build.xml:1092: There were test failures: 15 suites, 100 tests, 5 errors, 3 failures [seed: 60E535E50EE90E50]

Total time: 18 minutes 12 seconds

[repro] Setting last failure code to 256

[repro] Failures:
[repro]   2/5 failed: org.apache.solr.cloud.cdcr.CdcrBootstrapTest
[repro]   2/5 failed: org.apache.solr.cloud.rule.RulesTest
[repro]   3/5 failed: org.apache.solr.cloud.api.collections.ShardSplitTest
[repro] Exiting with code 256
+ mv lucene/build lucene/build.repro
+ mv solr/build solr/build.repro
+ mv lucene/build.orig lucene/build
+ mv solr/build.orig solr/build
Archiving artifacts
Setting ANT_1_8_2_HOME=/var/lib/jenkins/tools/hudson.tasks.Ant_AntInstallation/ANT_1.8.2
[WARNINGS] Parsing warnings in console log with parser Java Compiler (javac)
Setting ANT_1_8_2_HOME=/var/lib/jenkins/tools/hudson.tasks.Ant_AntInstallation/ANT_1.8.2
Setting ANT_1_8_2_HOME=/var/lib/jenkins/tools/hudson.tasks.Ant_AntInstallation/ANT_1.8.2
<Git Blamer> Using GitBlamer to create author and commit information for all warnings.
<Git Blamer> GIT_COMMIT=216f10026b86627750e133fe24ce6a750c470695, workspace=/var/lib/jenkins/workspace/Lucene-Solr-7.x-Linux
[WARNINGS] Computing warning deltas based on reference build #2826
Recording test results
Setting ANT_1_8_2_HOME=/var/lib/jenkins/tools/hudson.tasks.Ant_AntInstallation/ANT_1.8.2
Build step 'Publish JUnit test result report' changed build result to UNSTABLE
Email was triggered for: Unstable (Test Failures)
Sending email for trigger: Unstable (Test Failures)
Setting ANT_1_8_2_HOME=/var/lib/jenkins/tools/hudson.tasks.Ant_AntInstallation/ANT_1.8.2
Setting ANT_1_8_2_HOME=/var/lib/jenkins/tools/hudson.tasks.Ant_AntInstallation/ANT_1.8.2
Setting ANT_1_8_2_HOME=/var/lib/jenkins/tools/hudson.tasks.Ant_AntInstallation/ANT_1.8.2
Setting ANT_1_8_2_HOME=/var/lib/jenkins/tools/hudson.tasks.Ant_AntInstallation/ANT_1.8.2

Mime
View raw message