lucene-dev mailing list archives

Site index · List index
Message view « Date » · « Thread »
Top « Date » · « Thread »
From Apache Jenkins Server <jenk...@builds.apache.org>
Subject [JENKINS] Lucene-Solr-Tests-master - Build # 2822 - Unstable
Date Wed, 26 Sep 2018 01:30:38 GMT
Build: https://builds.apache.org/job/Lucene-Solr-Tests-master/2822/

3 tests failed.
FAILED:  junit.framework.TestSuite.org.apache.solr.rest.TestManagedResourceStorage

Error Message:
SolrCore.getOpenCount()==2

Stack Trace:
java.lang.RuntimeException: SolrCore.getOpenCount()==2
	at __randomizedtesting.SeedInfo.seed([CE69CED49B2E6122]:0)
	at org.apache.solr.util.TestHarness.close(TestHarness.java:380)
	at org.apache.solr.SolrTestCaseJ4.deleteCore(SolrTestCaseJ4.java:802)
	at org.apache.solr.cloud.AbstractZkTestCase.azt_afterClass(AbstractZkTestCase.java:147)
	at sun.reflect.NativeMethodAccessorImpl.invoke0(Native Method)
	at sun.reflect.NativeMethodAccessorImpl.invoke(NativeMethodAccessorImpl.java:62)
	at sun.reflect.DelegatingMethodAccessorImpl.invoke(DelegatingMethodAccessorImpl.java:43)
	at java.lang.reflect.Method.invoke(Method.java:498)
	at com.carrotsearch.randomizedtesting.RandomizedRunner.invoke(RandomizedRunner.java:1742)
	at com.carrotsearch.randomizedtesting.RandomizedRunner$7.evaluate(RandomizedRunner.java:898)
	at com.carrotsearch.randomizedtesting.rules.StatementAdapter.evaluate(StatementAdapter.java:36)
	at com.carrotsearch.randomizedtesting.rules.SystemPropertiesRestoreRule$1.evaluate(SystemPropertiesRestoreRule.java:57)
	at org.apache.lucene.util.AbstractBeforeAfterRule$1.evaluate(AbstractBeforeAfterRule.java:45)
	at com.carrotsearch.randomizedtesting.rules.StatementAdapter.evaluate(StatementAdapter.java:36)
	at org.apache.lucene.util.TestRuleStoreClassName$1.evaluate(TestRuleStoreClassName.java:41)
	at com.carrotsearch.randomizedtesting.rules.NoShadowingOrOverridesOnMethodsRule$1.evaluate(NoShadowingOrOverridesOnMethodsRule.java:40)
	at com.carrotsearch.randomizedtesting.rules.NoShadowingOrOverridesOnMethodsRule$1.evaluate(NoShadowingOrOverridesOnMethodsRule.java:40)
	at com.carrotsearch.randomizedtesting.rules.StatementAdapter.evaluate(StatementAdapter.java:36)
	at com.carrotsearch.randomizedtesting.rules.StatementAdapter.evaluate(StatementAdapter.java:36)
	at com.carrotsearch.randomizedtesting.rules.StatementAdapter.evaluate(StatementAdapter.java:36)
	at org.apache.lucene.util.TestRuleAssertionsRequired$1.evaluate(TestRuleAssertionsRequired.java:53)
	at org.apache.lucene.util.TestRuleMarkFailure$1.evaluate(TestRuleMarkFailure.java:47)
	at org.apache.lucene.util.TestRuleIgnoreAfterMaxFailures$1.evaluate(TestRuleIgnoreAfterMaxFailures.java:64)
	at org.apache.lucene.util.TestRuleIgnoreTestSuites$1.evaluate(TestRuleIgnoreTestSuites.java:54)
	at com.carrotsearch.randomizedtesting.rules.StatementAdapter.evaluate(StatementAdapter.java:36)
	at com.carrotsearch.randomizedtesting.ThreadLeakControl$StatementRunner.run(ThreadLeakControl.java:368)
	at java.lang.Thread.run(Thread.java:748)


FAILED:  junit.framework.TestSuite.org.apache.solr.rest.TestManagedResourceStorage

Error Message:
4 threads leaked from SUITE scope at org.apache.solr.rest.TestManagedResourceStorage:     1) Thread[id=10054, name=NIOServerCxn.Factory:0.0.0.0/0.0.0.0:0, state=RUNNABLE, group=TGRP-TestManagedResourceStorage]         at sun.nio.ch.EPollArrayWrapper.epollWait(Native Method)         at sun.nio.ch.EPollArrayWrapper.poll(EPollArrayWrapper.java:269)         at sun.nio.ch.EPollSelectorImpl.doSelect(EPollSelectorImpl.java:93)         at sun.nio.ch.SelectorImpl.lockAndDoSelect(SelectorImpl.java:86)         at sun.nio.ch.SelectorImpl.select(SelectorImpl.java:97)         at org.apache.zookeeper.server.NIOServerCnxnFactory.run(NIOServerCnxnFactory.java:196)         at java.lang.Thread.run(Thread.java:748)    2) Thread[id=10053, name=Thread-2224, state=WAITING, group=TGRP-TestManagedResourceStorage]         at java.lang.Object.wait(Native Method)         at java.lang.Thread.join(Thread.java:1252)         at java.lang.Thread.join(Thread.java:1326)         at org.apache.zookeeper.server.NIOServerCnxnFactory.join(NIOServerCnxnFactory.java:313)         at org.apache.solr.cloud.ZkTestServer$ZKServerMain.runFromConfig(ZkTestServer.java:313)         at org.apache.solr.cloud.ZkTestServer$2.run(ZkTestServer.java:496)    3) Thread[id=10055, name=SessionTracker, state=TIMED_WAITING, group=TGRP-TestManagedResourceStorage]         at java.lang.Object.wait(Native Method)         at org.apache.zookeeper.server.SessionTrackerImpl.run(SessionTrackerImpl.java:147)    4) Thread[id=10057, name=ProcessThread(sid:0 cport:34593):, state=WAITING, group=TGRP-TestManagedResourceStorage]         at sun.misc.Unsafe.park(Native Method)         at java.util.concurrent.locks.LockSupport.park(LockSupport.java:175)         at java.util.concurrent.locks.AbstractQueuedSynchronizer$ConditionObject.await(AbstractQueuedSynchronizer.java:2039)         at java.util.concurrent.LinkedBlockingQueue.take(LinkedBlockingQueue.java:442)         at org.apache.zookeeper.server.PrepRequestProcessor.run(PrepRequestProcessor.java:123)

Stack Trace:
com.carrotsearch.randomizedtesting.ThreadLeakError: 4 threads leaked from SUITE scope at org.apache.solr.rest.TestManagedResourceStorage: 
   1) Thread[id=10054, name=NIOServerCxn.Factory:0.0.0.0/0.0.0.0:0, state=RUNNABLE, group=TGRP-TestManagedResourceStorage]
        at sun.nio.ch.EPollArrayWrapper.epollWait(Native Method)
        at sun.nio.ch.EPollArrayWrapper.poll(EPollArrayWrapper.java:269)
        at sun.nio.ch.EPollSelectorImpl.doSelect(EPollSelectorImpl.java:93)
        at sun.nio.ch.SelectorImpl.lockAndDoSelect(SelectorImpl.java:86)
        at sun.nio.ch.SelectorImpl.select(SelectorImpl.java:97)
        at org.apache.zookeeper.server.NIOServerCnxnFactory.run(NIOServerCnxnFactory.java:196)
        at java.lang.Thread.run(Thread.java:748)
   2) Thread[id=10053, name=Thread-2224, state=WAITING, group=TGRP-TestManagedResourceStorage]
        at java.lang.Object.wait(Native Method)
        at java.lang.Thread.join(Thread.java:1252)
        at java.lang.Thread.join(Thread.java:1326)
        at org.apache.zookeeper.server.NIOServerCnxnFactory.join(NIOServerCnxnFactory.java:313)
        at org.apache.solr.cloud.ZkTestServer$ZKServerMain.runFromConfig(ZkTestServer.java:313)
        at org.apache.solr.cloud.ZkTestServer$2.run(ZkTestServer.java:496)
   3) Thread[id=10055, name=SessionTracker, state=TIMED_WAITING, group=TGRP-TestManagedResourceStorage]
        at java.lang.Object.wait(Native Method)
        at org.apache.zookeeper.server.SessionTrackerImpl.run(SessionTrackerImpl.java:147)
   4) Thread[id=10057, name=ProcessThread(sid:0 cport:34593):, state=WAITING, group=TGRP-TestManagedResourceStorage]
        at sun.misc.Unsafe.park(Native Method)
        at java.util.concurrent.locks.LockSupport.park(LockSupport.java:175)
        at java.util.concurrent.locks.AbstractQueuedSynchronizer$ConditionObject.await(AbstractQueuedSynchronizer.java:2039)
        at java.util.concurrent.LinkedBlockingQueue.take(LinkedBlockingQueue.java:442)
        at org.apache.zookeeper.server.PrepRequestProcessor.run(PrepRequestProcessor.java:123)
	at __randomizedtesting.SeedInfo.seed([CE69CED49B2E6122]:0)


FAILED:  junit.framework.TestSuite.org.apache.solr.rest.TestManagedResourceStorage

Error Message:
There are still zombie threads that couldn't be terminated:    1) Thread[id=10054, name=NIOServerCxn.Factory:0.0.0.0/0.0.0.0:0, state=RUNNABLE, group=TGRP-TestManagedResourceStorage]         at sun.nio.ch.EPollArrayWrapper.epollWait(Native Method)         at sun.nio.ch.EPollArrayWrapper.poll(EPollArrayWrapper.java:269)         at sun.nio.ch.EPollSelectorImpl.doSelect(EPollSelectorImpl.java:93)         at sun.nio.ch.SelectorImpl.lockAndDoSelect(SelectorImpl.java:86)         at sun.nio.ch.SelectorImpl.select(SelectorImpl.java:97)         at org.apache.zookeeper.server.NIOServerCnxnFactory.run(NIOServerCnxnFactory.java:196)         at java.lang.Thread.run(Thread.java:748)

Stack Trace:
com.carrotsearch.randomizedtesting.ThreadLeakError: There are still zombie threads that couldn't be terminated:
   1) Thread[id=10054, name=NIOServerCxn.Factory:0.0.0.0/0.0.0.0:0, state=RUNNABLE, group=TGRP-TestManagedResourceStorage]
        at sun.nio.ch.EPollArrayWrapper.epollWait(Native Method)
        at sun.nio.ch.EPollArrayWrapper.poll(EPollArrayWrapper.java:269)
        at sun.nio.ch.EPollSelectorImpl.doSelect(EPollSelectorImpl.java:93)
        at sun.nio.ch.SelectorImpl.lockAndDoSelect(SelectorImpl.java:86)
        at sun.nio.ch.SelectorImpl.select(SelectorImpl.java:97)
        at org.apache.zookeeper.server.NIOServerCnxnFactory.run(NIOServerCnxnFactory.java:196)
        at java.lang.Thread.run(Thread.java:748)
	at __randomizedtesting.SeedInfo.seed([CE69CED49B2E6122]:0)




Build Log:
[...truncated 13486 lines...]
   [junit4] Suite: org.apache.solr.rest.TestManagedResourceStorage
   [junit4]   2> Creating dataDir: /x1/jenkins/jenkins-slave/workspace/Lucene-Solr-Tests-master/solr/build/solr-core/test/J1/temp/solr.rest.TestManagedResourceStorage_CE69CED49B2E6122-001/init-core-data-001
   [junit4]   2> 815690 WARN  (SUITE-TestManagedResourceStorage-seed#[CE69CED49B2E6122]-worker) [    ] o.a.s.SolrTestCaseJ4 startTrackingSearchers: numOpens=1 numCloses=1
   [junit4]   2> 815690 INFO  (SUITE-TestManagedResourceStorage-seed#[CE69CED49B2E6122]-worker) [    ] o.a.s.SolrTestCaseJ4 Using PointFields (NUMERIC_POINTS_SYSPROP=true) w/NUMERIC_DOCVALUES_SYSPROP=true
   [junit4]   2> 815692 INFO  (SUITE-TestManagedResourceStorage-seed#[CE69CED49B2E6122]-worker) [    ] o.a.s.SolrTestCaseJ4 Randomized ssl (false) and clientAuth (true) via: @org.apache.solr.util.RandomizeSSL(reason=, ssl=NaN, value=NaN, clientAuth=NaN)
   [junit4]   2> 815692 INFO  (SUITE-TestManagedResourceStorage-seed#[CE69CED49B2E6122]-worker) [    ] o.a.s.SolrTestCaseJ4 SecureRandom sanity checks: test.solr.allowed.securerandom=null & java.security.egd=file:/dev/./urandom
   [junit4]   2> 815692 INFO  (SUITE-TestManagedResourceStorage-seed#[CE69CED49B2E6122]-worker) [    ] o.a.s.c.ZkTestServer STARTING ZK TEST SERVER
   [junit4]   2> 815709 INFO  (Thread-2224) [    ] o.a.s.c.ZkTestServer client port:0.0.0.0/0.0.0.0:0
   [junit4]   2> 815709 INFO  (Thread-2224) [    ] o.a.s.c.ZkTestServer Starting server
   [junit4]   2> 815722 ERROR (Thread-2224) [    ] o.a.z.s.ZooKeeperServer ZKShutdownHandler is not registered, so ZooKeeper server won't take any action on ERROR or SHUTDOWN server state changes
   [junit4]   2> 815809 INFO  (SUITE-TestManagedResourceStorage-seed#[CE69CED49B2E6122]-worker) [    ] o.a.s.c.ZkTestServer start zk server on port:34593
   [junit4]   2> 815845 INFO  (zkConnectionManagerCallback-2946-thread-1) [    ] o.a.s.c.c.ConnectionManager zkClient has connected
   [junit4]   2> 815865 INFO  (zkConnectionManagerCallback-2948-thread-1) [    ] o.a.s.c.c.ConnectionManager zkClient has connected
   [junit4]   2> 815869 INFO  (SUITE-TestManagedResourceStorage-seed#[CE69CED49B2E6122]-worker) [    ] o.a.s.c.AbstractZkTestCase put /x1/jenkins/jenkins-slave/workspace/Lucene-Solr-Tests-master/solr/core/src/test-files/solr/collection1/conf/solrconfig.xml to /configs/conf1/solrconfig.xml
   [junit4]   2> 815870 INFO  (SUITE-TestManagedResourceStorage-seed#[CE69CED49B2E6122]-worker) [    ] o.a.s.c.AbstractZkTestCase put /x1/jenkins/jenkins-slave/workspace/Lucene-Solr-Tests-master/solr/core/src/test-files/solr/collection1/conf/schema.xml to /configs/conf1/schema.xml
   [junit4]   2> 815871 INFO  (SUITE-TestManagedResourceStorage-seed#[CE69CED49B2E6122]-worker) [    ] o.a.s.c.AbstractZkTestCase put /x1/jenkins/jenkins-slave/workspace/Lucene-Solr-Tests-master/solr/core/src/test-files/solr/collection1/conf/solrconfig.snippet.randomindexconfig.xml to /configs/conf1/solrconfig.snippet.randomindexconfig.xml
   [junit4]   2> 815872 INFO  (SUITE-TestManagedResourceStorage-seed#[CE69CED49B2E6122]-worker) [    ] o.a.s.c.AbstractZkTestCase put /x1/jenkins/jenkins-slave/workspace/Lucene-Solr-Tests-master/solr/core/src/test-files/solr/collection1/conf/stopwords.txt to /configs/conf1/stopwords.txt
   [junit4]   2> 815873 INFO  (SUITE-TestManagedResourceStorage-seed#[CE69CED49B2E6122]-worker) [    ] o.a.s.c.AbstractZkTestCase put /x1/jenkins/jenkins-slave/workspace/Lucene-Solr-Tests-master/solr/core/src/test-files/solr/collection1/conf/protwords.txt to /configs/conf1/protwords.txt
   [junit4]   2> 815874 INFO  (SUITE-TestManagedResourceStorage-seed#[CE69CED49B2E6122]-worker) [    ] o.a.s.c.AbstractZkTestCase put /x1/jenkins/jenkins-slave/workspace/Lucene-Solr-Tests-master/solr/core/src/test-files/solr/collection1/conf/currency.xml to /configs/conf1/currency.xml
   [junit4]   2> 815875 INFO  (SUITE-TestManagedResourceStorage-seed#[CE69CED49B2E6122]-worker) [    ] o.a.s.c.AbstractZkTestCase put /x1/jenkins/jenkins-slave/workspace/Lucene-Solr-Tests-master/solr/core/src/test-files/solr/collection1/conf/enumsConfig.xml to /configs/conf1/enumsConfig.xml
   [junit4]   2> 815881 INFO  (SUITE-TestManagedResourceStorage-seed#[CE69CED49B2E6122]-worker) [    ] o.a.s.c.AbstractZkTestCase put /x1/jenkins/jenkins-slave/workspace/Lucene-Solr-Tests-master/solr/core/src/test-files/solr/collection1/conf/open-exchange-rates.json to /configs/conf1/open-exchange-rates.json
   [junit4]   2> 815882 INFO  (SUITE-TestManagedResourceStorage-seed#[CE69CED49B2E6122]-worker) [    ] o.a.s.c.AbstractZkTestCase put /x1/jenkins/jenkins-slave/workspace/Lucene-Solr-Tests-master/solr/core/src/test-files/solr/collection1/conf/mapping-ISOLatin1Accent.txt to /configs/conf1/mapping-ISOLatin1Accent.txt
   [junit4]   2> 815884 INFO  (SUITE-TestManagedResourceStorage-seed#[CE69CED49B2E6122]-worker) [    ] o.a.s.c.AbstractZkTestCase put /x1/jenkins/jenkins-slave/workspace/Lucene-Solr-Tests-master/solr/core/src/test-files/solr/collection1/conf/old_synonyms.txt to /configs/conf1/old_synonyms.txt
   [junit4]   2> 815884 INFO  (SUITE-TestManagedResourceStorage-seed#[CE69CED49B2E6122]-worker) [    ] o.a.s.c.AbstractZkTestCase put /x1/jenkins/jenkins-slave/workspace/Lucene-Solr-Tests-master/solr/core/src/test-files/solr/collection1/conf/synonyms.txt to /configs/conf1/synonyms.txt
   [junit4]   2> 815886 INFO  (SUITE-TestManagedResourceStorage-seed#[CE69CED49B2E6122]-worker) [    ] o.a.s.SolrTestCaseJ4 ####initCore
   [junit4]   2> 815887 INFO  (SUITE-TestManagedResourceStorage-seed#[CE69CED49B2E6122]-worker) [    ] o.a.s.c.SolrResourceLoader [null] Added 2 libs to classloader, from paths: [/x1/jenkins/jenkins-slave/workspace/Lucene-Solr-Tests-master/solr/core/src/test-files/solr/collection1/lib, /x1/jenkins/jenkins-slave/workspace/Lucene-Solr-Tests-master/solr/core/src/test-files/solr/collection1/lib/classes]
   [junit4]   2> 815945 INFO  (SUITE-TestManagedResourceStorage-seed#[CE69CED49B2E6122]-worker) [    ] o.a.s.c.SolrConfig Using Lucene MatchVersion: 8.0.0
   [junit4]   2> 815969 INFO  (SUITE-TestManagedResourceStorage-seed#[CE69CED49B2E6122]-worker) [    ] o.a.s.s.IndexSchema [null] Schema name=test
   [junit4]   2> 816174 INFO  (SUITE-TestManagedResourceStorage-seed#[CE69CED49B2E6122]-worker) [    ] o.a.s.s.IndexSchema Loaded schema test/1.0 with uniqueid field id
   [junit4]   2> 816454 INFO  (SUITE-TestManagedResourceStorage-seed#[CE69CED49B2E6122]-worker) [    ] o.a.s.c.ZkContainer Zookeeper client=127.0.0.1:34593/solr
   [junit4]   2> 816456 INFO  (zkConnectionManagerCallback-2952-thread-1) [    ] o.a.s.c.c.ConnectionManager zkClient has connected
   [junit4]   2> 816458 INFO  (zkConnectionManagerCallback-2954-thread-1) [    ] o.a.s.c.c.ConnectionManager zkClient has connected
   [junit4]   2> 816517 INFO  (SUITE-TestManagedResourceStorage-seed#[CE69CED49B2E6122]-worker) [n:10.41.0.5:8983_    ] o.a.s.c.OverseerElectionContext I am going to be the leader 10.41.0.5:8983_
   [junit4]   2> 816517 INFO  (SUITE-TestManagedResourceStorage-seed#[CE69CED49B2E6122]-worker) [n:10.41.0.5:8983_    ] o.a.s.c.Overseer Overseer (id=72399202314878979-10.41.0.5:8983_-n_0000000000) starting
   [junit4]   2> 816549 INFO  (zkConnectionManagerCallback-2961-thread-1) [    ] o.a.s.c.c.ConnectionManager zkClient has connected
   [junit4]   2> 816551 INFO  (SUITE-TestManagedResourceStorage-seed#[CE69CED49B2E6122]-worker) [n:10.41.0.5:8983_    ] o.a.s.c.s.i.ZkClientClusterStateProvider Cluster at 127.0.0.1:34593/solr ready
   [junit4]   2> 816561 INFO  (OverseerStateUpdate-72399202314878979-10.41.0.5:8983_-n_0000000000) [n:10.41.0.5:8983_    ] o.a.s.c.Overseer Starting to work on the main queue : 10.41.0.5:8983_
   [junit4]   2> 816569 INFO  (SUITE-TestManagedResourceStorage-seed#[CE69CED49B2E6122]-worker) [n:10.41.0.5:8983_    ] o.a.s.c.ZkController Register node as live in ZooKeeper:/live_nodes/10.41.0.5:8983_
   [junit4]   2> 816573 INFO  (zkCallback-2960-thread-1) [    ] o.a.s.c.c.ZkStateReader Updated live nodes from ZooKeeper... (0) -> (1)
   [junit4]   2> 816589 INFO  (zkCallback-2953-thread-1) [    ] o.a.s.c.c.ZkStateReader Updated live nodes from ZooKeeper... (0) -> (1)
   [junit4]   2> 816641 INFO  (SUITE-TestManagedResourceStorage-seed#[CE69CED49B2E6122]-worker) [n:10.41.0.5:8983_    ] o.a.s.h.a.MetricsHistoryHandler No .system collection, keeping metrics history in memory.
   [junit4]   2> 816660 INFO  (SUITE-TestManagedResourceStorage-seed#[CE69CED49B2E6122]-worker) [n:10.41.0.5:8983_    ] o.a.s.m.r.SolrJmxReporter JMX monitoring for 'solr.node' (registry 'solr.node') enabled at server: com.sun.jmx.mbeanserver.JmxMBeanServer@58f30964
   [junit4]   2> 816677 INFO  (SUITE-TestManagedResourceStorage-seed#[CE69CED49B2E6122]-worker) [n:10.41.0.5:8983_    ] o.a.s.m.r.SolrJmxReporter JMX monitoring for 'solr.jvm' (registry 'solr.jvm') enabled at server: com.sun.jmx.mbeanserver.JmxMBeanServer@58f30964
   [junit4]   2> 816677 INFO  (SUITE-TestManagedResourceStorage-seed#[CE69CED49B2E6122]-worker) [n:10.41.0.5:8983_    ] o.a.s.m.r.SolrJmxReporter JMX monitoring for 'solr.jetty' (registry 'solr.jetty') enabled at server: com.sun.jmx.mbeanserver.JmxMBeanServer@58f30964
   [junit4]   2> 816705 INFO  (coreLoadExecutor-4333-thread-1-processing-n:10.41.0.5:8983_) [n:10.41.0.5:8983_    ] o.a.s.c.TransientSolrCoreCacheDefault Allocating transient cache for 2147483647 transient cores
   [junit4]   2> 817707 INFO  (coreLoadExecutor-4333-thread-1-processing-n:10.41.0.5:8983_) [n:10.41.0.5:8983_ c:collection1 s:shard1  x:collection1] o.a.s.c.SolrResourceLoader [null] Added 2 libs to classloader, from paths: [/x1/jenkins/jenkins-slave/workspace/Lucene-Solr-Tests-master/solr/core/src/test-files/solr/collection1/lib, /x1/jenkins/jenkins-slave/workspace/Lucene-Solr-Tests-master/solr/core/src/test-files/solr/collection1/lib/classes]
   [junit4]   2> 817742 INFO  (coreLoadExecutor-4333-thread-1-processing-n:10.41.0.5:8983_) [n:10.41.0.5:8983_ c:collection1 s:shard1  x:collection1] o.a.s.c.SolrConfig Using Lucene MatchVersion: 8.0.0
   [junit4]   2> 817786 INFO  (coreLoadExecutor-4333-thread-1-processing-n:10.41.0.5:8983_) [n:10.41.0.5:8983_ c:collection1 s:shard1  x:collection1] o.a.s.s.IndexSchema [collection1] Schema name=test
   [junit4]   2> 817955 INFO  (coreLoadExecutor-4333-thread-1-processing-n:10.41.0.5:8983_) [n:10.41.0.5:8983_ c:collection1 s:shard1  x:collection1] o.a.s.s.IndexSchema Loaded schema test/1.0 with uniqueid field id
   [junit4]   2> 817981 INFO  (coreLoadExecutor-4333-thread-1-processing-n:10.41.0.5:8983_) [n:10.41.0.5:8983_ c:collection1 s:shard1  x:collection1] o.a.s.c.CoreContainer Creating SolrCore 'collection1' using configuration from collection collection1, trusted=true
   [junit4]   2> 817981 INFO  (coreLoadExecutor-4333-thread-1-processing-n:10.41.0.5:8983_) [n:10.41.0.5:8983_ c:collection1 s:shard1  x:collection1] o.a.s.m.r.SolrJmxReporter JMX monitoring for 'solr.core.collection1.shard1.10.41.0.5:8983__collection1' (registry 'solr.core.collection1.shard1.10.41.0.5:8983__collection1') enabled at server: com.sun.jmx.mbeanserver.JmxMBeanServer@58f30964
   [junit4]   2> 817982 INFO  (coreLoadExecutor-4333-thread-1-processing-n:10.41.0.5:8983_) [n:10.41.0.5:8983_ c:collection1 s:shard1  x:collection1] o.a.s.c.SolrCore [[collection1] ] Opening new SolrCore at [/x1/jenkins/jenkins-slave/workspace/Lucene-Solr-Tests-master/solr/core/src/test-files/solr/collection1], dataDir=[/x1/jenkins/jenkins-slave/workspace/Lucene-Solr-Tests-master/solr/build/solr-core/test/J1/temp/solr.rest.TestManagedResourceStorage_CE69CED49B2E6122-001/init-core-data-001/]
   [junit4]   2> 817984 INFO  (coreLoadExecutor-4333-thread-1-processing-n:10.41.0.5:8983_) [n:10.41.0.5:8983_ c:collection1 s:shard1  x:collection1] o.a.s.u.RandomMergePolicy RandomMergePolicy wrapping class org.apache.lucene.index.LogDocMergePolicy: [LogDocMergePolicy: minMergeSize=1000, mergeFactor=32, maxMergeSize=9223372036854775807, maxMergeSizeForForcedMerge=9223372036854775807, calibrateSizeByDeletes=false, maxMergeDocs=2147483647, maxCFSSegmentSizeMB=8.796093022207999E12, noCFSRatio=1.0]
   [junit4]   2> 818067 INFO  (coreLoadExecutor-4333-thread-1-processing-n:10.41.0.5:8983_) [n:10.41.0.5:8983_ c:collection1 s:shard1  x:collection1] o.a.s.u.UpdateHandler Using UpdateLog implementation: org.apache.solr.update.UpdateLog
   [junit4]   2> 818067 INFO  (coreLoadExecutor-4333-thread-1-processing-n:10.41.0.5:8983_) [n:10.41.0.5:8983_ c:collection1 s:shard1  x:collection1] o.a.s.u.UpdateLog Initializing UpdateLog: dataDir= defaultSyncLevel=FLUSH numRecordsToKeep=100 maxNumLogsToKeep=10 numVersionBuckets=65536
   [junit4]   2> 818068 INFO  (coreLoadExecutor-4333-thread-1-processing-n:10.41.0.5:8983_) [n:10.41.0.5:8983_ c:collection1 s:shard1  x:collection1] o.a.s.u.CommitTracker Hard AutoCommit: disabled
   [junit4]   2> 818068 INFO  (coreLoadExecutor-4333-thread-1-processing-n:10.41.0.5:8983_) [n:10.41.0.5:8983_ c:collection1 s:shard1  x:collection1] o.a.s.u.CommitTracker Soft AutoCommit: disabled
   [junit4]   2> 818069 INFO  (coreLoadExecutor-4333-thread-1-processing-n:10.41.0.5:8983_) [n:10.41.0.5:8983_ c:collection1 s:shard1  x:collection1] o.a.s.u.RandomMergePolicy RandomMergePolicy wrapping class org.apache.lucene.index.LogByteSizeMergePolicy: [LogByteSizeMergePolicy: minMergeSize=1677721, mergeFactor=5, maxMergeSize=2147483648, maxMergeSizeForForcedMerge=9223372036854775807, calibrateSizeByDeletes=false, maxMergeDocs=2147483647, maxCFSSegmentSizeMB=8.796093022207999E12, noCFSRatio=0.22003201900586228]
   [junit4]   2> 818070 INFO  (coreLoadExecutor-4333-thread-1-processing-n:10.41.0.5:8983_) [n:10.41.0.5:8983_ c:collection1 s:shard1  x:collection1] o.a.s.s.SolrIndexSearcher Opening [Searcher@4ebc4999[collection1] main]
   [junit4]   2> 818071 INFO  (coreLoadExecutor-4333-thread-1-processing-n:10.41.0.5:8983_) [n:10.41.0.5:8983_ c:collection1 s:shard1  x:collection1] o.a.s.h.c.SpellCheckComponent Initializing spell checkers
   [junit4]   2> 818078 INFO  (coreLoadExecutor-4333-thread-1-processing-n:10.41.0.5:8983_) [n:10.41.0.5:8983_ c:collection1 s:shard1  x:collection1] o.a.s.s.DirectSolrSpellChecker init: {name=direct,classname=DirectSolrSpellChecker,field=lowerfilt,minQueryLength=3}
   [junit4]   2> 818107 INFO  (coreLoadExecutor-4333-thread-1-processing-n:10.41.0.5:8983_) [n:10.41.0.5:8983_ c:collection1 s:shard1  x:collection1] o.a.s.h.ReplicationHandler Commits will be reserved for 10000ms.
   [junit4]   2> 818108 INFO  (searcherExecutor-4334-thread-1-processing-n:10.41.0.5:8983_ x:collection1 c:collection1 s:shard1) [n:10.41.0.5:8983_ c:collection1 s:shard1  x:collection1] o.a.s.h.c.SpellCheckComponent Loading spell index for spellchecker: default
   [junit4]   2> 818108 INFO  (coreLoadExecutor-4333-thread-1-processing-n:10.41.0.5:8983_) [n:10.41.0.5:8983_ c:collection1 s:shard1  x:collection1] o.a.s.u.UpdateLog Could not find max version in index or recent updates, using new clock 1612629998366097408
   [junit4]   2> 818108 INFO  (searcherExecutor-4334-thread-1-processing-n:10.41.0.5:8983_ x:collection1 c:collection1 s:shard1) [n:10.41.0.5:8983_ c:collection1 s:shard1  x:collection1] o.a.s.h.c.SpellCheckComponent Loading spell index for spellchecker: direct
   [junit4]   2> 818108 INFO  (searcherExecutor-4334-thread-1-processing-n:10.41.0.5:8983_ x:collection1 c:collection1 s:shard1) [n:10.41.0.5:8983_ c:collection1 s:shard1  x:collection1] o.a.s.h.c.SpellCheckComponent Loading spell index for spellchecker: wordbreak
   [junit4]   2> 818108 INFO  (searcherExecutor-4334-thread-1-processing-n:10.41.0.5:8983_ x:collection1 c:collection1 s:shard1) [n:10.41.0.5:8983_ c:collection1 s:shard1  x:collection1] o.a.s.h.c.SpellCheckComponent Loading spell index for spellchecker: multipleFields
   [junit4]   2> 818108 INFO  (searcherExecutor-4334-thread-1-processing-n:10.41.0.5:8983_ x:collection1 c:collection1 s:shard1) [n:10.41.0.5:8983_ c:collection1 s:shard1  x:collection1] o.a.s.h.c.SpellCheckComponent Loading spell index for spellchecker: jarowinkler
   [junit4]   2> 818108 INFO  (searcherExecutor-4334-thread-1-processing-n:10.41.0.5:8983_ x:collection1 c:collection1 s:shard1) [n:10.41.0.5:8983_ c:collection1 s:shard1  x:collection1] o.a.s.h.c.SpellCheckComponent Loading spell index for spellchecker: external
   [junit4]   2> 818108 INFO  (searcherExecutor-4334-thread-1-processing-n:10.41.0.5:8983_ x:collection1 c:collection1 s:shard1) [n:10.41.0.5:8983_ c:collection1 s:shard1  x:collection1] o.a.s.h.c.SpellCheckComponent Loading spell index for spellchecker: freq
   [junit4]   2> 818109 INFO  (searcherExecutor-4334-thread-1-processing-n:10.41.0.5:8983_ x:collection1 c:collection1 s:shard1) [n:10.41.0.5:8983_ c:collection1 s:shard1  x:collection1] o.a.s.h.c.SpellCheckComponent Loading spell index for spellchecker: fqcn
   [junit4]   2> 818109 INFO  (searcherExecutor-4334-thread-1-processing-n:10.41.0.5:8983_ x:collection1 c:collection1 s:shard1) [n:10.41.0.5:8983_ c:collection1 s:shard1  x:collection1] o.a.s.h.c.SpellCheckComponent Loading spell index for spellchecker: perDict
   [junit4]   2> 818110 INFO  (searcherExecutor-4334-thread-1-processing-n:10.41.0.5:8983_ x:collection1 c:collection1 s:shard1) [n:10.41.0.5:8983_ c:collection1 s:shard1  x:collection1] o.a.s.c.SolrCore [collection1] Registered new searcher Searcher@4ebc4999[collection1] main{ExitableDirectoryReader(UninvertingDirectoryReader())}
   [junit4]   2> 818114 INFO  (SUITE-TestManagedResourceStorage-seed#[CE69CED49B2E6122]-worker) [n:10.41.0.5:8983_    ] o.a.s.SolrTestCaseJ4 ####initCore end
   [junit4]   2> 818121 INFO  (TEST-TestManagedResourceStorage.testFileBasedJsonStorage-seed#[CE69CED49B2E6122]) [n:10.41.0.5:8983_    ] o.a.s.SolrTestCaseJ4 ###Starting testFileBasedJsonStorage
   [junit4]   2> 818121 INFO  (TEST-TestManagedResourceStorage.testFileBasedJsonStorage-seed#[CE69CED49B2E6122]) [n:10.41.0.5:8983_    ] o.a.s.r.ManagedResourceStorage File-based storage initialized to use dir: /x1/jenkins/jenkins-slave/workspace/Lucene-Solr-Tests-master/solr/build/solr-core/test/J1/temp/solr.rest.TestManagedResourceStorage_CE69CED49B2E6122-001/json-storage-001/managed
   [junit4]   2> 818122 INFO  (TEST-TestManagedResourceStorage.testFileBasedJsonStorage-seed#[CE69CED49B2E6122]) [n:10.41.0.5:8983_    ] o.a.s.r.ManagedResourceStorage Saved JSON object to path _test_foo.json using file:dir=/x1/jenkins/jenkins-slave/workspace/Lucene-Solr-Tests-master/solr/build/solr-core/test/J1/temp/solr.rest.TestManagedResourceStorage_CE69CED49B2E6122-001/json-storage-001/managed
   [junit4]   2> 818122 INFO  (TEST-TestManagedResourceStorage.testFileBasedJsonStorage-seed#[CE69CED49B2E6122]) [n:10.41.0.5:8983_    ] o.a.s.r.ManagedResourceStorage Loaded LinkedHashMap at path _test_foo.json using file:dir=/x1/jenkins/jenkins-slave/workspace/Lucene-Solr-Tests-master/solr/build/solr-core/test/J1/temp/solr.rest.TestManagedResourceStorage_CE69CED49B2E6122-001/json-storage-001/managed
   [junit4]   2> 818122 INFO  (TEST-TestManagedResourceStorage.testFileBasedJsonStorage-seed#[CE69CED49B2E6122]) [n:10.41.0.5:8983_    ] o.a.s.r.ManagedResourceStorage Saved JSON object to path _test_foo.json using file:dir=/x1/jenkins/jenkins-slave/workspace/Lucene-Solr-Tests-master/solr/build/solr-core/test/J1/temp/solr.rest.TestManagedResourceStorage_CE69CED49B2E6122-001/json-storage-001/managed
   [junit4]   2> 818122 INFO  (TEST-TestManagedResourceStorage.testFileBasedJsonStorage-seed#[CE69CED49B2E6122]) [n:10.41.0.5:8983_    ] o.a.s.r.ManagedResourceStorage Loaded LinkedHashMap at path _test_foo.json using file:dir=/x1/jenkins/jenkins-slave/workspace/Lucene-Solr-Tests-master/solr/build/solr-core/test/J1/temp/solr.rest.TestManagedResourceStorage_CE69CED49B2E6122-001/json-storage-001/managed
   [junit4]   2> 818123 INFO  (TEST-TestManagedResourceStorage.testFileBasedJsonStorage-seed#[CE69CED49B2E6122]) [n:10.41.0.5:8983_    ] o.a.s.SolrTestCaseJ4 ###Ending testFileBasedJsonStorage
   [junit4]   2> 818129 INFO  (TEST-TestManagedResourceStorage.testZkBasedJsonStorage-seed#[CE69CED49B2E6122]) [n:10.41.0.5:8983_    ] o.a.s.SolrTestCaseJ4 ###Starting testZkBasedJsonStorage
   [junit4]   2> 818131 INFO  (TEST-TestManagedResourceStorage.testZkBasedJsonStorage-seed#[CE69CED49B2E6122]) [n:10.41.0.5:8983_    ] o.a.s.r.ManagedResourceStorage Configured ZooKeeperStorageIO with znodeBase: /test
   [junit4]   2> 818132 INFO  (TEST-TestManagedResourceStorage.testZkBasedJsonStorage-seed#[CE69CED49B2E6122]) [n:10.41.0.5:8983_    ] o.a.s.r.ManagedResourceStorage Wrote 136 bytes to new znode /test/_test_foo.json
   [junit4]   2> 818132 INFO  (TEST-TestManagedResourceStorage.testZkBasedJsonStorage-seed#[CE69CED49B2E6122]) [n:10.41.0.5:8983_    ] o.a.s.r.ManagedResourceStorage Saved JSON object to path _test_foo.json using ZooKeeperStorageIO:path=/test
   [junit4]   2> 818132 INFO  (coreZkRegister-4321-thread-1-processing-n:10.41.0.5:8983_ x:collection1 c:collection1 s:shard1) [n:10.41.0.5:8983_ c:collection1 s:shard1 r:10.41.0.5:8983__collection1 x:collection1] o.a.s.c.ZkShardTerms Successful update of terms at /collections/collection1/terms/shard1 to Terms{values={10.41.0.5:8983__collection1=0}, version=0}
   [junit4]   2> 818133 INFO  (TEST-TestManagedResourceStorage.testZkBasedJsonStorage-seed#[CE69CED49B2E6122]) [n:10.41.0.5:8983_    ] o.a.s.r.ManagedResourceStorage Loaded LinkedHashMap at path _test_foo.json using ZooKeeperStorageIO:path=/test
   [junit4]   2> 818134 INFO  (TEST-TestManagedResourceStorage.testZkBasedJsonStorage-seed#[CE69CED49B2E6122]) [n:10.41.0.5:8983_    ] o.a.s.r.ManagedResourceStorage Wrote 175 bytes to existing znode /test/_test_foo.json
   [junit4]   2> 818134 INFO  (TEST-TestManagedResourceStorage.testZkBasedJsonStorage-seed#[CE69CED49B2E6122]) [n:10.41.0.5:8983_    ] o.a.s.r.ManagedResourceStorage Saved JSON object to path _test_foo.json using ZooKeeperStorageIO:path=/test
   [junit4]   2> 818134 INFO  (TEST-TestManagedResourceStorage.testZkBasedJsonStorage-seed#[CE69CED49B2E6122]) [n:10.41.0.5:8983_    ] o.a.s.r.ManagedResourceStorage Loaded LinkedHashMap at path _test_foo.json using ZooKeeperStorageIO:path=/test
   [junit4]   2> 818135 INFO  (TEST-TestManagedResourceStorage.testZkBasedJsonStorage-seed#[CE69CED49B2E6122]) [n:10.41.0.5:8983_    ] o.a.s.SolrTestCaseJ4 ###Ending testZkBasedJsonStorage
   [junit4]   2> 818135 INFO  (SUITE-TestManagedResourceStorage-seed#[CE69CED49B2E6122]-worker) [n:10.41.0.5:8983_    ] o.a.s.SolrTestCaseJ4 ###deleteCore
   [junit4]   2> 818135 INFO  (coreZkRegister-4321-thread-1-processing-n:10.41.0.5:8983_ x:collection1 c:collection1 s:shard1) [n:10.41.0.5:8983_ c:collection1 s:shard1 r:10.41.0.5:8983__collection1 x:collection1] o.a.s.c.ShardLeaderElectionContext Enough replicas found to continue.
   [junit4]   2> 818135 INFO  (coreZkRegister-4321-thread-1-processing-n:10.41.0.5:8983_ x:collection1 c:collection1 s:shard1) [n:10.41.0.5:8983_ c:collection1 s:shard1 r:10.41.0.5:8983__collection1 x:collection1] o.a.s.c.ShardLeaderElectionContext I may be the new leader - try and sync
   [junit4]   2> 818135 INFO  (coreZkRegister-4321-thread-1-processing-n:10.41.0.5:8983_ x:collection1 c:collection1 s:shard1) [n:10.41.0.5:8983_ c:collection1 s:shard1 r:10.41.0.5:8983__collection1 x:collection1] o.a.s.c.ShardLeaderElectionContext Found all replicas participating in election, clear LIR
   [junit4]   2> 818136 INFO  (SUITE-TestManagedResourceStorage-seed#[CE69CED49B2E6122]-worker) [n:10.41.0.5:8983_    ] o.a.s.SolrTestCaseJ4 ###deleteCore
   [junit4]   2> 818136 INFO  (SUITE-TestManagedResourceStorage-seed#[CE69CED49B2E6122]-worker) [n:10.41.0.5:8983_    ] o.a.s.c.CoreContainer Shutting down CoreContainer instance=232445106
   [junit4]   2> 818136 INFO  (SUITE-TestManagedResourceStorage-seed#[CE69CED49B2E6122]-worker) [n:10.41.0.5:8983_    ] o.a.s.m.SolrMetricManager Closing metric reporters for registry=solr.node, tag=null
   [junit4]   2> 818136 INFO  (SUITE-TestManagedResourceStorage-seed#[CE69CED49B2E6122]-worker) [n:10.41.0.5:8983_    ] o.a.s.m.r.SolrJmxReporter Closing reporter [org.apache.solr.metrics.reporters.SolrJmxReporter@4dfc8656: rootName = null, domain = solr.node, service url = null, agent id = null] for registry solr.node / com.codahale.metrics.MetricRegistry@3185b96c
   [junit4]   2> 818138 INFO  (coreZkRegister-4321-thread-1-processing-n:10.41.0.5:8983_ x:collection1 c:collection1 s:shard1) [n:10.41.0.5:8983_ c:collection1 s:shard1 r:10.41.0.5:8983__collection1 x:collection1] o.a.s.c.ShardLeaderElectionContext I am the new leader: http://10.41.0.5:8983/collection1/ shard1
   [junit4]   2> 818141 INFO  (SUITE-TestManagedResourceStorage-seed#[CE69CED49B2E6122]-worker) [n:10.41.0.5:8983_    ] o.a.s.m.SolrMetricManager Closing metric reporters for registry=solr.jvm, tag=null
   [junit4]   2> 818141 INFO  (SUITE-TestManagedResourceStorage-seed#[CE69CED49B2E6122]-worker) [n:10.41.0.5:8983_    ] o.a.s.m.r.SolrJmxReporter Closing reporter [org.apache.solr.metrics.reporters.SolrJmxReporter@2fa07a6c: rootName = null, domain = solr.jvm, service url = null, agent id = null] for registry solr.jvm / com.codahale.metrics.MetricRegistry@6bde06cf
   [junit4]   2> 818144 INFO  (SUITE-TestManagedResourceStorage-seed#[CE69CED49B2E6122]-worker) [n:10.41.0.5:8983_    ] o.a.s.m.SolrMetricManager Closing metric reporters for registry=solr.jetty, tag=null
   [junit4]   2> 818144 INFO  (SUITE-TestManagedResourceStorage-seed#[CE69CED49B2E6122]-worker) [n:10.41.0.5:8983_    ] o.a.s.m.r.SolrJmxReporter Closing reporter [org.apache.solr.metrics.reporters.SolrJmxReporter@33df1a0f: rootName = null, domain = solr.jetty, service url = null, agent id = null] for registry solr.jetty / com.codahale.metrics.MetricRegistry@2164259c
   [junit4]   2> 818145 INFO  (SUITE-TestManagedResourceStorage-seed#[CE69CED49B2E6122]-worker) [n:10.41.0.5:8983_    ] o.a.s.c.ZkController Remove node as live in ZooKeeper:/live_nodes/10.41.0.5:8983_
   [junit4]   2> 818145 INFO  (zkCallback-2960-thread-1) [    ] o.a.s.c.c.ZkStateReader Updated live nodes from ZooKeeper... (1) -> (0)
   [junit4]   2> 818146 INFO  (SUITE-TestManagedResourceStorage-seed#[CE69CED49B2E6122]-worker) [n:10.41.0.5:8983_    ] o.a.s.m.SolrMetricManager Closing metric reporters for registry=solr.cluster, tag=null
   [junit4]   2> 818146 INFO  (zkCallback-2953-thread-2) [    ] o.a.s.c.c.ZkStateReader Updated live nodes from ZooKeeper... (1) -> (0)
   [junit4]   2> 818147 INFO  (coreCloseExecutor-4339-thread-1-processing-n:10.41.0.5:8983_) [n:10.41.0.5:8983_ c:collection1 s:shard1 r:10.41.0.5:8983__collection1 x:collection1] o.a.s.c.SolrCore [collection1]  CLOSING SolrCore org.apache.solr.core.SolrCore@51015f2c
   [junit4]   2> 818147 INFO  (coreCloseExecutor-4339-thread-1-processing-n:10.41.0.5:8983_) [n:10.41.0.5:8983_ c:collection1 s:shard1 r:10.41.0.5:8983__collection1 x:collection1] o.a.s.m.SolrMetricManager Closing metric reporters for registry=solr.core.collection1.shard1.10.41.0.5:8983__collection1, tag=51015f2c
   [junit4]   2> 818147 INFO  (coreCloseExecutor-4339-thread-1-processing-n:10.41.0.5:8983_) [n:10.41.0.5:8983_ c:collection1 s:shard1 r:10.41.0.5:8983__collection1 x:collection1] o.a.s.m.r.SolrJmxReporter Closing reporter [org.apache.solr.metrics.reporters.SolrJmxReporter@b82c82b: rootName = null, domain = solr.core.collection1.shard1.10.41.0.5:8983__collection1, service url = null, agent id = null] for registry solr.core.collection1.shard1.10.41.0.5:8983__collection1 / com.codahale.metrics.MetricRegistry@97b8eea
   [junit4]   2> 818160 INFO  (coreCloseExecutor-4339-thread-1-processing-n:10.41.0.5:8983_) [n:10.41.0.5:8983_ c:collection1 s:shard1 r:10.41.0.5:8983__collection1 x:collection1] o.a.s.m.SolrMetricManager Closing metric reporters for registry=solr.collection.collection1.shard1.leader, tag=51015f2c
   [junit4]   2> 818162 INFO  (SUITE-TestManagedResourceStorage-seed#[CE69CED49B2E6122]-worker) [n:10.41.0.5:8983_    ] o.a.s.c.Overseer Overseer (id=72399202314878979-10.41.0.5:8983_-n_0000000000) closing
   [junit4]   2> 818162 WARN  (OverseerAutoScalingTriggerThread-72399202314878979-10.41.0.5:8983_-n_0000000000) [    ] o.a.s.c.a.OverseerTriggerThread OverseerTriggerThread woken up but we are closed, exiting.
   [junit4]   2> 818162 INFO  (OverseerStateUpdate-72399202314878979-10.41.0.5:8983_-n_0000000000) [n:10.41.0.5:8983_    ] o.a.s.c.Overseer Overseer Loop exiting : 10.41.0.5:8983_
   [junit4]   2> 818190 ERROR (coreZkRegister-4321-thread-1-processing-n:10.41.0.5:8983_ x:collection1 c:collection1 s:shard1) [n:10.41.0.5:8983_ c:collection1 s:shard1 r:10.41.0.5:8983__collection1 x:collection1] o.a.s.c.ZkController Error getting leader from zk
   [junit4]   2> org.apache.solr.common.SolrException: No registered leader was found after waiting for 1560000ms , collection: collection1 slice: shard1 saw state=DocCollection(collection1//clusterstate.json/1)={
   [junit4]   2>   "shards":{"shard1":{
   [junit4]   2>       "parent":null,
   [junit4]   2>       "range":null,
   [junit4]   2>       "state":"active",
   [junit4]   2>       "replicas":{"10.41.0.5:8983__collection1":{
   [junit4]   2>           "core":"collection1",
   [junit4]   2>           "base_url":"http://10.41.0.5:8983",
   [junit4]   2>           "node_name":"10.41.0.5:8983_",
   [junit4]   2>           "state":"down",
   [junit4]   2>           "type":"NRT"}}}},
   [junit4]   2>   "router":{"name":"implicit"}} with live_nodes=[]
   [junit4]   2> 	at org.apache.solr.common.cloud.ZkStateReader.getLeaderRetry(ZkStateReader.java:861) ~[java/:?]
   [junit4]   2> 	at org.apache.solr.common.cloud.ZkStateReader.getLeaderUrl(ZkStateReader.java:826) ~[java/:?]
   [junit4]   2> 	at org.apache.solr.cloud.ZkController.getLeader(ZkController.java:1269) ~[java/:?]
   [junit4]   2> 	at org.apache.solr.cloud.ZkController.register(ZkController.java:1149) ~[java/:?]
   [junit4]   2> 	at org.apache.solr.cloud.ZkController.register(ZkController.java:1080) ~[java/:?]
   [junit4]   2> 	at org.apache.solr.core.ZkContainer.lambda$registerInZk$0(ZkContainer.java:187) ~[java/:?]
   [junit4]   2> 	at org.apache.solr.common.util.ExecutorUtil$MDCAwareThreadPoolExecutor.lambda$execute$0(ExecutorUtil.java:209) ~[java/:?]
   [junit4]   2> 	at java.util.concurrent.ThreadPoolExecutor.runWorker(ThreadPoolExecutor.java:1149) [?:1.8.0_172]
   [junit4]   2> 	at java.util.concurrent.ThreadPoolExecutor$Worker.run(ThreadPoolExecutor.java:624) [?:1.8.0_172]
   [junit4]   2> 	at java.lang.Thread.run(Thread.java:748) [?:1.8.0_172]
   [junit4]   2> 818190 ERROR (coreZkRegister-4321-thread-1-processing-n:10.41.0.5:8983_ x:collection1 c:collection1 s:shard1) [n:10.41.0.5:8983_ c:collection1 s:shard1 r:10.41.0.5:8983__collection1 x:collection1] o.a.s.c.ZkContainer :org.apache.solr.common.SolrException: Error getting leader from zk for shard shard1
   [junit4]   2> 	at org.apache.solr.cloud.ZkController.getLeader(ZkController.java:1298)
   [junit4]   2> 	at org.apache.solr.cloud.ZkController.register(ZkController.java:1149)
   [junit4]   2> 	at org.apache.solr.cloud.ZkController.register(ZkController.java:1080)
   [junit4]   2> 	at org.apache.solr.core.ZkContainer.lambda$registerInZk$0(ZkContainer.java:187)
   [junit4]   2> 	at org.apache.solr.common.util.ExecutorUtil$MDCAwareThreadPoolExecutor.lambda$execute$0(ExecutorUtil.java:209)
   [junit4]   2> 	at java.util.concurrent.ThreadPoolExecutor.runWorker(ThreadPoolExecutor.java:1149)
   [junit4]   2> 	at java.util.concurrent.ThreadPoolExecutor$Worker.run(ThreadPoolExecutor.java:624)
   [junit4]   2> 	at java.lang.Thread.run(Thread.java:748)
   [junit4]   2> Caused by: org.apache.solr.common.SolrException: No registered leader was found after waiting for 1560000ms , collection: collection1 slice: shard1 saw state=DocCollection(collection1//clusterstate.json/1)={
   [junit4]   2>   "shards":{"shard1":{
   [junit4]   2>       "parent":null,
   [junit4]   2>       "range":null,
   [junit4]   2>       "state":"active",
   [junit4]   2>       "replicas":{"10.41.0.5:8983__collection1":{
   [junit4]   2>           "core":"collection1",
   [junit4]   2>           "base_url":"http://10.41.0.5:8983",
   [junit4]   2>           "node_name":"10.41.0.5:8983_",
   [junit4]   2>           "state":"down",
   [junit4]   2>           "type":"NRT"}}}},
   [junit4]   2>   "router":{"name":"implicit"}} with live_nodes=[]
   [junit4]   2> 	at org.apache.solr.common.cloud.ZkStateReader.getLeaderRetry(ZkStateReader.java:861)
   [junit4]   2> 	at org.apache.solr.common.cloud.ZkStateReader.getLeaderUrl(ZkStateReader.java:826)
   [junit4]   2> 	at org.apache.solr.cloud.ZkController.getLeader(ZkController.java:1269)
   [junit4]   2> 	... 7 more
   [junit4]   2> 
   [junit4]   2> 818191 INFO  (SUITE-TestManagedResourceStorage-seed#[CE69CED49B2E6122]-worker) [n:10.41.0.5:8983_    ] o.a.s.SolrTestCaseJ4 ------------------------------------------------------- Done waiting for tracked resources to be released
   [junit4]   2> Sep 26, 2018 1:03:31 AM com.carrotsearch.randomizedtesting.ThreadLeakControl checkThreadLeaks
   [junit4]   2> WARNING: Will linger awaiting termination of 6 leaked thread(s).
   [junit4]   2> Sep 26, 2018 1:04:51 AM com.carrotsearch.randomizedtesting.ThreadLeakControl checkThreadLeaks
   [junit4]   2> SEVERE: 4 threads leaked from SUITE scope at org.apache.solr.rest.TestManagedResourceStorage: 
   [junit4]   2>    1) Thread[id=10054, name=NIOServerCxn.Factory:0.0.0.0/0.0.0.0:0, state=RUNNABLE, group=TGRP-TestManagedResourceStorage]
   [junit4]   2>         at sun.nio.ch.EPollArrayWrapper.epollWait(Native Method)
   [junit4]   2>         at sun.nio.ch.EPollArrayWrapper.poll(EPollArrayWrapper.java:269)
   [junit4]   2>         at sun.nio.ch.EPollSelectorImpl.doSelect(EPollSelectorImpl.java:93)
   [junit4]   2>         at sun.nio.ch.SelectorImpl.lockAndDoSelect(SelectorImpl.java:86)
   [junit4]   2>         at sun.nio.ch.SelectorImpl.select(SelectorImpl.java:97)
   [junit4]   2>         at org.apache.zookeeper.server.NIOServerCnxnFactory.run(NIOServerCnxnFactory.java:196)
   [junit4]   2>         at java.lang.Thread.run(Thread.java:748)
   [junit4]   2>    2) Thread[id=10053, name=Thread-2224, state=WAITING, group=TGRP-TestManagedResourceStorage]
   [junit4]   2>         at java.lang.Object.wait(Native Method)
   [junit4]   2>         at java.lang.Thread.join(Thread.java:1252)
   [junit4]   2>         at java.lang.Thread.join(Thread.java:1326)
   [junit4]   2>         at org.apache.zookeeper.server.NIOServerCnxnFactory.join(NIOServerCnxnFactory.java:313)
   [junit4]   2>         at org.apache.solr.cloud.ZkTestServer$ZKServerMain.runFromConfig(ZkTestServer.java:313)
   [junit4]   2>         at org.apache.solr.cloud.ZkTestServer$2.run(ZkTestServer.java:496)
   [junit4]   2>    3) Thread[id=10055, name=SessionTracker, state=TIMED_WAITING, group=TGRP-TestManagedResourceStorage]
   [junit4]   2>         at java.lang.Object.wait(Native Method)
   [junit4]   2>         at org.apache.zookeeper.server.SessionTrackerImpl.run(SessionTrackerImpl.java:147)
   [junit4]   2>    4) Thread[id=10057, name=ProcessThread(sid:0 cport:34593):, state=WAITING, group=TGRP-TestManagedResourceStorage]
   [junit4]   2>         at sun.misc.Unsafe.park(Native Method)
   [junit4]   2>         at java.util.concurrent.locks.LockSupport.park(LockSupport.java:175)
   [junit4]   2>         at java.util.concurrent.locks.AbstractQueuedSynchronizer$ConditionObject.await(AbstractQueuedSynchronizer.java:2039)
   [junit4]   2>         at java.util.concurrent.LinkedBlockingQueue.take(LinkedBlockingQueue.java:442)
   [junit4]   2>         at org.apache.zookeeper.server.PrepRequestProcessor.run(PrepRequestProcessor.java:123)
   [junit4]   2> Sep 26, 2018 1:04:51 AM com.carrotsearch.randomizedtesting.ThreadLeakControl tryToInterruptAll
   [junit4]   2> INFO: Starting to interrupt leaked threads:
   [junit4]   2>    1) Thread[id=10054, name=NIOServerCxn.Factory:0.0.0.0/0.0.0.0:0, state=RUNNABLE, group=TGRP-TestManagedResourceStorage]
   [junit4]   2>    2) Thread[id=10053, name=Thread-2224, state=WAITING, group=TGRP-TestManagedResourceStorage]
   [junit4]   2>    3) Thread[id=10055, name=SessionTracker, state=TIMED_WAITING, group=TGRP-TestManagedResourceStorage]
   [junit4]   2>    4) Thread[id=10057, name=ProcessThread(sid:0 cport:34593):, state=WAITING, group=TGRP-TestManagedResourceStorage]
   [junit4]   2> 898214 ERROR (ProcessThread(sid:0 cport:34593):) [    ] o.a.z.s.ZooKeeperCriticalThread Severe unrecoverable error, from thread : ProcessThread(sid:0 cport:34593):
   [junit4]   2> java.lang.InterruptedException: null
   [junit4]   2> 	at java.util.concurrent.locks.AbstractQueuedSynchronizer$ConditionObject.reportInterruptAfterWait(AbstractQueuedSynchronizer.java:2014) ~[?:1.8.0_172]
   [junit4]   2> 	at java.util.concurrent.locks.AbstractQueuedSynchronizer$ConditionObject.await(AbstractQueuedSynchronizer.java:2048) ~[?:1.8.0_172]
   [junit4]   2> 	at java.util.concurrent.LinkedBlockingQueue.take(LinkedBlockingQueue.java:442) ~[?:1.8.0_172]
   [junit4]   2> 	at org.apache.zookeeper.server.PrepRequestProcessor.run(PrepRequestProcessor.java:123) [zookeeper-3.4.11.jar:3.4.11-37e277162d567b55a07d1755f0b31c32e93c01a0]
   [junit4]   2> 898215 ERROR (ProcessThread(sid:0 cport:34593):) [    ] o.a.z.s.ZooKeeperServer ZKShutdownHandler is not registered, so ZooKeeper server won't take any action on ERROR or SHUTDOWN server state changes
   [junit4]   2> 898217 WARN  (Thread-2224) [    ] o.a.s.c.ZkTestServer Server interrupted
   [junit4]   2> java.lang.InterruptedException: null
   [junit4]   2> 	at java.lang.Object.wait(Native Method) ~[?:1.8.0_172]
   [junit4]   2> 	at java.lang.Thread.join(Thread.java:1252) ~[?:1.8.0_172]
   [junit4]   2> 	at java.lang.Thread.join(Thread.java:1326) ~[?:1.8.0_172]
   [junit4]   2> 	at org.apache.zookeeper.server.NIOServerCnxnFactory.join(NIOServerCnxnFactory.java:313) ~[zookeeper-3.4.11.jar:3.4.11-37e277162d567b55a07d1755f0b31c32e93c01a0]
   [junit4]   2> 	at org.apache.solr.cloud.ZkTestServer$ZKServerMain.runFromConfig(ZkTestServer.java:313) [java/:?]
   [junit4]   2> 	at org.apache.solr.cloud.ZkTestServer$2.run(ZkTestServer.java:496) [java/:?]
   [junit4]   2> 898217 ERROR (SessionTracker) [    ] o.a.z.s.ZooKeeperCriticalThread Severe unrecoverable error, from thread : SessionTracker
   [junit4]   2> java.lang.InterruptedException: null
   [junit4]   2> 	at java.lang.Object.wait(Native Method) ~[?:1.8.0_172]
   [junit4]   2> 	at org.apache.zookeeper.server.SessionTrackerImpl.run(SessionTrackerImpl.java:147) [zookeeper-3.4.11.jar:3.4.11-37e277162d567b55a07d1755f0b31c32e93c01a0]
   [junit4]   2> 898217 ERROR (SessionTracker) [    ] o.a.z.s.ZooKeeperServer ZKShutdownHandler is not registered, so ZooKeeper server won't take any action on ERROR or SHUTDOWN server state changes
   [junit4]   2> Sep 26, 2018 1:04:54 AM com.carrotsearch.randomizedtesting.ThreadLeakControl tryToInterruptAll
   [junit4]   2> SEVERE: There are still zombie threads that couldn't be terminated:
   [junit4]   2>    1) Thread[id=10054, name=NIOServerCxn.Factory:0.0.0.0/0.0.0.0:0, state=RUNNABLE, group=TGRP-TestManagedResourceStorage]
   [junit4]   2>         at sun.nio.ch.EPollArrayWrapper.epollWait(Native Method)
   [junit4]   2>         at sun.nio.ch.EPollArrayWrapper.poll(EPollArrayWrapper.java:269)
   [junit4]   2>         at sun.nio.ch.EPollSelectorImpl.doSelect(EPollSelectorImpl.java:93)
   [junit4]   2>         at sun.nio.ch.SelectorImpl.lockAndDoSelect(SelectorImpl.java:86)
   [junit4]   2>         at sun.nio.ch.SelectorImpl.select(SelectorImpl.java:97)
   [junit4]   2>         at org.apache.zookeeper.server.NIOServerCnxnFactory.run(NIOServerCnxnFactory.java:196)
   [junit4]   2>         at java.lang.Thread.run(Thread.java:748)
   [junit4]   2> NOTE: test params are: codec=Asserting(Lucene80): {}, docValues:{}, maxPointsInLeafNode=1821, maxMBSortInHeap=7.765174408568794, sim=Asserting(org.apache.lucene.search.similarities.AssertingSimilarity@220b9fad), locale=en-GB, timezone=America/Sao_Paulo
   [junit4]   2> NOTE: Linux 4.4.0-130-generic amd64/Oracle Corporation 1.8.0_172 (64-bit)/cpus=4,threads=3,free=264598624,total=531628032
   [junit4]   2> NOTE: All tests run in this JVM: [TemplateUpdateProcessorTest, TestSchemaSimilarityResource, TestMultiValuedNumericRangeQuery, LegacyCloudClusterPropTest, TestJsonRequest, SchemaVersionSpecificBehaviorTest, SignatureUpdateProcessorFactoryTest, HdfsWriteToMultipleCollectionsTest, CollectionsAPIAsyncDistributedZkTest, TestQuerySenderListener, TestSQLHandlerNonCloud, TestExclusionRuleCollectionAccess, BigEndianAscendingWordSerializerTest, TestConfigSetsAPIZkFailure, TriggerSetPropertiesIntegrationTest, DocumentAnalysisRequestHandlerTest, RankQueryTest, TestReversedWildcardFilterFactory, CdcrUpdateLogTest, TestSSLRandomization, MinimalSchemaTest, SparseHLLTest, DeleteStatusTest, DistribJoinFromCollectionTest, TestZkAclsWithHadoopAuth, SolrCoreCheckLockOnStartupTest, PeerSyncWithBufferUpdatesTest, NotRequiredUniqueKeyTest, DocumentBuilderTest, TestRecovery, TestAtomicUpdateErrorCases, TestSimDistribStateManager, SolrRrdBackendFactoryTest, TestLeaderElectionZkExpiry, DistanceUnitsTest, MissingSegmentRecoveryTest, MergeStrategyTest, TestDelegationWithHadoopAuth, TestMiniSolrCloudClusterSSL, ShardRoutingTest, TestRTGBase, TestStressInPlaceUpdates, TestCloudDeleteByQuery, TestHdfsUpdateLog, TestSolrXml, DocValuesMissingTest, SolrInfoBeanTest, TestSizeLimitedDistributedMap, InfixSuggestersTest, ExitableDirectoryReaderTest, NodeMarkersRegistrationTest, AutoScalingHandlerTest, TransactionLogTest, TestWithCollection, TestConfigSets, FullHLLTest, TestFieldTypeResource, TestCoreAdminApis, HdfsThreadLeakTest, SSLMigrationTest, ProtectedTermFilterFactoryTest, BooleanFieldTest, MetricTriggerIntegrationTest, HdfsChaosMonkeySafeLeaderTest, TestExactStatsCache, RemoteQueryErrorTest, TestChildDocTransformer, DistributedQueryComponentOptimizationTest, EmbeddedSolrNoSerializeTest, TestSlowCompositeReaderWrapper, TestDefaultStatsCache, TriLevelCompositeIdRoutingTest, LeaderFailureAfterFreshStartTest, TestFieldCache, DisMaxRequestHandlerTest, TestCopyFieldCollectionResource, TestAnalyzeInfixSuggestions, HealthCheckHandlerTest, PluginInfoTest, TestUniqueKeyFieldResource, TestHdfsBackupRestoreCore, SuggestComponentContextFilterQueryTest, TestSolrJ, TestHighFrequencyDictionaryFactory, ShowFileRequestHandlerTest, CdcrOpsAndBoundariesTest, CoreAdminOperationTest, TestPHPSerializedResponseWriter, SpellCheckCollatorWithCollapseTest, InfoHandlerTest, TestNumericTokenStream, TriggerCooldownIntegrationTest, ReplicaListTransformerTest, TestMacros, ScheduledTriggerIntegrationTest, HighlighterTest, PreAnalyzedUpdateProcessorTest, ConfigureRecoveryStrategyTest, BlobRepositoryCloudTest, TestClusterProperties, IgnoreCommitOptimizeUpdateProcessorFactoryTest, SuggesterTSTTest, TestPerFieldSimilarityWithDefaultOverride, SolrGraphiteReporterTest, TestLuceneIndexBackCompat, TestSolr4Spatial2, AssignBackwardCompatibilityTest, RequestHandlersTest, TestInfoStreamLogging, TestSolrDeletionPolicy1, TestSuggestSpellingConverter, SolrPluginUtilsTest, TestManagedResourceStorage]
   [junit4]   2> NOTE: reproduce with: ant test  -Dtestcase=TestManagedResourceStorage -Dtests.seed=CE69CED49B2E6122 -Dtests.multiplier=2 -Dtests.slow=true -Dtests.locale=en-GB -Dtests.timezone=America/Sao_Paulo -Dtests.asserts=true -Dtests.file.encoding=ISO-8859-1
   [junit4] ERROR   0.00s J1 | TestManagedResourceStorage (suite) <<<
   [junit4]    > Throwable #1: java.lang.RuntimeException: SolrCore.getOpenCount()==2
   [junit4]    > 	at __randomizedtesting.SeedInfo.seed([CE69CED49B2E6122]:0)
   [junit4]    > 	at org.apache.solr.util.TestHarness.close(TestHarness.java:380)
   [junit4]    > 	at org.apache.solr.SolrTestCaseJ4.deleteCore(SolrTestCaseJ4.java:802)
   [junit4]    > 	at org.apache.solr.cloud.AbstractZkTestCase.azt_afterClass(AbstractZkTestCase.java:147)
   [junit4]    > 	at java.lang.Thread.run(Thread.java:748)Throwable #2: com.carrotsearch.randomizedtesting.ThreadLeakError: 4 threads leaked from SUITE scope at org.apache.solr.rest.TestManagedResourceStorage: 
   [junit4]    >    1) Thread[id=10054, name=NIOServerCxn.Factory:0.0.0.0/0.0.0.0:0, state=RUNNABLE, group=TGRP-TestManagedResourceStorage]
   [junit4]    >         at sun.nio.ch.EPollArrayWrapper.epollWait(Native Method)
   [junit4]    >         at sun.nio.ch.EPollArrayWrapper.poll(EPollArrayWrapper.java:269)
   [junit4]    >         at sun.nio.ch.EPollSelectorImpl.doSelect(EPollSelectorImpl.java:93)
   [junit4]    >         at sun.nio.ch.SelectorImpl.lockAndDoSelect(SelectorImpl.java:86)
   [junit4]    >         at sun.nio.ch.SelectorImpl.select(SelectorImpl.java:97)
   [junit4]    >         at org.apache.zookeeper.server.NIOServerCnxnFactory.run(NIOServerCnxnFactory.java:196)
   [junit4]    >         at java.lang.Thread.run(Thread.java:748)
   [junit4]    >    2) Thread[id=10053, name=Thread-2224, state=WAITING, group=TGRP-TestManagedResourceStorage]
   [junit4]    >         at java.lang.Object.wait(Native Method)
   [junit4]    >         at java.lang.Thread.join(Thread.java:1252)
   [junit4]    >         at java.lang.Thread.join(Thread.java:1326)
   [junit4]    >         at org.apache.zookeeper.server.NIOServerCnxnFactory.join(NIOServerCnxnFactory.java:313)
   [junit4]    >         at org.apache.solr.cloud.ZkTestServer$ZKServerMain.runFromConfig(ZkTestServer.java:313)
   [junit4]    >         at org.apache.solr.cloud.ZkTestServer$2.run(ZkTestServer.java:496)
   [junit4]    >    3) Thread[id=10055, name=SessionTracker, state=TIMED_WAITING, group=TGRP-TestManagedResourceStorage]
   [junit4]    >         at java.lang.Object.wait(Native Method)
   [junit4]    >         at org.apache.zookeeper.server.SessionTrackerImpl.run(SessionTrackerImpl.java:147)
   [junit4]    >    4) Thread[id=10057, name=ProcessThread(sid:0 cport:34593):, state=WAITING, group=TGRP-TestManagedResourceStorage]
   [junit4]    >         at sun.misc.Unsafe.park(Native Method)
   [junit4]    >         at java.util.concurrent.locks.LockSupport.park(LockSupport.java:175)
   [junit4]    >         at java.util.concurrent.locks.AbstractQueuedSynchronizer$ConditionObject.await(AbstractQueuedSynchronizer.java:2039)
   [junit4]    >         at java.util.concurrent.LinkedBlockingQueue.take(LinkedBlockingQueue.java:442)
   [junit4]    >         at org.apache.zookeeper.server.PrepRequestProcessor.run(PrepRequestProcessor.java:123)
   [junit4]    > 	at __randomizedtesting.SeedInfo.seed([CE69CED49B2E6122]:0)Throwable #3: com.carrotsearch.randomizedtesting.ThreadLeakError: There are still zombie threads that couldn't be terminated:
   [junit4]    >    1) Thread[id=10054, name=NIOServerCxn.Factory:0.0.0.0/0.0.0.0:0, state=RUNNABLE, group=TGRP-TestManagedResourceStorage]
   [junit4]    >         at sun.nio.ch.EPollArrayWrapper.epollWait(Native Method)
   [junit4]    >         at sun.nio.ch.EPollArrayWrapper.poll(EPollArrayWrapper.java:269)
   [junit4]    >         at sun.nio.ch.EPollSelectorImpl.doSelect(EPollSelectorImpl.java:93)
   [junit4]    >         at sun.nio.ch.SelectorImpl.lockAndDoSelect(SelectorImpl.java:86)
   [junit4]    >         at sun.nio.ch.SelectorImpl.select(SelectorImpl.java:97)
   [junit4]    >         at org.apache.zookeeper.server.NIOServerCnxnFactory.run(NIOServerCnxnFactory.java:196)
   [junit4]    >         at java.lang.Thread.run(Thread.java:748)
   [junit4]    > 	at __randomizedtesting.SeedInfo.seed([CE69CED49B2E6122]:0)
   [junit4] Completed [320/834 (1!)] on J1 in 85.56s, 2 tests, 3 errors <<< FAILURES!

[...truncated 50339 lines...]
[asciidoctor:convert] asciidoctor: ERROR: about-this-guide.adoc: line 1: invalid part, must have at least one section (e.g., chapter, appendix, etc.)
[asciidoctor:convert] asciidoctor: ERROR: solr-glossary.adoc: line 1: invalid part, must have at least one section (e.g., chapter, appendix, etc.)
     [java] Processed 2430 links (1982 relative) to 3172 anchors in 246 files
     [echo] Validated Links & Anchors via: /x1/jenkins/jenkins-slave/workspace/Lucene-Solr-Tests-master/solr/build/solr-ref-guide/bare-bones-html/

-documentation-lint:
    [jtidy] Checking for broken html (such as invalid tags)...
   [delete] Deleting directory /x1/jenkins/jenkins-slave/workspace/Lucene-Solr-Tests-master/lucene/build/jtidy_tmp
     [echo] Checking for broken links...
     [exec] 
     [exec] Crawl/parse...
     [exec] 
     [exec] Verify...
     [echo] Checking for malformed docs...

jar-checksums:

resolve:

ivy-availability-check:
[loadresource] Do not set property disallowed.ivy.jars.list as its length is 0.

-ivy-fail-disallowed-ivy-version:

ivy-fail:

ivy-configure:
[ivy:configure] :: loading settings :: file = /x1/jenkins/jenkins-slave/workspace/Lucene-Solr-Tests-master/lucene/top-level-ivy-settings.xml

resolve:

ivy-availability-check:
[loadresource] Do not set property disallowed.ivy.jars.list as its length is 0.

-ivy-fail-disallowed-ivy-version:

ivy-fail:

ivy-configure:
[ivy:configure] :: loading settings :: file = /x1/jenkins/jenkins-slave/workspace/Lucene-Solr-Tests-master/lucene/top-level-ivy-settings.xml

resolve:

resolve:

ivy-availability-check:
[loadresource] Do not set property disallowed.ivy.jars.list as its length is 0.

-ivy-fail-disallowed-ivy-version:

ivy-fail:

ivy-configure:
[ivy:configure] :: loading settings :: file = /x1/jenkins/jenkins-slave/workspace/Lucene-Solr-Tests-master/lucene/top-level-ivy-settings.xml

resolve:

ivy-availability-check:
[loadresource] Do not set property disallowed.ivy.jars.list as its length is 0.

-ivy-fail-disallowed-ivy-version:

ivy-fail:

ivy-configure:
[ivy:configure] :: loading settings :: file = /x1/jenkins/jenkins-slave/workspace/Lucene-Solr-Tests-master/lucene/top-level-ivy-settings.xml

resolve:

ivy-availability-check:
[loadresource] Do not set property disallowed.ivy.jars.list as its length is 0.

-ivy-fail-disallowed-ivy-version:

ivy-fail:

ivy-configure:
[ivy:configure] :: loading settings :: file = /x1/jenkins/jenkins-slave/workspace/Lucene-Solr-Tests-master/lucene/top-level-ivy-settings.xml

resolve:

ivy-availability-check:
[loadresource] Do not set property disallowed.ivy.jars.list as its length is 0.

-ivy-fail-disallowed-ivy-version:

ivy-fail:

ivy-configure:
[ivy:configure] :: loading settings :: file = /x1/jenkins/jenkins-slave/workspace/Lucene-Solr-Tests-master/lucene/top-level-ivy-settings.xml

resolve:

ivy-availability-check:
[loadresource] Do not set property disallowed.ivy.jars.list as its length is 0.

-ivy-fail-disallowed-ivy-version:

ivy-fail:

ivy-configure:
[ivy:configure] :: loading settings :: file = /x1/jenkins/jenkins-slave/workspace/Lucene-Solr-Tests-master/lucene/top-level-ivy-settings.xml

resolve:

ivy-availability-check:
[loadresource] Do not set property disallowed.ivy.jars.list as its length is 0.

-ivy-fail-disallowed-ivy-version:

ivy-fail:

ivy-configure:
[ivy:configure] :: loading settings :: file = /x1/jenkins/jenkins-slave/workspace/Lucene-Solr-Tests-master/lucene/top-level-ivy-settings.xml

resolve:

ivy-availability-check:
[loadresource] Do not set property disallowed.ivy.jars.list as its length is 0.

-ivy-fail-disallowed-ivy-version:

ivy-fail:

ivy-configure:
[ivy:configure] :: loading settings :: file = /x1/jenkins/jenkins-slave/workspace/Lucene-Solr-Tests-master/lucene/top-level-ivy-settings.xml

resolve:

ivy-availability-check:
[loadresource] Do not set property disallowed.ivy.jars.list as its length is 0.

-ivy-fail-disallowed-ivy-version:

ivy-fail:

ivy-configure:
[ivy:configure] :: loading settings :: file = /x1/jenkins/jenkins-slave/workspace/Lucene-Solr-Tests-master/lucene/top-level-ivy-settings.xml

resolve:

ivy-availability-check:
[loadresource] Do not set property disallowed.ivy.jars.list as its length is 0.

-ivy-fail-disallowed-ivy-version:

ivy-fail:

ivy-configure:
[ivy:configure] :: loading settings :: file = /x1/jenkins/jenkins-slave/workspace/Lucene-Solr-Tests-master/lucene/top-level-ivy-settings.xml

resolve:

ivy-availability-check:
[loadresource] Do not set property disallowed.ivy.jars.list as its length is 0.

-ivy-fail-disallowed-ivy-version:

ivy-fail:

ivy-configure:
[ivy:configure] :: loading settings :: file = /x1/jenkins/jenkins-slave/workspace/Lucene-Solr-Tests-master/lucene/top-level-ivy-settings.xml

resolve:

ivy-availability-check:
[loadresource] Do not set property disallowed.ivy.jars.list as its length is 0.

-ivy-fail-disallowed-ivy-version:

ivy-fail:

ivy-configure:
[ivy:configure] :: loading settings :: file = /x1/jenkins/jenkins-slave/workspace/Lucene-Solr-Tests-master/lucene/top-level-ivy-settings.xml

resolve:

ivy-availability-check:
[loadresource] Do not set property disallowed.ivy.jars.list as its length is 0.

-ivy-fail-disallowed-ivy-version:

ivy-fail:

ivy-configure:
[ivy:configure] :: loading settings :: file = /x1/jenkins/jenkins-slave/workspace/Lucene-Solr-Tests-master/lucene/top-level-ivy-settings.xml

resolve:

ivy-availability-check:
[loadresource] Do not set property disallowed.ivy.jars.list as its length is 0.

-ivy-fail-disallowed-ivy-version:

ivy-fail:

ivy-configure:
[ivy:configure] :: loading settings :: file = /x1/jenkins/jenkins-slave/workspace/Lucene-Solr-Tests-master/lucene/top-level-ivy-settings.xml

resolve:

ivy-availability-check:
[loadresource] Do not set property disallowed.ivy.jars.list as its length is 0.

-ivy-fail-disallowed-ivy-version:

ivy-fail:

ivy-configure:
[ivy:configure] :: loading settings :: file = /x1/jenkins/jenkins-slave/workspace/Lucene-Solr-Tests-master/lucene/top-level-ivy-settings.xml

resolve:

ivy-availability-check:
[loadresource] Do not set property disallowed.ivy.jars.list as its length is 0.

-ivy-fail-disallowed-ivy-version:

ivy-fail:

ivy-configure:
[ivy:configure] :: loading settings :: file = /x1/jenkins/jenkins-slave/workspace/Lucene-Solr-Tests-master/lucene/top-level-ivy-settings.xml

resolve:

ivy-availability-check:
[loadresource] Do not set property disallowed.ivy.jars.list as its length is 0.

-ivy-fail-disallowed-ivy-version:

ivy-fail:

ivy-configure:
[ivy:configure] :: loading settings :: file = /x1/jenkins/jenkins-slave/workspace/Lucene-Solr-Tests-master/lucene/top-level-ivy-settings.xml

resolve:

ivy-availability-check:
[loadresource] Do not set property disallowed.ivy.jars.list as its length is 0.

-ivy-fail-disallowed-ivy-version:

ivy-fail:

ivy-configure:
[ivy:configure] :: loading settings :: file = /x1/jenkins/jenkins-slave/workspace/Lucene-Solr-Tests-master/lucene/top-level-ivy-settings.xml

resolve:

ivy-availability-check:
[loadresource] Do not set property disallowed.ivy.jars.list as its length is 0.

-ivy-fail-disallowed-ivy-version:

ivy-fail:

ivy-configure:
[ivy:configure] :: loading settings :: file = /x1/jenkins/jenkins-slave/workspace/Lucene-Solr-Tests-master/lucene/top-level-ivy-settings.xml

resolve:

ivy-availability-check:
[loadresource] Do not set property disallowed.ivy.jars.list as its length is 0.

-ivy-fail-disallowed-ivy-version:

ivy-fail:

ivy-configure:
[ivy:configure] :: loading settings :: file = /x1/jenkins/jenkins-slave/workspace/Lucene-Solr-Tests-master/lucene/top-level-ivy-settings.xml

resolve:

ivy-availability-check:
[loadresource] Do not set property disallowed.ivy.jars.list as its length is 0.

-ivy-fail-disallowed-ivy-version:

ivy-fail:

ivy-configure:
[ivy:configure] :: loading settings :: file = /x1/jenkins/jenkins-slave/workspace/Lucene-Solr-Tests-master/lucene/top-level-ivy-settings.xml

resolve:

ivy-availability-check:
[loadresource] Do not set property disallowed.ivy.jars.list as its length is 0.

-ivy-fail-disallowed-ivy-version:

ivy-fail:

ivy-configure:
[ivy:configure] :: loading settings :: file = /x1/jenkins/jenkins-slave/workspace/Lucene-Solr-Tests-master/lucene/top-level-ivy-settings.xml

resolve:

ivy-availability-check:
[loadresource] Do not set property disallowed.ivy.jars.list as its length is 0.

-ivy-fail-disallowed-ivy-version:

ivy-fail:

ivy-configure:
[ivy:configure] :: loading settings :: file = /x1/jenkins/jenkins-slave/workspace/Lucene-Solr-Tests-master/lucene/top-level-ivy-settings.xml

resolve:

ivy-availability-check:
[loadresource] Do not set property disallowed.ivy.jars.list as its length is 0.

-ivy-fail-disallowed-ivy-version:

ivy-fail:

ivy-configure:
[ivy:configure] :: loading settings :: file = /x1/jenkins/jenkins-slave/workspace/Lucene-Solr-Tests-master/lucene/top-level-ivy-settings.xml

resolve:

ivy-availability-check:
[loadresource] Do not set property disallowed.ivy.jars.list as its length is 0.

-ivy-fail-disallowed-ivy-version:

ivy-fail:

ivy-configure:
[ivy:configure] :: loading settings :: file = /x1/jenkins/jenkins-slave/workspace/Lucene-Solr-Tests-master/lucene/top-level-ivy-settings.xml

common.resolve:

resolve:

ivy-availability-check:
[loadresource] Do not set property disallowed.ivy.jars.list as its length is 0.

-ivy-fail-disallowed-ivy-version:

ivy-fail:

ivy-configure:
[ivy:configure] :: loading settings :: file = /x1/jenkins/jenkins-slave/workspace/Lucene-Solr-Tests-master/lucene/top-level-ivy-settings.xml

resolve:

ivy-availability-check:
[loadresource] Do not set property disallowed.ivy.jars.list as its length is 0.

-ivy-fail-disallowed-ivy-version:

ivy-fail:

ivy-configure:
[ivy:configure] :: loading settings :: file = /x1/jenkins/jenkins-slave/workspace/Lucene-Solr-Tests-master/lucene/top-level-ivy-settings.xml

resolve:

ivy-availability-check:
[loadresource] Do not set property disallowed.ivy.jars.list as its length is 0.

-ivy-fail-disallowed-ivy-version:

ivy-fail:

ivy-configure:
[ivy:configure] :: loading settings :: file = /x1/jenkins/jenkins-slave/workspace/Lucene-Solr-Tests-master/lucene/top-level-ivy-settings.xml

resolve:

ivy-availability-check:
[loadresource] Do not set property disallowed.ivy.jars.list as its length is 0.

-ivy-fail-disallowed-ivy-version:

ivy-fail:

ivy-configure:
[ivy:configure] :: loading settings :: file = /x1/jenkins/jenkins-slave/workspace/Lucene-Solr-Tests-master/lucene/top-level-ivy-settings.xml

resolve:

ivy-availability-check:
[loadresource] Do not set property disallowed.ivy.jars.list as its length is 0.

-ivy-fail-disallowed-ivy-version:

ivy-fail:

ivy-configure:
[ivy:configure] :: loading settings :: file = /x1/jenkins/jenkins-slave/workspace/Lucene-Solr-Tests-master/lucene/top-level-ivy-settings.xml

resolve:

jar-checksums:
    [mkdir] Created dir: /x1/jenkins/jenkins-slave/workspace/Lucene-Solr-Tests-master/lucene/null1058017467
     [copy] Copying 35 files to /x1/jenkins/jenkins-slave/workspace/Lucene-Solr-Tests-master/lucene/null1058017467
   [delete] Deleting directory /x1/jenkins/jenkins-slave/workspace/Lucene-Solr-Tests-master/lucene/null1058017467

resolve-example:

ivy-availability-check:
[loadresource] Do not set property disallowed.ivy.jars.list as its length is 0.

-ivy-fail-disallowed-ivy-version:

ivy-fail:

ivy-configure:
[ivy:configure] :: loading settings :: file = /x1/jenkins/jenkins-slave/workspace/Lucene-Solr-Tests-master/lucene/top-level-ivy-settings.xml

resolve:

resolve-server:

ivy-availability-check:
[loadresource] Do not set property disallowed.ivy.jars.list as its length is 0.

-ivy-fail-disallowed-ivy-version:

ivy-fail:

ivy-fail:

ivy-configure:
[ivy:configure] :: loading settings :: file = /x1/jenkins/jenkins-slave/workspace/Lucene-Solr-Tests-master/lucene/top-level-ivy-settings.xml

resolve:

resolve:

ivy-availability-check:
[loadresource] Do not set property disallowed.ivy.jars.list as its length is 0.

-ivy-fail-disallowed-ivy-version:

ivy-fail:

ivy-fail:

ivy-configure:
[ivy:configure] :: loading settings :: file = /x1/jenkins/jenkins-slave/workspace/Lucene-Solr-Tests-master/lucene/top-level-ivy-settings.xml

resolve:

ivy-availability-check:
[loadresource] Do not set property disallowed.ivy.jars.list as its length is 0.

-ivy-fail-disallowed-ivy-version:

ivy-fail:

ivy-fail:

ivy-configure:
[ivy:configure] :: loading settings :: file = /x1/jenkins/jenkins-slave/workspace/Lucene-Solr-Tests-master/lucene/top-level-ivy-settings.xml

resolve:

ivy-availability-check:
[loadresource] Do not set property disallowed.ivy.jars.list as its length is 0.

-ivy-fail-disallowed-ivy-version:

ivy-fail:

ivy-configure:
[ivy:configure] :: loading settings :: file = /x1/jenkins/jenkins-slave/workspace/Lucene-Solr-Tests-master/lucene/top-level-ivy-settings.xml

resolve:

ivy-availability-check:
[loadresource] Do not set property disallowed.ivy.jars.list as its length is 0.

-ivy-fail-disallowed-ivy-version:

ivy-fail:

ivy-fail:

ivy-configure:
[ivy:configure] :: loading settings :: file = /x1/jenkins/jenkins-slave/workspace/Lucene-Solr-Tests-master/lucene/top-level-ivy-settings.xml

resolve:

ivy-availability-check:
[loadresource] Do not set property disallowed.ivy.jars.list as its length is 0.

-ivy-fail-disallowed-ivy-version:

ivy-fail:

ivy-configure:
[ivy:configure] :: loading settings :: file = /x1/jenkins/jenkins-slave/workspace/Lucene-Solr-Tests-master/lucene/top-level-ivy-settings.xml

resolve:

ivy-availability-check:
[loadresource] Do not set property disallowed.ivy.jars.list as its length is 0.

-ivy-fail-disallowed-ivy-version:

ivy-fail:

ivy-fail:

ivy-configure:
[ivy:configure] :: loading settings :: file = /x1/jenkins/jenkins-slave/workspace/Lucene-Solr-Tests-master/lucene/top-level-ivy-settings.xml

resolve:

ivy-availability-check:
[loadresource] Do not set property disallowed.ivy.jars.list as its length is 0.

-ivy-fail-disallowed-ivy-version:

ivy-fail:

ivy-fail:

ivy-configure:
[ivy:configure] :: loading settings :: file = /x1/jenkins/jenkins-slave/workspace/Lucene-Solr-Tests-master/lucene/top-level-ivy-settings.xml

resolve:

ivy-availability-check:
[loadresource] Do not set property disallowed.ivy.jars.list as its length is 0.

-ivy-fail-disallowed-ivy-version:

ivy-fail:

ivy-fail:

ivy-configure:
[ivy:configure] :: loading settings :: file = /x1/jenkins/jenkins-slave/workspace/Lucene-Solr-Tests-master/lucene/top-level-ivy-settings.xml

resolve:

ivy-availability-check:
[loadresource] Do not set property disallowed.ivy.jars.list as its length is 0.

-ivy-fail-disallowed-ivy-version:

ivy-fail:

ivy-fail:

ivy-configure:
[ivy:configure] :: loading settings :: file = /x1/jenkins/jenkins-slave/workspace/Lucene-Solr-Tests-master/lucene/top-level-ivy-settings.xml

resolve:

ivy-availability-check:
[loadresource] Do not set property disallowed.ivy.jars.list as its length is 0.

-ivy-fail-disallowed-ivy-version:

ivy-fail:

ivy-fail:

ivy-configure:
[ivy:configure] :: loading settings :: file = /x1/jenkins/jenkins-slave/workspace/Lucene-Solr-Tests-master/lucene/top-level-ivy-settings.xml

resolve:

ivy-availability-check:
[loadresource] Do not set property disallowed.ivy.jars.list as its length is 0.

-ivy-fail-disallowed-ivy-version:

ivy-fail:

ivy-fail:

ivy-configure:
[ivy:configure] :: loading settings :: file = /x1/jenkins/jenkins-slave/workspace/Lucene-Solr-Tests-master/lucene/top-level-ivy-settings.xml

resolve:

ivy-availability-check:
[loadresource] Do not set property disallowed.ivy.jars.list as its length is 0.

-ivy-fail-disallowed-ivy-version:

ivy-fail:

ivy-fail:

ivy-configure:
[ivy:configure] :: loading settings :: file = /x1/jenkins/jenkins-slave/workspace/Lucene-Solr-Tests-master/lucene/top-level-ivy-settings.xml

resolve:

ivy-availability-check:
[loadresource] Do not set property disallowed.ivy.jars.list as its length is 0.

-ivy-fail-disallowed-ivy-version:

ivy-fail:

ivy-fail:

ivy-configure:
[ivy:configure] :: loading settings :: file = /x1/jenkins/jenkins-slave/workspace/Lucene-Solr-Tests-master/lucene/top-level-ivy-settings.xml

resolve:

ivy-availability-check:
[loadresource] Do not set property disallowed.ivy.jars.list as its length is 0.

-ivy-fail-disallowed-ivy-version:

ivy-fail:

ivy-fail:

ivy-configure:
[ivy:configure] :: loading settings :: file = /x1/jenkins/jenkins-slave/workspace/Lucene-Solr-Tests-master/lucene/top-level-ivy-settings.xml

resolve:

ivy-availability-check:
[loadresource] Do not set property disallowed.ivy.jars.list as its length is 0.

-ivy-fail-disallowed-ivy-version:

ivy-fail:

ivy-fail:

ivy-configure:
[ivy:configure] :: loading settings :: file = /x1/jenkins/jenkins-slave/workspace/Lucene-Solr-Tests-master/lucene/top-level-ivy-settings.xml

resolve:

jar-checksums:
    [mkdir] Created dir: /x1/jenkins/jenkins-slave/workspace/Lucene-Solr-Tests-master/solr/null625537765
     [copy] Copying 238 files to /x1/jenkins/jenkins-slave/workspace/Lucene-Solr-Tests-master/solr/null625537765
   [delete] Deleting directory /x1/jenkins/jenkins-slave/workspace/Lucene-Solr-Tests-master/solr/null625537765

check-working-copy:
[ivy:cachepath] :: resolving dependencies :: org.eclipse.jgit#org.eclipse.jgit-caller;working
[ivy:cachepath] 	confs: [default]
[ivy:cachepath] 	found org.eclipse.jgit#org.eclipse.jgit;4.6.0.201612231935-r in public
[ivy:cachepath] 	found com.jcraft#jsch;0.1.53 in public
[ivy:cachepath] 	found com.googlecode.javaewah#JavaEWAH;1.1.6 in public
[ivy:cachepath] 	found org.apache.httpcomponents#httpclient;4.3.6 in public
[ivy:cachepath] 	found org.apache.httpcomponents#httpcore;4.3.3 in public
[ivy:cachepath] 	found commons-logging#commons-logging;1.1.3 in public
[ivy:cachepath] 	found commons-codec#commons-codec;1.6 in public
[ivy:cachepath] 	found org.slf4j#slf4j-api;1.7.2 in public
[ivy:cachepath] :: resolution report :: resolve 23ms :: artifacts dl 1ms
	---------------------------------------------------------------------
	|                  |            modules            ||   artifacts   |
	|       conf       | number| search|dwnlded|evicted|| number|dwnlded|
	---------------------------------------------------------------------
	|      default     |   8   |   0   |   0   |   0   ||   8   |   0   |
	---------------------------------------------------------------------
[wc-checker] Initializing working copy...
[wc-checker] SLF4J: Failed to load class "org.slf4j.impl.StaticLoggerBinder".
[wc-checker] SLF4J: Defaulting to no-operation (NOP) logger implementation
[wc-checker] SLF4J: See http://www.slf4j.org/codes.html#StaticLoggerBinder for further details.
[wc-checker] Checking working copy status...

-jenkins-base:

BUILD SUCCESSFUL
Total time: 75 minutes 52 seconds
Archiving artifacts
java.lang.InterruptedException: no matches found within 10000
	at hudson.FilePath$34.hasMatch(FilePath.java:2678)
	at hudson.FilePath$34.invoke(FilePath.java:2557)
	at hudson.FilePath$34.invoke(FilePath.java:2547)
	at hudson.FilePath$FileCallableWrapper.call(FilePath.java:2918)
Also:   hudson.remoting.Channel$CallSiteStackTrace: Remote call to lucene
		at hudson.remoting.Channel.attachCallSiteStackTrace(Channel.java:1741)
		at hudson.remoting.UserRequest$ExceptionResponse.retrieve(UserRequest.java:357)
		at hudson.remoting.Channel.call(Channel.java:955)
		at hudson.FilePath.act(FilePath.java:1036)
		at hudson.FilePath.act(FilePath.java:1025)
		at hudson.FilePath.validateAntFileMask(FilePath.java:2547)
		at hudson.tasks.ArtifactArchiver.perform(ArtifactArchiver.java:243)
		at hudson.tasks.BuildStepCompatibilityLayer.perform(BuildStepCompatibilityLayer.java:81)
		at hudson.tasks.BuildStepMonitor$1.perform(BuildStepMonitor.java:20)
		at hudson.model.AbstractBuild$AbstractBuildExecution.perform(AbstractBuild.java:744)
		at hudson.model.AbstractBuild$AbstractBuildExecution.performAllBuildSteps(AbstractBuild.java:690)
		at hudson.model.Build$BuildExecution.post2(Build.java:186)
		at hudson.model.AbstractBuild$AbstractBuildExecution.post(AbstractBuild.java:635)
		at hudson.model.Run.execute(Run.java:1819)
		at hudson.model.FreeStyleBuild.run(FreeStyleBuild.java:43)
		at hudson.model.ResourceController.execute(ResourceController.java:97)
		at hudson.model.Executor.run(Executor.java:429)
Caused: hudson.FilePath$TunneledInterruptedException
	at hudson.FilePath$FileCallableWrapper.call(FilePath.java:2920)
	at hudson.remoting.UserRequest.perform(UserRequest.java:212)
	at hudson.remoting.UserRequest.perform(UserRequest.java:54)
	at hudson.remoting.Request$2.run(Request.java:369)
	at hudson.remoting.InterceptingExecutorService$1.call(InterceptingExecutorService.java:72)
	at java.util.concurrent.FutureTask.run(FutureTask.java:266)
	at java.util.concurrent.ThreadPoolExecutor.runWorker(ThreadPoolExecutor.java:1142)
	at java.util.concurrent.ThreadPoolExecutor$Worker.run(ThreadPoolExecutor.java:617)
	at java.lang.Thread.run(Thread.java:748)
Caused: java.lang.InterruptedException: java.lang.InterruptedException: no matches found within 10000
	at hudson.FilePath.act(FilePath.java:1038)
	at hudson.FilePath.act(FilePath.java:1025)
	at hudson.FilePath.validateAntFileMask(FilePath.java:2547)
	at hudson.tasks.ArtifactArchiver.perform(ArtifactArchiver.java:243)
	at hudson.tasks.BuildStepCompatibilityLayer.perform(BuildStepCompatibilityLayer.java:81)
	at hudson.tasks.BuildStepMonitor$1.perform(BuildStepMonitor.java:20)
	at hudson.model.AbstractBuild$AbstractBuildExecution.perform(AbstractBuild.java:744)
	at hudson.model.AbstractBuild$AbstractBuildExecution.performAllBuildSteps(AbstractBuild.java:690)
	at hudson.model.Build$BuildExecution.post2(Build.java:186)
	at hudson.model.AbstractBuild$AbstractBuildExecution.post(AbstractBuild.java:635)
	at hudson.model.Run.execute(Run.java:1819)
	at hudson.model.FreeStyleBuild.run(FreeStyleBuild.java:43)
	at hudson.model.ResourceController.execute(ResourceController.java:97)
	at hudson.model.Executor.run(Executor.java:429)
No artifacts found that match the file pattern "**/*.events,heapdumps/**,**/hs_err_pid*". Configuration error?
Recording test results
Build step 'Publish JUnit test result report' changed build result to UNSTABLE
Email was triggered for: Unstable (Test Failures)
Sending email for trigger: Unstable (Test Failures)

Mime
View raw message