lucene-dev mailing list archives

Site index · List index
Message view « Date » · « Thread »
Top « Date » · « Thread »
From Policeman Jenkins Server <jenk...@thetaphi.de>
Subject [JENKINS-EA] Lucene-Solr-master-Linux (64bit/jdk-11-ea+28) - Build # 22865 - Still Unstable!
Date Sun, 16 Sep 2018 03:09:56 GMT
Build: https://jenkins.thetaphi.de/job/Lucene-Solr-master-Linux/22865/
Java: 64bit/jdk-11-ea+28 -XX:+UseCompressedOops -XX:+UseParallelGC

8 tests failed.
FAILED:  junit.framework.TestSuite.org.apache.solr.handler.admin.AutoscalingHistoryHandlerTest

Error Message:
Could not find collection : AutoscalingHistoryHandlerTest_collection

Stack Trace:
org.apache.solr.common.SolrException: Could not find collection : AutoscalingHistoryHandlerTest_collection
	at __randomizedtesting.SeedInfo.seed([A58EF8F0FB7EC0DD]:0)
	at org.apache.solr.common.cloud.ClusterState.getCollection(ClusterState.java:118)
	at org.apache.solr.cloud.SolrCloudTestCase.getCollectionState(SolrCloudTestCase.java:258)
	at org.apache.solr.handler.admin.AutoscalingHistoryHandlerTest.waitForRecovery(AutoscalingHistoryHandlerTest.java:403)
	at org.apache.solr.handler.admin.AutoscalingHistoryHandlerTest.setupCluster(AutoscalingHistoryHandlerTest.java:97)
	at java.base/jdk.internal.reflect.NativeMethodAccessorImpl.invoke0(Native Method)
	at java.base/jdk.internal.reflect.NativeMethodAccessorImpl.invoke(NativeMethodAccessorImpl.java:62)
	at java.base/jdk.internal.reflect.DelegatingMethodAccessorImpl.invoke(DelegatingMethodAccessorImpl.java:43)
	at java.base/java.lang.reflect.Method.invoke(Method.java:566)
	at com.carrotsearch.randomizedtesting.RandomizedRunner.invoke(RandomizedRunner.java:1742)
	at com.carrotsearch.randomizedtesting.RandomizedRunner$6.evaluate(RandomizedRunner.java:875)
	at com.carrotsearch.randomizedtesting.RandomizedRunner$7.evaluate(RandomizedRunner.java:891)
	at com.carrotsearch.randomizedtesting.rules.StatementAdapter.evaluate(StatementAdapter.java:36)
	at com.carrotsearch.randomizedtesting.rules.SystemPropertiesRestoreRule$1.evaluate(SystemPropertiesRestoreRule.java:57)
	at org.apache.lucene.util.AbstractBeforeAfterRule$1.evaluate(AbstractBeforeAfterRule.java:45)
	at com.carrotsearch.randomizedtesting.rules.StatementAdapter.evaluate(StatementAdapter.java:36)
	at org.apache.lucene.util.TestRuleStoreClassName$1.evaluate(TestRuleStoreClassName.java:41)
	at com.carrotsearch.randomizedtesting.rules.NoShadowingOrOverridesOnMethodsRule$1.evaluate(NoShadowingOrOverridesOnMethodsRule.java:40)
	at com.carrotsearch.randomizedtesting.rules.NoShadowingOrOverridesOnMethodsRule$1.evaluate(NoShadowingOrOverridesOnMethodsRule.java:40)
	at com.carrotsearch.randomizedtesting.rules.StatementAdapter.evaluate(StatementAdapter.java:36)
	at com.carrotsearch.randomizedtesting.rules.StatementAdapter.evaluate(StatementAdapter.java:36)
	at org.apache.lucene.util.TestRuleAssertionsRequired$1.evaluate(TestRuleAssertionsRequired.java:53)
	at org.apache.lucene.util.TestRuleMarkFailure$1.evaluate(TestRuleMarkFailure.java:47)
	at org.apache.lucene.util.TestRuleIgnoreAfterMaxFailures$1.evaluate(TestRuleIgnoreAfterMaxFailures.java:64)
	at org.apache.lucene.util.TestRuleIgnoreTestSuites$1.evaluate(TestRuleIgnoreTestSuites.java:54)
	at com.carrotsearch.randomizedtesting.rules.StatementAdapter.evaluate(StatementAdapter.java:36)
	at com.carrotsearch.randomizedtesting.ThreadLeakControl$StatementRunner.run(ThreadLeakControl.java:368)
	at java.base/java.lang.Thread.run(Thread.java:834)


FAILED:  junit.framework.TestSuite.org.apache.solr.handler.admin.AutoscalingHistoryHandlerTest

Error Message:
Could not find collection : AutoscalingHistoryHandlerTest_collection

Stack Trace:
org.apache.solr.common.SolrException: Could not find collection : AutoscalingHistoryHandlerTest_collection
	at __randomizedtesting.SeedInfo.seed([A58EF8F0FB7EC0DD]:0)
	at org.apache.solr.common.cloud.ClusterState.getCollection(ClusterState.java:118)
	at org.apache.solr.cloud.SolrCloudTestCase.getCollectionState(SolrCloudTestCase.java:258)
	at org.apache.solr.handler.admin.AutoscalingHistoryHandlerTest.waitForRecovery(AutoscalingHistoryHandlerTest.java:403)
	at org.apache.solr.handler.admin.AutoscalingHistoryHandlerTest.setupCluster(AutoscalingHistoryHandlerTest.java:97)
	at java.base/jdk.internal.reflect.NativeMethodAccessorImpl.invoke0(Native Method)
	at java.base/jdk.internal.reflect.NativeMethodAccessorImpl.invoke(NativeMethodAccessorImpl.java:62)
	at java.base/jdk.internal.reflect.DelegatingMethodAccessorImpl.invoke(DelegatingMethodAccessorImpl.java:43)
	at java.base/java.lang.reflect.Method.invoke(Method.java:566)
	at com.carrotsearch.randomizedtesting.RandomizedRunner.invoke(RandomizedRunner.java:1742)
	at com.carrotsearch.randomizedtesting.RandomizedRunner$6.evaluate(RandomizedRunner.java:875)
	at com.carrotsearch.randomizedtesting.RandomizedRunner$7.evaluate(RandomizedRunner.java:891)
	at com.carrotsearch.randomizedtesting.rules.StatementAdapter.evaluate(StatementAdapter.java:36)
	at com.carrotsearch.randomizedtesting.rules.SystemPropertiesRestoreRule$1.evaluate(SystemPropertiesRestoreRule.java:57)
	at org.apache.lucene.util.AbstractBeforeAfterRule$1.evaluate(AbstractBeforeAfterRule.java:45)
	at com.carrotsearch.randomizedtesting.rules.StatementAdapter.evaluate(StatementAdapter.java:36)
	at org.apache.lucene.util.TestRuleStoreClassName$1.evaluate(TestRuleStoreClassName.java:41)
	at com.carrotsearch.randomizedtesting.rules.NoShadowingOrOverridesOnMethodsRule$1.evaluate(NoShadowingOrOverridesOnMethodsRule.java:40)
	at com.carrotsearch.randomizedtesting.rules.NoShadowingOrOverridesOnMethodsRule$1.evaluate(NoShadowingOrOverridesOnMethodsRule.java:40)
	at com.carrotsearch.randomizedtesting.rules.StatementAdapter.evaluate(StatementAdapter.java:36)
	at com.carrotsearch.randomizedtesting.rules.StatementAdapter.evaluate(StatementAdapter.java:36)
	at org.apache.lucene.util.TestRuleAssertionsRequired$1.evaluate(TestRuleAssertionsRequired.java:53)
	at org.apache.lucene.util.TestRuleMarkFailure$1.evaluate(TestRuleMarkFailure.java:47)
	at org.apache.lucene.util.TestRuleIgnoreAfterMaxFailures$1.evaluate(TestRuleIgnoreAfterMaxFailures.java:64)
	at org.apache.lucene.util.TestRuleIgnoreTestSuites$1.evaluate(TestRuleIgnoreTestSuites.java:54)
	at com.carrotsearch.randomizedtesting.rules.StatementAdapter.evaluate(StatementAdapter.java:36)
	at com.carrotsearch.randomizedtesting.ThreadLeakControl$StatementRunner.run(ThreadLeakControl.java:368)
	at java.base/java.lang.Thread.run(Thread.java:834)


FAILED:  junit.framework.TestSuite.org.apache.solr.handler.component.CustomHighlightComponentTest

Error Message:
Could not find collection:collection11

Stack Trace:
java.lang.AssertionError: Could not find collection:collection11
	at __randomizedtesting.SeedInfo.seed([A58EF8F0FB7EC0DD]:0)
	at org.junit.Assert.fail(Assert.java:93)
	at org.junit.Assert.assertTrue(Assert.java:43)
	at org.junit.Assert.assertNotNull(Assert.java:526)
	at org.apache.solr.cloud.AbstractDistribZkTestBase.waitForRecoveriesToFinish(AbstractDistribZkTestBase.java:155)
	at org.apache.solr.handler.component.CustomHighlightComponentTest.setupCluster(CustomHighlightComponentTest.java:125)
	at java.base/jdk.internal.reflect.NativeMethodAccessorImpl.invoke0(Native Method)
	at java.base/jdk.internal.reflect.NativeMethodAccessorImpl.invoke(NativeMethodAccessorImpl.java:62)
	at java.base/jdk.internal.reflect.DelegatingMethodAccessorImpl.invoke(DelegatingMethodAccessorImpl.java:43)
	at java.base/java.lang.reflect.Method.invoke(Method.java:566)
	at com.carrotsearch.randomizedtesting.RandomizedRunner.invoke(RandomizedRunner.java:1742)
	at com.carrotsearch.randomizedtesting.RandomizedRunner$6.evaluate(RandomizedRunner.java:875)
	at com.carrotsearch.randomizedtesting.RandomizedRunner$7.evaluate(RandomizedRunner.java:891)
	at com.carrotsearch.randomizedtesting.rules.StatementAdapter.evaluate(StatementAdapter.java:36)
	at com.carrotsearch.randomizedtesting.rules.SystemPropertiesRestoreRule$1.evaluate(SystemPropertiesRestoreRule.java:57)
	at org.apache.lucene.util.AbstractBeforeAfterRule$1.evaluate(AbstractBeforeAfterRule.java:45)
	at com.carrotsearch.randomizedtesting.rules.StatementAdapter.evaluate(StatementAdapter.java:36)
	at org.apache.lucene.util.TestRuleStoreClassName$1.evaluate(TestRuleStoreClassName.java:41)
	at com.carrotsearch.randomizedtesting.rules.NoShadowingOrOverridesOnMethodsRule$1.evaluate(NoShadowingOrOverridesOnMethodsRule.java:40)
	at com.carrotsearch.randomizedtesting.rules.NoShadowingOrOverridesOnMethodsRule$1.evaluate(NoShadowingOrOverridesOnMethodsRule.java:40)
	at com.carrotsearch.randomizedtesting.rules.StatementAdapter.evaluate(StatementAdapter.java:36)
	at com.carrotsearch.randomizedtesting.rules.StatementAdapter.evaluate(StatementAdapter.java:36)
	at org.apache.lucene.util.TestRuleAssertionsRequired$1.evaluate(TestRuleAssertionsRequired.java:53)
	at org.apache.lucene.util.TestRuleMarkFailure$1.evaluate(TestRuleMarkFailure.java:47)
	at org.apache.lucene.util.TestRuleIgnoreAfterMaxFailures$1.evaluate(TestRuleIgnoreAfterMaxFailures.java:64)
	at org.apache.lucene.util.TestRuleIgnoreTestSuites$1.evaluate(TestRuleIgnoreTestSuites.java:54)
	at com.carrotsearch.randomizedtesting.rules.StatementAdapter.evaluate(StatementAdapter.java:36)
	at com.carrotsearch.randomizedtesting.ThreadLeakControl$StatementRunner.run(ThreadLeakControl.java:368)
	at java.base/java.lang.Thread.run(Thread.java:834)


FAILED:  junit.framework.TestSuite.org.apache.solr.handler.component.CustomHighlightComponentTest

Error Message:
Could not find collection:collection11

Stack Trace:
java.lang.AssertionError: Could not find collection:collection11
	at __randomizedtesting.SeedInfo.seed([A58EF8F0FB7EC0DD]:0)
	at org.junit.Assert.fail(Assert.java:93)
	at org.junit.Assert.assertTrue(Assert.java:43)
	at org.junit.Assert.assertNotNull(Assert.java:526)
	at org.apache.solr.cloud.AbstractDistribZkTestBase.waitForRecoveriesToFinish(AbstractDistribZkTestBase.java:155)
	at org.apache.solr.handler.component.CustomHighlightComponentTest.setupCluster(CustomHighlightComponentTest.java:125)
	at java.base/jdk.internal.reflect.NativeMethodAccessorImpl.invoke0(Native Method)
	at java.base/jdk.internal.reflect.NativeMethodAccessorImpl.invoke(NativeMethodAccessorImpl.java:62)
	at java.base/jdk.internal.reflect.DelegatingMethodAccessorImpl.invoke(DelegatingMethodAccessorImpl.java:43)
	at java.base/java.lang.reflect.Method.invoke(Method.java:566)
	at com.carrotsearch.randomizedtesting.RandomizedRunner.invoke(RandomizedRunner.java:1742)
	at com.carrotsearch.randomizedtesting.RandomizedRunner$6.evaluate(RandomizedRunner.java:875)
	at com.carrotsearch.randomizedtesting.RandomizedRunner$7.evaluate(RandomizedRunner.java:891)
	at com.carrotsearch.randomizedtesting.rules.StatementAdapter.evaluate(StatementAdapter.java:36)
	at com.carrotsearch.randomizedtesting.rules.SystemPropertiesRestoreRule$1.evaluate(SystemPropertiesRestoreRule.java:57)
	at org.apache.lucene.util.AbstractBeforeAfterRule$1.evaluate(AbstractBeforeAfterRule.java:45)
	at com.carrotsearch.randomizedtesting.rules.StatementAdapter.evaluate(StatementAdapter.java:36)
	at org.apache.lucene.util.TestRuleStoreClassName$1.evaluate(TestRuleStoreClassName.java:41)
	at com.carrotsearch.randomizedtesting.rules.NoShadowingOrOverridesOnMethodsRule$1.evaluate(NoShadowingOrOverridesOnMethodsRule.java:40)
	at com.carrotsearch.randomizedtesting.rules.NoShadowingOrOverridesOnMethodsRule$1.evaluate(NoShadowingOrOverridesOnMethodsRule.java:40)
	at com.carrotsearch.randomizedtesting.rules.StatementAdapter.evaluate(StatementAdapter.java:36)
	at com.carrotsearch.randomizedtesting.rules.StatementAdapter.evaluate(StatementAdapter.java:36)
	at org.apache.lucene.util.TestRuleAssertionsRequired$1.evaluate(TestRuleAssertionsRequired.java:53)
	at org.apache.lucene.util.TestRuleMarkFailure$1.evaluate(TestRuleMarkFailure.java:47)
	at org.apache.lucene.util.TestRuleIgnoreAfterMaxFailures$1.evaluate(TestRuleIgnoreAfterMaxFailures.java:64)
	at org.apache.lucene.util.TestRuleIgnoreTestSuites$1.evaluate(TestRuleIgnoreTestSuites.java:54)
	at com.carrotsearch.randomizedtesting.rules.StatementAdapter.evaluate(StatementAdapter.java:36)
	at com.carrotsearch.randomizedtesting.ThreadLeakControl$StatementRunner.run(ThreadLeakControl.java:368)
	at java.base/java.lang.Thread.run(Thread.java:834)


FAILED:  org.apache.solr.cloud.ReplaceNodeTest.test

Error Message:
Could not find collection : replacenodetest_coll

Stack Trace:
org.apache.solr.common.SolrException: Could not find collection : replacenodetest_coll
	at __randomizedtesting.SeedInfo.seed([A58EF8F0FB7EC0DD:2DDAC72A5582AD25]:0)
	at org.apache.solr.common.cloud.ClusterState.getCollection(ClusterState.java:118)
	at org.apache.solr.cloud.ReplaceNodeTest.test(ReplaceNodeTest.java:87)
	at java.base/jdk.internal.reflect.NativeMethodAccessorImpl.invoke0(Native Method)
	at java.base/jdk.internal.reflect.NativeMethodAccessorImpl.invoke(NativeMethodAccessorImpl.java:62)
	at java.base/jdk.internal.reflect.DelegatingMethodAccessorImpl.invoke(DelegatingMethodAccessorImpl.java:43)
	at java.base/java.lang.reflect.Method.invoke(Method.java:566)
	at com.carrotsearch.randomizedtesting.RandomizedRunner.invoke(RandomizedRunner.java:1742)
	at com.carrotsearch.randomizedtesting.RandomizedRunner$8.evaluate(RandomizedRunner.java:935)
	at com.carrotsearch.randomizedtesting.RandomizedRunner$9.evaluate(RandomizedRunner.java:971)
	at com.carrotsearch.randomizedtesting.RandomizedRunner$10.evaluate(RandomizedRunner.java:985)
	at com.carrotsearch.randomizedtesting.rules.SystemPropertiesRestoreRule$1.evaluate(SystemPropertiesRestoreRule.java:57)
	at org.apache.lucene.util.TestRuleSetupTeardownChained$1.evaluate(TestRuleSetupTeardownChained.java:49)
	at org.apache.lucene.util.AbstractBeforeAfterRule$1.evaluate(AbstractBeforeAfterRule.java:45)
	at org.apache.lucene.util.TestRuleThreadAndTestName$1.evaluate(TestRuleThreadAndTestName.java:48)
	at org.apache.lucene.util.TestRuleIgnoreAfterMaxFailures$1.evaluate(TestRuleIgnoreAfterMaxFailures.java:64)
	at org.apache.lucene.util.TestRuleMarkFailure$1.evaluate(TestRuleMarkFailure.java:47)
	at com.carrotsearch.randomizedtesting.rules.StatementAdapter.evaluate(StatementAdapter.java:36)
	at com.carrotsearch.randomizedtesting.ThreadLeakControl$StatementRunner.run(ThreadLeakControl.java:368)
	at com.carrotsearch.randomizedtesting.ThreadLeakControl.forkTimeoutingTask(ThreadLeakControl.java:817)
	at com.carrotsearch.randomizedtesting.ThreadLeakControl$3.evaluate(ThreadLeakControl.java:468)
	at com.carrotsearch.randomizedtesting.RandomizedRunner.runSingleTest(RandomizedRunner.java:944)
	at com.carrotsearch.randomizedtesting.RandomizedRunner$5.evaluate(RandomizedRunner.java:830)
	at com.carrotsearch.randomizedtesting.RandomizedRunner$6.evaluate(RandomizedRunner.java:880)
	at com.carrotsearch.randomizedtesting.RandomizedRunner$7.evaluate(RandomizedRunner.java:891)
	at com.carrotsearch.randomizedtesting.rules.StatementAdapter.evaluate(StatementAdapter.java:36)
	at com.carrotsearch.randomizedtesting.rules.SystemPropertiesRestoreRule$1.evaluate(SystemPropertiesRestoreRule.java:57)
	at org.apache.lucene.util.AbstractBeforeAfterRule$1.evaluate(AbstractBeforeAfterRule.java:45)
	at com.carrotsearch.randomizedtesting.rules.StatementAdapter.evaluate(StatementAdapter.java:36)
	at org.apache.lucene.util.TestRuleStoreClassName$1.evaluate(TestRuleStoreClassName.java:41)
	at com.carrotsearch.randomizedtesting.rules.NoShadowingOrOverridesOnMethodsRule$1.evaluate(NoShadowingOrOverridesOnMethodsRule.java:40)
	at com.carrotsearch.randomizedtesting.rules.NoShadowingOrOverridesOnMethodsRule$1.evaluate(NoShadowingOrOverridesOnMethodsRule.java:40)
	at com.carrotsearch.randomizedtesting.rules.StatementAdapter.evaluate(StatementAdapter.java:36)
	at com.carrotsearch.randomizedtesting.rules.StatementAdapter.evaluate(StatementAdapter.java:36)
	at org.apache.lucene.util.TestRuleAssertionsRequired$1.evaluate(TestRuleAssertionsRequired.java:53)
	at org.apache.lucene.util.TestRuleMarkFailure$1.evaluate(TestRuleMarkFailure.java:47)
	at org.apache.lucene.util.TestRuleIgnoreAfterMaxFailures$1.evaluate(TestRuleIgnoreAfterMaxFailures.java:64)
	at org.apache.lucene.util.TestRuleIgnoreTestSuites$1.evaluate(TestRuleIgnoreTestSuites.java:54)
	at com.carrotsearch.randomizedtesting.rules.StatementAdapter.evaluate(StatementAdapter.java:36)
	at com.carrotsearch.randomizedtesting.ThreadLeakControl$StatementRunner.run(ThreadLeakControl.java:368)
	at java.base/java.lang.Thread.run(Thread.java:834)


FAILED:  org.apache.solr.cloud.ReplaceNodeTest.test

Error Message:
Error from server at https://127.0.0.1:38129/solr: create the collection time out:180s

Stack Trace:
org.apache.solr.client.solrj.impl.HttpSolrClient$RemoteSolrException: Error from server at https://127.0.0.1:38129/solr: create the collection time out:180s
	at __randomizedtesting.SeedInfo.seed([A58EF8F0FB7EC0DD:2DDAC72A5582AD25]:0)
	at org.apache.solr.client.solrj.impl.HttpSolrClient.executeMethod(HttpSolrClient.java:643)
	at org.apache.solr.client.solrj.impl.HttpSolrClient.request(HttpSolrClient.java:255)
	at org.apache.solr.client.solrj.impl.HttpSolrClient.request(HttpSolrClient.java:244)
	at org.apache.solr.client.solrj.impl.LBHttpSolrClient.doRequest(LBHttpSolrClient.java:483)
	at org.apache.solr.client.solrj.impl.LBHttpSolrClient.request(LBHttpSolrClient.java:413)
	at org.apache.solr.client.solrj.impl.CloudSolrClient.sendRequest(CloudSolrClient.java:1107)
	at org.apache.solr.client.solrj.impl.CloudSolrClient.requestWithRetryOnStaleState(CloudSolrClient.java:884)
	at org.apache.solr.client.solrj.impl.CloudSolrClient.request(CloudSolrClient.java:817)
	at org.apache.solr.client.solrj.SolrClient.request(SolrClient.java:1219)
	at org.apache.solr.cloud.ReplaceNodeTest.test(ReplaceNodeTest.java:86)
	at java.base/jdk.internal.reflect.NativeMethodAccessorImpl.invoke0(Native Method)
	at java.base/jdk.internal.reflect.NativeMethodAccessorImpl.invoke(NativeMethodAccessorImpl.java:62)
	at java.base/jdk.internal.reflect.DelegatingMethodAccessorImpl.invoke(DelegatingMethodAccessorImpl.java:43)
	at java.base/java.lang.reflect.Method.invoke(Method.java:566)
	at com.carrotsearch.randomizedtesting.RandomizedRunner.invoke(RandomizedRunner.java:1742)
	at com.carrotsearch.randomizedtesting.RandomizedRunner$8.evaluate(RandomizedRunner.java:935)
	at com.carrotsearch.randomizedtesting.RandomizedRunner$9.evaluate(RandomizedRunner.java:971)
	at com.carrotsearch.randomizedtesting.RandomizedRunner$10.evaluate(RandomizedRunner.java:985)
	at com.carrotsearch.randomizedtesting.rules.SystemPropertiesRestoreRule$1.evaluate(SystemPropertiesRestoreRule.java:57)
	at org.apache.lucene.util.TestRuleSetupTeardownChained$1.evaluate(TestRuleSetupTeardownChained.java:49)
	at org.apache.lucene.util.AbstractBeforeAfterRule$1.evaluate(AbstractBeforeAfterRule.java:45)
	at org.apache.lucene.util.TestRuleThreadAndTestName$1.evaluate(TestRuleThreadAndTestName.java:48)
	at org.apache.lucene.util.TestRuleIgnoreAfterMaxFailures$1.evaluate(TestRuleIgnoreAfterMaxFailures.java:64)
	at org.apache.lucene.util.TestRuleMarkFailure$1.evaluate(TestRuleMarkFailure.java:47)
	at com.carrotsearch.randomizedtesting.rules.StatementAdapter.evaluate(StatementAdapter.java:36)
	at com.carrotsearch.randomizedtesting.ThreadLeakControl$StatementRunner.run(ThreadLeakControl.java:368)
	at com.carrotsearch.randomizedtesting.ThreadLeakControl.forkTimeoutingTask(ThreadLeakControl.java:817)
	at com.carrotsearch.randomizedtesting.ThreadLeakControl$3.evaluate(ThreadLeakControl.java:468)
	at com.carrotsearch.randomizedtesting.RandomizedRunner.runSingleTest(RandomizedRunner.java:944)
	at com.carrotsearch.randomizedtesting.RandomizedRunner$5.evaluate(RandomizedRunner.java:830)
	at com.carrotsearch.randomizedtesting.RandomizedRunner$6.evaluate(RandomizedRunner.java:880)
	at com.carrotsearch.randomizedtesting.RandomizedRunner$7.evaluate(RandomizedRunner.java:891)
	at com.carrotsearch.randomizedtesting.rules.StatementAdapter.evaluate(StatementAdapter.java:36)
	at com.carrotsearch.randomizedtesting.rules.SystemPropertiesRestoreRule$1.evaluate(SystemPropertiesRestoreRule.java:57)
	at org.apache.lucene.util.AbstractBeforeAfterRule$1.evaluate(AbstractBeforeAfterRule.java:45)
	at com.carrotsearch.randomizedtesting.rules.StatementAdapter.evaluate(StatementAdapter.java:36)
	at org.apache.lucene.util.TestRuleStoreClassName$1.evaluate(TestRuleStoreClassName.java:41)
	at com.carrotsearch.randomizedtesting.rules.NoShadowingOrOverridesOnMethodsRule$1.evaluate(NoShadowingOrOverridesOnMethodsRule.java:40)
	at com.carrotsearch.randomizedtesting.rules.NoShadowingOrOverridesOnMethodsRule$1.evaluate(NoShadowingOrOverridesOnMethodsRule.java:40)
	at com.carrotsearch.randomizedtesting.rules.StatementAdapter.evaluate(StatementAdapter.java:36)
	at com.carrotsearch.randomizedtesting.rules.StatementAdapter.evaluate(StatementAdapter.java:36)
	at org.apache.lucene.util.TestRuleAssertionsRequired$1.evaluate(TestRuleAssertionsRequired.java:53)
	at org.apache.lucene.util.TestRuleMarkFailure$1.evaluate(TestRuleMarkFailure.java:47)
	at org.apache.lucene.util.TestRuleIgnoreAfterMaxFailures$1.evaluate(TestRuleIgnoreAfterMaxFailures.java:64)
	at org.apache.lucene.util.TestRuleIgnoreTestSuites$1.evaluate(TestRuleIgnoreTestSuites.java:54)
	at com.carrotsearch.randomizedtesting.rules.StatementAdapter.evaluate(StatementAdapter.java:36)
	at com.carrotsearch.randomizedtesting.ThreadLeakControl$StatementRunner.run(ThreadLeakControl.java:368)
	at java.base/java.lang.Thread.run(Thread.java:834)


FAILED:  org.apache.solr.handler.component.CustomHighlightComponentTest.test

Error Message:
java.lang.NullPointerException

Stack Trace:
org.apache.solr.client.solrj.SolrServerException: java.lang.NullPointerException
	at __randomizedtesting.SeedInfo.seed([A58EF8F0FB7EC0DD:2DDAC72A5582AD25]:0)
	at org.apache.solr.client.solrj.impl.CloudSolrClient.requestWithRetryOnStaleState(CloudSolrClient.java:999)
	at org.apache.solr.client.solrj.impl.CloudSolrClient.request(CloudSolrClient.java:817)
	at org.apache.solr.client.solrj.SolrRequest.process(SolrRequest.java:194)
	at org.apache.solr.client.solrj.request.UpdateRequest.commit(UpdateRequest.java:233)
	at org.apache.solr.handler.component.CustomHighlightComponentTest.test(CustomHighlightComponentTest.java:177)
	at java.base/jdk.internal.reflect.NativeMethodAccessorImpl.invoke0(Native Method)
	at java.base/jdk.internal.reflect.NativeMethodAccessorImpl.invoke(NativeMethodAccessorImpl.java:62)
	at java.base/jdk.internal.reflect.DelegatingMethodAccessorImpl.invoke(DelegatingMethodAccessorImpl.java:43)
	at java.base/java.lang.reflect.Method.invoke(Method.java:566)
	at com.carrotsearch.randomizedtesting.RandomizedRunner.invoke(RandomizedRunner.java:1742)
	at com.carrotsearch.randomizedtesting.RandomizedRunner$8.evaluate(RandomizedRunner.java:935)
	at com.carrotsearch.randomizedtesting.RandomizedRunner$9.evaluate(RandomizedRunner.java:971)
	at com.carrotsearch.randomizedtesting.RandomizedRunner$10.evaluate(RandomizedRunner.java:985)
	at com.carrotsearch.randomizedtesting.rules.SystemPropertiesRestoreRule$1.evaluate(SystemPropertiesRestoreRule.java:57)
	at org.apache.lucene.util.TestRuleSetupTeardownChained$1.evaluate(TestRuleSetupTeardownChained.java:49)
	at org.apache.lucene.util.AbstractBeforeAfterRule$1.evaluate(AbstractBeforeAfterRule.java:45)
	at org.apache.lucene.util.TestRuleThreadAndTestName$1.evaluate(TestRuleThreadAndTestName.java:48)
	at org.apache.lucene.util.TestRuleIgnoreAfterMaxFailures$1.evaluate(TestRuleIgnoreAfterMaxFailures.java:64)
	at org.apache.lucene.util.TestRuleMarkFailure$1.evaluate(TestRuleMarkFailure.java:47)
	at com.carrotsearch.randomizedtesting.rules.StatementAdapter.evaluate(StatementAdapter.java:36)
	at com.carrotsearch.randomizedtesting.ThreadLeakControl$StatementRunner.run(ThreadLeakControl.java:368)
	at com.carrotsearch.randomizedtesting.ThreadLeakControl.forkTimeoutingTask(ThreadLeakControl.java:817)
	at com.carrotsearch.randomizedtesting.ThreadLeakControl$3.evaluate(ThreadLeakControl.java:468)
	at com.carrotsearch.randomizedtesting.RandomizedRunner.runSingleTest(RandomizedRunner.java:944)
	at com.carrotsearch.randomizedtesting.RandomizedRunner$5.evaluate(RandomizedRunner.java:830)
	at com.carrotsearch.randomizedtesting.RandomizedRunner$6.evaluate(RandomizedRunner.java:880)
	at com.carrotsearch.randomizedtesting.RandomizedRunner$7.evaluate(RandomizedRunner.java:891)
	at com.carrotsearch.randomizedtesting.rules.StatementAdapter.evaluate(StatementAdapter.java:36)
	at com.carrotsearch.randomizedtesting.rules.SystemPropertiesRestoreRule$1.evaluate(SystemPropertiesRestoreRule.java:57)
	at org.apache.lucene.util.AbstractBeforeAfterRule$1.evaluate(AbstractBeforeAfterRule.java:45)
	at com.carrotsearch.randomizedtesting.rules.StatementAdapter.evaluate(StatementAdapter.java:36)
	at org.apache.lucene.util.TestRuleStoreClassName$1.evaluate(TestRuleStoreClassName.java:41)
	at com.carrotsearch.randomizedtesting.rules.NoShadowingOrOverridesOnMethodsRule$1.evaluate(NoShadowingOrOverridesOnMethodsRule.java:40)
	at com.carrotsearch.randomizedtesting.rules.NoShadowingOrOverridesOnMethodsRule$1.evaluate(NoShadowingOrOverridesOnMethodsRule.java:40)
	at com.carrotsearch.randomizedtesting.rules.StatementAdapter.evaluate(StatementAdapter.java:36)
	at com.carrotsearch.randomizedtesting.rules.StatementAdapter.evaluate(StatementAdapter.java:36)
	at org.apache.lucene.util.TestRuleAssertionsRequired$1.evaluate(TestRuleAssertionsRequired.java:53)
	at org.apache.lucene.util.TestRuleMarkFailure$1.evaluate(TestRuleMarkFailure.java:47)
	at org.apache.lucene.util.TestRuleIgnoreAfterMaxFailures$1.evaluate(TestRuleIgnoreAfterMaxFailures.java:64)
	at org.apache.lucene.util.TestRuleIgnoreTestSuites$1.evaluate(TestRuleIgnoreTestSuites.java:54)
	at com.carrotsearch.randomizedtesting.rules.StatementAdapter.evaluate(StatementAdapter.java:36)
	at com.carrotsearch.randomizedtesting.ThreadLeakControl$StatementRunner.run(ThreadLeakControl.java:368)
	at java.base/java.lang.Thread.run(Thread.java:834)
Caused by: java.lang.NullPointerException
	at org.apache.solr.client.solrj.impl.CloudSolrClient.buildUrlMap(CloudSolrClient.java:639)
	at org.apache.solr.client.solrj.impl.CloudSolrClient.directUpdate(CloudSolrClient.java:502)
	at org.apache.solr.client.solrj.impl.CloudSolrClient.sendRequest(CloudSolrClient.java:1016)
	at org.apache.solr.client.solrj.impl.CloudSolrClient.requestWithRetryOnStaleState(CloudSolrClient.java:884)
	... 42 more


FAILED:  org.apache.solr.handler.component.CustomHighlightComponentTest.test

Error Message:
java.lang.NullPointerException

Stack Trace:
org.apache.solr.client.solrj.SolrServerException: java.lang.NullPointerException
	at __randomizedtesting.SeedInfo.seed([A58EF8F0FB7EC0DD:2DDAC72A5582AD25]:0)
	at org.apache.solr.client.solrj.impl.CloudSolrClient.requestWithRetryOnStaleState(CloudSolrClient.java:999)
	at org.apache.solr.client.solrj.impl.CloudSolrClient.request(CloudSolrClient.java:817)
	at org.apache.solr.client.solrj.SolrRequest.process(SolrRequest.java:194)
	at org.apache.solr.client.solrj.request.UpdateRequest.commit(UpdateRequest.java:233)
	at org.apache.solr.handler.component.CustomHighlightComponentTest.test(CustomHighlightComponentTest.java:177)
	at java.base/jdk.internal.reflect.NativeMethodAccessorImpl.invoke0(Native Method)
	at java.base/jdk.internal.reflect.NativeMethodAccessorImpl.invoke(NativeMethodAccessorImpl.java:62)
	at java.base/jdk.internal.reflect.DelegatingMethodAccessorImpl.invoke(DelegatingMethodAccessorImpl.java:43)
	at java.base/java.lang.reflect.Method.invoke(Method.java:566)
	at com.carrotsearch.randomizedtesting.RandomizedRunner.invoke(RandomizedRunner.java:1742)
	at com.carrotsearch.randomizedtesting.RandomizedRunner$8.evaluate(RandomizedRunner.java:935)
	at com.carrotsearch.randomizedtesting.RandomizedRunner$9.evaluate(RandomizedRunner.java:971)
	at com.carrotsearch.randomizedtesting.RandomizedRunner$10.evaluate(RandomizedRunner.java:985)
	at com.carrotsearch.randomizedtesting.rules.SystemPropertiesRestoreRule$1.evaluate(SystemPropertiesRestoreRule.java:57)
	at org.apache.lucene.util.TestRuleSetupTeardownChained$1.evaluate(TestRuleSetupTeardownChained.java:49)
	at org.apache.lucene.util.AbstractBeforeAfterRule$1.evaluate(AbstractBeforeAfterRule.java:45)
	at org.apache.lucene.util.TestRuleThreadAndTestName$1.evaluate(TestRuleThreadAndTestName.java:48)
	at org.apache.lucene.util.TestRuleIgnoreAfterMaxFailures$1.evaluate(TestRuleIgnoreAfterMaxFailures.java:64)
	at org.apache.lucene.util.TestRuleMarkFailure$1.evaluate(TestRuleMarkFailure.java:47)
	at com.carrotsearch.randomizedtesting.rules.StatementAdapter.evaluate(StatementAdapter.java:36)
	at com.carrotsearch.randomizedtesting.ThreadLeakControl$StatementRunner.run(ThreadLeakControl.java:368)
	at com.carrotsearch.randomizedtesting.ThreadLeakControl.forkTimeoutingTask(ThreadLeakControl.java:817)
	at com.carrotsearch.randomizedtesting.ThreadLeakControl$3.evaluate(ThreadLeakControl.java:468)
	at com.carrotsearch.randomizedtesting.RandomizedRunner.runSingleTest(RandomizedRunner.java:944)
	at com.carrotsearch.randomizedtesting.RandomizedRunner$5.evaluate(RandomizedRunner.java:830)
	at com.carrotsearch.randomizedtesting.RandomizedRunner$6.evaluate(RandomizedRunner.java:880)
	at com.carrotsearch.randomizedtesting.RandomizedRunner$7.evaluate(RandomizedRunner.java:891)
	at com.carrotsearch.randomizedtesting.rules.StatementAdapter.evaluate(StatementAdapter.java:36)
	at com.carrotsearch.randomizedtesting.rules.SystemPropertiesRestoreRule$1.evaluate(SystemPropertiesRestoreRule.java:57)
	at org.apache.lucene.util.AbstractBeforeAfterRule$1.evaluate(AbstractBeforeAfterRule.java:45)
	at com.carrotsearch.randomizedtesting.rules.StatementAdapter.evaluate(StatementAdapter.java:36)
	at org.apache.lucene.util.TestRuleStoreClassName$1.evaluate(TestRuleStoreClassName.java:41)
	at com.carrotsearch.randomizedtesting.rules.NoShadowingOrOverridesOnMethodsRule$1.evaluate(NoShadowingOrOverridesOnMethodsRule.java:40)
	at com.carrotsearch.randomizedtesting.rules.NoShadowingOrOverridesOnMethodsRule$1.evaluate(NoShadowingOrOverridesOnMethodsRule.java:40)
	at com.carrotsearch.randomizedtesting.rules.StatementAdapter.evaluate(StatementAdapter.java:36)
	at com.carrotsearch.randomizedtesting.rules.StatementAdapter.evaluate(StatementAdapter.java:36)
	at org.apache.lucene.util.TestRuleAssertionsRequired$1.evaluate(TestRuleAssertionsRequired.java:53)
	at org.apache.lucene.util.TestRuleMarkFailure$1.evaluate(TestRuleMarkFailure.java:47)
	at org.apache.lucene.util.TestRuleIgnoreAfterMaxFailures$1.evaluate(TestRuleIgnoreAfterMaxFailures.java:64)
	at org.apache.lucene.util.TestRuleIgnoreTestSuites$1.evaluate(TestRuleIgnoreTestSuites.java:54)
	at com.carrotsearch.randomizedtesting.rules.StatementAdapter.evaluate(StatementAdapter.java:36)
	at com.carrotsearch.randomizedtesting.ThreadLeakControl$StatementRunner.run(ThreadLeakControl.java:368)
	at java.base/java.lang.Thread.run(Thread.java:834)
Caused by: java.lang.NullPointerException
	at org.apache.solr.client.solrj.impl.CloudSolrClient.buildUrlMap(CloudSolrClient.java:639)
	at org.apache.solr.client.solrj.impl.CloudSolrClient.directUpdate(CloudSolrClient.java:502)
	at org.apache.solr.client.solrj.impl.CloudSolrClient.sendRequest(CloudSolrClient.java:1016)
	at org.apache.solr.client.solrj.impl.CloudSolrClient.requestWithRetryOnStaleState(CloudSolrClient.java:884)
	... 42 more




Build Log:
[...truncated 12602 lines...]
   [junit4] Suite: org.apache.solr.cloud.ReplaceNodeTest
   [junit4]   2> 61335 INFO  (SUITE-ReplaceNodeTest-seed#[A58EF8F0FB7EC0DD]-worker) [    ] o.a.s.SolrTestCaseJ4 SecureRandom sanity checks: test.solr.allowed.securerandom=null & java.security.egd=file:/dev/./urandom
   [junit4]   2> Creating dataDir: /home/jenkins/workspace/Lucene-Solr-master-Linux/solr/build/solr-core/test/J0/temp/solr.cloud.ReplaceNodeTest_A58EF8F0FB7EC0DD-001/init-core-data-001
   [junit4]   2> 61335 WARN  (SUITE-ReplaceNodeTest-seed#[A58EF8F0FB7EC0DD]-worker) [    ] o.a.s.SolrTestCaseJ4 startTrackingSearchers: numOpens=18 numCloses=18
   [junit4]   2> 61336 INFO  (SUITE-ReplaceNodeTest-seed#[A58EF8F0FB7EC0DD]-worker) [    ] o.a.s.SolrTestCaseJ4 Using PointFields (NUMERIC_POINTS_SYSPROP=true) w/NUMERIC_DOCVALUES_SYSPROP=false
   [junit4]   2> 61336 INFO  (SUITE-ReplaceNodeTest-seed#[A58EF8F0FB7EC0DD]-worker) [    ] o.a.s.SolrTestCaseJ4 Randomized ssl (true) and clientAuth (false) via: @org.apache.solr.util.RandomizeSSL(reason="", ssl=0.0/0.0, value=0.0/0.0, clientAuth=0.0/0.0)
   [junit4]   2> 61339 INFO  (SUITE-ReplaceNodeTest-seed#[A58EF8F0FB7EC0DD]-worker) [    ] o.a.s.c.MiniSolrCloudCluster Starting cluster of 6 servers in /home/jenkins/workspace/Lucene-Solr-master-Linux/solr/build/solr-core/test/J0/temp/solr.cloud.ReplaceNodeTest_A58EF8F0FB7EC0DD-001/tempDir-001
   [junit4]   2> 61345 INFO  (SUITE-ReplaceNodeTest-seed#[A58EF8F0FB7EC0DD]-worker) [    ] o.a.s.c.ZkTestServer STARTING ZK TEST SERVER
   [junit4]   2> 61346 INFO  (Thread-304) [    ] o.a.s.c.ZkTestServer client port:0.0.0.0/0.0.0.0:0
   [junit4]   2> 61346 INFO  (Thread-304) [    ] o.a.s.c.ZkTestServer Starting server
   [junit4]   2> 61383 ERROR (Thread-304) [    ] o.a.z.s.ZooKeeperServer ZKShutdownHandler is not registered, so ZooKeeper server won't take any action on ERROR or SHUTDOWN server state changes
   [junit4]   2> 61446 INFO  (SUITE-ReplaceNodeTest-seed#[A58EF8F0FB7EC0DD]-worker) [    ] o.a.s.c.ZkTestServer start zk server on port:41541
   [junit4]   2> 61493 INFO  (zkConnectionManagerCallback-34-thread-1) [    ] o.a.s.c.c.ConnectionManager zkClient has connected
   [junit4]   2> 61536 INFO  (jetty-launcher-31-thread-1) [    ] o.e.j.s.Server jetty-9.4.11.v20180605; built: 2018-06-05T18:24:03.829Z; git: d5fc0523cfa96bfebfbda19606cad384d772f04c; jvm 11+28
   [junit4]   2> 61536 INFO  (jetty-launcher-31-thread-3) [    ] o.e.j.s.Server jetty-9.4.11.v20180605; built: 2018-06-05T18:24:03.829Z; git: d5fc0523cfa96bfebfbda19606cad384d772f04c; jvm 11+28
   [junit4]   2> 61536 INFO  (jetty-launcher-31-thread-4) [    ] o.e.j.s.Server jetty-9.4.11.v20180605; built: 2018-06-05T18:24:03.829Z; git: d5fc0523cfa96bfebfbda19606cad384d772f04c; jvm 11+28
   [junit4]   2> 61536 INFO  (jetty-launcher-31-thread-2) [    ] o.e.j.s.Server jetty-9.4.11.v20180605; built: 2018-06-05T18:24:03.829Z; git: d5fc0523cfa96bfebfbda19606cad384d772f04c; jvm 11+28
   [junit4]   2> 61536 INFO  (jetty-launcher-31-thread-5) [    ] o.e.j.s.Server jetty-9.4.11.v20180605; built: 2018-06-05T18:24:03.829Z; git: d5fc0523cfa96bfebfbda19606cad384d772f04c; jvm 11+28
   [junit4]   2> 61537 INFO  (jetty-launcher-31-thread-6) [    ] o.e.j.s.Server jetty-9.4.11.v20180605; built: 2018-06-05T18:24:03.829Z; git: d5fc0523cfa96bfebfbda19606cad384d772f04c; jvm 11+28
   [junit4]   2> 61562 INFO  (jetty-launcher-31-thread-4) [    ] o.e.j.s.session DefaultSessionIdManager workerName=node0
   [junit4]   2> 61563 INFO  (jetty-launcher-31-thread-4) [    ] o.e.j.s.session No SessionScavenger set, using defaults
   [junit4]   2> 61563 INFO  (jetty-launcher-31-thread-4) [    ] o.e.j.s.session node0 Scavenging every 600000ms
   [junit4]   2> 61567 INFO  (jetty-launcher-31-thread-5) [    ] o.e.j.s.session DefaultSessionIdManager workerName=node0
   [junit4]   2> 61568 INFO  (jetty-launcher-31-thread-5) [    ] o.e.j.s.session No SessionScavenger set, using defaults
   [junit4]   2> 61568 INFO  (jetty-launcher-31-thread-5) [    ] o.e.j.s.session node0 Scavenging every 660000ms
   [junit4]   2> 61575 INFO  (jetty-launcher-31-thread-4) [    ] o.e.j.s.h.ContextHandler Started o.e.j.s.ServletContextHandler@25f408fc{/solr,null,AVAILABLE}
   [junit4]   2> 61576 INFO  (jetty-launcher-31-thread-4) [    ] o.e.j.s.AbstractConnector Started ServerConnector@77875543{SSL,[ssl, http/1.1]}{127.0.0.1:34279}
   [junit4]   2> 61576 INFO  (jetty-launcher-31-thread-4) [    ] o.e.j.s.Server Started @61599ms
   [junit4]   2> 61576 INFO  (jetty-launcher-31-thread-4) [    ] o.a.s.c.s.e.JettySolrRunner Jetty properties: {hostContext=/solr, hostPort=34279}
   [junit4]   2> 61576 ERROR (jetty-launcher-31-thread-4) [    ] o.a.s.u.StartupLoggingUtils Missing Java Option solr.log.dir. Logging may be missing or incomplete.
   [junit4]   2> 61576 INFO  (jetty-launcher-31-thread-4) [    ] o.a.s.s.SolrDispatchFilter Using logger factory org.apache.logging.slf4j.Log4jLoggerFactory
   [junit4]   2> 61576 INFO  (jetty-launcher-31-thread-4) [    ] o.a.s.s.SolrDispatchFilter  ___      _       Welcome to Apache Solr? version 8.0.0
   [junit4]   2> 61576 INFO  (jetty-launcher-31-thread-4) [    ] o.a.s.s.SolrDispatchFilter / __| ___| |_ _   Starting in cloud mode on port null
   [junit4]   2> 61576 INFO  (jetty-launcher-31-thread-4) [    ] o.a.s.s.SolrDispatchFilter \__ \/ _ \ | '_|  Install dir: null
   [junit4]   2> 61576 INFO  (jetty-launcher-31-thread-4) [    ] o.a.s.s.SolrDispatchFilter |___/\___/_|_|    Start time: 2018-09-16T01:55:27.228888Z
   [junit4]   2> 61586 INFO  (jetty-launcher-31-thread-2) [    ] o.e.j.s.session DefaultSessionIdManager workerName=node0
   [junit4]   2> 61586 INFO  (jetty-launcher-31-thread-2) [    ] o.e.j.s.session No SessionScavenger set, using defaults
   [junit4]   2> 61586 INFO  (jetty-launcher-31-thread-2) [    ] o.e.j.s.session node0 Scavenging every 660000ms
   [junit4]   2> 61586 INFO  (jetty-launcher-31-thread-6) [    ] o.e.j.s.session DefaultSessionIdManager workerName=node0
   [junit4]   2> 61586 INFO  (jetty-launcher-31-thread-6) [    ] o.e.j.s.session No SessionScavenger set, using defaults
   [junit4]   2> 61586 INFO  (jetty-launcher-31-thread-6) [    ] o.e.j.s.session node0 Scavenging every 660000ms
   [junit4]   2> 61586 INFO  (jetty-launcher-31-thread-5) [    ] o.e.j.s.h.ContextHandler Started o.e.j.s.ServletContextHandler@6d539549{/solr,null,AVAILABLE}
   [junit4]   2> 61587 INFO  (jetty-launcher-31-thread-5) [    ] o.e.j.s.AbstractConnector Started ServerConnector@64d05635{SSL,[ssl, http/1.1]}{127.0.0.1:46149}
   [junit4]   2> 61587 INFO  (jetty-launcher-31-thread-5) [    ] o.e.j.s.Server Started @61610ms
   [junit4]   2> 61587 INFO  (jetty-launcher-31-thread-5) [    ] o.a.s.c.s.e.JettySolrRunner Jetty properties: {hostContext=/solr, hostPort=46149}
   [junit4]   2> 61588 ERROR (jetty-launcher-31-thread-5) [    ] o.a.s.u.StartupLoggingUtils Missing Java Option solr.log.dir. Logging may be missing or incomplete.
   [junit4]   2> 61588 INFO  (jetty-launcher-31-thread-5) [    ] o.a.s.s.SolrDispatchFilter Using logger factory org.apache.logging.slf4j.Log4jLoggerFactory
   [junit4]   2> 61588 INFO  (jetty-launcher-31-thread-5) [    ] o.a.s.s.SolrDispatchFilter  ___      _       Welcome to Apache Solr? version 8.0.0
   [junit4]   2> 61588 INFO  (jetty-launcher-31-thread-5) [    ] o.a.s.s.SolrDispatchFilter / __| ___| |_ _   Starting in cloud mode on port null
   [junit4]   2> 61588 INFO  (jetty-launcher-31-thread-5) [    ] o.a.s.s.SolrDispatchFilter \__ \/ _ \ | '_|  Install dir: null
   [junit4]   2> 61588 INFO  (jetty-launcher-31-thread-5) [    ] o.a.s.s.SolrDispatchFilter |___/\___/_|_|    Start time: 2018-09-16T01:55:27.240334Z
   [junit4]   2> 61596 INFO  (jetty-launcher-31-thread-6) [    ] o.e.j.s.h.ContextHandler Started o.e.j.s.ServletContextHandler@735b7c26{/solr,null,AVAILABLE}
   [junit4]   2> 61596 INFO  (jetty-launcher-31-thread-2) [    ] o.e.j.s.h.ContextHandler Started o.e.j.s.ServletContextHandler@42a900cd{/solr,null,AVAILABLE}
   [junit4]   2> 61596 INFO  (jetty-launcher-31-thread-6) [    ] o.e.j.s.AbstractConnector Started ServerConnector@2b94fd8{SSL,[ssl, http/1.1]}{127.0.0.1:33949}
   [junit4]   2> 61596 INFO  (jetty-launcher-31-thread-6) [    ] o.e.j.s.Server Started @61619ms
   [junit4]   2> 61596 INFO  (jetty-launcher-31-thread-6) [    ] o.a.s.c.s.e.JettySolrRunner Jetty properties: {hostContext=/solr, hostPort=33949}
   [junit4]   2> 61596 INFO  (jetty-launcher-31-thread-2) [    ] o.e.j.s.AbstractConnector Started ServerConnector@33198e12{SSL,[ssl, http/1.1]}{127.0.0.1:42979}
   [junit4]   2> 61597 INFO  (jetty-launcher-31-thread-2) [    ] o.e.j.s.Server Started @61619ms
   [junit4]   2> 61597 INFO  (jetty-launcher-31-thread-2) [    ] o.a.s.c.s.e.JettySolrRunner Jetty properties: {hostContext=/solr, hostPort=42979}
   [junit4]   2> 61597 ERROR (jetty-launcher-31-thread-6) [    ] o.a.s.u.StartupLoggingUtils Missing Java Option solr.log.dir. Logging may be missing or incomplete.
   [junit4]   2> 61597 INFO  (jetty-launcher-31-thread-6) [    ] o.a.s.s.SolrDispatchFilter Using logger factory org.apache.logging.slf4j.Log4jLoggerFactory
   [junit4]   2> 61597 INFO  (jetty-launcher-31-thread-6) [    ] o.a.s.s.SolrDispatchFilter  ___      _       Welcome to Apache Solr? version 8.0.0
   [junit4]   2> 61597 INFO  (jetty-launcher-31-thread-6) [    ] o.a.s.s.SolrDispatchFilter / __| ___| |_ _   Starting in cloud mode on port null
   [junit4]   2> 61597 INFO  (jetty-launcher-31-thread-6) [    ] o.a.s.s.SolrDispatchFilter \__ \/ _ \ | '_|  Install dir: null
   [junit4]   2> 61597 INFO  (jetty-launcher-31-thread-6) [    ] o.a.s.s.SolrDispatchFilter |___/\___/_|_|    Start time: 2018-09-16T01:55:27.249287Z
   [junit4]   2> 61597 ERROR (jetty-launcher-31-thread-2) [    ] o.a.s.u.StartupLoggingUtils Missing Java Option solr.log.dir. Logging may be missing or incomplete.
   [junit4]   2> 61597 INFO  (jetty-launcher-31-thread-2) [    ] o.a.s.s.SolrDispatchFilter Using logger factory org.apache.logging.slf4j.Log4jLoggerFactory
   [junit4]   2> 61597 INFO  (jetty-launcher-31-thread-2) [    ] o.a.s.s.SolrDispatchFilter  ___      _       Welcome to Apache Solr? version 8.0.0
   [junit4]   2> 61597 INFO  (jetty-launcher-31-thread-2) [    ] o.a.s.s.SolrDispatchFilter / __| ___| |_ _   Starting in cloud mode on port null
   [junit4]   2> 61597 INFO  (jetty-launcher-31-thread-2) [    ] o.a.s.s.SolrDispatchFilter \__ \/ _ \ | '_|  Install dir: null
   [junit4]   2> 61597 INFO  (jetty-launcher-31-thread-2) [    ] o.a.s.s.SolrDispatchFilter |___/\___/_|_|    Start time: 2018-09-16T01:55:27.249537Z
   [junit4]   2> 61616 INFO  (zkConnectionManagerCallback-38-thread-1) [    ] o.a.s.c.c.ConnectionManager zkClient has connected
   [junit4]   2> 61620 INFO  (zkConnectionManagerCallback-42-thread-1) [    ] o.a.s.c.c.ConnectionManager zkClient has connected
   [junit4]   2> 61624 INFO  (zkConnectionManagerCallback-36-thread-1) [    ] o.a.s.c.c.ConnectionManager zkClient has connected
   [junit4]   2> 61624 INFO  (jetty-launcher-31-thread-1) [    ] o.e.j.s.session DefaultSessionIdManager workerName=node0
   [junit4]   2> 61624 INFO  (jetty-launcher-31-thread-1) [    ] o.e.j.s.session No SessionScavenger set, using defaults
   [junit4]   2> 61626 INFO  (jetty-launcher-31-thread-3) [    ] o.e.j.s.session DefaultSessionIdManager workerName=node0
   [junit4]   2> 61626 INFO  (jetty-launcher-31-thread-3) [    ] o.e.j.s.session No SessionScavenger set, using defaults
   [junit4]   2> 61626 INFO  (jetty-launcher-31-thread-3) [    ] o.e.j.s.session node0 Scavenging every 660000ms
   [junit4]   2> 61624 INFO  (jetty-launcher-31-thread-1) [    ] o.e.j.s.session node0 Scavenging every 660000ms
   [junit4]   2> 61624 INFO  (jetty-launcher-31-thread-5) [    ] o.a.s.s.SolrDispatchFilter solr.xml found in ZooKeeper. Loading...
   [junit4]   2> 61626 INFO  (jetty-launcher-31-thread-3) [    ] o.e.j.s.h.ContextHandler Started o.e.j.s.ServletContextHandler@65a95fa3{/solr,null,AVAILABLE}
   [junit4]   2> 61626 INFO  (jetty-launcher-31-thread-2) [    ] o.a.s.s.SolrDispatchFilter solr.xml found in ZooKeeper. Loading...
   [junit4]   2> 61627 INFO  (jetty-launcher-31-thread-3) [    ] o.e.j.s.AbstractConnector Started ServerConnector@13261903{SSL,[ssl, http/1.1]}{127.0.0.1:38129}
   [junit4]   2> 61627 INFO  (jetty-launcher-31-thread-3) [    ] o.e.j.s.Server Started @61650ms
   [junit4]   2> 61627 INFO  (jetty-launcher-31-thread-4) [    ] o.a.s.s.SolrDispatchFilter solr.xml found in ZooKeeper. Loading...
   [junit4]   2> 61627 INFO  (jetty-launcher-31-thread-3) [    ] o.a.s.c.s.e.JettySolrRunner Jetty properties: {hostContext=/solr, hostPort=38129}
   [junit4]   2> 61627 INFO  (jetty-launcher-31-thread-1) [    ] o.e.j.s.h.ContextHandler Started o.e.j.s.ServletContextHandler@14245605{/solr,null,AVAILABLE}
   [junit4]   2> 61627 ERROR (jetty-launcher-31-thread-3) [    ] o.a.s.u.StartupLoggingUtils Missing Java Option solr.log.dir. Logging may be missing or incomplete.
   [junit4]   2> 61628 INFO  (jetty-launcher-31-thread-3) [    ] o.a.s.s.SolrDispatchFilter Using logger factory org.apache.logging.slf4j.Log4jLoggerFactory
   [junit4]   2> 61628 INFO  (jetty-launcher-31-thread-3) [    ] o.a.s.s.SolrDispatchFilter  ___      _       Welcome to Apache Solr? version 8.0.0
   [junit4]   2> 61628 INFO  (jetty-launcher-31-thread-3) [    ] o.a.s.s.SolrDispatchFilter / __| ___| |_ _   Starting in cloud mode on port null
   [junit4]   2> 61628 INFO  (jetty-launcher-31-thread-3) [    ] o.a.s.s.SolrDispatchFilter \__ \/ _ \ | '_|  Install dir: null
   [junit4]   2> 61628 INFO  (jetty-launcher-31-thread-3) [    ] o.a.s.s.SolrDispatchFilter |___/\___/_|_|    Start time: 2018-09-16T01:55:27.280219Z
   [junit4]   2> 61628 INFO  (jetty-launcher-31-thread-1) [    ] o.e.j.s.AbstractConnector Started ServerConnector@75ed4c7d{SSL,[ssl, http/1.1]}{127.0.0.1:46857}
   [junit4]   2> 61628 INFO  (jetty-launcher-31-thread-1) [    ] o.e.j.s.Server Started @61651ms
   [junit4]   2> 61628 INFO  (jetty-launcher-31-thread-1) [    ] o.a.s.c.s.e.JettySolrRunner Jetty properties: {hostContext=/solr, hostPort=46857}
   [junit4]   2> 61641 ERROR (jetty-launcher-31-thread-1) [    ] o.a.s.u.StartupLoggingUtils Missing Java Option solr.log.dir. Logging may be missing or incomplete.
   [junit4]   2> 61641 INFO  (jetty-launcher-31-thread-1) [    ] o.a.s.s.SolrDispatchFilter Using logger factory org.apache.logging.slf4j.Log4jLoggerFactory
   [junit4]   2> 61641 INFO  (jetty-launcher-31-thread-1) [    ] o.a.s.s.SolrDispatchFilter  ___      _       Welcome to Apache Solr? version 8.0.0
   [junit4]   2> 61641 INFO  (jetty-launcher-31-thread-1) [    ] o.a.s.s.SolrDispatchFilter / __| ___| |_ _   Starting in cloud mode on port null
   [junit4]   2> 61641 INFO  (jetty-launcher-31-thread-1) [    ] o.a.s.s.SolrDispatchFilter \__ \/ _ \ | '_|  Install dir: null
   [junit4]   2> 61641 INFO  (jetty-launcher-31-thread-1) [    ] o.a.s.s.SolrDispatchFilter |___/\___/_|_|    Start time: 2018-09-16T01:55:27.293784Z
   [junit4]   2> 61647 INFO  (zkConnectionManagerCallback-40-thread-1) [    ] o.a.s.c.c.ConnectionManager zkClient has connected
   [junit4]   2> 61679 INFO  (zkConnectionManagerCallback-44-thread-1) [    ] o.a.s.c.c.ConnectionManager zkClient has connected
   [junit4]   2> 61691 INFO  (jetty-launcher-31-thread-6) [    ] o.a.s.s.SolrDispatchFilter solr.xml found in ZooKeeper. Loading...
   [junit4]   2> 61691 INFO  (jetty-launcher-31-thread-3) [    ] o.a.s.s.SolrDispatchFilter solr.xml found in ZooKeeper. Loading...
   [junit4]   2> 61691 INFO  (zkConnectionManagerCallback-46-thread-1) [    ] o.a.s.c.c.ConnectionManager zkClient has connected
   [junit4]   2> 61692 INFO  (jetty-launcher-31-thread-1) [    ] o.a.s.s.SolrDispatchFilter solr.xml found in ZooKeeper. Loading...
   [junit4]   2> 61836 INFO  (jetty-launcher-31-thread-2) [    ] o.a.s.c.ZkContainer Zookeeper client=127.0.0.1:41541/solr
   [junit4]   2> 61915 INFO  (jetty-launcher-31-thread-4) [    ] o.a.s.c.ZkContainer Zookeeper client=127.0.0.1:41541/solr
   [junit4]   2> 61919 INFO  (jetty-launcher-31-thread-1) [    ] o.a.s.c.ZkContainer Zookeeper client=127.0.0.1:41541/solr
   [junit4]   2> 61944 INFO  (zkConnectionManagerCallback-50-thread-1) [    ] o.a.s.c.c.ConnectionManager zkClient has connected
   [junit4]   2> 61951 INFO  (zkConnectionManagerCallback-58-thread-1) [    ] o.a.s.c.c.ConnectionManager zkClient has connected
   [junit4]   2> 61954 INFO  (zkConnectionManagerCallback-55-thread-1) [    ] o.a.s.c.c.ConnectionManager zkClient has connected
   [junit4]   2> 61956 INFO  (jetty-launcher-31-thread-5) [    ] o.a.s.c.ZkContainer Zookeeper client=127.0.0.1:41541/solr
   [junit4]   2> 61960 WARN  (NIOServerCxn.Factory:0.0.0.0/0.0.0.0:0) [    ] o.a.z.s.NIOServerCnxn Unable to read additional data from client sessionid 0x1009e77166c0008, likely client has closed socket
   [junit4]   2> 61960 WARN  (NIOServerCxn.Factory:0.0.0.0/0.0.0.0:0) [    ] o.a.z.s.NIOServerCnxn Unable to read additional data from client sessionid 0x1009e77166c0007, likely client has closed socket
   [junit4]   2> 61975 INFO  (zkConnectionManagerCallback-66-thread-1) [    ] o.a.s.c.c.ConnectionManager zkClient has connected
   [junit4]   2> 61983 INFO  (zkConnectionManagerCallback-62-thread-1) [    ] o.a.s.c.c.ConnectionManager zkClient has connected
   [junit4]   2> 61995 INFO  (zkConnectionManagerCallback-64-thread-1) [    ] o.a.s.c.c.ConnectionManager zkClient has connected
   [junit4]   2> 61997 INFO  (zkConnectionManagerCallback-68-thread-1) [    ] o.a.s.c.c.ConnectionManager zkClient has connected
   [junit4]   2> 62002 INFO  (zkConnectionManagerCallback-70-thread-1) [    ] o.a.s.c.c.ConnectionManager zkClient has connected
   [junit4]   2> 62037 INFO  (jetty-launcher-31-thread-6) [    ] o.a.s.c.ZkContainer Zookeeper client=127.0.0.1:41541/solr
   [junit4]   2> 62039 INFO  (zkConnectionManagerCallback-82-thread-1) [    ] o.a.s.c.c.ConnectionManager zkClient has connected
   [junit4]   2> 62041 WARN  (NIOServerCxn.Factory:0.0.0.0/0.0.0.0:0) [    ] o.a.z.s.NIOServerCnxn Unable to read additional data from client sessionid 0x1009e77166c000f, likely client has closed socket
   [junit4]   2> 62051 INFO  (zkConnectionManagerCallback-84-thread-1) [    ] o.a.s.c.c.ConnectionManager zkClient has connected
   [junit4]   2> 62121 INFO  (jetty-launcher-31-thread-6) [n:127.0.0.1:33949_solr    ] o.a.s.c.OverseerElectionContext I am going to be the leader 127.0.0.1:33949_solr
   [junit4]   2> 62129 INFO  (jetty-launcher-31-thread-6) [n:127.0.0.1:33949_solr    ] o.a.s.c.Overseer Overseer (id=72231828352401424-127.0.0.1:33949_solr-n_0000000000) starting
   [junit4]   2> 62141 INFO  (jetty-launcher-31-thread-3) [    ] o.a.s.c.ZkContainer Zookeeper client=127.0.0.1:41541/solr
   [junit4]   2> 62161 INFO  (zkConnectionManagerCallback-90-thread-1) [    ] o.a.s.c.c.ConnectionManager zkClient has connected
   [junit4]   2> 62180 INFO  (zkConnectionManagerCallback-92-thread-1) [    ] o.a.s.c.c.ConnectionManager zkClient has connected
   [junit4]   2> 62227 INFO  (jetty-launcher-31-thread-3) [n:127.0.0.1:38129_solr    ] o.a.s.c.ZkController Register node as live in ZooKeeper:/live_nodes/127.0.0.1:38129_solr
   [junit4]   2> 62286 INFO  (zkCallback-91-thread-1) [    ] o.a.s.c.c.ZkStateReader Updated live nodes from ZooKeeper... (0) -> (1)
   [junit4]   2> 62313 INFO  (zkConnectionManagerCallback-99-thread-1) [    ] o.a.s.c.c.ConnectionManager zkClient has connected
   [junit4]   2> 62338 INFO  (zkCallback-83-thread-1) [    ] o.a.s.c.c.ZkStateReader Updated live nodes from ZooKeeper... (0) -> (1)
   [junit4]   2> 62372 INFO  (jetty-launcher-31-thread-6) [n:127.0.0.1:33949_solr    ] o.a.s.c.c.ZkStateReader Updated live nodes from ZooKeeper... (0) -> (1)
   [junit4]   2> 62374 INFO  (jetty-launcher-31-thread-1) [n:127.0.0.1:46857_solr    ] o.a.s.c.c.ZkStateReader Updated live nodes from ZooKeeper... (0) -> (1)
   [junit4]   2> 62374 INFO  (jetty-launcher-31-thread-2) [n:127.0.0.1:42979_solr    ] o.a.s.c.c.ZkStateReader Updated live nodes from ZooKeeper... (0) -> (1)
   [junit4]   2> 62375 INFO  (jetty-launcher-31-thread-6) [n:127.0.0.1:33949_solr    ] o.a.s.c.s.i.ZkClientClusterStateProvider Cluster at 127.0.0.1:41541/solr ready
   [junit4]   2> 62387 INFO  (zkConnectionManagerCallback-104-thread-1) [    ] o.a.s.c.c.ConnectionManager zkClient has connected
   [junit4]   2> 62388 INFO  (jetty-launcher-31-thread-5) [n:127.0.0.1:46149_solr    ] o.a.s.c.c.ZkStateReader Updated live nodes from ZooKeeper... (0) -> (1)
   [junit4]   2> 62389 INFO  (jetty-launcher-31-thread-3) [n:127.0.0.1:38129_solr    ] o.a.s.c.c.ZkStateReader Updated live nodes from ZooKeeper... (0) -> (1)
   [junit4]   2> 62390 INFO  (jetty-launcher-31-thread-4) [n:127.0.0.1:34279_solr    ] o.a.s.c.c.ZkStateReader Updated live nodes from ZooKeeper... (0) -> (1)
   [junit4]   2> 62391 INFO  (jetty-launcher-31-thread-3) [n:127.0.0.1:38129_solr    ] o.a.s.c.s.i.ZkClientClusterStateProvider Cluster at 127.0.0.1:41541/solr ready
   [junit4]   2> 62392 INFO  (jetty-launcher-31-thread-1) [n:127.0.0.1:46857_solr    ] o.a.s.c.TransientSolrCoreCacheDefault Allocating transient cache for 2147483647 transient cores
   [junit4]   2> 62392 INFO  (jetty-launcher-31-thread-2) [n:127.0.0.1:42979_solr    ] o.a.s.c.TransientSolrCoreCacheDefault Allocating transient cache for 2147483647 transient cores
   [junit4]   2> 62392 INFO  (jetty-launcher-31-thread-1) [n:127.0.0.1:46857_solr    ] o.a.s.c.ZkController Register node as live in ZooKeeper:/live_nodes/127.0.0.1:46857_solr
   [junit4]   2> 62393 INFO  (jetty-launcher-31-thread-2) [n:127.0.0.1:42979_solr    ] o.a.s.c.ZkController Register node as live in ZooKeeper:/live_nodes/127.0.0.1:42979_solr
   [junit4]   2> 62394 INFO  (zkCallback-91-thread-1) [    ] o.a.s.c.c.ZkStateReader Updated live nodes from ZooKeeper... (1) -> (3)
   [junit4]   2> 62394 INFO  (zkCallback-83-thread-1) [    ] o.a.s.c.c.ZkStateReader Updated live nodes from ZooKeeper... (1) -> (3)
   [junit4]   2> 62419 INFO  (jetty-launcher-31-thread-5) [n:127.0.0.1:46149_solr    ] o.a.s.c.TransientSolrCoreCacheDefault Allocating transient cache for 2147483647 transient cores
   [junit4]   2> 62420 INFO  (jetty-launcher-31-thread-5) [n:127.0.0.1:46149_solr    ] o.a.s.c.ZkController Register node as live in ZooKeeper:/live_nodes/127.0.0.1:46149_solr
   [junit4]   2> 62427 INFO  (zkCallback-91-thread-1) [    ] o.a.s.c.c.ZkStateReader Updated live nodes from ZooKeeper... (3) -> (4)
   [junit4]   2> 62436 INFO  (jetty-launcher-31-thread-4) [n:127.0.0.1:34279_solr    ] o.a.s.c.TransientSolrCoreCacheDefault Allocating transient cache for 2147483647 transient cores
   [junit4]   2> 62437 INFO  (jetty-launcher-31-thread-4) [n:127.0.0.1:34279_solr    ] o.a.s.c.ZkController Register node as live in ZooKeeper:/live_nodes/127.0.0.1:34279_solr
   [junit4]   2> 62438 INFO  (zkCallback-91-thread-1) [    ] o.a.s.c.c.ZkStateReader Updated live nodes from ZooKeeper... (4) -> (5)
   [junit4]   2> 62447 INFO  (zkCallback-83-thread-1) [    ] o.a.s.c.c.ZkStateReader Updated live nodes from ZooKeeper... (3) -> (4)
   [junit4]   2> 62448 INFO  (zkCallback-83-thread-1) [    ] o.a.s.c.c.ZkStateReader Updated live nodes from ZooKeeper... (4) -> (5)
   [junit4]   2> 62500 INFO  (zkCallback-69-thread-1) [    ] o.a.s.c.c.ZkStateReader Updated live nodes from ZooKeeper... (1) -> (4)
   [junit4]   2> 62500 INFO  (zkCallback-67-thread-1) [    ] o.a.s.c.c.ZkStateReader Updated live nodes from ZooKeeper... (1) -> (5)
   [junit4]   2> 62500 INFO  (zkCallback-103-thread-1) [    ] o.a.s.c.c.ZkStateReader Updated live nodes from ZooKeeper... (1) -> (5)
   [junit4]   2> 62500 INFO  (zkCallback-98-thread-1) [    ] o.a.s.c.c.ZkStateReader Updated live nodes from ZooKeeper... (1) -> (5)
   [junit4]   2> 62500 INFO  (zkCallback-63-thread-1) [    ] o.a.s.c.c.ZkStateReader Updated live nodes from ZooKeeper... (1) -> (5)
   [junit4]   2> 62500 INFO  (zkCallback-65-thread-1) [    ] o.a.s.c.c.ZkStateReader Updated live nodes from ZooKeeper... (1) -> (5)
   [junit4]   2> 62501 INFO  (jetty-launcher-31-thread-3) [n:127.0.0.1:38129_solr    ] o.a.s.h.a.MetricsHistoryHandler No .system collection, keeping metrics history in memory.
   [junit4]   2> 62524 INFO  (zkCallback-69-thread-2) [    ] o.a.s.c.c.ZkStateReader Updated live nodes from ZooKeeper... (4) -> (5)
   [junit4]   2> 62526 INFO  (OverseerStateUpdate-72231828352401424-127.0.0.1:33949_solr-n_0000000000) [n:127.0.0.1:33949_solr    ] o.a.s.c.Overseer Starting to work on the main queue : 127.0.0.1:33949_solr
   [junit4]   2> 62526 INFO  (jetty-launcher-31-thread-6) [n:127.0.0.1:33949_solr    ] o.a.s.c.TransientSolrCoreCacheDefault Allocating transient cache for 2147483647 transient cores
   [junit4]   2> 62526 INFO  (jetty-launcher-31-thread-6) [n:127.0.0.1:33949_solr    ] o.a.s.c.ZkController Register node as live in ZooKeeper:/live_nodes/127.0.0.1:33949_solr
   [junit4]   2> 62528 INFO  (zkCallback-91-thread-1) [    ] o.a.s.c.c.ZkStateReader Updated live nodes from ZooKeeper... (5) -> (6)
   [junit4]   2> 62528 INFO  (zkCallback-69-thread-2) [    ] o.a.s.c.c.ZkStateReader Updated live nodes from ZooKeeper... (5) -> (6)
   [junit4]   2> 62528 INFO  (zkCallback-67-thread-1) [    ] o.a.s.c.c.ZkStateReader Updated live nodes from ZooKeeper... (5) -> (6)
   [junit4]   2> 62528 INFO  (zkCallback-98-thread-1) [    ] o.a.s.c.c.ZkStateReader Updated live nodes from ZooKeeper... (5) -> (6)
   [junit4]   2> 62528 INFO  (zkCallback-103-thread-1) [    ] o.a.s.c.c.ZkStateReader Updated live nodes from ZooKeeper... (5) -> (6)
   [junit4]   2> 62528 INFO  (zkCallback-65-thread-1) [    ] o.a.s.c.c.ZkStateReader Updated live nodes from ZooKeeper... (5) -> (6)
   [junit4]   2> 62540 INFO  (zkCallback-63-thread-1) [    ] o.a.s.c.c.ZkStateReader Updated live nodes from ZooKeeper... (5) -> (6)
   [junit4]   2> 62540 INFO  (zkCallback-83-thread-1) [    ] o.a.s.c.c.ZkStateReader Updated live nodes from ZooKeeper... (5) -> (6)
   [junit4]   2> 62573 INFO  (jetty-launcher-31-thread-3) [n:127.0.0.1:38129_solr    ] o.a.s.m.r.SolrJmxReporter JMX monitoring for 'solr_38129.solr.node' (registry 'solr.node') enabled at server: com.sun.jmx.mbeanserver.JmxMBeanServer@61ba7a7b
   [junit4]   2> 62595 INFO  (zkConnectionManagerCallback-113-thread-1) [    ] o.a.s.c.c.ConnectionManager zkClient has connected
   [junit4]   2> 62595 INFO  (jetty-launcher-31-thread-3) [n:127.0.0.1:38129_solr    ] o.a.s.m.r.SolrJmxReporter JMX monitoring for 'solr_38129.solr.jvm' (registry 'solr.jvm') enabled at server: com.sun.jmx.mbeanserver.JmxMBeanServer@61ba7a7b
   [junit4]   2> 62596 INFO  (jetty-launcher-31-thread-3) [n:127.0.0.1:38129_solr    ] o.a.s.m.r.SolrJmxReporter JMX monitoring for 'solr_38129.solr.jetty' (registry 'solr.jetty') enabled at server: com.sun.jmx.mbeanserver.JmxMBeanServer@61ba7a7b
   [junit4]   2> 62598 INFO  (jetty-launcher-31-thread-3) [n:127.0.0.1:38129_solr    ] o.a.s.c.CorePropertiesLocator Found 0 core definitions underneath /home/jenkins/workspace/Lucene-Solr-master-Linux/solr/build/solr-core/test/J0/temp/solr.cloud.ReplaceNodeTest_A58EF8F0FB7EC0DD-001/tempDir-001/node4/.
   [junit4]   2> 62603 INFO  (zkConnectionManagerCallback-117-thread-1) [    ] o.a.s.c.c.ConnectionManager zkClient has connected
   [junit4]   2> 62611 INFO  (zkConnectionManagerCallback-125-thread-1) [    ] o.a.s.c.c.ConnectionManager zkClient has connected
   [junit4]   2> 62619 INFO  (zkConnectionManagerCallback-121-thread-1) [    ] o.a.s.c.c.ConnectionManager zkClient has connected
   [junit4]   2> 62635 INFO  (jetty-launcher-31-thread-6) [n:127.0.0.1:33949_solr    ] o.a.s.h.a.MetricsHistoryHandler No .system collection, keeping metrics history in memory.
   [junit4]   2> 62648 INFO  (jetty-launcher-31-thread-1) [n:127.0.0.1:46857_solr    ] o.a.s.c.c.ZkStateReader Updated live nodes from ZooKeeper... (0) -> (6)
   [junit4]   2> 62649 INFO  (jetty-launcher-31-thread-1) [n:127.0.0.1:46857_solr    ] o.a.s.c.s.i.ZkClientClusterStateProvider Cluster at 127.0.0.1:41541/solr ready
   [junit4]   2> 62649 INFO  (jetty-launcher-31-thread-2) [n:127.0.0.1:42979_solr    ] o.a.s.c.c.ZkStateReader Updated live nodes from ZooKeeper... (0) -> (6)
   [junit4]   2> 62649 INFO  (jetty-launcher-31-thread-4) [n:127.0.0.1:34279_solr    ] o.a.s.c.c.ZkStateReader Updated live nodes from ZooKeeper... (0) -> (6)
   [junit4]   2> 62649 INFO  (jetty-launcher-31-thread-5) [n:127.0.0.1:46149_solr    ] o.a.s.c.c.ZkStateReader Updated live nodes from ZooKeeper... (0) -> (6)
   [junit4]   2> 62650 INFO  (jetty-launcher-31-thread-4) [n:127.0.0.1:34279_solr    ] o.a.s.c.s.i.ZkClientClusterStateProvider Cluster at 127.0.0.1:41541/solr ready
   [junit4]   2> 62651 INFO  (jetty-launcher-31-thread-2) [n:127.0.0.1:42979_solr    ] o.a.s.c.s.i.ZkClientClusterStateProvider Cluster at 127.0.0.1:41541/solr ready
   [junit4]   2> 62651 INFO  (jetty-launcher-31-thread-5) [n:127.0.0.1:46149_solr    ] o.a.s.c.s.i.ZkClientClusterStateProvider Cluster at 127.0.0.1:41541/solr ready
   [junit4]   2> 62663 INFO  (jetty-launcher-31-thread-6) [n:127.0.0.1:33949_solr    ] o.a.s.m.r.SolrJmxReporter JMX monitoring for 'solr_33949.solr.node' (registry 'solr.node') enabled at server: com.sun.jmx.mbeanserver.JmxMBeanServer@61ba7a7b
   [junit4]   2> 62671 INFO  (jetty-launcher-31-thread-5) [n:127.0.0.1:46149_solr    ] o.a.s.h.a.MetricsHistoryHandler No .system collection, keeping metrics history in memory.
   [junit4]   2> 62687 INFO  (jetty-launcher-31-thread-5) [n:127.0.0.1:46149_solr    ] o.a.s.m.r.SolrJmxReporter JMX monitoring for 'solr_46149.solr.node' (registry 'solr.node') enabled at server: com.sun.jmx.mbeanserver.JmxMBeanServer@61ba7a7b
   [junit4]   2> 62690 INFO  (jetty-launcher-31-thread-6) [n:127.0.0.1:33949_solr    ] o.a.s.m.r.SolrJmxReporter JMX monitoring for 'solr_33949.solr.jvm' (registry 'solr.jvm') enabled at server: com.sun.jmx.mbeanserver.JmxMBeanServer@61ba7a7b
   [junit4]   2> 62690 INFO  (jetty-launcher-31-thread-6) [n:127.0.0.1:33949_solr    ] o.a.s.m.r.SolrJmxReporter JMX monitoring for 'solr_33949.solr.jetty' (registry 'solr.jetty') enabled at server: com.sun.jmx.mbeanserver.JmxMBeanServer@61ba7a7b
   [junit4]   2> 62691 INFO  (jetty-launcher-31-thread-6) [n:127.0.0.1:33949_solr    ] o.a.s.c.CorePropertiesLocator Found 0 core definitions underneath /home/jenkins/workspace/Lucene-Solr-master-Linux/solr/build/solr-core/test/J0/temp/solr.cloud.ReplaceNodeTest_A58EF8F0FB7EC0DD-001/tempDir-001/node6/.
   [junit4]   2> 62698 INFO  (jetty-launcher-31-thread-5) [n:127.0.0.1:46149_solr    ] o.a.s.m.r.SolrJmxReporter JMX monitoring for 'solr_46149.solr.jvm' (registry 'solr.jvm') enabled at server: com.sun.jmx.mbeanserver.JmxMBeanServer@61ba7a7b
   [junit4]   2> 62698 INFO  (jetty-launcher-31-thread-5) [n:127.0.0.1:46149_solr    ] o.a.s.m.r.SolrJmxReporter JMX monitoring for 'solr_46149.solr.jetty' (registry 'solr.jetty') enabled at server: com.sun.jmx.mbeanserver.JmxMBeanServer@61ba7a7b
   [junit4]   2> 62699 INFO  (jetty-launcher-31-thread-5) [n:127.0.0.1:46149_solr    ] o.a.s.c.CorePropertiesLocator Found 0 core definitions underneath /home/jenkins/workspace/Lucene-Solr-master-Linux/solr/build/solr-core/test/J0/temp/solr.cloud.ReplaceNodeTest_A58EF8F0FB7EC0DD-001/tempDir-001/node5/.
   [junit4]   2> 62699 INFO  (jetty-launcher-31-thread-2) [n:127.0.0.1:42979_solr    ] o.a.s.h.a.MetricsHistoryHandler No .system collection, keeping metrics history in memory.
   [junit4]   2> 62715 INFO  (jetty-launcher-31-thread-2) [n:127.0.0.1:42979_solr    ] o.a.s.m.r.SolrJmxReporter JMX monitoring for 'solr_42979.solr.node' (registry 'solr.node') enabled at server: com.sun.jmx.mbeanserver.JmxMBeanServer@61ba7a7b
   [junit4]   2> 62727 INFO  (jetty-launcher-31-thread-4) [n:127.0.0.1:34279_solr    ] o.a.s.h.a.MetricsHistoryHandler No .system collection, keeping metrics history in memory.
   [junit4]   2> 62762 INFO  (jetty-launcher-31-thread-2) [n:127.0.0.1:42979_solr    ] o.a.s.m.r.SolrJmxReporter JMX monitoring for 'solr_42979.solr.jvm' (registry 'solr.jvm') enabled at server: com.sun.jmx.mbeanserver.JmxMBeanServer@61ba7a7b
   [junit4]   2> 62763 INFO  (jetty-launcher-31-thread-2) [n:127.0.0.1:42979_solr    ] o.a.s.m.r.SolrJmxReporter JMX monitoring for 'solr_42979.solr.jetty' (registry 'solr.jetty') enabled at server: com.sun.jmx.mbeanserver.JmxMBeanServer@61ba7a7b
   [junit4]   2> 62764 INFO  (jetty-launcher-31-thread-4) [n:127.0.0.1:34279_solr    ] o.a.s.m.r.SolrJmxReporter JMX monitoring for 'solr_34279.solr.node' (registry 'solr.node') enabled at server: com.sun.jmx.mbeanserver.JmxMBeanServer@61ba7a7b
   [junit4]   2> 62764 INFO  (jetty-launcher-31-thread-2) [n:127.0.0.1:42979_solr    ] o.a.s.c.CorePropertiesLocator Found 0 core definitions underneath /home/jenkins/workspace/Lucene-Solr-master-Linux/solr/build/solr-core/test/J0/temp/solr.cloud.ReplaceNodeTest_A58EF8F0FB7EC0DD-001/tempDir-001/node2/.
   [junit4]   2> 62767 INFO  (jetty-launcher-31-thread-1) [n:127.0.0.1:46857_solr    ] o.a.s.h.a.MetricsHistoryHandler No .system collection, keeping metrics history in memory.
   [junit4]   2> 62773 INFO  (jetty-launcher-31-thread-4) [n:127.0.0.1:34279_solr    ] o.a.s.m.r.SolrJmxReporter JMX monitoring for 'solr_34279.solr.jvm' (registry 'solr.jvm') enabled at server: com.sun.jmx.mbeanserver.JmxMBeanServer@61ba7a7b
   [junit4]   2> 62773 INFO  (jetty-launcher-31-thread-4) [n:127.0.0.1:34279_solr    ] o.a.s.m.r.SolrJmxReporter JMX monitoring for 'solr_34279.solr.jetty' (registry 'solr.jetty') enabled at server: com.sun.jmx.mbeanserver.JmxMBeanServer@61ba7a7b
   [junit4]   2> 62774 INFO  (jetty-launcher-31-thread-4) [n:127.0.0.1:34279_solr    ] o.a.s.c.CorePropertiesLocator Found 0 core definitions underneath /home/jenkins/workspace/Lucene-Solr-master-Linux/solr/build/solr-core/test/J0/temp/solr.cloud.ReplaceNodeTest_A58EF8F0FB7EC0DD-001/tempDir-001/node3/.
   [junit4]   2> 62824 INFO  (jetty-launcher-31-thread-1) [n:127.0.0.1:46857_solr    ] o.a.s.m.r.SolrJmxReporter JMX monitoring for 'solr_46857.solr.node' (registry 'solr.node') enabled at server: com.sun.jmx.mbeanserver.JmxMBeanServer@61ba7a7b
   [junit4]   2> 62833 INFO  (jetty-launcher-31-thread-1) [n:127.0.0.1:46857_solr    ] o.a.s.m.r.SolrJmxReporter JMX monitoring for 'solr_46857.solr.jvm' (registry 'solr.jvm') enabled at server: com.sun.jmx.mbeanserver.JmxMBeanServer@61ba7a7b
   [junit4]   2> 62833 INFO  (jetty-launcher-31-thread-1) [n:127.0.0.1:46857_solr    ] o.a.s.m.r.SolrJmxReporter JMX monitoring for 'solr_46857.solr.jetty' (registry 'solr.jetty') enabled at server: com.sun.jmx.mbeanserver.JmxMBeanServer@61ba7a7b
   [junit4]   2> 62834 INFO  (jetty-launcher-31-thread-1) [n:127.0.0.1:46857_solr    ] o.a.s.c.CorePropertiesLocator Found 0 core definitions underneath /home/jenkins/workspace/Lucene-Solr-master-Linux/solr/build/solr-core/test/J0/temp/solr.cloud.ReplaceNodeTest_A58EF8F0FB7EC0DD-001/tempDir-001/node1/.
   [junit4]   2> 63067 INFO  (zkConnectionManagerCallback-132-thread-1) [    ] o.a.s.c.c.ConnectionManager zkClient has connected
   [junit4]   2> 63074 INFO  (zkConnectionManagerCallback-137-thread-1) [    ] o.a.s.c.c.ConnectionManager zkClient has connected
   [junit4]   2> 63077 INFO  (SUITE-ReplaceNodeTest-seed#[A58EF8F0FB7EC0DD]-worker) [    ] o.a.s.c.c.ZkStateReader Updated live nodes from ZooKeeper... (0) -> (6)
   [junit4]   2> 63077 INFO  (SUITE-ReplaceNodeTest-seed#[A58EF8F0FB7EC0DD]-worker) [    ] o.a.s.c.s.i.ZkClientClusterStateProvider Cluster at 127.0.0.1:41541/solr ready
   [junit4]   2> 63127 INFO  (TEST-ReplaceNodeTest.test-seed#[A58EF8F0FB7EC0DD]) [    ] o.a.s.SolrTestCaseJ4 ###Starting test
   [junit4]   2> 63190 INFO  (zkConnectionManagerCallback-139-thread-1) [    ] o.a.s.c.c.ConnectionManager zkClient has connected
   [junit4]   2> 63199 INFO  (TEST-ReplaceNodeTest.test-seed#[A58EF8F0FB7EC0DD]) [    ] o.a.s.c.ReplaceNodeTest total_jettys: 6
   [junit4]   2> 63233 INFO  (qtp2000769186-689) [n:127.0.0.1:38129_solr    ] o.a.s.h.a.CollectionsHandler Invoked Collection Action :create with params pullReplicas=1&collection.configName=conf1&maxShardsPerNode=3&name=replacenodetest_coll&nrtReplicas=0&action=CREATE&numShards=5&tlogReplicas=1&createNodeSet=127.0.0.1:38129_solr,127.0.0.1:46857_solr,127.0.0.1:46149_solr,127.0.0.1:42979_solr,127.0.0.1:34279_solr&wt=javabin&version=2 and sendToOCPQueue=true
   [junit4]   2> 63264 INFO  (OverseerThreadFactory-242-thread-1-processing-n:127.0.0.1:33949_solr) [n:127.0.0.1:33949_solr    ] o.a.s.c.a.c.CreateCollectionCmd Create collection replacenodetest_coll
   [junit4]   2> 63399 INFO  (OverseerStateUpdate-72231828352401424-127.0.0.1:33949_solr-n_0000000000) [n:127.0.0.1:33949_solr    ] o.a.s.c.o.SliceMutator createReplica() {
   [junit4]   2>   "operation":"ADDREPLICA",
   [junit4]   2>   "collection":"replacenodetest_coll",
   [junit4]   2>   "shard":"shard1",
   [junit4]   2>   "core":"replacenodetest_coll_shard1_replica_t1",
   [junit4]   2>   "state":"down",
   [junit4]   2>   "base_url":"https://127.0.0.1:46149/solr",
   [junit4]   2>   "type":"TLOG",
   [junit4]   2>   "waitForFinalState":"false"} 
   [junit4]   2> 63408 INFO  (OverseerStateUpdate-72231828352401424-127.0.0.1:33949_solr-n_0000000000) [n:127.0.0.1:33949_solr    ] o.a.s.c.o.SliceMutator createReplica() {
   [junit4]   2>   "operation":"ADDREPLICA",
   [junit4]   2>   "collection":"replacenodetest_coll",
   [junit4]   2>   "shard":"shard1",
   [junit4]   2>   "core":"replacenodetest_coll_shard1_replica_p3",
   [junit4]   2>   "state":"down",
   [junit4]   2>   "base_url":"https://127.0.0.1:42979/solr",
   [junit4]   2>   "type":"PULL",
   [junit4]   2>   "waitForFinalState":"false"} 
   [junit4]   2> 63410 INFO  (OverseerStateUpdate-72231828352401424-127.0.0.1:33949_solr-n_0000000000) [n:127.0.0.1:33949_solr    ] o.a.s.c.o.SliceMutator createReplica() {
   [junit4]   2>   "operation":"ADDREPLICA",
   [junit4]   2>   "collection":"replacenodetest_coll",
   [junit4]   2>   "shard":"shard2",
   [junit4]   2>   "core":"replacenodetest_coll_shard2_replica_t5",
   [junit4]   2>   "state":"down",
   [junit4]   2>   "base_url":"https://127.0.0.1:38129/solr",
   [junit4]   2>   "type":"TLOG",
   [junit4]   2>   "waitForFinalState":"false"} 
   [junit4]   2> 63413 INFO  (OverseerStateUpdate-72231828352401424-127.0.0.1:33949_solr-n_0000000000) [n:127.0.0.1:33949_solr    ] o.a.s.c.o.SliceMutator createReplica() {
   [junit4]   2>   "operation":"ADDREPLICA",
   [junit4]   2>   "collection":"replacenodetest_coll",
   [junit4]   2>   "shard":"shard2",
   [junit4]   2>   "core":"replacenodetest_coll_shard2_replica_p6",
   [junit4]   2>   "state":"down",
   [junit4]   2>   "base_url":"https://127.0.0.1:46857/solr",
   [junit4]   2>   "type":"PULL",
   [junit4]   2>   "waitForFinalState":"false"} 
   [junit4]   2> 63415 INFO  (OverseerStateUpdate-72231828352401424-127.0.0.1:33949_solr-n_0000000000) [n:127.0.0.1:33949_solr    ] o.a.s.c.o.SliceMutator createReplica() {
   [junit4]   2>   "operation":"ADDREPLICA",
   [junit4]   2>   "collection":"replacenodetest_coll",
   [junit4]   2>   "shard":"shard3",
   [junit4]   2>   "core":"replacenodetest_coll_shard3_replica_t8",
   [junit4]   2>   "state":"down",
   [junit4]   2>   "base_url":"https://127.0.0.1:34279/solr",
   [junit4]   2>   "type":"TLOG",
   [junit4]   2>   "waitForFinalState":"false"} 
   [junit4]   2> 63417 INFO  (OverseerStateUpdate-72231828352401424-127.0.0.1:33949_solr-n_0000000000) [n:127.0.0.1:33949_solr    ] o.a.s.c.o.SliceMutator createReplica() {
   [junit4]   2>   "operation":"ADDREPLICA",
   [junit4]   2>   "collection":"replacenodetest_coll",
   [junit4]   2>   "shard":"shard3",
   [junit4]   2>   "core":"replacenodetest_coll_shard3_replica_p10",
   [junit4]   2>   "state":"down",
   [junit4]   2>   "base_url":"https://127.0.0.1:46149/solr",
   [junit4]   2>   "type":"PULL",
   [junit4]   2>   "waitForFinalState":"false"} 
   [junit4]   2> 63420 INFO  (OverseerStateUpdate-72231828352401424-127.0.0.1:33949_solr-n_0000000000) [n:127.0.0.1:33949_solr    ] o.a.s.c.o.SliceMutator createReplica() {
   [junit4]   2>   "operation":"ADDREPLICA",
   [junit4]   2>   "collection":"replacenodetest_coll",
   [junit4]   2>   "shard":"shard4",
   [junit4]   2>   "core":"replacenodetest_coll_shard4_replica_t12",
   [junit4]   2>   "state":"down",
   [junit4]   2>   "base_url":"https://127.0.0.1:42979/solr",
   [junit4]   2>   "type":"TLOG",
   [junit4]   2>   "waitForFinalState":"false"} 
   [junit4]   2> 63422 INFO  (OverseerStateUpdate-72231828352401424-127.0.0.1:33949_solr-n_0000000000) [n:127.0.0.1:33949_solr    ] o.a.s.c.o.SliceMutator createReplica() {
   [junit4]   2>   "operation":"ADDREPLICA",
   [junit4]   2>   "collection":"replacenodetest_coll",
   [junit4]   2>   "shard":"shard4",
   [junit4]   2>   "core":"replacenodetest_coll_shard4_replica_p14",
   [junit4]   2>   "state":"down",
   [junit4]   2>   "base_url":"https://127.0.0.1:38129/solr",
   [junit4]   2>   "type":"PULL",
   [junit4]   2>   "waitForFinalState":"false"} 
   [junit4]   2> 63424 INFO  (OverseerStateUpdate-72231828352401424-127.0.0.1:33949_solr-n_0000000000) [n:127.0.0.1:33949_solr    ] o.a.s.c.o.SliceMutator createReplica() {
   [junit4]   2>   "operation":"ADDREPLICA",
   [junit4]   2>   "collection":"replacenodetest_coll",
   [junit4]   2>   "shard":"shard5",
   [junit4]   2>   "core":"replacenodetest_coll_shard5_replica_t16",
   [junit4]   2>   "state":"down",
   [junit4]   2>   "base_url":"https://127.0.0.1:46857/solr",
   [junit4]   2>   "type":"TLOG",
   [junit4]   2>   "waitForFinalState":"false"} 
   [junit4]   2> 63426 INFO  (OverseerStateUpdate-72231828352401424-127.0.0.1:33949_solr-n_0000000000) [n:127.0.0.1:33949_solr    ] o.a.s.c.o.SliceMutator createReplica() {
   [junit4]   2>   "operation":"ADDREPLICA",
   [junit4]   2>   "collection":"replacenodetest_coll",
   [junit4]   2>   "shard":"shard5",
   [junit4]   2>   "core":"replacenodetest_coll_shard5_replica_p18",
   [junit4]   2>   "state":"down",
   [junit4]   2>   "base_url":"https://127.0.0.1:34279/solr",
   [junit4]   2>   "type":"PULL",
   [junit4]   2>   "waitForFinalState":"false"} 
   [junit4]   2> 63869 INFO  (qtp1660332121-854) [n:127.0.0.1:46857_solr    x:replacenodetest_coll_shard5_replica_t16] o.a.s.h.a.CoreAdminOperation core create command qt=/admin/cores&coreNodeName=core_node19&collection.configName=conf1&newCollection=true&name=replacenodetest_coll_shard5_replica_t16&action=CREATE&numShards=5&collection=replacenodetest_coll&shard=shard5&wt=javabin&version=2&replicaType=TLOG
   [junit4]   2> 63874 INFO  (qtp1227824748-640) [n:127.0.0.1:46149_solr    x:replacenodetest_coll_shard1_replica_t1] o.a.s.h.a.CoreAdminOperation core create command qt=/admin/cores&coreNodeName=core_node2&collection.configName=conf1&newCollection=true&name=replacenodetest_coll_shard1_replica_t1&action=CREATE&numShards=5&collection=replacenodetest_coll&shard=shard1&wt=javabin&version=2&replicaType=TLOG
   [junit4]   2> 63880 INFO  (qtp727307786-646) [n:127.0.0.1:42979_solr    x:replacenodetest_coll_shard4_replica_t12] o.a.s.h.a.CoreAdminOperation core create command qt=/admin/cores&coreNodeName=core_node15&collection.configName=conf1&newCollection=true&name=replacenodetest_coll_shard4_replica_t12&action=CREATE&numShards=5&collection=replacenodetest_coll&shard=shard4&wt=javabin&version=2&replicaType=TLOG
   [junit4]   2> 63856 ERROR (OverseerThreadFactory-242-thread-1-processing-n:127.0.0.1:33949_solr) [n:127.0.0.1:33949_solr    ] o.a.s.c.a.c.OverseerCollectionMessageHandler Error from shard: https://127.0.0.1:38129/solr
   [junit4]   2> org.apache.solr.client.solrj.SolrServerException: IOException occured when talking to server at: https://127.0.0.1:38129/solr
   [junit4]   2> 	at org.apache.solr.client.solrj.impl.HttpSolrClient.executeMethod(HttpSolrClient.java:657) ~[java/:?]
   [junit4]   2> 	at org.apache.solr.client.solrj.impl.HttpSolrClient.request(HttpSolrClient.java:255) ~[java/:?]
   [junit4]   2> 	at org.apache.solr.client.solrj.impl.HttpSolrClient.request(HttpSolrClient.java:244) ~[java/:?]
   [junit4]   2> 	at org.apache.solr.client.solrj.SolrClient.request(SolrClient.java:1219) ~[java/:?]
   [junit4]   2> 	at org.apache.solr.handler.component.HttpShardHandler.lambda$submit$0(HttpShardHandler.java:172) ~[java/:?]
   [junit4]   2> 	at java.util.concurrent.FutureTask.run(FutureTask.java:264) ~[?:?]
   [junit4]   2> 	at java.util.concurrent.Executors$RunnableAdapter.call(Executors.java:515) ~[?:?]
   [junit4]   2> 	at java.util.concurrent.FutureTask.run(FutureTask.java:264) ~[?:?]
   [junit4]   2> 	at com.codahale.metrics.InstrumentedExecutorService$InstrumentedRunnable.run(InstrumentedExecutorService.java:176) ~[metrics-core-3.2.6.jar:3.2.6]
   [junit4]   2> 	at org.apache.solr.common.util.ExecutorUtil$MDCAwareThreadPoolExecutor.lambda$execute$0(ExecutorUtil.java:209) [java/:?]
   [junit4]   2> 	at java.util.concurrent.ThreadPoolExecutor.runWorker(ThreadPoolExecutor.java:1128) [?:?]
   [junit4]   2> 	at java.util.concurrent.ThreadPoolExecutor$Worker.run(ThreadPoolExecutor.java:628) [?:?]
   [junit4]   2> 	at java.lang.Thread.run(Thread.java:834) [?:?]
   [junit4]   2> Caused by: javax.net.ssl.SSLException: Received fatal alert: internal_error
   [junit4]   2> 	at sun.security.ssl.Alert.createSSLException(Alert.java:129) ~[?:?]
   [junit4]   2> 	at sun.security.ssl.Alert.createSSLException(Alert.java:117) ~[?:?]
   [junit4]   2> 	at sun.security.ssl.TransportContext.fatal(TransportContext.java:308) ~[?:?]
   [junit4]   2> 	at sun.security.ssl.Alert$AlertConsumer.consume(Alert.java:279) ~[?:?]
   [junit4]   2> 	at sun.security.ssl.TransportContext.dispatch(TransportContext.java:181) ~[?:?]
   [junit4]   2> 	at sun.security.ssl.SSLTransport.decode(SSLTransport.java:164) ~[?:?]
   [junit4]   2> 	at sun.security.ssl.SSLSocketImpl.decode(SSLSocketImpl.java:1152) ~[?:?]
   [junit4]   2> 	at sun.security.ssl.SSLSocketImpl.readHandshakeRecord(SSLSocketImpl.java:1063) ~[?:?]
   [junit4]   2> 	at sun.security.ssl.SSLSocketImpl.startHandshake(SSLSocketImpl.java:402) ~[?:?]
   [junit4]   2> 	at org.apache.http.conn.ssl.SSLConnectionSocketFactory.createLayeredSocket(SSLConnectionSocketFactory.java:396) ~[httpclient-4.5.3.jar:4.5.3]
   [junit4]   2> 	at org.apache.http.conn.ssl.SSLConnectionSocketFactory.connectSocket(SSLConnectionSocketFactory.java:355) ~[httpclient-4.5.3.jar:4.5.3]
   [junit4]   2> 	at org.apache.http.impl.conn.DefaultHttpClientConnectionOperator.connect(DefaultHttpClientConnectionOperator.java:142) ~[httpclient-4.5.3.jar:4.5.3]
   [junit4]   2> 	at org.apache.http.impl.conn.PoolingHttpClientConnectionManager.connect(PoolingHttpClientConnectionManager.java:359) ~[httpclient-4.5.3.jar:4.5.3]
   [junit4]   2> 	at org.apache.http.impl.execchain.MainClientExec.establishRoute(MainClientExec.java:381) ~[httpclient-4.5.3.jar:4.5.3]
   [junit4]   2> 	at org.apache.http.impl.execchain.MainClientExec.execute(MainClientExec.java:237) ~[httpclient-4.5.3.jar:4.5.3]
   [junit4]   2> 	at org.apache.http.impl.execchain.ProtocolExec.execute(ProtocolExec.java:185) ~[httpclient-4.5.3.jar:4.5.3]
   [junit4]   2> 	at org.apache.http.impl.execchain.RetryExec.execute(RetryExec.java:89) ~[httpclient-4.5.3.jar:4.5.3]
   [junit4]   2> 	at org.apache.http.impl.execchain.RedirectExec.execute(RedirectExec.java:111) ~[httpclient-4.5.3.jar:4.5.3]
   [junit4]   2> 	at org.apache.http.impl.client.InternalHttpClient.doExecute(InternalHttpClient.java:185) ~[httpclient-4.5.3.jar:4.5.3]
   [junit4]   2> 	at org.apache.http.impl.client.CloseableHttpClient.execute(CloseableHttpClient.java:83) ~[httpclient-4.5.3.jar:4.5.3]
   [junit4]   2> 	at org.apache.http.impl.client.CloseableHttpClient.execute(CloseableHttpClient.java:56) ~[httpclient-4.5.3.jar:4.5.3]
   [junit4]   2> 	at org.apache.solr.client.solrj.impl.HttpSolrClient.executeMethod(HttpSolrClient.java:542) ~[java/:?]
   [junit4]   2> 	... 12 more
   [junit4]   2> 63911 INFO  (qtp2000769186-678) [n:127.0.0.1:38129_solr    x:replacenodetest_coll_shard4_replica_p14] o.a.s.h.a.CoreAdminOperation core create command qt=/admin/cores&coreNodeName=core_node17&collection.configName=conf1&newCollection=true&name=replacenodetest_coll_shard4_replica_p14&action=CREATE&numShards=5&collection=replacenodetest_coll&shard=shard4&wt=javabin&version=2&replicaType=PULL
   [junit4]   2> 63915 INFO  (qtp2000769186-678) [n:127.0.0.1:38129_solr    x:replacenodetest_coll_shard4_replica_p14] o.a.s.c.TransientSolrCoreCacheDefault Allocating transient cache for 2147483647 transient cores
   [junit4]   2> 63915 INFO  (qtp1660332121-692) [n:127.0.0.1:46857_solr    x:replacenodetest_coll_shard2_replica_p6] o.a.s.h.a.CoreAdminOperation core create command qt=/admin/cores&coreNodeName=core_node9&collection.configName=conf1&newCollection=true&name=replacenodetest_coll_shard2_replica_p6&action=CREATE&numShards=5&collection=replacenodetest_coll&shard=shard2&wt=javabin&version=2&replicaType=PULL
   [junit4]   2> 63916 INFO  (qtp1227824748-662) [n:127.0.0.1:46149_solr    x:replacenodetest_coll_shard3_replica_p10] o.a.s.h.a.CoreAdminOperation core create command qt=/admin/cores&coreNodeName=core_node13&collection.configName=conf1&newCollection=true&name=replacenodetest_coll_shard3_replica_p10&action=CREATE&numShards=5&collection=replacenodetest_coll&shard=shard3&wt=javabin&version=2&replicaType=PULL
   [junit4]   2> 63918 INFO  (qtp727307786-674) [n:127.0.0.1:42979_solr    x:replacenodetest_coll_shard1_replica_p3] o.a.s.h.a.CoreAdminOperation core create command qt=/admin/cores&coreNodeName=core_node4&collection.configName=conf1&newCollection=true&name=replacenodetest_coll_shard1_replica_p3&action=CREATE&numShards=5&collection=replacenodetest_coll&shard=shard1&wt=javabin&version=2&replicaType=PULL
   [junit4]   2> 63929 INFO  (qtp2016692700-644) [n:127.0.0.1:34279_solr    x:replacenodetest_coll_shard5_replica_p18] o.a.s.h.a.CoreAdminOperation core create command qt=/admin/cores&coreNodeName=core_node20&collection.configName=conf1&newCollection=true&name=replacenodetest_coll_shard5_replica_p18&action=CREATE&numShards=5&collection=replacenodetest_coll&shard=shard5&wt=javabin&version=2&replicaType=PULL
   [junit4]   2> 63932 INFO  (qtp2016692700-666) [n:127.0.0.1:34279_solr    x:replacenodetest_coll_shard3_replica_t8] o.a.s.h.a.CoreAdminOperation core create command qt=/admin/cores&coreNodeName=core_node11&collection.configName=conf1&newCollection=true&name=replacenodetest_coll_shard3_replica_t8&action=CREATE&numShards=5&collection=replacenodetest_coll&shard=shard3&wt=javabin&version=2&replicaType=TLOG
   [junit4]   2> 64906 INFO  (qtp1660332121-854) [n:127.0.0.1:46857_solr c:replacenodetest_coll s:shard5 r:core_node19 x:replacenodetest_coll_shard5_replica_t16] o.a.s.c.SolrConfig Using Lucene MatchVersion: 8.0.0
   [junit4]   2> 64912 INFO  (qtp1660332121-854) [n:127.0.0.1:46857_solr c:replacenodetest_coll s:shard5 r:core_node19 x:replacenodetest_coll_shard5_replica_t16] o.a.s.s.IndexSchema [replacenodetest_coll_shard5_replica_t16] Schema name=cloud-dynamic
   [junit4]   2> 64947 INFO  (qtp1227824748-640) [n:127.0.0.1:46149_solr c:replacenodetest_coll s:shard1 r:core_node2 x:replacenodetest_coll_shard1_replica_t1] o.a.s.c.SolrConfig Using Lucene MatchVersion: 8.0.0
   [junit4]   2> 64947 INFO  (qtp727307786-646) [n:127.0.0.1:42979_solr c:replacenodetest_coll s:shard4 r:core_node15 x:replacenodetest_coll_shard4_replica_t12] o.a.s.c.SolrConfig Using Lucene MatchVersion: 8.0.0
   [junit4]   2> 64959 INFO  (qtp1227824748-640) [n:127.0.0.1:46149_solr c:replacenodetest_coll s:shard1 r:core_node2 x:replacenodetest_coll_shard1_replica_t1] o.a.s.s.IndexSchema [replacenodetest_coll_shard1_replica_t1] Schema name=cloud-dynamic
   [junit4]   2> 64964 INFO  (qtp1660332121-854) [n:127.0.0.1:46857_solr c:replacenodetest_coll s:shard5 r:core_node19 x:replacenodetest_coll_shard5_replica_t16] o.a.s.s.IndexSchema Loaded schema cloud-dynamic/1.6 with uniqueid field id
   [junit4]   2> 64964 INFO  (qtp727307786-646) [n:127.0.0.1:42979_solr c:replacenodetest_coll s:shard4 r:core_node15 x:replacenodetest_coll_shard4_replica_t12] o.a.s.s.IndexSchema [replacenodetest_coll_shard4_replica_t12] Schema name=cloud-dynamic
   [junit4]   2> 64964 INFO  (qtp1660332121-854) [n:127.0.0.1:46857_solr c:replacenodetest_coll s:shard5 r:core_node19 x:replacenodetest_coll_shard5_replica_t16] o.a.s.c.CoreContainer Creating SolrCore 'replacenodetest_coll_shard5_replica_t16' using configuration from collection replacenodetest_coll, trusted=true
   [junit4]   2> 64972 INFO  (qtp1660332121-854) [n:127.0.0.1:46857_solr c:replacenodetest_coll s:shard5 r:core_node19 x:replacenodetest_coll_shard5_replica_t16] o.a.s.m.r.SolrJmxReporter JMX monitoring for 'solr_46857.solr.core.replacenodetest_coll.shard5.replica_t16' (registry 'solr.core.replacenodetest_coll.shard5.replica_t16') enabled at server: com.sun.jmx.mbeanserver.JmxMBeanServer@61ba7a7b
   [junit4]   2> 64972 INFO  (qtp1660332121-854) [n:127.0.0.1:46857_solr c:replacenodetest_coll s:shard5 r:core_node19 x:replacenodetest_coll_shard5_replica_t16] o.a.s.c.SolrCore [[replacenodetest_coll_shard5_replica_t16] ] Opening new SolrCore at [/home/jenkins/workspace/Lucene-Solr-master-Linux/solr/build/solr-core/test/J0/temp/solr.cloud.ReplaceNodeTest_A58EF8F0FB7EC0DD-001/tempDir-001/node1/replacenodetest_coll_shard5_replica_t16], dataDir=[/home/jenkins/workspace/Lucene-Solr-master-Linux/solr/build/solr-core/test/J0/temp/solr.cloud.ReplaceNodeTest_A58EF8F0FB7EC0DD-001/tempDir-001/node1/./replacenodetest_coll_shard5_replica_t16/data/]
   [junit4]   2> 64980 INFO  (qtp1227824748-662) [n:127.0.0.1:46149_solr c:replacenodetest_coll s:shard3 r:core_node13 x:replacenodetest_coll_shard3_replica_p10] o.a.s.c.SolrConfig Using Lucene MatchVersion: 8.0.0
   [junit4]   2> 64984 INFO  (qtp1660332121-692) [n:127.0.0.1:46857_solr c:replacenodetest_coll s:shard2 r:core_node9 x:replacenodetest_coll_shard2_replica_p6] o.a.s.c.SolrConfig Using Lucene MatchVersion: 8.0.0
   [junit4]   2> 64999 INFO  (qtp2000769186-678) [n:127.0.0.1:38129_solr c:replacenodetest_coll s:shard4 r:core_node17 x:replacenodetest_coll_shard4_replica_p14] o.a.s.c.SolrConfig Using Lucene MatchVersion: 8.0.0
   [junit4]   2> 65001 INFO  (qtp1227824748-640) [n:127.0.0.1:46149_solr c:replacenodetest_coll s:shard1 r:core_node2 x:replacenodetest_coll_shard1_replica_t1] o.a.s.s.IndexSchema Loaded schema cloud-dynamic/1.6 with uniqueid field id
   [junit4]   2> 65001 INFO  (qtp1227824748-640) [n:127.0.0.1:46149_solr c:replacenodetest_coll s:shard1 r:core_node2 x:replacenodetest_coll_shard1_replica_t1] o.a.s.c.CoreContainer Creating SolrCore 'replacenodetest_coll_shard1_replica_t1' using configuration from collection replacenodetest_coll, trusted=true
   [junit4]   2> 65002 INFO  (qtp1227824748-640) [n:127.0.0.1:46149_solr c:replacenodetest_coll s:shard1 r:core_node2 x:replacenodetest_coll_shard1_replica_t1] o.a.s.m.r.SolrJmxReporter JMX monitoring for 'solr_46149.solr.core.replacenodetest_coll.shard1.replica_t1' (registry 'solr.core.replacenodetest_coll.shard1.replica_t1') enabled at server: com.sun.jmx.mbeanserver.JmxMBeanServer@61ba7a7b
   [junit4]   2> 65002 INFO  (qtp1227824748-640) [n:127.0.0.1:46149_solr c:replacenodetest_coll s:shard1 r:core_node2 x:replacenodetest_coll_shard1_replica_t1] o.a.s.c.SolrCore [[replacenodetest_coll_shard1_replica_t1] ] Opening new SolrCore at [/home/jenkins/workspace/Lucene-Solr-master-Linux/solr/build/solr-core/test/J0/temp/solr.cloud.ReplaceNodeTest_A58EF8F0FB7EC0DD-001/tempDir-001/node5/replacenodetest_coll_shard1_replica_t1], dataDir=[/home/jenkins/workspace/Lucene-Solr-master-Linux/solr/build/solr-core/test/J0/temp/solr.cloud.ReplaceNodeTest_A58EF8F0FB7EC0DD-001/tempDir-001/node5/./replacenodetest_coll_shard1_replica_t1/data/]
   [junit4]   2> 65003 INFO  (qtp2016692700-666) [n:127.0.0.1:34279_solr c:replacenodetest_coll s:shard3 r:core_node11 x:replacenodetest_coll_shard3_replica_t8] o.a.s.c.SolrConfig Using Lucene MatchVersion: 8.0.0
   [junit4]   2> 65006 INFO  (qtp727307786-674) [n:127.0.0.1:42979_solr c:replacenodetest_coll s:shard1 r:core_node4 x:replacenodetest_coll_shard1_replica_p3] o.a.s.c.SolrConfig Using Lucene MatchVersion: 8.0.0
   [junit4]   2> 65006 INFO  (qtp2016692700-644) [n:127.0.0.1:34279_solr c:replacenodetest_coll s:shard5 r:core_node20 x:replacenodetest_coll_shard5_replica_p18] o.a.s.c.SolrConfig Using Lucene MatchVersion: 8.0.0
   [junit4]   2> 65009 INFO  (qtp1227824748-662) [n:127.0.0.1:46149_solr c:replacenodetest_coll s:shard3 r:core_node13 x:replacenodetest_coll_shard3_replica_p10] o.a.s.s.IndexSchema [replacenodetest_coll_shard3_replica_p10] Schema name=cloud-dynamic
   [junit4]   2> 65009 INFO  (qtp2000769186-678) [n:127.0.0.1:38129_solr c:replacenodetest_coll s:shard4 r:core_node17 x:replacenodetest_coll_shard4_replica_p14] o.a.s.s.IndexSchema [replacenodetest_coll_shard4_replica_p14] Schema name=cloud-dynamic
   [junit4]   2> 65010 INFO  (qtp2016692700-666) [n:127.0.0.1:34279_solr c:replacenodetest_coll s:shard3 r:core_node11 x:replacenodetest_coll_shard3_replica_t8] o.a.s.s.IndexSchema [replacenodetest_coll_shard3_replica_t8] Schema name=cloud-dynamic
   [junit4]   2> 65078 INFO  (qtp727307786-674) [n:127.0.0.1:42979_solr c:replacenodetest_coll s:shard1 r:core_node4 x:replacenodetest_coll_shard1_replica_p3] o.a.s.s.IndexSchema [replacenodetest_coll_shard1_replica_p3] Schema name=cloud-dynamic
   [junit4]   2> 65078 INFO  (qtp1660332121-692) [n:127.0.0.1:46857_solr c:replacenodetest_coll s:shard2 r:core_node9 x:replacenodetest_coll_shard2_replica_p6] o.a.s.s.IndexSchema [replacenodetest_coll_shard2_replica_p6] Schema name=cloud-dynamic
   [junit4]   2> 65080 INFO  (qtp2016692700-644) [n:127.0.0.1:34279_solr c:replacenodetest_coll s:shard5 r:core_node20 x:replacenodetest_coll_shard5_replica_p18] o.a.s.s.IndexSchema [replacenodetest_coll_shard5_replica_p18] Schema name=cloud-dynamic
   [junit4]   2> 65118 INFO  (qtp1227824748-662) [n:127.0.0.1:46149_solr c:replacenodetest_coll s:shard3 r:core_node13 x:replacenodetest_coll_shard3_replica_p10] o.a.s.s.IndexSchema Loaded schema cloud-dynamic/1.6 with uniqueid field id
   [junit4]   2> 65118 INFO  (qtp1227824748-662) [n:127.0.0.1:46149_solr c:replacenodetest_coll s:shard3 r:core_node13 x:replacenodetest_coll_shard3_replica_p10] o.a.s.c.CoreContainer Creating SolrCore 'replacenodetest_coll_shard3_replica_p10' using configuration from collection replacenodetest_coll, trusted=true
   [junit4]   2> 65118 INFO  (qtp1227824748-662) [n:127.0.0.1:46149_solr c:replacenodetest_coll s:shard3 r:core_node13 x:replacenodetest_coll_shard3_replica_p10] o.a.s.m.r.SolrJmxReporter JMX monitoring for 'solr_46149.solr.core.replacenodetest_coll.shard3.replica

[...truncated too long message...]

e_url":"https://127.0.0.1:36453/solr","state":"down","node_name":null,"type":"NRT"}
   [junit4]   2> 	at org.apache.solr.cloud.overseer.NodeMutator.downNode(NodeMutator.java:62) ~[java/:?]
   [junit4]   2> 	at org.apache.solr.cloud.Overseer$ClusterStateUpdater.processMessage(Overseer.java:407) ~[java/:?]
   [junit4]   2> 	at org.apache.solr.cloud.Overseer$ClusterStateUpdater.processQueueItem(Overseer.java:280) [java/:?]
   [junit4]   2> 	at org.apache.solr.cloud.Overseer$ClusterStateUpdater.run(Overseer.java:228) [java/:?]
   [junit4]   2> 	at java.lang.Thread.run(Thread.java:834) [?:?]
   [junit4]   2> 142967 INFO  (coreCloseExecutor-568-thread-2) [n:127.0.0.1:34359_solr c:collection11 s:shard3 r:core_node12 x:collection11_shard3_replica_n10] o.a.s.c.SolrCore [collection11_shard3_replica_n10]  CLOSING SolrCore org.apache.solr.core.SolrCore@3e2ddad9
   [junit4]   2> 142973 INFO  (coreCloseExecutor-567-thread-1) [n:127.0.0.1:45883_solr c:collection11 s:shard3 r:core_node11 x:collection11_shard3_replica_n8] o.a.s.m.SolrMetricManager Closing metric reporters for registry=solr.collection.collection11.shard3.leader, tag=1766d05c
   [junit4]   2> 142973 INFO  (coreCloseExecutor-567-thread-2) [n:127.0.0.1:45883_solr c:collection11 s:shard1 r:core_node5 x:collection11_shard1_replica_n2] o.a.s.m.SolrMetricManager Closing metric reporters for registry=solr.core.collection11.shard1.replica_n2, tag=40e3a198
   [junit4]   2> 142973 INFO  (coreCloseExecutor-567-thread-2) [n:127.0.0.1:45883_solr c:collection11 s:shard1 r:core_node5 x:collection11_shard1_replica_n2] o.a.s.m.r.SolrJmxReporter Closing reporter [org.apache.solr.metrics.reporters.SolrJmxReporter@3239a4df: rootName = solr_45883, domain = solr.core.collection11.shard1.replica_n2, service url = null, agent id = null] for registry solr.core.collection11.shard1.replica_n2 / com.codahale.metrics.MetricRegistry@590ff1e8
   [junit4]   2> 142976 INFO  (coreCloseExecutor-566-thread-1) [n:127.0.0.1:36453_solr c:collection11 s:shard1 r:core_node3 x:collection11_shard1_replica_n1] o.a.s.m.SolrMetricManager Closing metric reporters for registry=solr.collection.collection11.shard1.leader, tag=37ea45db
   [junit4]   2> 142976 INFO  (coreCloseExecutor-568-thread-2) [n:127.0.0.1:34359_solr c:collection11 s:shard3 r:core_node12 x:collection11_shard3_replica_n10] o.a.s.m.SolrMetricManager Closing metric reporters for registry=solr.core.collection11.shard3.replica_n10, tag=3e2ddad9
   [junit4]   2> 142976 INFO  (coreCloseExecutor-568-thread-2) [n:127.0.0.1:34359_solr c:collection11 s:shard3 r:core_node12 x:collection11_shard3_replica_n10] o.a.s.m.r.SolrJmxReporter Closing reporter [org.apache.solr.metrics.reporters.SolrJmxReporter@1e8eb236: rootName = solr_34359, domain = solr.core.collection11.shard3.replica_n10, service url = null, agent id = null] for registry solr.core.collection11.shard3.replica_n10 / com.codahale.metrics.MetricRegistry@3fd09bb5
   [junit4]   2> 142978 INFO  (jetty-closer-479-thread-1) [    ] o.a.s.c.Overseer Overseer (id=72232095323389959-127.0.0.1:36453_solr-n_0000000000) closing
   [junit4]   2> 142978 INFO  (OverseerStateUpdate-72232095323389959-127.0.0.1:36453_solr-n_0000000000) [n:127.0.0.1:36453_solr    ] o.a.s.c.Overseer Overseer Loop exiting : 127.0.0.1:36453_solr
   [junit4]   2> 142978 WARN  (OverseerAutoScalingTriggerThread-72232095323389959-127.0.0.1:36453_solr-n_0000000000) [    ] o.a.s.c.a.OverseerTriggerThread OverseerTriggerThread woken up but we are closed, exiting.
   [junit4]   2> 142980 INFO  (jetty-closer-479-thread-1) [    ] o.e.j.s.h.ContextHandler Stopped o.e.j.s.ServletContextHandler@69894e9d{/solr,null,UNAVAILABLE}
   [junit4]   2> 142980 INFO  (jetty-closer-479-thread-1) [    ] o.e.j.s.session node0 Stopped scavenging
   [junit4]   2> 142980 INFO  (zkCallback-508-thread-1) [    ] o.a.s.c.OverseerElectionContext I am going to be the leader 127.0.0.1:34359_solr
   [junit4]   2> 142984 INFO  (coreCloseExecutor-567-thread-2) [n:127.0.0.1:45883_solr c:collection11 s:shard1 r:core_node5 x:collection11_shard1_replica_n2] o.a.s.m.SolrMetricManager Closing metric reporters for registry=solr.collection.collection11.shard1.leader, tag=40e3a198
   [junit4]   2> 142985 INFO  (coreCloseExecutor-568-thread-1) [n:127.0.0.1:34359_solr c:collection11 s:shard2 r:core_node7 x:collection11_shard2_replica_n4] o.a.s.m.SolrMetricManager Closing metric reporters for registry=solr.collection.collection11.shard2.leader, tag=307d6cb
   [junit4]   2> 142985 INFO  (coreCloseExecutor-568-thread-2) [n:127.0.0.1:34359_solr c:collection11 s:shard3 r:core_node12 x:collection11_shard3_replica_n10] o.a.s.m.SolrMetricManager Closing metric reporters for registry=solr.collection.collection11.shard3.leader, tag=3e2ddad9
   [junit4]   2> 142991 WARN  (NIOServerCxn.Factory:0.0.0.0/0.0.0.0:0) [    ] o.a.z.s.NIOServerCnxn Unable to read additional data from client sessionid 0x1009eb53f22000c, likely client has closed socket
   [junit4]   2> 142992 INFO  (jetty-closer-479-thread-3) [    ] o.e.j.s.h.ContextHandler Stopped o.e.j.s.ServletContextHandler@777124c{/solr,null,UNAVAILABLE}
   [junit4]   2> 142992 INFO  (jetty-closer-479-thread-3) [    ] o.e.j.s.session node0 Stopped scavenging
   [junit4]   2> 144492 INFO  (jetty-closer-479-thread-2) [    ] o.e.j.s.h.ContextHandler Stopped o.e.j.s.ServletContextHandler@31f4387f{/solr,null,UNAVAILABLE}
   [junit4]   2> 144492 INFO  (jetty-closer-479-thread-2) [    ] o.e.j.s.session node0 Stopped scavenging
   [junit4]   2> 144493 ERROR (SUITE-CustomHighlightComponentTest-seed#[A58EF8F0FB7EC0DD]-worker) [    ] o.a.z.s.ZooKeeperServer ZKShutdownHandler is not registered, so ZooKeeper server won't take any action on ERROR or SHUTDOWN server state changes
   [junit4]   2> 144493 INFO  (SUITE-CustomHighlightComponentTest-seed#[A58EF8F0FB7EC0DD]-worker) [    ] o.a.s.c.ZkTestServer connecting to 127.0.0.1:34921 34921
   [junit4]   2> 145357 INFO  (Thread-215) [    ] o.a.s.c.ZkTestServer connecting to 127.0.0.1:34921 34921
   [junit4]   2> 145357 WARN  (Thread-215) [    ] o.a.s.c.ZkTestServer Watch limit violations: 
   [junit4]   2> Maximum concurrent create/delete watches above limit:
   [junit4]   2> 
   [junit4]   2> 	9	/solr/configs/conf
   [junit4]   2> 	7	/solr/aliases.json
   [junit4]   2> 	5	/solr/collections/collection11/terms/shard3
   [junit4]   2> 	5	/solr/collections/collection11/terms/shard1
   [junit4]   2> 	3	/solr/security.json
   [junit4]   2> 	2	/solr/collections/collection11/terms/shard2
   [junit4]   2> 
   [junit4]   2> Maximum concurrent data watches above limit:
   [junit4]   2> 
   [junit4]   2> 	7	/solr/clusterstate.json
   [junit4]   2> 	7	/solr/clusterprops.json
   [junit4]   2> 	6	/solr/collections/collection11/state.json
   [junit4]   2> 
   [junit4]   2> Maximum concurrent children watches above limit:
   [junit4]   2> 
   [junit4]   2> 	7	/solr/live_nodes
   [junit4]   2> 	7	/solr/collections
   [junit4]   2> 
   [junit4]   2> NOTE: leaving temporary files on disk at: /home/jenkins/workspace/Lucene-Solr-master-Linux/solr/build/solr-core/test/J2/temp/solr.handler.component.CustomHighlightComponentTest_A58EF8F0FB7EC0DD-001
   [junit4]   2> NOTE: test params are: codec=Asserting(Lucene80): {}, docValues:{}, maxPointsInLeafNode=1994, maxMBSortInHeap=7.616669283791145, sim=Asserting(org.apache.lucene.search.similarities.AssertingSimilarity@4b22e435), locale=mua-CM, timezone=America/Iqaluit
   [junit4]   2> NOTE: Linux 4.15.0-32-generic amd64/Oracle Corporation 11 (64-bit)/cpus=8,threads=1,free=210208928,total=524288000
   [junit4]   2> NOTE: All tests run in this JVM: [CustomHighlightComponentTest, ReplaceNodeTest, CustomHighlightComponentTest, AutoscalingHistoryHandlerTest, AutoscalingHistoryHandlerTest, CustomHighlightComponentTest]
   [junit4] Completed [15/15 (5!)] on J2 in 15.39s, 1 test, 1 error <<< FAILURES!

[...truncated 15 lines...]
BUILD FAILED
/home/jenkins/workspace/Lucene-Solr-master-Linux/lucene/common-build.xml:1567: The following error occurred while executing this line:
/home/jenkins/workspace/Lucene-Solr-master-Linux/lucene/common-build.xml:1092: There were test failures: 15 suites, 13 tests, 2 suite-level errors, 3 errors [seed: A58EF8F0FB7EC0DD]

Total time: 2 minutes 27 seconds

[repro] Setting last failure code to 256

[repro] Failures:
[repro]   1/5 failed: org.apache.solr.cloud.ReplaceNodeTest
[repro]   1/5 failed: org.apache.solr.handler.admin.AutoscalingHistoryHandlerTest
[repro]   3/5 failed: org.apache.solr.handler.component.CustomHighlightComponentTest
[repro] Exiting with code 256
+ mv lucene/build lucene/build.repro
+ mv solr/build solr/build.repro
+ mv lucene/build.orig lucene/build
+ mv solr/build.orig solr/build
Archiving artifacts
Setting ANT_1_8_2_HOME=/var/lib/jenkins/tools/hudson.tasks.Ant_AntInstallation/ANT_1.8.2
[WARNINGS] Parsing warnings in console log with parser Java Compiler (javac)
Setting ANT_1_8_2_HOME=/var/lib/jenkins/tools/hudson.tasks.Ant_AntInstallation/ANT_1.8.2
Setting ANT_1_8_2_HOME=/var/lib/jenkins/tools/hudson.tasks.Ant_AntInstallation/ANT_1.8.2
<Git Blamer> Using GitBlamer to create author and commit information for all warnings.
<Git Blamer> GIT_COMMIT=a02959c87e132ae341a689b55afdd566f90f7e5c, workspace=/var/lib/jenkins/workspace/Lucene-Solr-master-Linux
[WARNINGS] Computing warning deltas based on reference build #22864
Recording test results
Setting ANT_1_8_2_HOME=/var/lib/jenkins/tools/hudson.tasks.Ant_AntInstallation/ANT_1.8.2
Build step 'Publish JUnit test result report' changed build result to UNSTABLE
Email was triggered for: Unstable (Test Failures)
Sending email for trigger: Unstable (Test Failures)
Setting ANT_1_8_2_HOME=/var/lib/jenkins/tools/hudson.tasks.Ant_AntInstallation/ANT_1.8.2
Setting ANT_1_8_2_HOME=/var/lib/jenkins/tools/hudson.tasks.Ant_AntInstallation/ANT_1.8.2
Setting ANT_1_8_2_HOME=/var/lib/jenkins/tools/hudson.tasks.Ant_AntInstallation/ANT_1.8.2
Setting ANT_1_8_2_HOME=/var/lib/jenkins/tools/hudson.tasks.Ant_AntInstallation/ANT_1.8.2

Mime
View raw message