lucene-dev mailing list archives

Site index · List index
Message view « Date » · « Thread »
Top « Date » · « Thread »
From Apache Jenkins Server <jenk...@builds.apache.org>
Subject [JENKINS] Lucene-Solr-Tests-master - Build # 2768 - Still Unstable
Date Mon, 03 Sep 2018 22:59:04 GMT
Build: https://builds.apache.org/job/Lucene-Solr-Tests-master/2768/

3 tests failed.
FAILED:  org.apache.solr.cloud.autoscaling.SearchRateTriggerIntegrationTest.testAboveSearchRate

Error Message:


Stack Trace:
java.lang.AssertionError
	at __randomizedtesting.SeedInfo.seed([C40BA5808E98E5E2:3200184664FCDF3E]:0)
	at org.junit.Assert.fail(Assert.java:92)
	at org.junit.Assert.assertTrue(Assert.java:43)
	at org.junit.Assert.assertTrue(Assert.java:54)
	at org.apache.solr.cloud.autoscaling.SearchRateTriggerIntegrationTest.testAboveSearchRate(SearchRateTriggerIntegrationTest.java:269)
	at sun.reflect.NativeMethodAccessorImpl.invoke0(Native Method)
	at sun.reflect.NativeMethodAccessorImpl.invoke(NativeMethodAccessorImpl.java:62)
	at sun.reflect.DelegatingMethodAccessorImpl.invoke(DelegatingMethodAccessorImpl.java:43)
	at java.lang.reflect.Method.invoke(Method.java:498)
	at com.carrotsearch.randomizedtesting.RandomizedRunner.invoke(RandomizedRunner.java:1737)
	at com.carrotsearch.randomizedtesting.RandomizedRunner$8.evaluate(RandomizedRunner.java:934)
	at com.carrotsearch.randomizedtesting.RandomizedRunner$9.evaluate(RandomizedRunner.java:970)
	at com.carrotsearch.randomizedtesting.RandomizedRunner$10.evaluate(RandomizedRunner.java:984)
	at com.carrotsearch.randomizedtesting.rules.SystemPropertiesRestoreRule$1.evaluate(SystemPropertiesRestoreRule.java:57)
	at org.apache.lucene.util.TestRuleSetupTeardownChained$1.evaluate(TestRuleSetupTeardownChained.java:49)
	at org.apache.lucene.util.AbstractBeforeAfterRule$1.evaluate(AbstractBeforeAfterRule.java:45)
	at org.apache.lucene.util.TestRuleThreadAndTestName$1.evaluate(TestRuleThreadAndTestName.java:48)
	at org.apache.lucene.util.TestRuleIgnoreAfterMaxFailures$1.evaluate(TestRuleIgnoreAfterMaxFailures.java:64)
	at org.apache.lucene.util.TestRuleMarkFailure$1.evaluate(TestRuleMarkFailure.java:47)
	at com.carrotsearch.randomizedtesting.rules.StatementAdapter.evaluate(StatementAdapter.java:36)
	at com.carrotsearch.randomizedtesting.ThreadLeakControl$StatementRunner.run(ThreadLeakControl.java:368)
	at com.carrotsearch.randomizedtesting.ThreadLeakControl.forkTimeoutingTask(ThreadLeakControl.java:817)
	at com.carrotsearch.randomizedtesting.ThreadLeakControl$3.evaluate(ThreadLeakControl.java:468)
	at com.carrotsearch.randomizedtesting.RandomizedRunner.runSingleTest(RandomizedRunner.java:943)
	at com.carrotsearch.randomizedtesting.RandomizedRunner$5.evaluate(RandomizedRunner.java:829)
	at com.carrotsearch.randomizedtesting.RandomizedRunner$6.evaluate(RandomizedRunner.java:879)
	at com.carrotsearch.randomizedtesting.RandomizedRunner$7.evaluate(RandomizedRunner.java:890)
	at com.carrotsearch.randomizedtesting.rules.StatementAdapter.evaluate(StatementAdapter.java:36)
	at com.carrotsearch.randomizedtesting.rules.SystemPropertiesRestoreRule$1.evaluate(SystemPropertiesRestoreRule.java:57)
	at org.apache.lucene.util.AbstractBeforeAfterRule$1.evaluate(AbstractBeforeAfterRule.java:45)
	at com.carrotsearch.randomizedtesting.rules.StatementAdapter.evaluate(StatementAdapter.java:36)
	at org.apache.lucene.util.TestRuleStoreClassName$1.evaluate(TestRuleStoreClassName.java:41)
	at com.carrotsearch.randomizedtesting.rules.NoShadowingOrOverridesOnMethodsRule$1.evaluate(NoShadowingOrOverridesOnMethodsRule.java:40)
	at com.carrotsearch.randomizedtesting.rules.NoShadowingOrOverridesOnMethodsRule$1.evaluate(NoShadowingOrOverridesOnMethodsRule.java:40)
	at com.carrotsearch.randomizedtesting.rules.StatementAdapter.evaluate(StatementAdapter.java:36)
	at com.carrotsearch.randomizedtesting.rules.StatementAdapter.evaluate(StatementAdapter.java:36)
	at com.carrotsearch.randomizedtesting.rules.StatementAdapter.evaluate(StatementAdapter.java:36)
	at org.apache.lucene.util.TestRuleAssertionsRequired$1.evaluate(TestRuleAssertionsRequired.java:53)
	at org.apache.lucene.util.TestRuleMarkFailure$1.evaluate(TestRuleMarkFailure.java:47)
	at org.apache.lucene.util.TestRuleIgnoreAfterMaxFailures$1.evaluate(TestRuleIgnoreAfterMaxFailures.java:64)
	at org.apache.lucene.util.TestRuleIgnoreTestSuites$1.evaluate(TestRuleIgnoreTestSuites.java:54)
	at com.carrotsearch.randomizedtesting.rules.StatementAdapter.evaluate(StatementAdapter.java:36)
	at com.carrotsearch.randomizedtesting.ThreadLeakControl$StatementRunner.run(ThreadLeakControl.java:368)
	at java.lang.Thread.run(Thread.java:748)


FAILED:  org.apache.solr.cloud.autoscaling.SearchRateTriggerIntegrationTest.testBelowSearchRate

Error Message:
[Op{action=DELETEREPLICA, hints={COLL_SHARD=[{   "first":"belowRate_collection",   "second":"shard1"}], REPLICA=[core_node6]}}, Op{action=DELETEREPLICA, hints={COLL_SHARD=[{   "first":"belowRate_collection",   "second":"shard1"}], REPLICA=[core_node3]}}, Op{action=DELETEREPLICA, hints={COLL_SHARD=[{   "first":"belowRate_collection",   "second":"shard1"}], REPLICA=[core_node8]}}, Op{action=NONE, hints={SRC_NODE=[127.0.0.1:45303_solr]}}, Op{action=NONE, hints={SRC_NODE=[127.0.0.1:32934_solr]}}, Op{action=NONE, hints={SRC_NODE=[127.0.0.1:35635_solr]}}, Op{action=NONE, hints={SRC_NODE=[127.0.0.1:44760_solr]}}, Op{action=NONE, hints={SRC_NODE=[127.0.0.1:36176_solr]}}] expected:<7> but was:<8>

Stack Trace:
java.lang.AssertionError: [Op{action=DELETEREPLICA, hints={COLL_SHARD=[{
  "first":"belowRate_collection",
  "second":"shard1"}], REPLICA=[core_node6]}}, Op{action=DELETEREPLICA, hints={COLL_SHARD=[{
  "first":"belowRate_collection",
  "second":"shard1"}], REPLICA=[core_node3]}}, Op{action=DELETEREPLICA, hints={COLL_SHARD=[{
  "first":"belowRate_collection",
  "second":"shard1"}], REPLICA=[core_node8]}}, Op{action=NONE, hints={SRC_NODE=[127.0.0.1:45303_solr]}}, Op{action=NONE, hints={SRC_NODE=[127.0.0.1:32934_solr]}}, Op{action=NONE, hints={SRC_NODE=[127.0.0.1:35635_solr]}}, Op{action=NONE, hints={SRC_NODE=[127.0.0.1:44760_solr]}}, Op{action=NONE, hints={SRC_NODE=[127.0.0.1:36176_solr]}}] expected:<7> but was:<8>
	at __randomizedtesting.SeedInfo.seed([C40BA5808E98E5E2:AEA603E0D67060F1]:0)
	at org.junit.Assert.fail(Assert.java:93)
	at org.junit.Assert.failNotEquals(Assert.java:647)
	at org.junit.Assert.assertEquals(Assert.java:128)
	at org.junit.Assert.assertEquals(Assert.java:472)
	at org.apache.solr.cloud.autoscaling.SearchRateTriggerIntegrationTest.testBelowSearchRate(SearchRateTriggerIntegrationTest.java:398)
	at sun.reflect.NativeMethodAccessorImpl.invoke0(Native Method)
	at sun.reflect.NativeMethodAccessorImpl.invoke(NativeMethodAccessorImpl.java:62)
	at sun.reflect.DelegatingMethodAccessorImpl.invoke(DelegatingMethodAccessorImpl.java:43)
	at java.lang.reflect.Method.invoke(Method.java:498)
	at com.carrotsearch.randomizedtesting.RandomizedRunner.invoke(RandomizedRunner.java:1737)
	at com.carrotsearch.randomizedtesting.RandomizedRunner$8.evaluate(RandomizedRunner.java:934)
	at com.carrotsearch.randomizedtesting.RandomizedRunner$9.evaluate(RandomizedRunner.java:970)
	at com.carrotsearch.randomizedtesting.RandomizedRunner$10.evaluate(RandomizedRunner.java:984)
	at com.carrotsearch.randomizedtesting.rules.SystemPropertiesRestoreRule$1.evaluate(SystemPropertiesRestoreRule.java:57)
	at org.apache.lucene.util.TestRuleSetupTeardownChained$1.evaluate(TestRuleSetupTeardownChained.java:49)
	at org.apache.lucene.util.AbstractBeforeAfterRule$1.evaluate(AbstractBeforeAfterRule.java:45)
	at org.apache.lucene.util.TestRuleThreadAndTestName$1.evaluate(TestRuleThreadAndTestName.java:48)
	at org.apache.lucene.util.TestRuleIgnoreAfterMaxFailures$1.evaluate(TestRuleIgnoreAfterMaxFailures.java:64)
	at org.apache.lucene.util.TestRuleMarkFailure$1.evaluate(TestRuleMarkFailure.java:47)
	at com.carrotsearch.randomizedtesting.rules.StatementAdapter.evaluate(StatementAdapter.java:36)
	at com.carrotsearch.randomizedtesting.ThreadLeakControl$StatementRunner.run(ThreadLeakControl.java:368)
	at com.carrotsearch.randomizedtesting.ThreadLeakControl.forkTimeoutingTask(ThreadLeakControl.java:817)
	at com.carrotsearch.randomizedtesting.ThreadLeakControl$3.evaluate(ThreadLeakControl.java:468)
	at com.carrotsearch.randomizedtesting.RandomizedRunner.runSingleTest(RandomizedRunner.java:943)
	at com.carrotsearch.randomizedtesting.RandomizedRunner$5.evaluate(RandomizedRunner.java:829)
	at com.carrotsearch.randomizedtesting.RandomizedRunner$6.evaluate(RandomizedRunner.java:879)
	at com.carrotsearch.randomizedtesting.RandomizedRunner$7.evaluate(RandomizedRunner.java:890)
	at com.carrotsearch.randomizedtesting.rules.StatementAdapter.evaluate(StatementAdapter.java:36)
	at com.carrotsearch.randomizedtesting.rules.SystemPropertiesRestoreRule$1.evaluate(SystemPropertiesRestoreRule.java:57)
	at org.apache.lucene.util.AbstractBeforeAfterRule$1.evaluate(AbstractBeforeAfterRule.java:45)
	at com.carrotsearch.randomizedtesting.rules.StatementAdapter.evaluate(StatementAdapter.java:36)
	at org.apache.lucene.util.TestRuleStoreClassName$1.evaluate(TestRuleStoreClassName.java:41)
	at com.carrotsearch.randomizedtesting.rules.NoShadowingOrOverridesOnMethodsRule$1.evaluate(NoShadowingOrOverridesOnMethodsRule.java:40)
	at com.carrotsearch.randomizedtesting.rules.NoShadowingOrOverridesOnMethodsRule$1.evaluate(NoShadowingOrOverridesOnMethodsRule.java:40)
	at com.carrotsearch.randomizedtesting.rules.StatementAdapter.evaluate(StatementAdapter.java:36)
	at com.carrotsearch.randomizedtesting.rules.StatementAdapter.evaluate(StatementAdapter.java:36)
	at com.carrotsearch.randomizedtesting.rules.StatementAdapter.evaluate(StatementAdapter.java:36)
	at org.apache.lucene.util.TestRuleAssertionsRequired$1.evaluate(TestRuleAssertionsRequired.java:53)
	at org.apache.lucene.util.TestRuleMarkFailure$1.evaluate(TestRuleMarkFailure.java:47)
	at org.apache.lucene.util.TestRuleIgnoreAfterMaxFailures$1.evaluate(TestRuleIgnoreAfterMaxFailures.java:64)
	at org.apache.lucene.util.TestRuleIgnoreTestSuites$1.evaluate(TestRuleIgnoreTestSuites.java:54)
	at com.carrotsearch.randomizedtesting.rules.StatementAdapter.evaluate(StatementAdapter.java:36)
	at com.carrotsearch.randomizedtesting.ThreadLeakControl$StatementRunner.run(ThreadLeakControl.java:368)
	at java.lang.Thread.run(Thread.java:748)


FAILED:  org.apache.solr.cloud.cdcr.CdcrBidirectionalTest.testBiDir

Error Message:
Captured an uncaught exception in thread: Thread[id=30100, name=cdcr-replicator-10662-thread-1, state=RUNNABLE, group=TGRP-CdcrBidirectionalTest]

Stack Trace:
com.carrotsearch.randomizedtesting.UncaughtExceptionError: Captured an uncaught exception in thread: Thread[id=30100, name=cdcr-replicator-10662-thread-1, state=RUNNABLE, group=TGRP-CdcrBidirectionalTest]
Caused by: java.lang.AssertionError: 1610624916471676928 != 1610624915525861376
	at __randomizedtesting.SeedInfo.seed([C40BA5808E98E5E2]:0)
	at org.apache.solr.update.CdcrUpdateLog$CdcrLogReader.forwardSeek(CdcrUpdateLog.java:611)
	at org.apache.solr.handler.CdcrReplicator.run(CdcrReplicator.java:125)
	at org.apache.solr.handler.CdcrReplicatorScheduler.lambda$null$0(CdcrReplicatorScheduler.java:81)
	at org.apache.solr.common.util.ExecutorUtil$MDCAwareThreadPoolExecutor.lambda$execute$0(ExecutorUtil.java:209)
	at java.util.concurrent.ThreadPoolExecutor.runWorker(ThreadPoolExecutor.java:1149)
	at java.util.concurrent.ThreadPoolExecutor$Worker.run(ThreadPoolExecutor.java:624)
	at java.lang.Thread.run(Thread.java:748)




Build Log:
[...truncated 12779 lines...]
   [junit4] Suite: org.apache.solr.cloud.autoscaling.SearchRateTriggerIntegrationTest
   [junit4]   2> 999685 INFO  (SUITE-SearchRateTriggerIntegrationTest-seed#[C40BA5808E98E5E2]-worker) [    ] o.a.s.SolrTestCaseJ4 SecureRandom sanity checks: test.solr.allowed.securerandom=null & java.security.egd=file:/dev/./urandom
   [junit4]   2> Creating dataDir: /home/jenkins/jenkins-slave/workspace/Lucene-Solr-Tests-master/solr/build/solr-core/test/J2/temp/solr.cloud.autoscaling.SearchRateTriggerIntegrationTest_C40BA5808E98E5E2-001/init-core-data-001
   [junit4]   2> 999698 WARN  (SUITE-SearchRateTriggerIntegrationTest-seed#[C40BA5808E98E5E2]-worker) [    ] o.a.s.SolrTestCaseJ4 startTrackingSearchers: numOpens=337 numCloses=337
   [junit4]   2> 999698 INFO  (SUITE-SearchRateTriggerIntegrationTest-seed#[C40BA5808E98E5E2]-worker) [    ] o.a.s.SolrTestCaseJ4 Using PointFields (NUMERIC_POINTS_SYSPROP=true) w/NUMERIC_DOCVALUES_SYSPROP=true
   [junit4]   2> 999700 INFO  (SUITE-SearchRateTriggerIntegrationTest-seed#[C40BA5808E98E5E2]-worker) [    ] o.a.s.SolrTestCaseJ4 Randomized ssl (true) and clientAuth (false) via: @org.apache.solr.util.RandomizeSSL(reason=, ssl=NaN, value=NaN, clientAuth=NaN)
   [junit4]   2> 999701 INFO  (SUITE-SearchRateTriggerIntegrationTest-seed#[C40BA5808E98E5E2]-worker) [    ] o.a.s.c.MiniSolrCloudCluster Starting cluster of 5 servers in /home/jenkins/jenkins-slave/workspace/Lucene-Solr-Tests-master/solr/build/solr-core/test/J2/temp/solr.cloud.autoscaling.SearchRateTriggerIntegrationTest_C40BA5808E98E5E2-001/tempDir-001
   [junit4]   2> 999701 INFO  (SUITE-SearchRateTriggerIntegrationTest-seed#[C40BA5808E98E5E2]-worker) [    ] o.a.s.c.ZkTestServer STARTING ZK TEST SERVER
   [junit4]   2> 999714 INFO  (Thread-747) [    ] o.a.s.c.ZkTestServer client port:0.0.0.0/0.0.0.0:0
   [junit4]   2> 999714 INFO  (Thread-747) [    ] o.a.s.c.ZkTestServer Starting server
   [junit4]   2> 999728 ERROR (Thread-747) [    ] o.a.z.s.ZooKeeperServer ZKShutdownHandler is not registered, so ZooKeeper server won't take any action on ERROR or SHUTDOWN server state changes
   [junit4]   2> 999815 INFO  (SUITE-SearchRateTriggerIntegrationTest-seed#[C40BA5808E98E5E2]-worker) [    ] o.a.s.c.ZkTestServer start zk server on port:34974
   [junit4]   2> 999828 INFO  (zkConnectionManagerCallback-1581-thread-1) [    ] o.a.s.c.c.ConnectionManager zkClient has connected
   [junit4]   2> 1000019 INFO  (jetty-launcher-1578-thread-2) [    ] o.e.j.s.Server jetty-9.4.11.v20180605; built: 2018-06-05T18:24:03.829Z; git: d5fc0523cfa96bfebfbda19606cad384d772f04c; jvm 1.8.0_172-b11
   [junit4]   2> 1000043 INFO  (jetty-launcher-1578-thread-5) [    ] o.e.j.s.Server jetty-9.4.11.v20180605; built: 2018-06-05T18:24:03.829Z; git: d5fc0523cfa96bfebfbda19606cad384d772f04c; jvm 1.8.0_172-b11
   [junit4]   2> 1000044 INFO  (jetty-launcher-1578-thread-1) [    ] o.e.j.s.Server jetty-9.4.11.v20180605; built: 2018-06-05T18:24:03.829Z; git: d5fc0523cfa96bfebfbda19606cad384d772f04c; jvm 1.8.0_172-b11
   [junit4]   2> 1000045 INFO  (jetty-launcher-1578-thread-4) [    ] o.e.j.s.Server jetty-9.4.11.v20180605; built: 2018-06-05T18:24:03.829Z; git: d5fc0523cfa96bfebfbda19606cad384d772f04c; jvm 1.8.0_172-b11
   [junit4]   2> 1000075 INFO  (jetty-launcher-1578-thread-2) [    ] o.e.j.s.session DefaultSessionIdManager workerName=node0
   [junit4]   2> 1000075 INFO  (jetty-launcher-1578-thread-2) [    ] o.e.j.s.session No SessionScavenger set, using defaults
   [junit4]   2> 1000075 INFO  (jetty-launcher-1578-thread-2) [    ] o.e.j.s.session node0 Scavenging every 600000ms
   [junit4]   2> 1000075 INFO  (jetty-launcher-1578-thread-2) [    ] o.e.j.s.h.ContextHandler Started o.e.j.s.ServletContextHandler@542da240{/solr,null,AVAILABLE}
   [junit4]   2> 1000108 INFO  (jetty-launcher-1578-thread-4) [    ] o.e.j.s.session DefaultSessionIdManager workerName=node0
   [junit4]   2> 1000108 INFO  (jetty-launcher-1578-thread-4) [    ] o.e.j.s.session No SessionScavenger set, using defaults
   [junit4]   2> 1000108 INFO  (jetty-launcher-1578-thread-4) [    ] o.e.j.s.session node0 Scavenging every 660000ms
   [junit4]   2> 1000109 INFO  (jetty-launcher-1578-thread-4) [    ] o.e.j.s.h.ContextHandler Started o.e.j.s.ServletContextHandler@531a1665{/solr,null,AVAILABLE}
   [junit4]   2> 1000116 INFO  (jetty-launcher-1578-thread-3) [    ] o.e.j.s.Server jetty-9.4.11.v20180605; built: 2018-06-05T18:24:03.829Z; git: d5fc0523cfa96bfebfbda19606cad384d772f04c; jvm 1.8.0_172-b11
   [junit4]   2> 1000169 INFO  (jetty-launcher-1578-thread-1) [    ] o.e.j.s.session DefaultSessionIdManager workerName=node0
   [junit4]   2> 1000169 INFO  (jetty-launcher-1578-thread-1) [    ] o.e.j.s.session No SessionScavenger set, using defaults
   [junit4]   2> 1000169 INFO  (jetty-launcher-1578-thread-1) [    ] o.e.j.s.session node0 Scavenging every 600000ms
   [junit4]   2> 1000170 INFO  (jetty-launcher-1578-thread-1) [    ] o.e.j.s.h.ContextHandler Started o.e.j.s.ServletContextHandler@7d81aabb{/solr,null,AVAILABLE}
   [junit4]   2> 1000171 INFO  (jetty-launcher-1578-thread-5) [    ] o.e.j.s.session DefaultSessionIdManager workerName=node0
   [junit4]   2> 1000171 INFO  (jetty-launcher-1578-thread-5) [    ] o.e.j.s.session No SessionScavenger set, using defaults
   [junit4]   2> 1000171 INFO  (jetty-launcher-1578-thread-5) [    ] o.e.j.s.session node0 Scavenging every 600000ms
   [junit4]   2> 1000171 INFO  (jetty-launcher-1578-thread-5) [    ] o.e.j.s.h.ContextHandler Started o.e.j.s.ServletContextHandler@6f6cdab4{/solr,null,AVAILABLE}
   [junit4]   2> 1000180 INFO  (jetty-launcher-1578-thread-3) [    ] o.e.j.s.session DefaultSessionIdManager workerName=node0
   [junit4]   2> 1000180 INFO  (jetty-launcher-1578-thread-3) [    ] o.e.j.s.session No SessionScavenger set, using defaults
   [junit4]   2> 1000180 INFO  (jetty-launcher-1578-thread-3) [    ] o.e.j.s.session node0 Scavenging every 660000ms
   [junit4]   2> 1000201 INFO  (jetty-launcher-1578-thread-3) [    ] o.e.j.s.h.ContextHandler Started o.e.j.s.ServletContextHandler@5bd3a464{/solr,null,AVAILABLE}
   [junit4]   2> 1000222 INFO  (jetty-launcher-1578-thread-2) [    ] o.e.j.s.AbstractConnector Started ServerConnector@2387af50{SSL,[ssl, http/1.1]}{127.0.0.1:35635}
   [junit4]   2> 1000222 INFO  (jetty-launcher-1578-thread-2) [    ] o.e.j.s.Server Started @1000272ms
   [junit4]   2> 1000222 INFO  (jetty-launcher-1578-thread-2) [    ] o.a.s.c.s.e.JettySolrRunner Jetty properties: {hostContext=/solr, hostPort=35635}
   [junit4]   2> 1000223 ERROR (jetty-launcher-1578-thread-2) [    ] o.a.s.u.StartupLoggingUtils Missing Java Option solr.log.dir. Logging may be missing or incomplete.
   [junit4]   2> 1000223 INFO  (jetty-launcher-1578-thread-2) [    ] o.a.s.s.SolrDispatchFilter Using logger factory org.apache.logging.slf4j.Log4jLoggerFactory
   [junit4]   2> 1000223 INFO  (jetty-launcher-1578-thread-2) [    ] o.a.s.s.SolrDispatchFilter  ___      _       Welcome to Apache Solr™ version 8.0.0
   [junit4]   2> 1000223 INFO  (jetty-launcher-1578-thread-2) [    ] o.a.s.s.SolrDispatchFilter / __| ___| |_ _   Starting in cloud mode on port null
   [junit4]   2> 1000223 INFO  (jetty-launcher-1578-thread-2) [    ] o.a.s.s.SolrDispatchFilter \__ \/ _ \ | '_|  Install dir: null
   [junit4]   2> 1000223 INFO  (jetty-launcher-1578-thread-2) [    ] o.a.s.s.SolrDispatchFilter |___/\___/_|_|    Start time: 2018-09-03T21:02:28.715Z
   [junit4]   2> 1000274 INFO  (jetty-launcher-1578-thread-3) [    ] o.e.j.s.AbstractConnector Started ServerConnector@ce61702{SSL,[ssl, http/1.1]}{127.0.0.1:36176}
   [junit4]   2> 1000274 INFO  (jetty-launcher-1578-thread-5) [    ] o.e.j.s.AbstractConnector Started ServerConnector@772a2d75{SSL,[ssl, http/1.1]}{127.0.0.1:44760}
   [junit4]   2> 1000274 INFO  (jetty-launcher-1578-thread-3) [    ] o.e.j.s.Server Started @1000324ms
   [junit4]   2> 1000274 INFO  (jetty-launcher-1578-thread-1) [    ] o.e.j.s.AbstractConnector Started ServerConnector@67fc6bad{SSL,[ssl, http/1.1]}{127.0.0.1:32934}
   [junit4]   2> 1000274 INFO  (jetty-launcher-1578-thread-3) [    ] o.a.s.c.s.e.JettySolrRunner Jetty properties: {hostContext=/solr, hostPort=36176}
   [junit4]   2> 1000274 INFO  (jetty-launcher-1578-thread-1) [    ] o.e.j.s.Server Started @1000324ms
   [junit4]   2> 1000274 INFO  (jetty-launcher-1578-thread-1) [    ] o.a.s.c.s.e.JettySolrRunner Jetty properties: {hostContext=/solr, hostPort=32934}
   [junit4]   2> 1000274 ERROR (jetty-launcher-1578-thread-3) [    ] o.a.s.u.StartupLoggingUtils Missing Java Option solr.log.dir. Logging may be missing or incomplete.
   [junit4]   2> 1000274 INFO  (jetty-launcher-1578-thread-3) [    ] o.a.s.s.SolrDispatchFilter Using logger factory org.apache.logging.slf4j.Log4jLoggerFactory
   [junit4]   2> 1000274 ERROR (jetty-launcher-1578-thread-1) [    ] o.a.s.u.StartupLoggingUtils Missing Java Option solr.log.dir. Logging may be missing or incomplete.
   [junit4]   2> 1000274 INFO  (jetty-launcher-1578-thread-1) [    ] o.a.s.s.SolrDispatchFilter Using logger factory org.apache.logging.slf4j.Log4jLoggerFactory
   [junit4]   2> 1000274 INFO  (jetty-launcher-1578-thread-3) [    ] o.a.s.s.SolrDispatchFilter  ___      _       Welcome to Apache Solr™ version 8.0.0
   [junit4]   2> 1000274 INFO  (jetty-launcher-1578-thread-3) [    ] o.a.s.s.SolrDispatchFilter / __| ___| |_ _   Starting in cloud mode on port null
   [junit4]   2> 1000274 INFO  (jetty-launcher-1578-thread-1) [    ] o.a.s.s.SolrDispatchFilter  ___      _       Welcome to Apache Solr™ version 8.0.0
   [junit4]   2> 1000274 INFO  (jetty-launcher-1578-thread-3) [    ] o.a.s.s.SolrDispatchFilter \__ \/ _ \ | '_|  Install dir: null
   [junit4]   2> 1000274 INFO  (jetty-launcher-1578-thread-1) [    ] o.a.s.s.SolrDispatchFilter / __| ___| |_ _   Starting in cloud mode on port null
   [junit4]   2> 1000274 INFO  (jetty-launcher-1578-thread-1) [    ] o.a.s.s.SolrDispatchFilter \__ \/ _ \ | '_|  Install dir: null
   [junit4]   2> 1000274 INFO  (jetty-launcher-1578-thread-3) [    ] o.a.s.s.SolrDispatchFilter |___/\___/_|_|    Start time: 2018-09-03T21:02:28.766Z
   [junit4]   2> 1000274 INFO  (jetty-launcher-1578-thread-1) [    ] o.a.s.s.SolrDispatchFilter |___/\___/_|_|    Start time: 2018-09-03T21:02:28.766Z
   [junit4]   2> 1000290 INFO  (jetty-launcher-1578-thread-5) [    ] o.e.j.s.Server Started @1000340ms
   [junit4]   2> 1000290 INFO  (jetty-launcher-1578-thread-5) [    ] o.a.s.c.s.e.JettySolrRunner Jetty properties: {hostContext=/solr, hostPort=44760}
   [junit4]   2> 1000290 ERROR (jetty-launcher-1578-thread-5) [    ] o.a.s.u.StartupLoggingUtils Missing Java Option solr.log.dir. Logging may be missing or incomplete.
   [junit4]   2> 1000290 INFO  (jetty-launcher-1578-thread-5) [    ] o.a.s.s.SolrDispatchFilter Using logger factory org.apache.logging.slf4j.Log4jLoggerFactory
   [junit4]   2> 1000290 INFO  (jetty-launcher-1578-thread-5) [    ] o.a.s.s.SolrDispatchFilter  ___      _       Welcome to Apache Solr™ version 8.0.0
   [junit4]   2> 1000290 INFO  (jetty-launcher-1578-thread-5) [    ] o.a.s.s.SolrDispatchFilter / __| ___| |_ _   Starting in cloud mode on port null
   [junit4]   2> 1000290 INFO  (jetty-launcher-1578-thread-5) [    ] o.a.s.s.SolrDispatchFilter \__ \/ _ \ | '_|  Install dir: null
   [junit4]   2> 1000290 INFO  (jetty-launcher-1578-thread-5) [    ] o.a.s.s.SolrDispatchFilter |___/\___/_|_|    Start time: 2018-09-03T21:02:28.782Z
   [junit4]   2> 1000291 INFO  (jetty-launcher-1578-thread-4) [    ] o.e.j.s.AbstractConnector Started ServerConnector@1405bc7f{SSL,[ssl, http/1.1]}{127.0.0.1:45303}
   [junit4]   2> 1000291 INFO  (jetty-launcher-1578-thread-4) [    ] o.e.j.s.Server Started @1000341ms
   [junit4]   2> 1000291 INFO  (jetty-launcher-1578-thread-4) [    ] o.a.s.c.s.e.JettySolrRunner Jetty properties: {hostContext=/solr, hostPort=45303}
   [junit4]   2> 1000291 ERROR (jetty-launcher-1578-thread-4) [    ] o.a.s.u.StartupLoggingUtils Missing Java Option solr.log.dir. Logging may be missing or incomplete.
   [junit4]   2> 1000291 INFO  (jetty-launcher-1578-thread-4) [    ] o.a.s.s.SolrDispatchFilter Using logger factory org.apache.logging.slf4j.Log4jLoggerFactory
   [junit4]   2> 1000291 INFO  (jetty-launcher-1578-thread-4) [    ] o.a.s.s.SolrDispatchFilter  ___      _       Welcome to Apache Solr™ version 8.0.0
   [junit4]   2> 1000291 INFO  (jetty-launcher-1578-thread-4) [    ] o.a.s.s.SolrDispatchFilter / __| ___| |_ _   Starting in cloud mode on port null
   [junit4]   2> 1000291 INFO  (jetty-launcher-1578-thread-4) [    ] o.a.s.s.SolrDispatchFilter \__ \/ _ \ | '_|  Install dir: null
   [junit4]   2> 1000291 INFO  (jetty-launcher-1578-thread-4) [    ] o.a.s.s.SolrDispatchFilter |___/\___/_|_|    Start time: 2018-09-03T21:02:28.783Z
   [junit4]   2> 1000379 INFO  (zkConnectionManagerCallback-1583-thread-1) [    ] o.a.s.c.c.ConnectionManager zkClient has connected
   [junit4]   2> 1000453 INFO  (zkConnectionManagerCallback-1589-thread-1) [    ] o.a.s.c.c.ConnectionManager zkClient has connected
   [junit4]   2> 1000454 INFO  (zkConnectionManagerCallback-1591-thread-1) [    ] o.a.s.c.c.ConnectionManager zkClient has connected
   [junit4]   2> 1000456 INFO  (zkConnectionManagerCallback-1585-thread-1) [    ] o.a.s.c.c.ConnectionManager zkClient has connected
   [junit4]   2> 1000468 INFO  (zkConnectionManagerCallback-1587-thread-1) [    ] o.a.s.c.c.ConnectionManager zkClient has connected
   [junit4]   2> 1000472 INFO  (jetty-launcher-1578-thread-2) [    ] o.a.s.s.SolrDispatchFilter solr.xml found in ZooKeeper. Loading...
   [junit4]   2> 1000525 INFO  (jetty-launcher-1578-thread-4) [    ] o.a.s.s.SolrDispatchFilter solr.xml found in ZooKeeper. Loading...
   [junit4]   2> 1000525 INFO  (jetty-launcher-1578-thread-5) [    ] o.a.s.s.SolrDispatchFilter solr.xml found in ZooKeeper. Loading...
   [junit4]   2> 1000541 INFO  (jetty-launcher-1578-thread-1) [    ] o.a.s.s.SolrDispatchFilter solr.xml found in ZooKeeper. Loading...
   [junit4]   2> 1000541 INFO  (jetty-launcher-1578-thread-3) [    ] o.a.s.s.SolrDispatchFilter solr.xml found in ZooKeeper. Loading...
   [junit4]   2> 1001399 INFO  (jetty-launcher-1578-thread-2) [    ] o.a.s.c.ZkContainer Zookeeper client=127.0.0.1:34974/solr
   [junit4]   2> 1001635 INFO  (jetty-launcher-1578-thread-1) [    ] o.a.s.c.ZkContainer Zookeeper client=127.0.0.1:34974/solr
   [junit4]   2> 1001871 INFO  (zkConnectionManagerCallback-1599-thread-1) [    ] o.a.s.c.c.ConnectionManager zkClient has connected
   [junit4]   2> 1002131 INFO  (zkConnectionManagerCallback-1595-thread-1) [    ] o.a.s.c.c.ConnectionManager zkClient has connected
   [junit4]   2> 1002403 INFO  (zkConnectionManagerCallback-1601-thread-1) [    ] o.a.s.c.c.ConnectionManager zkClient has connected
   [junit4]   2> 1002505 INFO  (zkConnectionManagerCallback-1603-thread-1) [    ] o.a.s.c.c.ConnectionManager zkClient has connected
   [junit4]   2> 1002519 INFO  (jetty-launcher-1578-thread-4) [    ] o.a.s.c.ZkContainer Zookeeper client=127.0.0.1:34974/solr
   [junit4]   2> 1002521 INFO  (jetty-launcher-1578-thread-3) [    ] o.a.s.c.ZkContainer Zookeeper client=127.0.0.1:34974/solr
   [junit4]   2> 1002545 INFO  (zkConnectionManagerCallback-1608-thread-1) [    ] o.a.s.c.c.ConnectionManager zkClient has connected
   [junit4]   2> 1002545 INFO  (zkConnectionManagerCallback-1611-thread-1) [    ] o.a.s.c.c.ConnectionManager zkClient has connected
   [junit4]   2> 1002611 WARN  (NIOServerCxn.Factory:0.0.0.0/0.0.0.0:0) [    ] o.a.z.s.NIOServerCnxn Unable to read additional data from client sessionid 0x1044580f7e4000a, likely client has closed socket
   [junit4]   2> 1002677 INFO  (zkConnectionManagerCallback-1613-thread-1) [    ] o.a.s.c.c.ConnectionManager zkClient has connected
   [junit4]   2> 1002778 INFO  (zkConnectionManagerCallback-1619-thread-1) [    ] o.a.s.c.c.ConnectionManager zkClient has connected
   [junit4]   2> 1002819 INFO  (jetty-launcher-1578-thread-5) [    ] o.a.s.c.ZkContainer Zookeeper client=127.0.0.1:34974/solr
   [junit4]   2> 1002842 INFO  (zkConnectionManagerCallback-1627-thread-1) [    ] o.a.s.c.c.ConnectionManager zkClient has connected
   [junit4]   2> 1002944 INFO  (zkConnectionManagerCallback-1629-thread-1) [    ] o.a.s.c.c.ConnectionManager zkClient has connected
   [junit4]   2> 1003002 INFO  (jetty-launcher-1578-thread-3) [n:127.0.0.1:36176_solr    ] o.a.s.c.OverseerElectionContext I am going to be the leader 127.0.0.1:36176_solr
   [junit4]   2> 1003005 INFO  (jetty-launcher-1578-thread-3) [n:127.0.0.1:36176_solr    ] o.a.s.c.Overseer Overseer (id=73259914161815565-127.0.0.1:36176_solr-n_0000000000) starting
   [junit4]   2> 1003052 INFO  (jetty-launcher-1578-thread-5) [n:127.0.0.1:44760_solr    ] o.a.s.c.ZkController Register node as live in ZooKeeper:/live_nodes/127.0.0.1:44760_solr
   [junit4]   2> 1003072 INFO  (zkCallback-1628-thread-1) [    ] o.a.s.c.c.ZkStateReader Updated live nodes from ZooKeeper... (0) -> (1)
   [junit4]   2> 1003107 INFO  (zkCallback-1618-thread-1) [    ] o.a.s.c.c.ZkStateReader Updated live nodes from ZooKeeper... (0) -> (1)
   [junit4]   2> 1003233 INFO  (zkConnectionManagerCallback-1636-thread-1) [    ] o.a.s.c.c.ConnectionManager zkClient has connected
   [junit4]   2> 1003388 INFO  (jetty-launcher-1578-thread-3) [n:127.0.0.1:36176_solr    ] o.a.s.c.c.ZkStateReader Updated live nodes from ZooKeeper... (0) -> (1)
   [junit4]   2> 1003392 INFO  (zkConnectionManagerCallback-1641-thread-1) [    ] o.a.s.c.c.ConnectionManager zkClient has connected
   [junit4]   2> 1003438 INFO  (jetty-launcher-1578-thread-5) [n:127.0.0.1:44760_solr    ] o.a.s.c.c.ZkStateReader Updated live nodes from ZooKeeper... (0) -> (1)
   [junit4]   2> 1003438 INFO  (jetty-launcher-1578-thread-3) [n:127.0.0.1:36176_solr    ] o.a.s.c.s.i.ZkClientClusterStateProvider Cluster at 127.0.0.1:34974/solr ready
   [junit4]   2> 1003440 INFO  (jetty-launcher-1578-thread-5) [n:127.0.0.1:44760_solr    ] o.a.s.c.s.i.ZkClientClusterStateProvider Cluster at 127.0.0.1:34974/solr ready
   [junit4]   2> 1003481 INFO  (jetty-launcher-1578-thread-5) [n:127.0.0.1:44760_solr    ] o.a.s.h.a.MetricsHistoryHandler No .system collection, keeping metrics history in memory.
   [junit4]   2> 1003490 INFO  (OverseerStateUpdate-73259914161815565-127.0.0.1:36176_solr-n_0000000000) [n:127.0.0.1:36176_solr    ] o.a.s.c.Overseer Starting to work on the main queue : 127.0.0.1:36176_solr
   [junit4]   2> 1003490 DEBUG (OverseerAutoScalingTriggerThread-73259914161815565-127.0.0.1:36176_solr-n_0000000000) [    ] o.a.s.c.a.OverseerTriggerThread Adding .auto_add_replicas and .scheduled_maintenance triggers
   [junit4]   2> 1003543 DEBUG (OverseerAutoScalingTriggerThread-73259914161815565-127.0.0.1:36176_solr-n_0000000000) [    ] o.a.s.c.a.OverseerTriggerThread Refreshing /autoscaling.json with znode version 1
   [junit4]   2> 1003543 DEBUG (OverseerAutoScalingTriggerThread-73259914161815565-127.0.0.1:36176_solr-n_0000000000) [    ] o.a.s.c.a.OverseerTriggerThread Current znodeVersion 1, lastZnodeVersion -1
   [junit4]   2> 1003543 DEBUG (OverseerAutoScalingTriggerThread-73259914161815565-127.0.0.1:36176_solr-n_0000000000) [    ] o.a.s.c.a.OverseerTriggerThread Processed trigger updates upto znodeVersion 1
   [junit4]   2> 1003603 INFO  (jetty-launcher-1578-thread-3) [n:127.0.0.1:36176_solr    ] o.a.s.c.TransientSolrCoreCacheDefault Allocating transient cache for 2147483647 transient cores
   [junit4]   2> 1003603 INFO  (jetty-launcher-1578-thread-3) [n:127.0.0.1:36176_solr    ] o.a.s.c.ZkController Register node as live in ZooKeeper:/live_nodes/127.0.0.1:36176_solr
   [junit4]   2> 1003606 INFO  (jetty-launcher-1578-thread-5) [n:127.0.0.1:44760_solr    ] o.a.s.m.r.SolrJmxReporter JMX monitoring for 'solr_44760.solr.node' (registry 'solr.node') enabled at server: com.sun.jmx.mbeanserver.JmxMBeanServer@578d0a86
   [junit4]   2> 1003642 INFO  (jetty-launcher-1578-thread-5) [n:127.0.0.1:44760_solr    ] o.a.s.m.r.SolrJmxReporter JMX monitoring for 'solr_44760.solr.jvm' (registry 'solr.jvm') enabled at server: com.sun.jmx.mbeanserver.JmxMBeanServer@578d0a86
   [junit4]   2> 1003642 INFO  (jetty-launcher-1578-thread-5) [n:127.0.0.1:44760_solr    ] o.a.s.m.r.SolrJmxReporter JMX monitoring for 'solr_44760.solr.jetty' (registry 'solr.jetty') enabled at server: com.sun.jmx.mbeanserver.JmxMBeanServer@578d0a86
   [junit4]   2> 1003643 INFO  (jetty-launcher-1578-thread-5) [n:127.0.0.1:44760_solr    ] o.a.s.c.CorePropertiesLocator Found 0 core definitions underneath /home/jenkins/jenkins-slave/workspace/Lucene-Solr-Tests-master/solr/build/solr-core/test/J2/temp/solr.cloud.autoscaling.SearchRateTriggerIntegrationTest_C40BA5808E98E5E2-001/tempDir-001/node5/.
   [junit4]   2> 1003653 INFO  (zkCallback-1618-thread-1) [    ] o.a.s.c.c.ZkStateReader Updated live nodes from ZooKeeper... (1) -> (2)
   [junit4]   2> 1003702 INFO  (zkCallback-1628-thread-1) [    ] o.a.s.c.c.ZkStateReader Updated live nodes from ZooKeeper... (1) -> (2)
   [junit4]   2> 1003717 DEBUG (OverseerAutoScalingTriggerThread-73259914161815565-127.0.0.1:36176_solr-n_0000000000) [    ] o.a.s.c.a.NodeLostTrigger NodeLostTrigger .auto_add_replicas - Initial livenodes: [127.0.0.1:44760_solr]
   [junit4]   2> 1003747 DEBUG (OverseerAutoScalingTriggerThread-73259914161815565-127.0.0.1:36176_solr-n_0000000000) [    ] o.a.s.c.a.OverseerTriggerThread -- clean old nodeAdded markers
   [junit4]   2> 1003804 INFO  (zkCallback-1640-thread-1) [    ] o.a.s.c.c.ZkStateReader Updated live nodes from ZooKeeper... (1) -> (2)
   [junit4]   2> 1003819 DEBUG (OverseerAutoScalingTriggerThread-73259914161815565-127.0.0.1:36176_solr-n_0000000000) [    ] o.a.s.c.a.OverseerTriggerThread Current znodeVersion 1, lastZnodeVersion 1
   [junit4]   2> 1003864 INFO  (zkCallback-1635-thread-1) [    ] o.a.s.c.c.ZkStateReader Updated live nodes from ZooKeeper... (1) -> (2)
   [junit4]   2> 1003885 DEBUG (ScheduledTrigger-1992-thread-1) [    ] o.a.s.c.a.NodeLostTrigger Running NodeLostTrigger: .auto_add_replicas with currently live nodes: 2
   [junit4]   2> 1003973 INFO  (jetty-launcher-1578-thread-3) [n:127.0.0.1:36176_solr    ] o.a.s.h.a.MetricsHistoryHandler No .system collection, keeping metrics history in memory.
   [junit4]   2> 1004009 INFO  (jetty-launcher-1578-thread-2) [n:127.0.0.1:35635_solr    ] o.a.s.c.c.ZkStateReader Updated live nodes from ZooKeeper... (0) -> (2)
   [junit4]   2> 1004065 INFO  (jetty-launcher-1578-thread-3) [n:127.0.0.1:36176_solr    ] o.a.s.m.r.SolrJmxReporter JMX monitoring for 'solr_36176.solr.node' (registry 'solr.node') enabled at server: com.sun.jmx.mbeanserver.JmxMBeanServer@578d0a86
   [junit4]   2> 1004080 INFO  (jetty-launcher-1578-thread-1) [n:127.0.0.1:32934_solr    ] o.a.s.c.c.ZkStateReader Updated live nodes from ZooKeeper... (0) -> (2)
   [junit4]   2> 1004081 INFO  (jetty-launcher-1578-thread-4) [n:127.0.0.1:45303_solr    ] o.a.s.c.c.ZkStateReader Updated live nodes from ZooKeeper... (0) -> (2)
   [junit4]   2> 1004085 INFO  (jetty-launcher-1578-thread-2) [n:127.0.0.1:35635_solr    ] o.a.s.c.TransientSolrCoreCacheDefault Allocating transient cache for 2147483647 transient cores
   [junit4]   2> 1004085 INFO  (jetty-launcher-1578-thread-2) [n:127.0.0.1:35635_solr    ] o.a.s.c.ZkController Register node as live in ZooKeeper:/live_nodes/127.0.0.1:35635_solr
   [junit4]   2> 1004102 INFO  (jetty-launcher-1578-thread-3) [n:127.0.0.1:36176_solr    ] o.a.s.m.r.SolrJmxReporter JMX monitoring for 'solr_36176.solr.jvm' (registry 'solr.jvm') enabled at server: com.sun.jmx.mbeanserver.JmxMBeanServer@578d0a86
   [junit4]   2> 1004102 INFO  (jetty-launcher-1578-thread-3) [n:127.0.0.1:36176_solr    ] o.a.s.m.r.SolrJmxReporter JMX monitoring for 'solr_36176.solr.jetty' (registry 'solr.jetty') enabled at server: com.sun.jmx.mbeanserver.JmxMBeanServer@578d0a86
   [junit4]   2> 1004116 INFO  (zkCallback-1628-thread-1) [    ] o.a.s.c.c.ZkStateReader Updated live nodes from ZooKeeper... (2) -> (3)
   [junit4]   2> 1004116 INFO  (zkCallback-1618-thread-2) [    ] o.a.s.c.c.ZkStateReader Updated live nodes from ZooKeeper... (2) -> (3)
   [junit4]   2> 1004116 INFO  (zkCallback-1635-thread-1) [    ] o.a.s.c.c.ZkStateReader Updated live nodes from ZooKeeper... (2) -> (3)
   [junit4]   2> 1004117 INFO  (jetty-launcher-1578-thread-1) [n:127.0.0.1:32934_solr    ] o.a.s.c.TransientSolrCoreCacheDefault Allocating transient cache for 2147483647 transient cores
   [junit4]   2> 1004117 INFO  (jetty-launcher-1578-thread-1) [n:127.0.0.1:32934_solr    ] o.a.s.c.ZkController Register node as live in ZooKeeper:/live_nodes/127.0.0.1:32934_solr
   [junit4]   2> 1004119 INFO  (zkCallback-1635-thread-1) [    ] o.a.s.c.c.ZkStateReader Updated live nodes from ZooKeeper... (3) -> (4)
   [junit4]   2> 1004119 INFO  (zkCallback-1628-thread-1) [    ] o.a.s.c.c.ZkStateReader Updated live nodes from ZooKeeper... (3) -> (4)
   [junit4]   2> 1004119 INFO  (zkCallback-1640-thread-1) [    ] o.a.s.c.c.ZkStateReader Updated live nodes from ZooKeeper... (2) -> (3)
   [junit4]   2> 1004122 INFO  (zkCallback-1640-thread-1) [    ] o.a.s.c.c.ZkStateReader Updated live nodes from ZooKeeper... (3) -> (4)
   [junit4]   2> 1004173 INFO  (zkCallback-1602-thread-1) [    ] o.a.s.c.c.ZkStateReader Updated live nodes from ZooKeeper... (2) -> (3)
   [junit4]   2> 1004173 INFO  (zkCallback-1600-thread-1) [    ] o.a.s.c.c.ZkStateReader Updated live nodes from ZooKeeper... (2) -> (4)
   [junit4]   2> 1004173 INFO  (zkCallback-1618-thread-1) [    ] o.a.s.c.c.ZkStateReader Updated live nodes from ZooKeeper... (3) -> (4)
   [junit4]   2> 1004173 INFO  (jetty-launcher-1578-thread-3) [n:127.0.0.1:36176_solr    ] o.a.s.c.CorePropertiesLocator Found 0 core definitions underneath /home/jenkins/jenkins-slave/workspace/Lucene-Solr-Tests-master/solr/build/solr-core/test/J2/temp/solr.cloud.autoscaling.SearchRateTriggerIntegrationTest_C40BA5808E98E5E2-001/tempDir-001/node3/.
   [junit4]   2> 1004176 INFO  (zkCallback-1612-thread-1) [    ] o.a.s.c.c.ZkStateReader Updated live nodes from ZooKeeper... (2) -> (4)
   [junit4]   2> 1004180 INFO  (zkCallback-1602-thread-2) [    ] o.a.s.c.c.ZkStateReader Updated live nodes from ZooKeeper... (3) -> (4)
   [junit4]   2> 1004209 INFO  (jetty-launcher-1578-thread-4) [n:127.0.0.1:45303_solr    ] o.a.s.c.TransientSolrCoreCacheDefault Allocating transient cache for 2147483647 transient cores
   [junit4]   2> 1004209 INFO  (jetty-launcher-1578-thread-4) [n:127.0.0.1:45303_solr    ] o.a.s.c.ZkController Register node as live in ZooKeeper:/live_nodes/127.0.0.1:45303_solr
   [junit4]   2> 1004210 INFO  (zkCallback-1635-thread-1) [    ] o.a.s.c.c.ZkStateReader Updated live nodes from ZooKeeper... (4) -> (5)
   [junit4]   2> 1004210 INFO  (zkCallback-1628-thread-1) [    ] o.a.s.c.c.ZkStateReader Updated live nodes from ZooKeeper... (4) -> (5)
   [junit4]   2> 1004245 INFO  (zkCallback-1612-thread-1) [    ] o.a.s.c.c.ZkStateReader Updated live nodes from ZooKeeper... (4) -> (5)
   [junit4]   2> 1004245 INFO  (zkCallback-1618-thread-2) [    ] o.a.s.c.c.ZkStateReader Updated live nodes from ZooKeeper... (4) -> (5)
   [junit4]   2> 1004245 INFO  (zkCallback-1640-thread-1) [    ] o.a.s.c.c.ZkStateReader Updated live nodes from ZooKeeper... (4) -> (5)
   [junit4]   2> 1004245 INFO  (zkCallback-1600-thread-2) [    ] o.a.s.c.c.ZkStateReader Updated live nodes from ZooKeeper... (4) -> (5)
   [junit4]   2> 1004253 INFO  (zkCallback-1602-thread-2) [    ] o.a.s.c.c.ZkStateReader Updated live nodes from ZooKeeper... (4) -> (5)
   [junit4]   2> 1004356 INFO  (zkConnectionManagerCallback-1657-thread-1) [    ] o.a.s.c.c.ConnectionManager zkClient has connected
   [junit4]   2> 1004357 INFO  (zkConnectionManagerCallback-1648-thread-1) [    ] o.a.s.c.c.ConnectionManager zkClient has connected
   [junit4]   2> 1004357 INFO  (zkConnectionManagerCallback-1658-thread-1) [    ] o.a.s.c.c.ConnectionManager zkClient has connected
   [junit4]   2> 1004373 INFO  (jetty-launcher-1578-thread-1) [n:127.0.0.1:32934_solr    ] o.a.s.c.c.ZkStateReader Updated live nodes from ZooKeeper... (0) -> (5)
   [junit4]   2> 1004374 INFO  (jetty-launcher-1578-thread-1) [n:127.0.0.1:32934_solr    ] o.a.s.c.s.i.ZkClientClusterStateProvider Cluster at 127.0.0.1:34974/solr ready
   [junit4]   2> 1004374 INFO  (jetty-launcher-1578-thread-1) [n:127.0.0.1:32934_solr    ] o.a.s.h.a.MetricsHistoryHandler No .system collection, keeping metrics history in memory.
   [junit4]   2> 1004412 INFO  (jetty-launcher-1578-thread-4) [n:127.0.0.1:45303_solr    ] o.a.s.c.c.ZkStateReader Updated live nodes from ZooKeeper... (0) -> (5)
   [junit4]   2> 1004424 INFO  (jetty-launcher-1578-thread-2) [n:127.0.0.1:35635_solr    ] o.a.s.c.c.ZkStateReader Updated live nodes from ZooKeeper... (0) -> (5)
   [junit4]   2> 1004425 INFO  (jetty-launcher-1578-thread-2) [n:127.0.0.1:35635_solr    ] o.a.s.c.s.i.ZkClientClusterStateProvider Cluster at 127.0.0.1:34974/solr ready
   [junit4]   2> 1004426 INFO  (jetty-launcher-1578-thread-4) [n:127.0.0.1:45303_solr    ] o.a.s.c.s.i.ZkClientClusterStateProvider Cluster at 127.0.0.1:34974/solr ready
   [junit4]   2> 1004426 INFO  (jetty-launcher-1578-thread-2) [n:127.0.0.1:35635_solr    ] o.a.s.h.a.MetricsHistoryHandler No .system collection, keeping metrics history in memory.
   [junit4]   2> 1004448 INFO  (jetty-launcher-1578-thread-1) [n:127.0.0.1:32934_solr    ] o.a.s.m.r.SolrJmxReporter JMX monitoring for 'solr_32934.solr.node' (registry 'solr.node') enabled at server: com.sun.jmx.mbeanserver.JmxMBeanServer@578d0a86
   [junit4]   2> 1004473 INFO  (jetty-launcher-1578-thread-4) [n:127.0.0.1:45303_solr    ] o.a.s.h.a.MetricsHistoryHandler No .system collection, keeping metrics history in memory.
   [junit4]   2> 1004484 INFO  (jetty-launcher-1578-thread-1) [n:127.0.0.1:32934_solr    ] o.a.s.m.r.SolrJmxReporter JMX monitoring for 'solr_32934.solr.jvm' (registry 'solr.jvm') enabled at server: com.sun.jmx.mbeanserver.JmxMBeanServer@578d0a86
   [junit4]   2> 1004484 INFO  (jetty-launcher-1578-thread-1) [n:127.0.0.1:32934_solr    ] o.a.s.m.r.SolrJmxReporter JMX monitoring for 'solr_32934.solr.jetty' (registry 'solr.jetty') enabled at server: com.sun.jmx.mbeanserver.JmxMBeanServer@578d0a86
   [junit4]   2> 1004497 INFO  (jetty-launcher-1578-thread-2) [n:127.0.0.1:35635_solr    ] o.a.s.m.r.SolrJmxReporter JMX monitoring for 'solr_35635.solr.node' (registry 'solr.node') enabled at server: com.sun.jmx.mbeanserver.JmxMBeanServer@578d0a86
   [junit4]   2> 1004497 INFO  (jetty-launcher-1578-thread-1) [n:127.0.0.1:32934_solr    ] o.a.s.c.CorePropertiesLocator Found 0 core definitions underneath /home/jenkins/jenkins-slave/workspace/Lucene-Solr-Tests-master/solr/build/solr-core/test/J2/temp/solr.cloud.autoscaling.SearchRateTriggerIntegrationTest_C40BA5808E98E5E2-001/tempDir-001/node1/.
   [junit4]   2> 1004526 INFO  (jetty-launcher-1578-thread-4) [n:127.0.0.1:45303_solr    ] o.a.s.m.r.SolrJmxReporter JMX monitoring for 'solr_45303.solr.node' (registry 'solr.node') enabled at server: com.sun.jmx.mbeanserver.JmxMBeanServer@578d0a86
   [junit4]   2> 1004550 INFO  (jetty-launcher-1578-thread-4) [n:127.0.0.1:45303_solr    ] o.a.s.m.r.SolrJmxReporter JMX monitoring for 'solr_45303.solr.jvm' (registry 'solr.jvm') enabled at server: com.sun.jmx.mbeanserver.JmxMBeanServer@578d0a86
   [junit4]   2> 1004562 INFO  (jetty-launcher-1578-thread-4) [n:127.0.0.1:45303_solr    ] o.a.s.m.r.SolrJmxReporter JMX monitoring for 'solr_45303.solr.jetty' (registry 'solr.jetty') enabled at server: com.sun.jmx.mbeanserver.JmxMBeanServer@578d0a86
   [junit4]   2> 1004563 INFO  (jetty-launcher-1578-thread-4) [n:127.0.0.1:45303_solr    ] o.a.s.c.CorePropertiesLocator Found 0 core definitions underneath /home/jenkins/jenkins-slave/workspace/Lucene-Solr-Tests-master/solr/build/solr-core/test/J2/temp/solr.cloud.autoscaling.SearchRateTriggerIntegrationTest_C40BA5808E98E5E2-001/tempDir-001/node4/.
   [junit4]   2> 1004606 INFO  (jetty-launcher-1578-thread-2) [n:127.0.0.1:35635_solr    ] o.a.s.m.r.SolrJmxReporter JMX monitoring for 'solr_35635.solr.jvm' (registry 'solr.jvm') enabled at server: com.sun.jmx.mbeanserver.JmxMBeanServer@578d0a86
   [junit4]   2> 1004606 INFO  (jetty-launcher-1578-thread-2) [n:127.0.0.1:35635_solr    ] o.a.s.m.r.SolrJmxReporter JMX monitoring for 'solr_35635.solr.jetty' (registry 'solr.jetty') enabled at server: com.sun.jmx.mbeanserver.JmxMBeanServer@578d0a86
   [junit4]   2> 1004678 INFO  (jetty-launcher-1578-thread-2) [n:127.0.0.1:35635_solr    ] o.a.s.c.CorePropertiesLocator Found 0 core definitions underneath /home/jenkins/jenkins-slave/workspace/Lucene-Solr-Tests-master/solr/build/solr-core/test/J2/temp/solr.cloud.autoscaling.SearchRateTriggerIntegrationTest_C40BA5808E98E5E2-001/tempDir-001/node2/.
   [junit4]   2> 1004986 DEBUG (ScheduledTrigger-1992-thread-2) [    ] o.a.s.c.a.NodeLostTrigger Running NodeLostTrigger: .auto_add_replicas with currently live nodes: 5
   [junit4]   2> 1005432 INFO  (zkConnectionManagerCallback-1663-thread-1) [    ] o.a.s.c.c.ConnectionManager zkClient has connected
   [junit4]   2> 1005464 INFO  (zkConnectionManagerCallback-1668-thread-1) [    ] o.a.s.c.c.ConnectionManager zkClient has connected
   [junit4]   2> 1005466 INFO  (SUITE-SearchRateTriggerIntegrationTest-seed#[C40BA5808E98E5E2]-worker) [    ] o.a.s.c.c.ZkStateReader Updated live nodes from ZooKeeper... (0) -> (5)
   [junit4]   2> 1005466 INFO  (SUITE-SearchRateTriggerIntegrationTest-seed#[C40BA5808E98E5E2]-worker) [    ] o.a.s.c.s.i.ZkClientClusterStateProvider Cluster at 127.0.0.1:34974/solr ready
   [junit4]   2> 1005734 INFO  (qtp1035068211-5555) [n:127.0.0.1:35635_solr    ] o.a.s.s.HttpSolrCall [admin] webapp=null path=/admin/metrics params={prefix=CONTAINER.fs.usableSpace,CONTAINER.fs.totalSpace,CORE.coreName&wt=javabin&version=2&group=solr.node,solr.core} status=0 QTime=0
   [junit4]   2> 1006064 INFO  (qtp1059503402-5562) [n:127.0.0.1:45303_solr    ] o.a.s.s.HttpSolrCall [admin] webapp=null path=/admin/metrics params={prefix=CONTAINER.fs.usableSpace,CONTAINER.fs.totalSpace,CORE.coreName&wt=javabin&version=2&group=solr.node,solr.core} status=0 QTime=12
   [junit4]   2> 1006251 DEBUG (ScheduledTrigger-1992-thread-1) [    ] o.a.s.c.a.NodeLostTrigger Running NodeLostTrigger: .auto_add_replicas with currently live nodes: 5
   [junit4]   2> 1006252 INFO  (qtp1517132326-5589) [n:127.0.0.1:36176_solr    ] o.a.s.s.HttpSolrCall [admin] webapp=null path=/admin/metrics params={prefix=CONTAINER.fs.usableSpace,CONTAINER.fs.totalSpace,CORE.coreName&wt=javabin&version=2&group=solr.node,solr.core} status=0 QTime=0
   [junit4]   2> 1006566 INFO  (qtp724442609-5582) [n:127.0.0.1:44760_solr    ] o.a.s.s.HttpSolrCall [admin] webapp=null path=/admin/metrics params={prefix=CONTAINER.fs.usableSpace,CONTAINER.fs.totalSpace,CORE.coreName&wt=javabin&version=2&group=solr.node,solr.core} status=0 QTime=0
   [junit4]   2> 1006748 INFO  (qtp1211727408-5571) [n:127.0.0.1:32934_solr    ] o.a.s.s.HttpSolrCall [admin] webapp=null path=/admin/metrics params={prefix=CONTAINER.fs.usableSpace,CONTAINER.fs.totalSpace,CORE.coreName&wt=javabin&version=2&group=solr.node,solr.core} status=0 QTime=0
   [junit4]   2> 1006748 DEBUG (qtp1035068211-5550) [n:127.0.0.1:35635_solr    ] o.a.s.c.a.AutoScalingHandler Verified autoscaling configuration
   [junit4]   2> 1006749 INFO  (qtp1035068211-5550) [n:127.0.0.1:35635_solr    ] o.a.s.s.HttpSolrCall [admin] webapp=null path=/admin/autoscaling params={wt=javabin&version=2} status=0 QTime=1155
   [junit4]   2> 1006788 DEBUG (zkCallback-1635-thread-1) [    ] o.a.s.c.a.OverseerTriggerThread Refreshing /autoscaling.json with znode version 2
   [junit4]   2> 1006861 DEBUG (OverseerAutoScalingTriggerThread-73259914161815565-127.0.0.1:36176_solr-n_0000000000) [    ] o.a.s.c.a.OverseerTriggerThread Processed trigger updates upto znodeVersion 2
   [junit4]   2> 1006967 DEBUG (OverseerAutoScalingTriggerThread-73259914161815565-127.0.0.1:36176_solr-n_0000000000) [    ] o.a.s.c.a.OverseerTriggerThread -- clean old nodeAdded markers
   [junit4]   2> 1006991 DEBUG (OverseerAutoScalingTriggerThread-73259914161815565-127.0.0.1:36176_solr-n_0000000000) [    ] o.a.s.c.a.OverseerTriggerThread Current znodeVersion 2, lastZnodeVersion 2
   [junit4]   2> 1007132 INFO  (TEST-SearchRateTriggerIntegrationTest.testAboveSearchRate-seed#[C40BA5808E98E5E2]) [    ] o.a.s.SolrTestCaseJ4 ###Starting testAboveSearchRate
   [junit4]   2> 1007133 INFO  (TEST-SearchRateTriggerIntegrationTest.testAboveSearchRate-seed#[C40BA5808E98E5E2]) [    ] o.a.s.c.c.ZkStateReader Updated live nodes from ZooKeeper... (0) -> (5)
   [junit4]   2> 1007172 INFO  (TEST-SearchRateTriggerIntegrationTest.testAboveSearchRate-seed#[C40BA5808E98E5E2]) [    ] o.a.s.c.a.SearchRateTriggerIntegrationTest /autoscaling.json reset, new znode version 3
   [junit4]   2> 1007191 DEBUG (zkCallback-1635-thread-2) [    ] o.a.s.c.a.OverseerTriggerThread Refreshing /autoscaling.json with znode version 3
   [junit4]   2> 1007192 DEBUG (OverseerAutoScalingTriggerThread-73259914161815565-127.0.0.1:36176_solr-n_0000000000) [    ] o.a.s.c.a.OverseerTriggerThread Processed trigger updates upto znodeVersion 3
   [junit4]   2> 1007192 DEBUG (OverseerAutoScalingTriggerThread-73259914161815565-127.0.0.1:36176_solr-n_0000000000) [    ] o.a.s.c.a.OverseerTriggerThread -- clean old nodeLost markers
   [junit4]   2> 1007193 DEBUG (OverseerAutoScalingTriggerThread-73259914161815565-127.0.0.1:36176_solr-n_0000000000) [    ] o.a.s.c.a.OverseerTriggerThread -- clean old nodeAdded markers
   [junit4]   2> 1007193 DEBUG (OverseerAutoScalingTriggerThread-73259914161815565-127.0.0.1:36176_solr-n_0000000000) [    ] o.a.s.c.a.OverseerTriggerThread Current znodeVersion 3, lastZnodeVersion 3
   [junit4]   2> 1012179 INFO  (qtp1035068211-5553) [n:127.0.0.1:35635_solr    ] o.a.s.h.a.CollectionsHandler Invoked Collection Action :create with params collection.configName=conf&name=aboveRate_collection&nrtReplicas=2&action=CREATE&numShards=1&wt=javabin&version=2 and sendToOCPQueue=true
   [junit4]   2> 1012181 INFO  (OverseerThreadFactory-1996-thread-1-processing-n:127.0.0.1:36176_solr) [n:127.0.0.1:36176_solr    ] o.a.s.c.a.c.CreateCollectionCmd Create collection aboveRate_collection
   [junit4]   2> 1012331 INFO  (OverseerStateUpdate-73259914161815565-127.0.0.1:36176_solr-n_0000000000) [n:127.0.0.1:36176_solr    ] o.a.s.c.o.SliceMutator createReplica() {
   [junit4]   2>   "operation":"ADDREPLICA",
   [junit4]   2>   "collection":"aboveRate_collection",
   [junit4]   2>   "shard":"shard1",
   [junit4]   2>   "core":"aboveRate_collection_shard1_replica_n1",
   [junit4]   2>   "state":"down",
   [junit4]   2>   "base_url":"https://127.0.0.1:44760/solr",
   [junit4]   2>   "type":"NRT",
   [junit4]   2>   "waitForFinalState":"false"} 
   [junit4]   2> 1012333 INFO  (OverseerStateUpdate-73259914161815565-127.0.0.1:36176_solr-n_0000000000) [n:127.0.0.1:36176_solr    ] o.a.s.c.o.SliceMutator createReplica() {
   [junit4]   2>   "operation":"ADDREPLICA",
   [junit4]   2>   "collection":"aboveRate_collection",
   [junit4]   2>   "shard":"shard1",
   [junit4]   2>   "core":"aboveRate_collection_shard1_replica_n2",
   [junit4]   2>   "state":"down",
   [junit4]   2>   "base_url":"https://127.0.0.1:36176/solr",
   [junit4]   2>   "type":"NRT",
   [junit4]   2>   "waitForFinalState":"false"} 
   [junit4]   2> 1012600 INFO  (qtp1517132326-5589) [n:127.0.0.1:36176_solr    x:aboveRate_collection_shard1_replica_n2] o.a.s.h.a.CoreAdminOperation core create command qt=/admin/cores&coreNodeName=core_node4&collection.configName=conf&newCollection=true&name=aboveRate_collection_shard1_replica_n2&action=CREATE&numShards=1&collection=aboveRate_collection&shard=shard1&wt=javabin&version=2&replicaType=NRT
   [junit4]   2> 1012668 INFO  (qtp724442609-5583) [n:127.0.0.1:44760_solr    x:aboveRate_collection_shard1_replica_n1] o.a.s.h.a.CoreAdminOperation core create command qt=/admin/cores&coreNodeName=core_node3&collection.configName=conf&newCollection=true&name=aboveRate_collection_shard1_replica_n1&action=CREATE&numShards=1&collection=aboveRate_collection&shard=shard1&wt=javabin&version=2&replicaType=NRT
   [junit4]   2> 1012669 INFO  (qtp724442609-5583) [n:127.0.0.1:44760_solr    x:aboveRate_collection_shard1_replica_n1] o.a.s.c.TransientSolrCoreCacheDefault Allocating transient cache for 2147483647 transient cores
   [junit4]   2> 1013657 INFO  (qtp1517132326-5589) [n:127.0.0.1:36176_solr c:aboveRate_collection s:shard1 r:core_node4 x:aboveRate_collection_shard1_replica_n2] o.a.s.c.SolrConfig Using Lucene MatchVersion: 8.0.0
   [junit4]   2> 1013701 INFO  (qtp1517132326-5589) [n:127.0.0.1:36176_solr c:aboveRate_collection s:shard1 r:core_node4 x:aboveRate_collection_shard1_replica_n2] o.a.s.s.IndexSchema [aboveRate_collection_shard1_replica_n2] Schema name=minimal
   [junit4]   2> 1013702 INFO  (qtp724442609-5583) [n:127.0.0.1:44760_solr c:aboveRate_collection s:shard1 r:core_node3 x:aboveRate_collection_shard1_replica_n1] o.a.s.c.SolrConfig Using Lucene MatchVersion: 8.0.0
   [junit4]   2> 1013703 INFO  (qtp1517132326-5589) [n:127.0.0.1:36176_solr c:aboveRate_collection s:shard1 r:core_node4 x:aboveRate_collection_shard1_replica_n2] o.a.s.s.IndexSchema Loaded schema minimal/1.1 with uniqueid field id
   [junit4]   2> 1013703 INFO  (qtp1517132326-5589) [n:127.0.0.1:36176_solr c:aboveRate_collection s:shard1 r:core_node4 x:aboveRate_collection_shard1_replica_n2] o.a.s.c.CoreContainer Creating SolrCore 'aboveRate_collection_shard1_replica_n2' using configuration from collection aboveRate_collection, trusted=true
   [junit4]   2> 1013704 INFO  (qtp1517132326-5589) [n:127.0.0.1:36176_solr c:aboveRate_collection s:shard1 r:core_node4 x:aboveRate_collection_shard1_replica_n2] o.a.s.m.r.SolrJmxReporter JMX monitoring for 'solr_36176.solr.core.aboveRate_collection.shard1.replica_n2' (registry 'solr.core.aboveRate_collection.shard1.replica_n2') enabled at server: com.sun.jmx.mbeanserver.JmxMBeanServer@578d0a86
   [junit4]   2> 1013720 INFO  (qtp1517132326-5589) [n:127.0.0.1:36176_solr c:aboveRate_collection s:shard1 r:core_node4 x:aboveRate_collection_shard1_replica_n2] o.a.s.c.SolrCore solr.RecoveryStrategy.Builder
   [junit4]   2> 1013720 INFO  (qtp1517132326-5589) [n:127.0.0.1:36176_solr c:aboveRate_collection s:shard1 r:core_node4 x:aboveRate_collection_shard1_replica_n2] o.a.s.c.SolrCore [[aboveRate_collection_shard1_replica_n2] ] Opening new SolrCore at [/home/jenkins/jenkins-slave/workspace/Lucene-Solr-Tests-master/solr/build/solr-core/test/J2/temp/solr.cloud.autoscaling.SearchRateTriggerIntegrationTest_C40BA5808E98E5E2-001/tempDir-001/node3/aboveRate_collection_shard1_replica_n2], dataDir=[/home/jenkins/jenkins-slave/workspace/Lucene-Solr-Tests-master/solr/build/solr-core/test/J2/temp/solr.cloud.autoscaling.SearchRateTriggerIntegrationTest_C40BA5808E98E5E2-001/tempDir-001/node3/./aboveRate_collection_shard1_replica_n2/data/]
   [junit4]   2> 1013733 INFO  (qtp724442609-5583) [n:127.0.0.1:44760_solr c:aboveRate_collection s:shard1 r:core_node3 x:aboveRate_collection_shard1_replica_n1] o.a.s.s.IndexSchema [aboveRate_collection_shard1_replica_n1] Schema name=minimal
   [junit4]   2> 1013742 INFO  (qtp724442609-5583) [n:127.0.0.1:44760_solr c:aboveRate_collection s:shard1 r:core_node3 x:aboveRate_collection_shard1_replica_n1] o.a.s.s.IndexSchema Loaded schema minimal/1.1 with uniqueid field id
   [junit4]   2> 1013742 INFO  (qtp724442609-5583) [n:127.0.0.1:44760_solr c:aboveRate_collection s:shard1 r:core_node3 x:aboveRate_collection_shard1_replica_n1] o.a.s.c.CoreContainer Creating SolrCore 'aboveRate_collection_shard1_replica_n1' using configuration from collection aboveRate_collection, trusted=true
   [junit4]   2> 1013742 INFO  (qtp724442609-5583) [n:127.0.0.1:44760_solr c:aboveRate_collection s:shard1 r:core_node3 x:aboveRate_collection_shard1_replica_n1] o.a.s.m.r.SolrJmxReporter JMX monitoring for 'solr_44760.solr.core.aboveRate_collection.shard1.replica_n1' (registry 'solr.core.aboveRate_collection.shard1.replica_n1') enabled at server: com.sun.jmx.mbeanserver.JmxMBeanServer@578d0a86
   [junit4]   2> 1013742 INFO  (qtp724442609-5583) [n:127.0.0.1:44760_solr c:aboveRate_collection s:shard1 r:core_node3 x:aboveRate_collection_shard1_replica_n1] o.a.s.c.SolrCore solr.RecoveryStrategy.Builder
   [junit4]   2> 1013743 INFO  (qtp724442609-5583) [n:127.0.0.1:44760_solr c:aboveRate_collection s:shard1 r:core_node3 x:aboveRate_collection_shard1_replica_n1] o.a.s.c.SolrCore [[aboveRate_collection_shard1_replica_n1] ] Opening new SolrCore at [/home/jenkins/jenkins-slave/workspace/Lucene-Solr-Tests-master/solr/build/solr-core/test/J2/temp/solr.cloud.autoscaling.SearchRateTriggerIntegrationTest_C40BA5808E98E5E2-001/tempDir-001/node5/aboveRate_collection_shard1_replica_n1], dataDir=[/home/jenkins/jenkins-slave/workspace/Lucene-Solr-Tests-master/solr/build/solr-core/test/J2/temp/solr.cloud.autoscaling.SearchRateTriggerIntegrationTest_C40BA5808E98E5E2-001/tempDir-001/node5/./aboveRate_collection_shard1_replica_n1/data/]
   [junit4]   2> 1014042 INFO  (qtp1517132326-5589) [n:127.0.0.1:36176_solr c:aboveRate_collection s:shard1 r:core_node4 x:aboveRate_collection_shard1_replica_n2] o.a.s.u.UpdateHandler Using UpdateLog implementation: org.apache.solr.update.UpdateLog
   [junit4]   2> 1014042 INFO  (qtp1517132326-5589) [n:127.0.0.1:36176_solr c:aboveRate_collection s:shard1 r:core_node4 x:aboveRate_collection_shard1_replica_n2] o.a.s.u.UpdateLog Initializing UpdateLog: dataDir=null defaultSyncLevel=FLUSH numRecordsToKeep=100 maxNumLogsToKeep=10 numVersionBuckets=65536
   [junit4]   2> 1014043 INFO  (qtp1517132326-5589) [n:127.0.0.1:36176_solr c:aboveRate_collection s:shard1 r:core_node4 x:aboveRate_collection_shard1_replica_n2] o.a.s.u.CommitTracker Hard AutoCommit: disabled
   [junit4]   2> 1014043 INFO  (qtp1517132326-5589) [n:127.0.0.1:36176_solr c:aboveRate_collection s:shard1 r:core_node4 x:aboveRate_collection_shard1_replica_n2] o.a.s.u.CommitTracker Soft AutoCommit: disabled
   [junit4]   2> 1014045 INFO  (qtp1517132326-5589) [n:127.0.0.1:36176_solr c:aboveRate_collection s:shard1 r:core_node4 x:aboveRate_collection_shard1_replica_n2] o.a.s.s.SolrIndexSearcher Opening [Searcher@1f32984b[aboveRate_collection_shard1_replica_n2] main]
   [junit4]   2> 1014061 INFO  (qtp724442609-5583) [n:127.0.0.1:44760_solr c:aboveRate_collection s:shard1 r:core_node3 x:aboveRate_collection_shard1_replica_n1] o.a.s.u.UpdateHandler Using UpdateLog implementation: org.apache.solr.update.UpdateLog
   [junit4]   2> 1014061 INFO  (qtp724442609-5583) [n:127.0.0.1:44760_solr c:aboveRate_collection s:shard1 r:core_node3 x:aboveRate_collection_shard1_replica_n1] o.a.s.u.UpdateLog Initializing UpdateLog: dataDir=null defaultSyncLevel=FLUSH numRecordsToKeep=100 maxNumLogsToKeep=10 numVersionBuckets=65536
   [junit4]   2> 1014079 INFO  (qtp724442609-5583) [n:127.0.0.1:44760_solr c:aboveRate_collection s:shard1 r:core_node3 x:aboveRate_collection_shard1_replica_n1] o.a.s.u.CommitTracker Hard AutoCommit: disabled
   [junit4]   2> 1014079 INFO  (qtp724442609-5583) [n:127.0.0.1:44760_solr c:aboveRate_collection s:shard1 r:core_node3 x:aboveRate_collection_shard1_replica_n1] o.a.s.u.CommitTracker Soft AutoCommit: disabled
   [junit4]   2> 1014080 INFO  (qtp724442609-5583) [n:127.0.0.1:44760_solr c:aboveRate_collection s:shard1 r:core_node3 x:aboveRate_collection_shard1_replica_n1] o.a.s.s.SolrIndexSearcher Opening [Searcher@1accee16[aboveRate_collection_shard1_replica_n1] main]
   [junit4]   2> 1014082 INFO  (qtp1517132326-5589) [n:127.0.0.1:36176_solr c:aboveRate_collection s:shard1 r:core_node4 x:aboveRate_collection_shard1_replica_n2] o.a.s.r.ManagedResourceStorage Configured ZooKeeperStorageIO with znodeBase: /configs/conf
   [junit4]   2> 1014082 INFO  (qtp724442609-5583) [n:127.0.0.1:44760_solr c:aboveRate_collection s:shard1 r:core_node3 x:aboveRate_collection_shard1_replica_n1] o.a.s.r.ManagedResourceStorage Configured ZooKeeperStorageIO with znodeBase: /configs/conf
   [junit4]   2> 1014082 INFO  (qtp724442609-5583) [n:127.0.0.1:44760_solr c:aboveRate_collection s:shard1 r:core_node3 x:aboveRate_collection_shard1_replica_n1] o.a.s.r.ManagedResourceStorage Loaded null at path _rest_managed.json using ZooKeeperStorageIO:path=/configs/conf
   [junit4]   2> 1014083 INFO  (qtp724442609-5583) [n:127.0.0.1:44760_solr c:aboveRate_collection s:shard1 r:core_node3 x:aboveRate_collection_shard1_replica_n1] o.a.s.h.ReplicationHandler Commits will be reserved for 10000ms.
   [junit4]   2> 1014083 INFO  (qtp724442609-5583) [n:127.0.0.1:44760_solr c:aboveRate_collection s:shard1 r:core_node3 x:aboveRate_collection_shard1_replica_n1] o.a.s.u.UpdateLog Could not find max version in index or recent updates, using new clock 1610621714510643200
   [junit4]   2> 1014115 INFO  (qtp1517132326-5589) [n:127.0.0.1:36176_solr c:aboveRate_collection s:shard1 r:core_node4 x:aboveRate_collection_shard1_replica_n2] o.a.s.r.ManagedResourceStorage Loaded null at path _rest_managed.json using ZooKeeperStorageIO:path=/configs/conf
   [junit4]   2> 1014116 INFO  (searcherExecutor-2015-thread-1-processing-n:127.0.0.1:44760_solr x:aboveRate_collection_shard1_replica_n1 c:aboveRate_collection s:shard1 r:core_node3) [n:127.0.0.1:44760_solr c:aboveRate_collection s:shard1 r:core_node3 x:aboveRate_collection_shard1_replica_n1] o.a.s.c.SolrCore [aboveRate_collection_shard1_replica_n1] Registered new searcher Searcher@1accee16[aboveRate_collection_shard1_replica_n1] main{ExitableDirectoryReader(UninvertingDirectoryReader())}
   [junit4]   2> 1014116 INFO  (qtp1517132326-5589) [n:127.0.0.1:36176_solr c:aboveRate_collection s:shard1 r:core_node4 x:aboveRate_collection_shard1_replica_n2] o.a.s.h.ReplicationHandler Commits will be reserved for 10000ms.
   [junit4]   2> 1014117 INFO  (searcherExecutor-2014-thread-1-processing-n:127.0.0.1:36176_solr x:aboveRate_collection_shard1_replica_n2 c:aboveRate_collection s:shard1 r:core_node4) [n:127.0.0.1:36176_solr c:aboveRate_collection s:shard1 r:core_node4 x:aboveRate_collection_shard1_replica_n2] o.a.s.c.SolrCore [aboveRate_collection_shard1_replica_n2] Registered new searcher Searcher@1f32984b[aboveRate_collection_shard1_replica_n2] main{ExitableDirectoryReader(UninvertingDirectoryReader())}
   [junit4]   2> 1014117 INFO  (qtp1517132326-5589) [n:127.0.0.1:36176_solr c:aboveRate_collection s:shard1 r:core_node4 x:aboveRate_collection_shard1_replica_n2] o.a.s.u.UpdateLog Could not find max version in index or recent updates, using new clock 1610621714546294784
   [junit4]   2> 1014118 INFO  (qtp724442609-5583) [n:127.0.0.1:44760_solr c:aboveRate_collection s:shard1 r:core_node3 x:aboveRate_collection_shard1_replica_n1] o.a.s.c.ZkShardTerms Successful update of terms at /collections/aboveRate_collection/terms/shard1 to Terms{values={core_node3=0}, version=0}
   [junit4]   2> 1014130 INFO  (qtp724442609-5583) [n:127.0.0.1:44760_solr c:aboveRate_collection s:shard1 r:core_node3 x:aboveRate_collection_shard1_replica_n1] o.a.s.c.ShardLeaderElectionContext Waiting until we see more replicas up for shard shard1: total=2 found=1 timeoutin=9999ms
   [junit4]   2> 1014153 INFO  (qtp1517132326-5589) [n:127.0.0.1:36176_solr c:aboveRate_collection s:shard1 r:core_node4 x:aboveRate_collection_shard1_replica_n2] o.a.s.c.ZkShardTerms Successful update of terms at /collections/aboveRate_collection/terms/shard1 to Terms{values={core_node3=0, core_node4=0}, version=1}
   [junit4]   2> 1014631 INFO  (qtp724442609-5583) [n:127.0.0.1:44760_solr c:aboveRate_collection s:shard1 r:core_node3 x:aboveRate_collection_shard1_replica_n1] o.a.s.c.ShardLeaderElectionContext Enough replicas found to continue.
   [junit4]   2> 1014631 INFO  (qtp724442609-5583) [n:127.0.0.1:44760_solr c:aboveRate_collection s:shard1 r:core_node3 x:aboveRate_collection_shard1_replica_n1] o.a.s.c.ShardLeaderElectionContext I may be the new leader - try and sync
   [junit4]   2> 1014631 INFO  (qtp724442609-5583) [n:127.0.0.1:44760_solr c:aboveRate_collection s:shard1 r:core_node3 x:aboveRate_collection_shard1_replica_n1] o.a.s.c.SyncStrategy Sync replicas to https://127.0.0.1:44760/solr/aboveRate_collection_shard1_replica_n1/
   [junit4]   2> 1014632 INFO  (qtp724442609-5583) [n:127.0.0.1:44760_solr c:aboveRate_collection s:shard1 r:core_node3 x:aboveRate_collection_shard1_replica_n1] o.a.s.u.PeerSync PeerSync: core=aboveRate_collection_shard1_replica_n1 url=https://127.0.0.1:44760/solr START replicas=[https://127.0.0.1:36176/solr/aboveRate_collection_shard1_replica_n2/] nUpdates=100
   [junit4]   2> 1014632 INFO  (qtp724442609-5583) [n:127.0.0.1:44760_solr c:aboveRate_collection s:shard1 r:core_node3 x:aboveRate_collection_shard1_replica_n1] o.a.s.u.PeerSync PeerSync: core=aboveRate_collection_shard1_replica_n1 url=https://127.0.0.1:44760/solr DONE.  We have no versions.  sync failed.
   [junit4]   2> 1014672 INFO  (qtp1517132326-5590) [n:127.0.0.1:36176_solr c:aboveRate_collection s:shard1 r:core_node4 x:aboveRate_collection_shard1_replica_n2] o.a.s.c.S.Request [aboveRate_collection_shard1_replica_n2]  webapp=/solr path=/get params={distrib=false&qt=/get&fingerprint=false&getVersions=100&wt=javabin&version=2} status=0 QTime=33
   [junit4]   2> 1014672 INFO  (qtp724442609-5583) [n:127.0.0.1:44760_solr c:aboveRate_collection s:shard1 r:core_node3 x:aboveRate_collection_shard1_replica_n1] o.a.s.c.SyncStrategy Leader's attempt to sync with shard failed, moving to the next candidate
   [junit4]   2> 1014672 INFO  (qtp724442609-5583) [n:127.0.0.1:44760_solr c:aboveRate_collection s:shard1 r:core_node3 x:aboveRate_collection_shard1_replica_n1] o.a.s.c.ShardLeaderElectionContext We failed sync, but we have no versions - we can't sync in that case - we were active before, so become leader anyway
   [junit4]   2> 1014672 INFO  (qtp724442609-5583) [n:127.0.0.1:44760_solr c:aboveRate_collection s:shard1 r:core_node3 x:aboveRate_collection_shard1_replica_n1] o.a.s.c.ShardLeaderElectionContext Found all replicas participating in election, clear LIR
   [junit4]   2> 1014676 INFO  (qtp724442609-5583) [n:127.0.0.1:44760_solr c:aboveRate_collection s:shard1 r:core_node3 x:aboveRate_collection_shard1_replica_n1] o.a.s.c.ShardLeaderElectionContext I am the new leader: https://127.0.0.1:44760/solr/aboveRate_collection_shard1_replica_n1/ shard1
   [junit4]   2> 1014787 INFO  (qtp724442609-5583) [n:127.0.0.1:44760_solr c:aboveRate_collection s:shard1 r:core_node3 x:aboveRate_collection_shard1_replica_n1] o.a.s.c.ZkController I am the leader, no recovery necessary
   [junit4]   2> 1014790 INFO  (qtp724442609-5583) [n:127.0.0.1:44760_solr c:aboveRate_collection s:shard1 r:core_node3 x:aboveRate_collection_shard1_replica_n1] o.a.s.s.HttpSolrCall [admin] webapp=null path=/admin/cores params={qt=/admin/cores&coreNodeName=core_node3&collection.configName=conf&newCollection=true&name=aboveRate_collection_shard1_replica_n1&action=CREATE&numShards=1&collection=aboveRate_collection&shard=shard1&wt=javabin&version=2&replicaType=NRT} status=0 QTime=2121
   [junit4]   2> 1014948 INFO  (zkCallback-1628-thread-1) [    ] o.a.s.c.c.ZkStateReader A cluster state change: [WatchedEvent state:SyncConnected type:NodeDataChanged path:/collections/aboveRate_collection/state.json] for collection [aboveRate_collection] has occurred - updating... (live nodes size: [5])
   [junit4]   2> 1015326 INFO  (qtp1517132326-5589) [n:127.0.0.1:36176_solr c:aboveRate_collection s:shard1 r:core_node4 x:aboveRate_collection_shard1_replica_n2] o.a.s.s.HttpSolrCall [admin] webapp=null path=/admin/cores params={qt=/admin/cores&coreNodeName=core_node4&collection.configName=conf&newCollection=true&name=aboveRate_collection_shard1_replica_n2&action=CREATE&numShards=1&collection=aboveRate_collection&shard=shard1&wt=javabin&version=2&replicaType=NRT} status=0 QTime=2727
   [junit4]   2> 1015372 INFO  (qtp1035068211-5553) [n:127.0.0.1:35635_solr    ] o.a.s.h.a.CollectionsHandler Wait for new collection to be active for at most 30 seconds. Check all shard replicas
   [junit4]   2> 1015509 INFO  (zkCallback-1628-thread-1) [    ] o.a.s.c.c.ZkStateReader A cluster state change: [WatchedEvent state:SyncConnected type:NodeDataChanged path:/collections/aboveRate_collection/state.json] for collection [aboveRate_collection] has occurred - updating... (live nodes size: [5])
   [junit4]   2> 1015525 INFO  (zkCallback-1618-thread-2) [    ] o.a.s.c.c.ZkStateReader A cluster state change: [WatchedEvent state:SyncConnected type:NodeDataChanged path:/collections/aboveRate_collection/state.json] for collection [aboveRate_collection] has occurred - updating... (live nodes size: [5])
   [junit4]   2> 1016213 INFO  (OverseerCollectionConfigSetProcessor-73259914161815565-127.0.0.1:36176_solr-n_0000000000) [n:127.0.0.1:36176_solr    ] o.a.s.c.OverseerTaskQueue Response ZK path: /overseer/collection-queue-work/qnr-0000000000 doesn't exist.  Requestor may have disconnected from ZooKeeper
   [junit4]   2> 1016373 INFO  (qtp1035068211-5553) [n:127.0.0.1:35635_solr    ] o.a.s.s.HttpSolrCall [admin] webapp=null path=/admin/collections params={collection.configName=conf&name=aboveRate_collection&nrtReplicas=2&action=CREATE&numShards=1&wt=javabin&version=2} status=0 QTime=4194
   [junit4]   2> 1016591 INFO  (qtp1035068211-5552) [n:127.0.0.1:35635_solr    ] o.a.s.s.HttpSolrCall [admin] webapp=null path=/admin/metrics params={prefix=CONTAINER.fs.usableSpace,CONTAINER.fs.totalSpace,CORE.coreName&wt=javabin&version=2&group=solr.node,solr.core} status=0 QTime=0
   [junit4]   2> 1016594 INFO  (qtp1059503402-5564) [n:127.0.0.1:45303_solr    ] o.a.s.s.HttpSolrCall [admin] webapp=null path=/admin/metrics params={prefix=CONTAINER.fs.usableSpace,CONTAINER.fs.totalSpace,CORE.coreName&wt=javabin&version=2&group=solr.node,solr.core} status=0 QTime=0
   [junit4]   2> 1016598 INFO  (qtp1517132326-5591) [n:127.0.0.1:36176_solr    ] o.a.s.s.HttpSolrCall [admin] webapp=null path=/admin/metrics params={wt=javabin&version=2&key=solr.core.aboveRate_collection.shard1.replica_n2:INDEX.sizeInBytes} status=0 QTime=0
   [junit4]   2> 1016614 INFO  (qtp1517132326-5589) [n:127.0.0.1:36176_solr    ] o.a.s.s.HttpSolrCall [admin] webapp=null path=/admin/metrics params={prefix=CONTAINER.fs.usableSpace,CONTAINER.fs.totalSpace,CORE.coreName&wt=javabin&version=2&group=solr.node,solr.core} status=0 QTime=0
   [junit4]   2> 1016661 INFO  (qtp724442609-5580) [n:127.0.0.1:44760_solr    ] o.a.s.s.HttpSolrCall [admin] webapp=null path=/admin/metrics params={wt=javabin&version=2&key=solr.core.aboveRate_collection.shard1.replica_n1:INDEX.sizeInBytes} status=0 QTime=0
   [junit4]   2> 1016662 INFO  (qtp724442609-5583) [n:127.0.0.1:44760_solr    ] o.a.s.s.HttpSolrCall [admin] webapp=null path=/admin/metrics params={prefix=CONTAINER.fs.usableSpace,CONTAINER.fs.totalSpace,CORE.coreName&wt=javabin&version=2&group=solr.node,solr.core} status=0 QTime=0
   [junit4]   2> 1016674 INFO  (qtp1211727408-5573) [n:127.0.0.1:32934_solr    ] o.a.s.s.HttpSolrCall [admin] webapp=null path=/admin/metrics params={prefix=CONTAINER.fs.usableSpace,CONTAINER.fs.totalSpace,CORE.coreName&wt=javabin&version=2&group=solr.node,solr.core} status=0 QTime=0
   [junit4]   2> 1016675 DEBUG (qtp1035068211-5555) [n:127.0.0.1:35635_solr    ] o.a.s.c.a.AutoScalingHandler Verified autoscaling configuration
   [junit4]   2> 1016676 DEBUG (zkCallback-1635-thread-1) [    ] o.a.s.c.a.OverseerTriggerThread Refreshing /autoscaling.json with znode version 4
   [junit4]   2> 1016676 DEBUG (OverseerAutoScalingTriggerThread-73259914161815565-127.0.0.1:36176_solr-n_0000000000) [    ] o.a.s.c.a.OverseerTriggerThread Processed trigger updates upto znodeVersion 4
   [junit4]   2> 1016676 DEBUG (OverseerAutoScalingTriggerThread-73259914161815565-127.0.0.1:36176_solr-n_0000000000) [    ] o.a.s.c.a.OverseerTriggerThread -- clean old nodeLost markers
   [junit4]   2> 1016677 DEBUG (OverseerAutoScalingTriggerThread-73259914161815565-127.0.0.1:36176_solr-n_0000000000) [    ] o.a.s.c.a.OverseerTriggerThread -- clean old nodeAdded markers
   [junit4]   2> 1016677 DEBUG (OverseerAutoScalingTriggerThread-73259914161815565-127.0.0.1:36176_solr-n_0000000000) [    ] o.a.s.c.a.OverseerTriggerThread Current znodeVersion 4, lastZnodeVersion 4
   [junit4]   2> 1016688 INFO  (qtp1035068211-5555) [n:127.0.0.1:35635_solr    ] o.a.s.s.HttpSolrCall [admin] webapp=null path=/cluster/autoscaling params={wt=javabin&version=2} status=0 QTime=194
   [junit4]   2> 1016812 INFO  (qtp1035068211-5555) [n:127.0.0.1:35635_solr    ] o.a.s.s.HttpSolrCall [admin] webapp=null path=/admin/metrics params={prefix=CONTAINER.fs.usableSpace,CONTAINER.fs.totalSpace,CORE.coreName&wt=javabin&version=2&group=solr.node,solr.core} status=0 QTime=0
   [junit4]   2> 1016859 INFO  (qtp1059503402-5564) [n:127.0.0.1:45303_solr    ] o.a.s.s.HttpSolrCall [admin] webapp=null path=/admin/metrics params={prefix=CONTAINER.fs.usableSpace,CONTAINER.fs.totalSpace,CORE.coreName&wt=javabin&version=2&group=solr.node,solr.core} status=0 QTime=0
   [junit4]   2> 1020604 INFO  (qtp1517132326-5591) [n:127.0.0.1:36176_solr    ] o.a.s.s.HttpSolrCall [admin] webapp=null path=/admin/metrics params={wt=javabin&version=2&key=solr.core.aboveRate_collection.shard1.replica_n2:INDEX.sizeInBytes} status=0 QTime=14
   [junit4]   2> 1020606 INFO  (qtp1517132326-5592) [n:127.0.0.1:36176_solr    ] o.a.s.s.HttpSolrCall [admin] webapp=null path=/admin/metrics params={prefix=CONTAINER.fs.usableSpace,CONTAINER.fs.totalSpace,CORE.coreName&wt=javabin&version=2&group=solr.node,solr.core} status=0 QTime=0
   [junit4]   2> 1020702 INFO  (qtp724442609-5581) [n:127.0.0.1:44760_solr    ] o.a.s.s.HttpSolrCall [admin] webapp=null path=/admin/metrics params={wt=javabin&version=2&key=solr.core.aboveRate_collection.shard1.replica_n1:INDEX.sizeInBytes} status=0 QTime=3
   [junit4]   2> 1020704 INFO  (qtp724442609-5582) [n:127.0.0.1:44760_solr    ] o.a.s.s.HttpSolrCall [admin] webapp=null path=/admin/metrics params={prefix=CONTAINER.fs.usableSpace,CONTAINER.fs.totalSpace,CORE.coreName&wt=javabin&version=2&group=solr.node,solr.core} status=0 QTime=0
   [junit4]   2> 1020763 INFO  (qtp1211727408-5573) [n:127.0.0.1:32934_solr    ] o.a.s.s.HttpSolrCall [admin] webapp=null path=/admin/metrics params={prefix=CONTAINER.fs.usableSpace,CONTAINER.fs.totalSpace,CORE.coreName&wt=javabin&version=2&group=solr.node,solr.core} status=0 QTime=0
   [junit4]   2> 1020764 DEBUG (qtp724442609-5583) [n:127.0.0.1:44760_solr    ] o.a.s.c.a.AutoScalingHandler Verified autoscaling configuration
   [junit4]   2> 1020770 INFO  (qtp724442609-5583) [n:127.0.0.1:44760_solr    ] o.a.s.s.HttpSolrCall [admin] webapp=null path=/cluster/autoscaling params={wt=javabin&version=2} status=0 QTime=4013
   [junit4]   2> 1020876 DEBUG (zkCallback-1635-thread-1) [    ] o.a.s.c.a.OverseerTriggerThread Refreshing /autoscaling.json with znode version 5
   [junit4]   2> 1020880 DEBUG (OverseerAutoScalingTriggerThread-73259914161815565-127.0.0.1:36176_solr-n_0000000000) [    ] o.a.s.c.a.OverseerTriggerThread Processed trigger updates upto znodeVersion 5
   [junit4]   2> 1020880 DEBUG (OverseerAutoScalingTriggerThread-73259914161815565-127.0.0.1:36176_solr-n_0000000000) [    ] o.a.s.c.a.OverseerTriggerThread -- clean old nodeLost markers
   [junit4]   2> 1020880 DEBUG (OverseerAutoScalingTriggerThread-73259914161815565-127.0.0.1:36176_solr-n_0000000000) [    ] o.a.s.c.a.OverseerTriggerThread -- clean old nodeAdded markers
   [junit4]   2> 1020880 DEBUG (OverseerAutoScalingTriggerThread-73259914161815565-127.0.0.1:36176_solr-n_0000000000) [    ] o.a.s.c.a.OverseerTriggerThread Current znodeVersion 5, lastZnodeVersion 5
   [junit4]   2> 1021019 INFO  (qtp1035068211-5555) [n:127.0.0.1:35635_solr    ] o.a.s.s.HttpSolrCall [admin] webapp=null path=/admin/metrics params={prefix=CONTAINER.fs.usableSpace,CONTAINER.fs.totalSpace,CORE.coreName&wt=javabin&version=2&group=solr.node,solr.core} status=0 QTime=0
   [junit4]   2> 1021222 INFO  (qtp1059503402-5564) [n:127.0.0.1:45303_solr    ] o.a.s.s.HttpSolrCall [admin] webapp=null path=/admin/metrics params={prefix=CONTAINER.fs.usableSpace,CONTAINER.fs.totalSpace,CORE.coreName&wt=javabin&version=2&group=solr.node,solr.core} status=0 QTime=0
   [junit4]   2> 1021417 INFO  (qtp1517132326-5590) [n:127.0.0.1:36176_solr    ] o.a.s.s.HttpSolrCall [admin] webapp=null path=/admin/metrics params={wt=javabin&version=2&key=solr.core.aboveRate_collection.shard1.replica_n2:INDEX.sizeInBytes} status=0 QTime=0
   [junit4]   2> 1021419 INFO  (qtp1517132326-5592) [n:127.0.0.1:36176_solr    ] o.a.s.s.HttpSolrCall [admin] webapp=null path=/admin/metrics params={prefix=CONTAINER.fs.usableSpace,CONTAINER.fs.totalSpace,CORE.coreName&wt=javabin&version=2&group=solr.node,solr.core} status=0 QTime=0
   [junit4]   2> 1021669 INFO  (qtp724442609-5583) [n:127.0.0.1:44760_solr    ] o.a.s.s.HttpSolrCall [admin] webapp=null path=/admin/metrics params={wt=javabin&version=2&key=solr.core.aboveRate_collection.shard1.replica_n1:INDEX.sizeInBytes} status=0 QTime=0
   [junit4]   2> 1021706 INFO  (qtp724442609-5580) [n:127.0.0.1:44760_solr    ] o.a.s.s.HttpSolrCall [admin] webapp=null path=/admin/metrics params={prefix=CONTAINER.fs.usableSpace,CONTAINER.fs.totalSpace,CORE.coreName&wt=javabin&version=2&group=solr.node,solr.core} status=0 QTime=0
   [junit4]   2> 1022011 INFO  (qtp1211727408-5573) [n:127.0.0.1:32934_solr    ] o.a.s.s.HttpSolrCall [admin] webapp=null path=/admin/metrics params={prefix=CONTAINER.fs.usableSpace,CONTAINER.fs.totalSpace,CORE.coreName&wt=javabin&version=2&group=solr.node,solr.core} status=0 QTime=0
   [junit4]   2> 1022011 DEBUG (qtp1517132326-5591) [n:127.0.0.1:36176_solr    ] o.a.s.c.a.AutoScalingHandler Verified autoscaling configuration
   [junit4]   2> 1022039 INFO  (qtp1517132326-5591) [n:127.0.0.1:36176_solr    ] o.a.s.s.HttpSolrCall [admin] webapp=null path=/cluster/autoscaling params={wt=javabin&version=2} status=0 QTime=1136
   [junit4]   2> 1022040 DEBUG (zkCallback-1635-thread-1) [    ] o.a.s.c.a.OverseerTriggerThread Refreshing /autoscaling.json with znode version 6
   [junit4]   2> 1022040 DEBUG (OverseerAutoScalingTriggerThread-73259914161815565-127.0.0.1:36176_solr-n_0000000000) [    ] o.a.s.c.a.OverseerTriggerThread Processed trigger updates upto znodeVersion 6
   [junit4]   2> 1022041 DEBUG (OverseerAutoScalingTriggerThread-73259914161815565-127.0.0.1:36176_solr-n_0000000000) [    ] o.a.s.c.a.OverseerTriggerThread -- clean old nodeLost markers
   [junit4]   2> 1022041 DEBUG (OverseerAutoScalingTriggerThread-73259914161815565-127.0.0.1:36176_solr-n_0000000000) [    ] o.a.s.c.a.OverseerTriggerThread -- clean old nodeAdded markers
   [junit4]   2> 1022041 DEBUG (OverseerAutoScalingTriggerThread-73259914161815565-127.0.0.1:36176_solr-n_0000000000) [    ] o.a.s.c.a.OverseerTriggerThread Current znodeVersion 6, lastZnodeVersion 6
   [junit4]   2> 1022073 INFO  (qtp1035068211-5554) [n:127.0.0.1:35635_solr    ] o.a.s.s.HttpSolrCall [admin] webapp=null path=/admin/metrics params={prefix=CONTAINER.fs.usableSpace,CONTAINER.fs.totalSpace,CORE.coreName&wt=javabin&version=2&group=solr.node,solr.core} status=0 QTime=0
   [junit4]   2> 1022140 INFO  (qtp1059503402-5562) [n:127.0.0.1:45303_solr    ] o.a.s.s.HttpSolrCall [admin] webapp=null path=/admin/metrics params={prefix=CONTAINER.fs.usableSpace,CONTAINER.fs.totalSpace,CORE.coreName&wt=javabin&version=2&group=solr.node,solr.core} status=0 QTime=48
   [junit4]   2> 1022142 INFO  (qtp1517132326-5589) [n:127.0.0.1:36176_solr    ] o.a.s.s.HttpSolrCall [admin] webapp=null path=/admin/metrics params={wt=javabin&version=2&key=solr.core.aboveRate_collection.shard1.replica_n2:INDEX.sizeInBytes} status=0 QTime=0
   [junit4]   2> 1022144 INFO  (qtp1517132326-5591) [n:127.0.0.1:36176_solr    ] o.a.s.s.HttpSolrCall [admin] webapp=null path=/admin/metrics params={prefix=CONTAINER.fs.usableSpace,CONTAINER.fs.totalSpace,CORE.coreName&wt=javabin&version=2&group=solr.node,solr.core} status=0 QTime=0
   [junit4]   2> 1022146 INFO  (qtp724442609-5583) [n:127.0.0.1:44760_solr    ] o.a.s.s.HttpSolrCall [admin] webapp=null path=/admin/metrics params={wt=javabin&version=2&key=solr.core.aboveRate_collection.shard1.replica_n1:INDEX.sizeInBytes} status=0 QTime=0
   [junit4]   2> 1022160 INFO  (qtp724442609-5580) [n:127.0.0.1:44760_solr    ] o.a.s.s.HttpSolrCall [admin] webapp=null path=/admin/metrics params={prefix=CONTAINER.fs.usableSpace,CONTAINER.fs.totalSpace,CORE.coreName&wt=javabin&version=2&group=solr.node,solr.core} status=0 QTime=13
   [junit4]   2> 1022162 INFO  (qtp1211727408-5571) [n:127.0.0.1:32934_solr    ] o.a.s.s.HttpSolrCall [admin] webapp=null path=/admin/metrics params={prefix=CONTAINER.fs.usableSpace,CONTAINER.fs.totalSpace,CORE.coreName&wt=javabin&version=2&group=solr.node,solr.core} status=0 QTime=0
   [junit4]   2> 1022162 DEBUG (qtp1035068211-5553) [n:127.0.0.1:35635_solr    ] o.a.s.c.a.AutoScalingHandler Verified autoscaling configuration
   [junit4]   2> 1022201 DEBUG (zkCallback-1635-thread-1) [    ] o.a.s.c.a.OverseerTriggerThread Refreshing /autoscaling.json with znode version 7
   [junit4]   2> 1022201 DEBUG (OverseerAutoScalingTriggerThread-73259914161815565-127.0.0.1:36176_solr-n_0000000000) [    ] o.a.s.c.a.OverseerTriggerThread Processed trigger updates upto znodeVersion 7
   [junit4]   2> 1022201 DEBUG (OverseerAutoScalingTriggerThread-73259914161815565-127.0.0.1:36176_solr-n_0000000000) [    ] o.a.s.c.a.OverseerTriggerThread -- clean old nodeLost markers
   [junit4]   2> 1022201 INFO  (qtp1035068211-5553) [n:127.0.0.1:35635_solr    ] o.a.s.s.HttpSolrCall [admin] webapp=null path=/admin/autoscaling params={wt=javabin&version=2} status=0 QTime=159
   [junit4]   2> 1022203 INFO  (qtp1517132326-5591) [n:127.0.0.1:36176_solr c:aboveRate_collection s:shard1 r:core_node4 x:aboveRate_collection_shard1_replica_n2] o.a.s.c.S.Request [aboveRate_collection_shard1_replica_n2]  webapp=/solr path=/select params={q=*:*&_stateVer_=aboveRate_collection:6&wt=javabin&version=2} hits=0 status=0 QTime=0
   [junit4]   2> 1022204 DEBUG (OverseerAutoScalingTriggerThread-73259914161815565-127.0.0.1:36176_solr-n_0000000000) [    ] o.a.s.c.a.OverseerTriggerThread -- clean old nodeAdded markers
   [junit4]   2> 1022204 DEBUG (OverseerAutoScalingTriggerThread-73259914161815565-127.0.0.1:36176_solr-n_0000000000) [    ] o.a.s.c.a.OverseerTriggerThread Current znodeVersion 7, lastZnodeVersion 7
   [junit4]   2> 1022254 INFO  (qtp1517132326-5591) [n:127.0.0.1:36176_solr c:aboveRate_collection s:shard1 r:core_node4 x:aboveRate_collection_shard1_replica_n2] o.a.s.c.S.Request [aboveRate_collection_shard1_replica_n2]  webapp=/solr path=/select params={q=*:*&_stateVer_=aboveRate_collection:6&wt=javabin&version=2} hits=0 status=0 QTime=0
   [junit4]   2> 1022255 INFO  (qtp1517132326-5591) [n:127.0.0.1:36176_solr c:aboveRate_collection s:shard1 r:core_node4 x:aboveRate_collection_shard1_replica_n2] o.a.s.c.S.Request [aboveRate_collection_shard1_replica_n2]  webapp=/solr path=/select params={q=*:*&_stateVer_=aboveRate_collection:6&wt=javabin&version=2} hits=0 status=0 QTime=0
   [junit4]   2> 1022270 INFO  (qtp724442609-5583) [n:127.0.0.1:44760_solr c:aboveRate_collection s:shard1 r:core_node3 x:aboveRate_collection_shard1_replica_n1] o.a.s.c.S.Request [aboveRate_collection_shard1_replica_n1]  webapp=/solr path=/select params={q=*:*&_stateVer_=aboveRate_collection:6&wt=javabin&version=2} hits=0 status=0 QTime=0
   [junit4]   2> 1022270 INFO  (qtp724442609-5583) [n:127.0.0.1:44760_solr c:aboveRate_collection s:shard1 r:core_node3 x:aboveRate_collection_shard1_replica_n1] o.a.s.c.S.Request [aboveRate_collection_shard1_replica_n1]  webapp=/solr path=/select params={q=*:*&_stateVer_=aboveRate_collection:6&wt=javabin&version=2} hits=0 status=0 QTime=0
   [junit4]   2> 1022271 INFO  (qtp724442609-5583) [n:127.0.0.1:44760_solr c:aboveRate_collection s:shard1 r:core_node3 x:aboveRate_collection_shard1_replica_n1] o.a.s.c.S.Request [aboveRate_collection_shard1_replica_n1]  webapp=/solr path=/select params={q=*:*&_stateVer_=aboveRate_collection:6&wt=javabin&version=2} hits=0 status=0 QTime=0
   [junit4]   2> 1022272 INFO  (qtp1517132326-5591) [n:127.0.0.1:36176_solr c:aboveRate_collection s:shard1 r:core_node4 x:aboveRate_collection_shard1_replica_n2] o.a.s.c.S.Request [aboveRate_collection_shard1_replica_n2]  webapp=/solr path=/select params={q=*:*&_stateVer_=aboveRate_collection:6&wt=javabin&version=2} hits=0 status=0 QTime=0
   [junit4]   2> 1022273 INFO  (qtp1517132326-5591) [n:127.0.0.1:36176_solr c:aboveRate_collection s:shard1 r:core_node4 x:aboveRate_collection_shard1_replica_n2] o.a.s.c.S.Request [aboveRate_collection_shard1_replica_n2]  webapp=/solr path=/select params={q=*:*&_stateVer_=aboveRate_collection:6&wt=javabin&version=2} hits=0 status=0 QTime=0
   [junit4]   2> 1022290 INFO  (qtp1517132326-5589) [n:127.0.0.1:36176_solr c:aboveRate_collection s:shard1 r:core_node4 x:aboveRate_collection_shard1_replica_n2] o.a.s.c.S.Request [aboveRate_collection_shard1_replica_n2]  webapp=/solr path=/select params={q=*:*&_stateVer_=aboveRate_collection:6&wt=javabin&version=2} hits=0 status=0 QTime=0
   [junit4]   2> 1022291 INFO  (qtp724442609-5583) [n:127.0.0.1:44760_solr c:aboveRate_collection s:shard1 r:core_node3 x:aboveRate_collection_shard1_replica_n1] o.a.s.c.S.Request [aboveRate_collection_shard1_replica_n1]  webapp=/solr path=/select params={q=*:*&_stateVer_=aboveRate_collection:6&wt=javabin&version=2} hits=0 status=0 QTime=0
   [junit4]   2> 1022292 INFO  (qtp724442609-5583) [n:127.0.0.1:44760_solr c:aboveRate_collection s:shard1 r:core_node3 x:aboveRate_collection_shard1_replica_n1] o.a.s.c.S.Request [aboveRate_collection_shard1_replica_n1]  webapp=/solr path=/select params={q=*:*&_stateVer_=aboveRate_collection:6&wt=javabin&version=2} hits=0 status=0 QTime=0
   [junit4]   2> 1022293 INFO  (qtp724442609-5583) [n:127.0.0.1:44760_solr c:aboveRate_collection s:shard1 r:core_node3 x:aboveRate_collection_shard1_replica_n1] o.a.s.c.S.Request [aboveRate_collection_shard1_replica_n1]  webapp=/solr path=/select params={q=*:*&_stateVer_=aboveRate_collection:6&wt=javabin&version=2} hits=0 status=0 QTime=0
   [junit4]   2> 1022306 INFO  (qtp1517132326-5589) [n:127.0.0.1:36176_solr c:aboveRate_collection s:shard1 r:core_node4 x:aboveRate_collection_shard1_replica_n2] o.a.s.c.S.Request [aboveRate_collection_shard1_replica_n2]  webapp=/solr path=/select params={q=*:*&_stateVer_=aboveRate_collection:6&wt=javabin&version=2} hits=0 status=0 QTime=12
   [junit4]   2> 1022306 INFO  (qtp1517132326-5589) [n:127.0.0.1:36176_solr c:aboveRate_collection s:shard1 r:core_node4 x:aboveRate_collection_shard1_replica_n2] o.a.s.c.S.Request [aboveRate_collection_shard1_replica_n2]  webapp=/solr path=/select params={q=*:*&_stateVer_=aboveRate_collection:6&wt=javabin&version=2} hits=0 status=0 QTime=0
   [junit4]   2> 1022307 INFO  (qtp724442609-5583) [n:127.0.0.1:44760_solr c:aboveRate_collection s:shard1 r:core_node3 x:aboveRate_collection_shard1_replica_n1] o.a.s.c.S.Request [aboveRate_collection_shard1_replica_n1]  webapp=/solr path=/select params={q=*:*&_stateVer_=aboveRate_collection:6&wt=javabin&version=2} hits=0 status=0 QTime=0
   [junit4]   2> 1022308 INFO  (qtp1517132326-5589) [n:127.0.0.1:36176_solr c:aboveRate_collection s:shard1 r:core_node4 x:aboveRate_collection_shard1_replica_n2] o.a.s.c.S.Request [aboveRate_collection_shard1_replica_n2]  webapp=/solr path=/select params={q=*:*&_stateVer_=aboveRate_collection:6&wt=javabin&version=2} hits=0 status=0 QTime=0
   [junit4]   2> 1022309 INFO  (qtp724442609-5583) [n:127.0.0.1:44760_solr c:aboveRate_collection s:shard1 r:core_node3 x:aboveRate_collection_shard1_replica_n1] o.a.s.c.S.Request [aboveRate_collection_shard1_replica_n1]  webapp=/solr path=/select params={q=*:*&_stateVer_=aboveRate_collection:6&wt=javabin&version=2} hits=0 status=0 QTime=0
   [junit4]   2> 1022309 INFO  (qtp724442609-5583) [n:127.0.0.1:44760_solr c:aboveRate_collection s:shard1 r:core_node3 x:aboveRate_collection_shard1_replica_n1] o.a.s.c.S.Request [aboveRate_collection_shard1_replica_n1]  webapp=/solr path=/select params={q=*:*&_stateVer_=aboveRate_collection:6&wt=javabin&version=2} hits=0 status=0 QTime=0
   [junit4]   2> 1022328 INFO  (qtp724442609-5583) [n:127.0.0.1:44760_solr c:aboveRate_collection s:shard1 r:core_node3 x:aboveRate_collection_shard1_replica_n1] o.a.s.c.S.Request [aboveRate_collection_shard1_replica_n1]  webapp=/solr path=/select params={q=*:*&_stateVer_=aboveRate_collection:6&wt=javabin&version=2} hits=0 status=0 QTime=0
   [junit4]   2> 1022329 INFO  (qtp1517132326-5591) [n:127.0.0.1:36176_solr c:aboveRate_collection s:shard1 r:core_node4 x:aboveRate_collection_shard1_replica_n2] o.a.s.c.S.Request [aboveRate_collection_shard1_replica_n2]  webapp=/solr path=/select params={q=*:*&_stateVer_=aboveRate_collection:6&wt=javabin&version=2} hits=0 status=0 QTime=0
   [junit4]   2> 1022334 INFO  (qtp724442609-5583) [n:127.0.0.1:44760_solr c:aboveRate_collection s:shard1 r:core_node3 x:aboveRate_collection_shard1_replica_n1] o.a.s.c.S.Request [aboveRate_collection_shard1_replica_n1]  webapp=/solr path=/select params={q=*:*&_stateVer_=aboveRate_collection:6&wt=javabin&version=2} hits=0 status=0 QTime=0
   [junit4]   2> 1022346 INFO  (qtp1517132326-5589) [n:127.0.0.1:36176_solr c:aboveRate_collection s:shard1 r:core_node4 x:aboveRate_collection_shard1_replica_n2] o.a.s.c.S.Request [aboveRate_collection_shard1_replica_n2]  webapp=/solr path=/select params={q=*:*&_stateVer_=aboveRate_collection:6&wt=javabin&version=2} hits=0 status=0 QTime=0
   [junit4]   2> 1022347 INFO  (qtp1517132326-5589) [n:127.0.0.1:36176_solr c:aboveRate_collection s:shard1 r:core_node4 x:aboveRate_collection_shard1_replica_n2] o.a.s.c.S.Request [aboveRate_collection_shard1_replica_n2]  webapp=/solr path=/select params={q=*:*&_stateVer_=aboveRate_collection:6&wt=javabin&version=2} hits=0 status=0 QTime=0
   [junit4]   2> 1022348 INFO  (qtp1517132326-5589) [n:127.0.0.1:36176_solr c:aboveRate_collection s:shard1 r:core_node4 x:aboveRate_collection_shard1_replica_n2] o.a.s.c.S.Request [aboveRate_collection_shard1_replica_n2]  webapp=/solr path=/select params={q=*:*&_stateVer_=aboveRate_collection:6&wt=javabin&version=2} hits=0 status=0 QTime=0
   [junit4]   2> 1022472 INFO  (qtp724442609-5580) [n:127.0.0.1:44760_solr c:aboveRate_collection s:shard1 r:core_node3 x:aboveRate_collection_shard1_replica_n1] o.a.s.c.S.Request [aboveRate_collection_shard1_replica_n1]  webapp=/solr path=/select params={q=*:*&_stateVer_=aboveRate_collection:6&wt=javabin&version=2} hits=0 status=0 QTime=123
   [junit4]   2> 1022473 INFO  (qtp

[...truncated too long message...]


-ivy-fail-disallowed-ivy-version:

ivy-fail:

ivy-fail:

ivy-configure:
[ivy:configure] :: loading settings :: file = /home/jenkins/jenkins-slave/workspace/Lucene-Solr-Tests-master/lucene/top-level-ivy-settings.xml

resolve:

ivy-availability-check:
[loadresource] Do not set property disallowed.ivy.jars.list as its length is 0.

-ivy-fail-disallowed-ivy-version:

ivy-fail:

ivy-configure:
[ivy:configure] :: loading settings :: file = /home/jenkins/jenkins-slave/workspace/Lucene-Solr-Tests-master/lucene/top-level-ivy-settings.xml

resolve:

ivy-availability-check:
[loadresource] Do not set property disallowed.ivy.jars.list as its length is 0.

-ivy-fail-disallowed-ivy-version:

ivy-fail:

ivy-fail:

ivy-configure:
[ivy:configure] :: loading settings :: file = /home/jenkins/jenkins-slave/workspace/Lucene-Solr-Tests-master/lucene/top-level-ivy-settings.xml

resolve:

ivy-availability-check:
[loadresource] Do not set property disallowed.ivy.jars.list as its length is 0.

-ivy-fail-disallowed-ivy-version:

ivy-fail:

ivy-configure:
[ivy:configure] :: loading settings :: file = /home/jenkins/jenkins-slave/workspace/Lucene-Solr-Tests-master/lucene/top-level-ivy-settings.xml

resolve:

ivy-availability-check:
[loadresource] Do not set property disallowed.ivy.jars.list as its length is 0.

-ivy-fail-disallowed-ivy-version:

ivy-fail:

ivy-fail:

ivy-configure:
[ivy:configure] :: loading settings :: file = /home/jenkins/jenkins-slave/workspace/Lucene-Solr-Tests-master/lucene/top-level-ivy-settings.xml

resolve:

ivy-availability-check:
[loadresource] Do not set property disallowed.ivy.jars.list as its length is 0.

-ivy-fail-disallowed-ivy-version:

ivy-fail:

ivy-fail:

ivy-configure:
[ivy:configure] :: loading settings :: file = /home/jenkins/jenkins-slave/workspace/Lucene-Solr-Tests-master/lucene/top-level-ivy-settings.xml

resolve:

ivy-availability-check:
[loadresource] Do not set property disallowed.ivy.jars.list as its length is 0.

-ivy-fail-disallowed-ivy-version:

ivy-fail:

ivy-fail:

ivy-configure:
[ivy:configure] :: loading settings :: file = /home/jenkins/jenkins-slave/workspace/Lucene-Solr-Tests-master/lucene/top-level-ivy-settings.xml

resolve:

ivy-availability-check:
[loadresource] Do not set property disallowed.ivy.jars.list as its length is 0.

-ivy-fail-disallowed-ivy-version:

ivy-fail:

ivy-fail:

ivy-configure:
[ivy:configure] :: loading settings :: file = /home/jenkins/jenkins-slave/workspace/Lucene-Solr-Tests-master/lucene/top-level-ivy-settings.xml

resolve:

ivy-availability-check:
[loadresource] Do not set property disallowed.ivy.jars.list as its length is 0.

-ivy-fail-disallowed-ivy-version:

ivy-fail:

ivy-fail:

ivy-configure:
[ivy:configure] :: loading settings :: file = /home/jenkins/jenkins-slave/workspace/Lucene-Solr-Tests-master/lucene/top-level-ivy-settings.xml

resolve:

ivy-availability-check:
[loadresource] Do not set property disallowed.ivy.jars.list as its length is 0.

-ivy-fail-disallowed-ivy-version:

ivy-fail:

ivy-fail:

ivy-configure:
[ivy:configure] :: loading settings :: file = /home/jenkins/jenkins-slave/workspace/Lucene-Solr-Tests-master/lucene/top-level-ivy-settings.xml

resolve:

ivy-availability-check:
[loadresource] Do not set property disallowed.ivy.jars.list as its length is 0.

-ivy-fail-disallowed-ivy-version:

ivy-fail:

ivy-fail:

ivy-configure:
[ivy:configure] :: loading settings :: file = /home/jenkins/jenkins-slave/workspace/Lucene-Solr-Tests-master/lucene/top-level-ivy-settings.xml

resolve:

ivy-availability-check:
[loadresource] Do not set property disallowed.ivy.jars.list as its length is 0.

-ivy-fail-disallowed-ivy-version:

ivy-fail:

ivy-fail:

ivy-configure:
[ivy:configure] :: loading settings :: file = /home/jenkins/jenkins-slave/workspace/Lucene-Solr-Tests-master/lucene/top-level-ivy-settings.xml

resolve:

ivy-availability-check:
[loadresource] Do not set property disallowed.ivy.jars.list as its length is 0.

-ivy-fail-disallowed-ivy-version:

ivy-fail:

ivy-fail:

ivy-configure:
[ivy:configure] :: loading settings :: file = /home/jenkins/jenkins-slave/workspace/Lucene-Solr-Tests-master/lucene/top-level-ivy-settings.xml

resolve:

ivy-availability-check:
[loadresource] Do not set property disallowed.ivy.jars.list as its length is 0.

-ivy-fail-disallowed-ivy-version:

ivy-fail:

ivy-fail:

ivy-configure:
[ivy:configure] :: loading settings :: file = /home/jenkins/jenkins-slave/workspace/Lucene-Solr-Tests-master/lucene/top-level-ivy-settings.xml

resolve:

jar-checksums:
    [mkdir] Created dir: /home/jenkins/jenkins-slave/workspace/Lucene-Solr-Tests-master/solr/null587639150
     [copy] Copying 238 files to /home/jenkins/jenkins-slave/workspace/Lucene-Solr-Tests-master/solr/null587639150
   [delete] Deleting directory /home/jenkins/jenkins-slave/workspace/Lucene-Solr-Tests-master/solr/null587639150

check-working-copy:
[ivy:cachepath] :: resolving dependencies :: org.eclipse.jgit#org.eclipse.jgit-caller;working
[ivy:cachepath] 	confs: [default]
[ivy:cachepath] 	found org.eclipse.jgit#org.eclipse.jgit;4.6.0.201612231935-r in public
[ivy:cachepath] 	found com.jcraft#jsch;0.1.53 in public
[ivy:cachepath] 	found com.googlecode.javaewah#JavaEWAH;1.1.6 in public
[ivy:cachepath] 	found org.apache.httpcomponents#httpclient;4.3.6 in public
[ivy:cachepath] 	found org.apache.httpcomponents#httpcore;4.3.3 in public
[ivy:cachepath] 	found commons-logging#commons-logging;1.1.3 in public
[ivy:cachepath] 	found commons-codec#commons-codec;1.6 in public
[ivy:cachepath] 	found org.slf4j#slf4j-api;1.7.2 in public
[ivy:cachepath] :: resolution report :: resolve 116ms :: artifacts dl 1ms
	---------------------------------------------------------------------
	|                  |            modules            ||   artifacts   |
	|       conf       | number| search|dwnlded|evicted|| number|dwnlded|
	---------------------------------------------------------------------
	|      default     |   8   |   0   |   0   |   0   ||   8   |   0   |
	---------------------------------------------------------------------
[wc-checker] Initializing working copy...
[wc-checker] SLF4J: Failed to load class "org.slf4j.impl.StaticLoggerBinder".
[wc-checker] SLF4J: Defaulting to no-operation (NOP) logger implementation
[wc-checker] SLF4J: See http://www.slf4j.org/codes.html#StaticLoggerBinder for further details.
[wc-checker] Checking working copy status...

-jenkins-base:

BUILD SUCCESSFUL
Total time: 210 minutes 59 seconds
Archiving artifacts
java.lang.InterruptedException: no matches found within 10000
	at hudson.FilePath$34.hasMatch(FilePath.java:2678)
	at hudson.FilePath$34.invoke(FilePath.java:2557)
	at hudson.FilePath$34.invoke(FilePath.java:2547)
	at hudson.FilePath$FileCallableWrapper.call(FilePath.java:2918)
Also:   hudson.remoting.Channel$CallSiteStackTrace: Remote call to lucene2
		at hudson.remoting.Channel.attachCallSiteStackTrace(Channel.java:1741)
		at hudson.remoting.UserRequest$ExceptionResponse.retrieve(UserRequest.java:357)
		at hudson.remoting.Channel.call(Channel.java:955)
		at hudson.FilePath.act(FilePath.java:1036)
		at hudson.FilePath.act(FilePath.java:1025)
		at hudson.FilePath.validateAntFileMask(FilePath.java:2547)
		at hudson.tasks.ArtifactArchiver.perform(ArtifactArchiver.java:243)
		at hudson.tasks.BuildStepCompatibilityLayer.perform(BuildStepCompatibilityLayer.java:81)
		at hudson.tasks.BuildStepMonitor$1.perform(BuildStepMonitor.java:20)
		at hudson.model.AbstractBuild$AbstractBuildExecution.perform(AbstractBuild.java:744)
		at hudson.model.AbstractBuild$AbstractBuildExecution.performAllBuildSteps(AbstractBuild.java:690)
		at hudson.model.Build$BuildExecution.post2(Build.java:186)
		at hudson.model.AbstractBuild$AbstractBuildExecution.post(AbstractBuild.java:635)
		at hudson.model.Run.execute(Run.java:1819)
		at hudson.model.FreeStyleBuild.run(FreeStyleBuild.java:43)
		at hudson.model.ResourceController.execute(ResourceController.java:97)
		at hudson.model.Executor.run(Executor.java:429)
Caused: hudson.FilePath$TunneledInterruptedException
	at hudson.FilePath$FileCallableWrapper.call(FilePath.java:2920)
	at hudson.remoting.UserRequest.perform(UserRequest.java:212)
	at hudson.remoting.UserRequest.perform(UserRequest.java:54)
	at hudson.remoting.Request$2.run(Request.java:369)
	at hudson.remoting.InterceptingExecutorService$1.call(InterceptingExecutorService.java:72)
	at java.util.concurrent.FutureTask.run(FutureTask.java:266)
	at java.util.concurrent.ThreadPoolExecutor.runWorker(ThreadPoolExecutor.java:1142)
	at java.util.concurrent.ThreadPoolExecutor$Worker.run(ThreadPoolExecutor.java:617)
	at java.lang.Thread.run(Thread.java:748)
Caused: java.lang.InterruptedException: java.lang.InterruptedException: no matches found within 10000
	at hudson.FilePath.act(FilePath.java:1038)
	at hudson.FilePath.act(FilePath.java:1025)
	at hudson.FilePath.validateAntFileMask(FilePath.java:2547)
	at hudson.tasks.ArtifactArchiver.perform(ArtifactArchiver.java:243)
	at hudson.tasks.BuildStepCompatibilityLayer.perform(BuildStepCompatibilityLayer.java:81)
	at hudson.tasks.BuildStepMonitor$1.perform(BuildStepMonitor.java:20)
	at hudson.model.AbstractBuild$AbstractBuildExecution.perform(AbstractBuild.java:744)
	at hudson.model.AbstractBuild$AbstractBuildExecution.performAllBuildSteps(AbstractBuild.java:690)
	at hudson.model.Build$BuildExecution.post2(Build.java:186)
	at hudson.model.AbstractBuild$AbstractBuildExecution.post(AbstractBuild.java:635)
	at hudson.model.Run.execute(Run.java:1819)
	at hudson.model.FreeStyleBuild.run(FreeStyleBuild.java:43)
	at hudson.model.ResourceController.execute(ResourceController.java:97)
	at hudson.model.Executor.run(Executor.java:429)
No artifacts found that match the file pattern "**/*.events,heapdumps/**,**/hs_err_pid*". Configuration error?
Recording test results
Build step 'Publish JUnit test result report' changed build result to UNSTABLE
Email was triggered for: Unstable (Test Failures)
Sending email for trigger: Unstable (Test Failures)

Mime
View raw message