lucene-dev mailing list archives

Site index · List index
Message view « Date » · « Thread »
Top « Date » · « Thread »
From Policeman Jenkins Server <jenk...@thetaphi.de>
Subject [JENKINS] Lucene-Solr-master-MacOSX (64bit/jdk-9) - Build # 4811 - Failure!
Date Mon, 03 Sep 2018 13:17:57 GMT
Build: https://jenkins.thetaphi.de/job/Lucene-Solr-master-MacOSX/4811/
Java: 64bit/jdk-9 -XX:+UseCompressedOops -XX:+UseSerialGC

2 tests failed.
FAILED:  org.apache.solr.handler.RequestLoggingTest.testLogBeforeExecuteWithCoreLogger

Error Message:


Stack Trace:
java.lang.AssertionError
	at __randomizedtesting.SeedInfo.seed([45FBB5EF6BEC0895:897DB56195256303]:0)
	at org.junit.Assert.fail(Assert.java:92)
	at org.junit.Assert.assertTrue(Assert.java:43)
	at org.junit.Assert.assertTrue(Assert.java:54)
	at org.apache.solr.handler.RequestLoggingTest.testLogBeforeExecute(RequestLoggingTest.java:88)
	at org.apache.solr.handler.RequestLoggingTest.testLogBeforeExecuteWithCoreLogger(RequestLoggingTest.java:65)
	at java.base/jdk.internal.reflect.NativeMethodAccessorImpl.invoke0(Native Method)
	at java.base/jdk.internal.reflect.NativeMethodAccessorImpl.invoke(NativeMethodAccessorImpl.java:62)
	at java.base/jdk.internal.reflect.DelegatingMethodAccessorImpl.invoke(DelegatingMethodAccessorImpl.java:43)
	at java.base/java.lang.reflect.Method.invoke(Method.java:564)
	at com.carrotsearch.randomizedtesting.RandomizedRunner.invoke(RandomizedRunner.java:1737)
	at com.carrotsearch.randomizedtesting.RandomizedRunner$8.evaluate(RandomizedRunner.java:934)
	at com.carrotsearch.randomizedtesting.RandomizedRunner$9.evaluate(RandomizedRunner.java:970)
	at com.carrotsearch.randomizedtesting.RandomizedRunner$10.evaluate(RandomizedRunner.java:984)
	at com.carrotsearch.randomizedtesting.rules.SystemPropertiesRestoreRule$1.evaluate(SystemPropertiesRestoreRule.java:57)
	at org.apache.lucene.util.TestRuleSetupTeardownChained$1.evaluate(TestRuleSetupTeardownChained.java:49)
	at org.apache.lucene.util.AbstractBeforeAfterRule$1.evaluate(AbstractBeforeAfterRule.java:45)
	at org.apache.lucene.util.TestRuleThreadAndTestName$1.evaluate(TestRuleThreadAndTestName.java:48)
	at org.apache.lucene.util.TestRuleIgnoreAfterMaxFailures$1.evaluate(TestRuleIgnoreAfterMaxFailures.java:64)
	at org.apache.lucene.util.TestRuleMarkFailure$1.evaluate(TestRuleMarkFailure.java:47)
	at com.carrotsearch.randomizedtesting.rules.StatementAdapter.evaluate(StatementAdapter.java:36)
	at com.carrotsearch.randomizedtesting.ThreadLeakControl$StatementRunner.run(ThreadLeakControl.java:368)
	at com.carrotsearch.randomizedtesting.ThreadLeakControl.forkTimeoutingTask(ThreadLeakControl.java:817)
	at com.carrotsearch.randomizedtesting.ThreadLeakControl$3.evaluate(ThreadLeakControl.java:468)
	at com.carrotsearch.randomizedtesting.RandomizedRunner.runSingleTest(RandomizedRunner.java:943)
	at com.carrotsearch.randomizedtesting.RandomizedRunner$5.evaluate(RandomizedRunner.java:829)
	at com.carrotsearch.randomizedtesting.RandomizedRunner$6.evaluate(RandomizedRunner.java:879)
	at com.carrotsearch.randomizedtesting.RandomizedRunner$7.evaluate(RandomizedRunner.java:890)
	at com.carrotsearch.randomizedtesting.rules.StatementAdapter.evaluate(StatementAdapter.java:36)
	at com.carrotsearch.randomizedtesting.rules.SystemPropertiesRestoreRule$1.evaluate(SystemPropertiesRestoreRule.java:57)
	at org.apache.lucene.util.AbstractBeforeAfterRule$1.evaluate(AbstractBeforeAfterRule.java:45)
	at com.carrotsearch.randomizedtesting.rules.StatementAdapter.evaluate(StatementAdapter.java:36)
	at org.apache.lucene.util.TestRuleStoreClassName$1.evaluate(TestRuleStoreClassName.java:41)
	at com.carrotsearch.randomizedtesting.rules.NoShadowingOrOverridesOnMethodsRule$1.evaluate(NoShadowingOrOverridesOnMethodsRule.java:40)
	at com.carrotsearch.randomizedtesting.rules.NoShadowingOrOverridesOnMethodsRule$1.evaluate(NoShadowingOrOverridesOnMethodsRule.java:40)
	at com.carrotsearch.randomizedtesting.rules.StatementAdapter.evaluate(StatementAdapter.java:36)
	at com.carrotsearch.randomizedtesting.rules.StatementAdapter.evaluate(StatementAdapter.java:36)
	at org.apache.lucene.util.TestRuleAssertionsRequired$1.evaluate(TestRuleAssertionsRequired.java:53)
	at org.apache.lucene.util.TestRuleMarkFailure$1.evaluate(TestRuleMarkFailure.java:47)
	at org.apache.lucene.util.TestRuleIgnoreAfterMaxFailures$1.evaluate(TestRuleIgnoreAfterMaxFailures.java:64)
	at org.apache.lucene.util.TestRuleIgnoreTestSuites$1.evaluate(TestRuleIgnoreTestSuites.java:54)
	at com.carrotsearch.randomizedtesting.rules.StatementAdapter.evaluate(StatementAdapter.java:36)
	at com.carrotsearch.randomizedtesting.ThreadLeakControl$StatementRunner.run(ThreadLeakControl.java:368)
	at java.base/java.lang.Thread.run(Thread.java:844)


FAILED:  org.apache.solr.handler.RequestLoggingTest.testLogBeforeExecuteWithRequestLogger

Error Message:


Stack Trace:
java.lang.AssertionError
	at __randomizedtesting.SeedInfo.seed([45FBB5EF6BEC0895:F49295E0C61AB0DB]:0)
	at org.junit.Assert.fail(Assert.java:92)
	at org.junit.Assert.assertTrue(Assert.java:43)
	at org.junit.Assert.assertTrue(Assert.java:54)
	at org.apache.solr.handler.RequestLoggingTest.testLogBeforeExecute(RequestLoggingTest.java:88)
	at org.apache.solr.handler.RequestLoggingTest.testLogBeforeExecuteWithRequestLogger(RequestLoggingTest.java:71)
	at java.base/jdk.internal.reflect.NativeMethodAccessorImpl.invoke0(Native Method)
	at java.base/jdk.internal.reflect.NativeMethodAccessorImpl.invoke(NativeMethodAccessorImpl.java:62)
	at java.base/jdk.internal.reflect.DelegatingMethodAccessorImpl.invoke(DelegatingMethodAccessorImpl.java:43)
	at java.base/java.lang.reflect.Method.invoke(Method.java:564)
	at com.carrotsearch.randomizedtesting.RandomizedRunner.invoke(RandomizedRunner.java:1737)
	at com.carrotsearch.randomizedtesting.RandomizedRunner$8.evaluate(RandomizedRunner.java:934)
	at com.carrotsearch.randomizedtesting.RandomizedRunner$9.evaluate(RandomizedRunner.java:970)
	at com.carrotsearch.randomizedtesting.RandomizedRunner$10.evaluate(RandomizedRunner.java:984)
	at com.carrotsearch.randomizedtesting.rules.SystemPropertiesRestoreRule$1.evaluate(SystemPropertiesRestoreRule.java:57)
	at org.apache.lucene.util.TestRuleSetupTeardownChained$1.evaluate(TestRuleSetupTeardownChained.java:49)
	at org.apache.lucene.util.AbstractBeforeAfterRule$1.evaluate(AbstractBeforeAfterRule.java:45)
	at org.apache.lucene.util.TestRuleThreadAndTestName$1.evaluate(TestRuleThreadAndTestName.java:48)
	at org.apache.lucene.util.TestRuleIgnoreAfterMaxFailures$1.evaluate(TestRuleIgnoreAfterMaxFailures.java:64)
	at org.apache.lucene.util.TestRuleMarkFailure$1.evaluate(TestRuleMarkFailure.java:47)
	at com.carrotsearch.randomizedtesting.rules.StatementAdapter.evaluate(StatementAdapter.java:36)
	at com.carrotsearch.randomizedtesting.ThreadLeakControl$StatementRunner.run(ThreadLeakControl.java:368)
	at com.carrotsearch.randomizedtesting.ThreadLeakControl.forkTimeoutingTask(ThreadLeakControl.java:817)
	at com.carrotsearch.randomizedtesting.ThreadLeakControl$3.evaluate(ThreadLeakControl.java:468)
	at com.carrotsearch.randomizedtesting.RandomizedRunner.runSingleTest(RandomizedRunner.java:943)
	at com.carrotsearch.randomizedtesting.RandomizedRunner$5.evaluate(RandomizedRunner.java:829)
	at com.carrotsearch.randomizedtesting.RandomizedRunner$6.evaluate(RandomizedRunner.java:879)
	at com.carrotsearch.randomizedtesting.RandomizedRunner$7.evaluate(RandomizedRunner.java:890)
	at com.carrotsearch.randomizedtesting.rules.StatementAdapter.evaluate(StatementAdapter.java:36)
	at com.carrotsearch.randomizedtesting.rules.SystemPropertiesRestoreRule$1.evaluate(SystemPropertiesRestoreRule.java:57)
	at org.apache.lucene.util.AbstractBeforeAfterRule$1.evaluate(AbstractBeforeAfterRule.java:45)
	at com.carrotsearch.randomizedtesting.rules.StatementAdapter.evaluate(StatementAdapter.java:36)
	at org.apache.lucene.util.TestRuleStoreClassName$1.evaluate(TestRuleStoreClassName.java:41)
	at com.carrotsearch.randomizedtesting.rules.NoShadowingOrOverridesOnMethodsRule$1.evaluate(NoShadowingOrOverridesOnMethodsRule.java:40)
	at com.carrotsearch.randomizedtesting.rules.NoShadowingOrOverridesOnMethodsRule$1.evaluate(NoShadowingOrOverridesOnMethodsRule.java:40)
	at com.carrotsearch.randomizedtesting.rules.StatementAdapter.evaluate(StatementAdapter.java:36)
	at com.carrotsearch.randomizedtesting.rules.StatementAdapter.evaluate(StatementAdapter.java:36)
	at org.apache.lucene.util.TestRuleAssertionsRequired$1.evaluate(TestRuleAssertionsRequired.java:53)
	at org.apache.lucene.util.TestRuleMarkFailure$1.evaluate(TestRuleMarkFailure.java:47)
	at org.apache.lucene.util.TestRuleIgnoreAfterMaxFailures$1.evaluate(TestRuleIgnoreAfterMaxFailures.java:64)
	at org.apache.lucene.util.TestRuleIgnoreTestSuites$1.evaluate(TestRuleIgnoreTestSuites.java:54)
	at com.carrotsearch.randomizedtesting.rules.StatementAdapter.evaluate(StatementAdapter.java:36)
	at com.carrotsearch.randomizedtesting.ThreadLeakControl$StatementRunner.run(ThreadLeakControl.java:368)
	at java.base/java.lang.Thread.run(Thread.java:844)




Build Log:
[...truncated 14414 lines...]
   [junit4] JVM J1: stdout was not empty, see: /Users/jenkins/workspace/Lucene-Solr-master-MacOSX/solr/build/solr-core/test/temp/junit4-J1-20180903_115833_5197090797972741318997.sysout
   [junit4] >>> JVM J1 emitted unexpected output (verbatim) ----
   [junit4] #
   [junit4] # A fatal error has been detected by the Java Runtime Environment:
   [junit4] #
   [junit4] #  SIGSEGV (0xb) at pc=0x000000010c3d79d8, pid=71702, tid=15619
   [junit4] #
   [junit4] # JRE version: Java(TM) SE Runtime Environment (9.0+181) (build 9+181)
   [junit4] # Java VM: Java HotSpot(TM) 64-Bit Server VM (9+181, mixed mode, tiered, compressed oops, serial gc, bsd-amd64)
   [junit4] # Problematic frame:
   [junit4] # V  [libjvm.dylib+0x4f49d8]
   [junit4] #
   [junit4] # No core dump will be written. Core dumps have been disabled. To enable core dumping, try "ulimit -c unlimited" before starting Java again
   [junit4] #
   [junit4] # An error report file with more information is saved as:
   [junit4] # /Users/jenkins/workspace/Lucene-Solr-master-MacOSX/solr/build/solr-core/test/J1/hs_err_pid71702.log
   [junit4] #
   [junit4] # Compiler replay data is saved as:
   [junit4] # /Users/jenkins/workspace/Lucene-Solr-master-MacOSX/solr/build/solr-core/test/J1/replay_pid71702.log
   [junit4] #
   [junit4] # If you would like to submit a bug report, please visit:
   [junit4] #   http://bugreport.java.com/bugreport/crash.jsp
   [junit4] #
   [junit4] <<< JVM J1: EOF ----

[...truncated 45 lines...]
   [junit4] Suite: org.apache.solr.handler.RequestLoggingTest
   [junit4]   2> Creating dataDir: /Users/jenkins/workspace/Lucene-Solr-master-MacOSX/solr/build/solr-core/test/J0/temp/solr.handler.RequestLoggingTest_45FBB5EF6BEC0895-001/init-core-data-001
   [junit4]   2> 3761187 WARN  (SUITE-RequestLoggingTest-seed#[45FBB5EF6BEC0895]-worker) [    ] o.a.s.SolrTestCaseJ4 startTrackingSearchers: numOpens=1 numCloses=1
   [junit4]   2> 3761188 INFO  (SUITE-RequestLoggingTest-seed#[45FBB5EF6BEC0895]-worker) [    ] o.a.s.SolrTestCaseJ4 Using PointFields (NUMERIC_POINTS_SYSPROP=true) w/NUMERIC_DOCVALUES_SYSPROP=false
   [junit4]   2> 3761188 INFO  (SUITE-RequestLoggingTest-seed#[45FBB5EF6BEC0895]-worker) [    ] o.a.s.SolrTestCaseJ4 Randomized ssl (false) and clientAuth (false) via: @org.apache.solr.util.RandomizeSSL(reason="", value=0.0/0.0, ssl=0.0/0.0, clientAuth=0.0/0.0) w/ MAC_OS_X supressed clientAuth
   [junit4]   2> 3761188 INFO  (SUITE-RequestLoggingTest-seed#[45FBB5EF6BEC0895]-worker) [    ] o.a.s.SolrTestCaseJ4 SecureRandom sanity checks: test.solr.allowed.securerandom=null & java.security.egd=file:/dev/./urandom
   [junit4]   2> 3761188 INFO  (SUITE-RequestLoggingTest-seed#[45FBB5EF6BEC0895]-worker) [    ] o.a.s.SolrTestCaseJ4 ####initCore
   [junit4]   2> 3761189 INFO  (SUITE-RequestLoggingTest-seed#[45FBB5EF6BEC0895]-worker) [    ] o.a.s.c.SolrResourceLoader [null] Added 2 libs to classloader, from paths: [/Users/jenkins/workspace/Lucene-Solr-master-MacOSX/solr/core/src/test-files/solr/collection1/lib, /Users/jenkins/workspace/Lucene-Solr-master-MacOSX/solr/core/src/test-files/solr/collection1/lib/classes]
   [junit4]   2> 3761206 INFO  (SUITE-RequestLoggingTest-seed#[45FBB5EF6BEC0895]-worker) [    ] o.a.s.c.SolrConfig Using Lucene MatchVersion: 8.0.0
   [junit4]   2> 3761219 INFO  (SUITE-RequestLoggingTest-seed#[45FBB5EF6BEC0895]-worker) [    ] o.a.s.s.IndexSchema [null] Schema name=test
   [junit4]   2> 3761269 INFO  (SUITE-RequestLoggingTest-seed#[45FBB5EF6BEC0895]-worker) [    ] o.a.s.s.IndexSchema Loaded schema test/1.0 with uniqueid field id
   [junit4]   2> 3761405 INFO  (SUITE-RequestLoggingTest-seed#[45FBB5EF6BEC0895]-worker) [    ] o.a.s.c.TransientSolrCoreCacheDefault Allocating transient cache for 2147483647 transient cores
   [junit4]   2> 3761406 INFO  (SUITE-RequestLoggingTest-seed#[45FBB5EF6BEC0895]-worker) [    ] o.a.s.h.a.MetricsHistoryHandler No .system collection, keeping metrics history in memory.
   [junit4]   2> 3761427 INFO  (SUITE-RequestLoggingTest-seed#[45FBB5EF6BEC0895]-worker) [    ] o.a.s.m.r.SolrJmxReporter JMX monitoring for 'solr.node' (registry 'solr.node') enabled at server: com.sun.jmx.mbeanserver.JmxMBeanServer@d74f61a
   [junit4]   2> 3761440 INFO  (SUITE-RequestLoggingTest-seed#[45FBB5EF6BEC0895]-worker) [    ] o.a.s.m.r.SolrJmxReporter JMX monitoring for 'solr.jvm' (registry 'solr.jvm') enabled at server: com.sun.jmx.mbeanserver.JmxMBeanServer@d74f61a
   [junit4]   2> 3761440 INFO  (SUITE-RequestLoggingTest-seed#[45FBB5EF6BEC0895]-worker) [    ] o.a.s.m.r.SolrJmxReporter JMX monitoring for 'solr.jetty' (registry 'solr.jetty') enabled at server: com.sun.jmx.mbeanserver.JmxMBeanServer@d74f61a
   [junit4]   2> 3761443 INFO  (coreLoadExecutor-10493-thread-1) [    x:collection1] o.a.s.c.SolrResourceLoader [null] Added 2 libs to classloader, from paths: [/Users/jenkins/workspace/Lucene-Solr-master-MacOSX/solr/core/src/test-files/solr/collection1/lib, /Users/jenkins/workspace/Lucene-Solr-master-MacOSX/solr/core/src/test-files/solr/collection1/lib/classes]
   [junit4]   2> 3761488 INFO  (coreLoadExecutor-10493-thread-1) [    x:collection1] o.a.s.c.SolrConfig Using Lucene MatchVersion: 8.0.0
   [junit4]   2> 3761512 INFO  (coreLoadExecutor-10493-thread-1) [    x:collection1] o.a.s.s.IndexSchema [collection1] Schema name=test
   [junit4]   2> 3761600 INFO  (coreLoadExecutor-10493-thread-1) [    x:collection1] o.a.s.s.IndexSchema Loaded schema test/1.0 with uniqueid field id
   [junit4]   2> 3761611 INFO  (coreLoadExecutor-10493-thread-1) [    x:collection1] o.a.s.c.CoreContainer Creating SolrCore 'collection1' using configuration from instancedir /Users/jenkins/workspace/Lucene-Solr-master-MacOSX/solr/core/src/test-files/solr/collection1, trusted=true
   [junit4]   2> 3761611 INFO  (coreLoadExecutor-10493-thread-1) [    x:collection1] o.a.s.m.r.SolrJmxReporter JMX monitoring for 'solr.core.collection1' (registry 'solr.core.collection1') enabled at server: com.sun.jmx.mbeanserver.JmxMBeanServer@d74f61a
   [junit4]   2> 3761611 INFO  (coreLoadExecutor-10493-thread-1) [    x:collection1] o.a.s.c.SolrCore solr.RecoveryStrategy.Builder
   [junit4]   2> 3761612 INFO  (coreLoadExecutor-10493-thread-1) [    x:collection1] o.a.s.c.SolrCore [[collection1] ] Opening new SolrCore at [/Users/jenkins/workspace/Lucene-Solr-master-MacOSX/solr/core/src/test-files/solr/collection1], dataDir=[/Users/jenkins/workspace/Lucene-Solr-master-MacOSX/solr/build/solr-core/test/J0/temp/solr.handler.RequestLoggingTest_45FBB5EF6BEC0895-001/init-core-data-001/]
   [junit4]   2> 3761613 INFO  (coreLoadExecutor-10493-thread-1) [    x:collection1] o.a.s.u.RandomMergePolicy RandomMergePolicy wrapping class org.apache.lucene.index.TieredMergePolicy: [TieredMergePolicy: maxMergeAtOnce=37, maxMergeAtOnceExplicit=39, maxMergedSegmentMB=49.251953125, floorSegmentMB=1.298828125, forceMergeDeletesPctAllowed=19.768105478861624, segmentsPerTier=35.0, maxCFSSegmentSizeMB=8.796093022207999E12, noCFSRatio=0.7242732363320833, deletesPctAllowed=22.109556004985656
   [junit4]   2> 3761691 INFO  (coreLoadExecutor-10493-thread-1) [    x:collection1] o.a.s.u.UpdateHandler Using UpdateLog implementation: org.apache.solr.update.UpdateLog
   [junit4]   2> 3761691 INFO  (coreLoadExecutor-10493-thread-1) [    x:collection1] o.a.s.u.UpdateLog Initializing UpdateLog: dataDir= defaultSyncLevel=FLUSH numRecordsToKeep=100 maxNumLogsToKeep=10 numVersionBuckets=65536
   [junit4]   2> 3761692 INFO  (coreLoadExecutor-10493-thread-1) [    x:collection1] o.a.s.u.CommitTracker Hard AutoCommit: disabled
   [junit4]   2> 3761692 INFO  (coreLoadExecutor-10493-thread-1) [    x:collection1] o.a.s.u.CommitTracker Soft AutoCommit: disabled
   [junit4]   2> 3761693 INFO  (coreLoadExecutor-10493-thread-1) [    x:collection1] o.a.s.u.RandomMergePolicy RandomMergePolicy wrapping class org.apache.lucene.index.LogByteSizeMergePolicy: [LogByteSizeMergePolicy: minMergeSize=1677721, mergeFactor=2, maxMergeSize=2147483648, maxMergeSizeForForcedMerge=9223372036854775807, calibrateSizeByDeletes=true, maxMergeDocs=2147483647, maxCFSSegmentSizeMB=8.796093022207999E12, noCFSRatio=1.0]
   [junit4]   2> 3761694 INFO  (coreLoadExecutor-10493-thread-1) [    x:collection1] o.a.s.s.SolrIndexSearcher Opening [Searcher@1068390[collection1] main]
   [junit4]   2> 3761695 INFO  (coreLoadExecutor-10493-thread-1) [    x:collection1] o.a.s.h.c.SpellCheckComponent Initializing spell checkers
   [junit4]   2> 3761724 INFO  (coreLoadExecutor-10493-thread-1) [    x:collection1] o.a.s.s.DirectSolrSpellChecker init: {name=direct,classname=DirectSolrSpellChecker,field=lowerfilt,minQueryLength=3}
   [junit4]   2> 3761803 INFO  (coreLoadExecutor-10493-thread-1) [    x:collection1] o.a.s.h.ReplicationHandler Commits will be reserved for 10000ms.
   [junit4]   2> 3761804 INFO  (searcherExecutor-10494-thread-1-processing-x:collection1) [    x:collection1] o.a.s.h.c.SpellCheckComponent Loading spell index for spellchecker: default
   [junit4]   2> 3761805 INFO  (coreLoadExecutor-10493-thread-1) [    x:collection1] o.a.s.u.UpdateLog Could not find max version in index or recent updates, using new clock 1610591424209747968
   [junit4]   2> 3761806 INFO  (searcherExecutor-10494-thread-1-processing-x:collection1) [    x:collection1] o.a.s.h.c.SpellCheckComponent Loading spell index for spellchecker: direct
   [junit4]   2> 3761807 INFO  (searcherExecutor-10494-thread-1-processing-x:collection1) [    x:collection1] o.a.s.h.c.SpellCheckComponent Loading spell index for spellchecker: wordbreak
   [junit4]   2> 3761807 INFO  (searcherExecutor-10494-thread-1-processing-x:collection1) [    x:collection1] o.a.s.h.c.SpellCheckComponent Loading spell index for spellchecker: multipleFields
   [junit4]   2> 3761807 INFO  (searcherExecutor-10494-thread-1-processing-x:collection1) [    x:collection1] o.a.s.h.c.SpellCheckComponent Loading spell index for spellchecker: jarowinkler
   [junit4]   2> 3761808 INFO  (searcherExecutor-10494-thread-1-processing-x:collection1) [    x:collection1] o.a.s.h.c.SpellCheckComponent Loading spell index for spellchecker: external
   [junit4]   2> 3761808 INFO  (SUITE-RequestLoggingTest-seed#[45FBB5EF6BEC0895]-worker) [    ] o.a.s.SolrTestCaseJ4 ####initCore end
   [junit4]   2> 3761808 INFO  (searcherExecutor-10494-thread-1-processing-x:collection1) [    x:collection1] o.a.s.h.c.SpellCheckComponent Loading spell index for spellchecker: freq
   [junit4]   2> 3761809 INFO  (searcherExecutor-10494-thread-1-processing-x:collection1) [    x:collection1] o.a.s.h.c.SpellCheckComponent Loading spell index for spellchecker: fqcn
   [junit4]   2> 3761811 INFO  (searcherExecutor-10494-thread-1-processing-x:collection1) [    x:collection1] o.a.s.h.c.SpellCheckComponent Loading spell index for spellchecker: perDict
   [junit4]   2> 3761812 INFO  (TEST-RequestLoggingTest.testLogBeforeExecuteWithCoreLogger-seed#[45FBB5EF6BEC0895]) [    ] o.a.s.SolrTestCaseJ4 ###Starting testLogBeforeExecuteWithCoreLogger
   [junit4]   2> 3761812 INFO  (searcherExecutor-10494-thread-1-processing-x:collection1) [    x:collection1] o.a.s.c.SolrCore [collection1] Registered new searcher Searcher@1068390[collection1] main{ExitableDirectoryReader(UninvertingDirectoryReader())}
   [junit4]   2> 3761831 DEBUG (TEST-RequestLoggingTest.testLogBeforeExecuteWithCoreLogger-seed#[45FBB5EF6BEC0895]) [    ] o.a.s.c.S.Request [collection1]  webapp=null path=null params={q=*:*&wt=xml}
   [junit4]   2> 3761831 DEBUG (TEST-RequestLoggingTest.testLogBeforeExecuteWithCoreLogger-seed#[45FBB5EF6BEC0895]) [    ] o.a.s.h.c.SearchHandler Adding  component:org.apache.solr.handler.component.QueryComponent@3caaabf5
   [junit4]   2> 3761831 DEBUG (TEST-RequestLoggingTest.testLogBeforeExecuteWithCoreLogger-seed#[45FBB5EF6BEC0895]) [    ] o.a.s.h.c.SearchHandler Adding  component:org.apache.solr.handler.component.FacetComponent@1b4c358b
   [junit4]   2> 3761831 DEBUG (TEST-RequestLoggingTest.testLogBeforeExecuteWithCoreLogger-seed#[45FBB5EF6BEC0895]) [    ] o.a.s.h.c.SearchHandler Adding  component:org.apache.solr.search.facet.FacetModule@1eb59897
   [junit4]   2> 3761831 DEBUG (TEST-RequestLoggingTest.testLogBeforeExecuteWithCoreLogger-seed#[45FBB5EF6BEC0895]) [    ] o.a.s.h.c.SearchHandler Adding  component:org.apache.solr.handler.component.MoreLikeThisComponent@20a07908
   [junit4]   2> 3761831 DEBUG (TEST-RequestLoggingTest.testLogBeforeExecuteWithCoreLogger-seed#[45FBB5EF6BEC0895]) [    ] o.a.s.h.c.SearchHandler Adding  component:org.apache.solr.handler.component.HighlightComponent@49bc9bea
   [junit4]   2> 3761831 DEBUG (TEST-RequestLoggingTest.testLogBeforeExecuteWithCoreLogger-seed#[45FBB5EF6BEC0895]) [    ] o.a.s.h.c.SearchHandler Adding  component:org.apache.solr.handler.component.StatsComponent@33a61f3b
   [junit4]   2> 3761831 DEBUG (TEST-RequestLoggingTest.testLogBeforeExecuteWithCoreLogger-seed#[45FBB5EF6BEC0895]) [    ] o.a.s.h.c.SearchHandler Adding  component:org.apache.solr.handler.component.ExpandComponent@16558f8
   [junit4]   2> 3761831 DEBUG (TEST-RequestLoggingTest.testLogBeforeExecuteWithCoreLogger-seed#[45FBB5EF6BEC0895]) [    ] o.a.s.h.c.SearchHandler Adding  component:org.apache.solr.handler.component.TermsComponent@22ae09e5
   [junit4]   2> 3761831 DEBUG (TEST-RequestLoggingTest.testLogBeforeExecuteWithCoreLogger-seed#[45FBB5EF6BEC0895]) [    ] o.a.s.h.c.SearchHandler Adding  debug component:org.apache.solr.handler.component.DebugComponent@f60b591
   [junit4]   2> 3761831 DEBUG (TEST-RequestLoggingTest.testLogBeforeExecuteWithCoreLogger-seed#[45FBB5EF6BEC0895]) [    ] o.a.s.h.c.QueryComponent process: q=*:*&df=text&wt=xml&indent=off
   [junit4]   2> 3761831 DEBUG (TEST-RequestLoggingTest.testLogBeforeExecuteWithCoreLogger-seed#[45FBB5EF6BEC0895]) [    ] o.a.s.s.s.LocalStatsCache ## GET LocalSolrQueryRequest{q=*:*&df=text&wt=xml&indent=off}
   [junit4]   2> 3761831 INFO  (TEST-RequestLoggingTest.testLogBeforeExecuteWithCoreLogger-seed#[45FBB5EF6BEC0895]) [    ] o.a.s.c.S.Request [collection1]  webapp=null path=null params={q=*:*&wt=xml} hits=0 status=0 QTime=0
   [junit4]   2> 3761833 INFO  (TEST-RequestLoggingTest.testLogBeforeExecuteWithCoreLogger-seed#[45FBB5EF6BEC0895]) [    ] o.a.s.SolrTestCaseJ4 ###Ending testLogBeforeExecuteWithCoreLogger
   [junit4]   2> NOTE: reproduce with: ant test  -Dtestcase=RequestLoggingTest -Dtests.method=testLogBeforeExecuteWithCoreLogger -Dtests.seed=45FBB5EF6BEC0895 -Dtests.slow=true -Dtests.locale=fr-NC -Dtests.timezone=America/Rosario -Dtests.asserts=true -Dtests.file.encoding=UTF-8
   [junit4] FAILURE 0.03s J0 | RequestLoggingTest.testLogBeforeExecuteWithCoreLogger <<<
   [junit4]    > Throwable #1: java.lang.AssertionError
   [junit4]    > 	at __randomizedtesting.SeedInfo.seed([45FBB5EF6BEC0895:897DB56195256303]:0)
   [junit4]    > 	at org.apache.solr.handler.RequestLoggingTest.testLogBeforeExecute(RequestLoggingTest.java:88)
   [junit4]    > 	at org.apache.solr.handler.RequestLoggingTest.testLogBeforeExecuteWithCoreLogger(RequestLoggingTest.java:65)
   [junit4]    > 	at java.base/jdk.internal.reflect.NativeMethodAccessorImpl.invoke0(Native Method)
   [junit4]    > 	at java.base/jdk.internal.reflect.NativeMethodAccessorImpl.invoke(NativeMethodAccessorImpl.java:62)
   [junit4]    > 	at java.base/jdk.internal.reflect.DelegatingMethodAccessorImpl.invoke(DelegatingMethodAccessorImpl.java:43)
   [junit4]    > 	at java.base/java.lang.reflect.Method.invoke(Method.java:564)
   [junit4]    > 	at java.base/java.lang.Thread.run(Thread.java:844)
   [junit4]   2> 3761838 INFO  (TEST-RequestLoggingTest.testLogBeforeExecuteWithRequestLogger-seed#[45FBB5EF6BEC0895]) [    ] o.a.s.SolrTestCaseJ4 ###Starting testLogBeforeExecuteWithRequestLogger
   [junit4]   2> 3761841 DEBUG (TEST-RequestLoggingTest.testLogBeforeExecuteWithRequestLogger-seed#[45FBB5EF6BEC0895]) [    ] o.a.s.c.S.Request [collection1]  webapp=null path=null params={q=*:*&wt=xml}
   [junit4]   2> 3761841 DEBUG (TEST-RequestLoggingTest.testLogBeforeExecuteWithRequestLogger-seed#[45FBB5EF6BEC0895]) [    ] o.a.s.h.c.QueryComponent process: q=*:*&df=text&wt=xml&indent=off
   [junit4]   2> 3761841 DEBUG (TEST-RequestLoggingTest.testLogBeforeExecuteWithRequestLogger-seed#[45FBB5EF6BEC0895]) [    ] o.a.s.s.s.LocalStatsCache ## GET LocalSolrQueryRequest{q=*:*&df=text&wt=xml&indent=off}
   [junit4]   2> 3761841 INFO  (TEST-RequestLoggingTest.testLogBeforeExecuteWithRequestLogger-seed#[45FBB5EF6BEC0895]) [    ] o.a.s.c.S.Request [collection1]  webapp=null path=null params={q=*:*&wt=xml} hits=0 status=0 QTime=0
   [junit4]   2> 3761843 INFO  (TEST-RequestLoggingTest.testLogBeforeExecuteWithRequestLogger-seed#[45FBB5EF6BEC0895]) [    ] o.a.s.SolrTestCaseJ4 ###Ending testLogBeforeExecuteWithRequestLogger
   [junit4]   2> NOTE: reproduce with: ant test  -Dtestcase=RequestLoggingTest -Dtests.method=testLogBeforeExecuteWithRequestLogger -Dtests.seed=45FBB5EF6BEC0895 -Dtests.slow=true -Dtests.locale=fr-NC -Dtests.timezone=America/Rosario -Dtests.asserts=true -Dtests.file.encoding=UTF-8
   [junit4] FAILURE 0.01s J0 | RequestLoggingTest.testLogBeforeExecuteWithRequestLogger <<<
   [junit4]    > Throwable #1: java.lang.AssertionError
   [junit4]    > 	at __randomizedtesting.SeedInfo.seed([45FBB5EF6BEC0895:F49295E0C61AB0DB]:0)
   [junit4]    > 	at org.apache.solr.handler.RequestLoggingTest.testLogBeforeExecute(RequestLoggingTest.java:88)
   [junit4]    > 	at org.apache.solr.handler.RequestLoggingTest.testLogBeforeExecuteWithRequestLogger(RequestLoggingTest.java:71)
   [junit4]    > 	at java.base/jdk.internal.reflect.NativeMethodAccessorImpl.invoke0(Native Method)
   [junit4]    > 	at java.base/jdk.internal.reflect.NativeMethodAccessorImpl.invoke(NativeMethodAccessorImpl.java:62)
   [junit4]    > 	at java.base/jdk.internal.reflect.DelegatingMethodAccessorImpl.invoke(DelegatingMethodAccessorImpl.java:43)
   [junit4]    > 	at java.base/java.lang.reflect.Method.invoke(Method.java:564)
   [junit4]    > 	at java.base/java.lang.Thread.run(Thread.java:844)
   [junit4]   2> 3761843 INFO  (SUITE-RequestLoggingTest-seed#[45FBB5EF6BEC0895]-worker) [    ] o.a.s.SolrTestCaseJ4 ###deleteCore
   [junit4]   2> 3761843 INFO  (SUITE-RequestLoggingTest-seed#[45FBB5EF6BEC0895]-worker) [    ] o.a.s.c.CoreContainer Shutting down CoreContainer instance=1968641352
   [junit4]   2> 3761844 INFO  (SUITE-RequestLoggingTest-seed#[45FBB5EF6BEC0895]-worker) [    ] o.a.s.m.SolrMetricManager Closing metric reporters for registry=solr.node, tag=null
   [junit4]   2> 3761844 INFO  (SUITE-RequestLoggingTest-seed#[45FBB5EF6BEC0895]-worker) [    ] o.a.s.m.r.SolrJmxReporter Closing reporter [org.apache.solr.metrics.reporters.SolrJmxReporter@7209651b: rootName = null, domain = solr.node, service url = null, agent id = null] for registry solr.node / com.codahale.metrics.MetricRegistry@17b0f0dc
   [junit4]   2> 3761851 INFO  (SUITE-RequestLoggingTest-seed#[45FBB5EF6BEC0895]-worker) [    ] o.a.s.m.SolrMetricManager Closing metric reporters for registry=solr.jvm, tag=null
   [junit4]   2> 3761851 INFO  (SUITE-RequestLoggingTest-seed#[45FBB5EF6BEC0895]-worker) [    ] o.a.s.m.r.SolrJmxReporter Closing reporter [org.apache.solr.metrics.reporters.SolrJmxReporter@294d1d7e: rootName = null, domain = solr.jvm, service url = null, agent id = null] for registry solr.jvm / com.codahale.metrics.MetricRegistry@3d4fc784
   [junit4]   2> 3761855 INFO  (SUITE-RequestLoggingTest-seed#[45FBB5EF6BEC0895]-worker) [    ] o.a.s.m.SolrMetricManager Closing metric reporters for registry=solr.jetty, tag=null
   [junit4]   2> 3761855 INFO  (SUITE-RequestLoggingTest-seed#[45FBB5EF6BEC0895]-worker) [    ] o.a.s.m.r.SolrJmxReporter Closing reporter [org.apache.solr.metrics.reporters.SolrJmxReporter@17c066ba: rootName = null, domain = solr.jetty, service url = null, agent id = null] for registry solr.jetty / com.codahale.metrics.MetricRegistry@101173a0
   [junit4]   2> 3761856 INFO  (coreCloseExecutor-10499-thread-1) [    x:collection1] o.a.s.c.SolrCore [collection1]  CLOSING SolrCore org.apache.solr.core.SolrCore@45f97392
   [junit4]   2> 3761856 INFO  (coreCloseExecutor-10499-thread-1) [    x:collection1] o.a.s.m.SolrMetricManager Closing metric reporters for registry=solr.core.collection1, tag=45f97392
   [junit4]   2> 3761856 INFO  (coreCloseExecutor-10499-thread-1) [    x:collection1] o.a.s.m.r.SolrJmxReporter Closing reporter [org.apache.solr.metrics.reporters.SolrJmxReporter@4dd5b552: rootName = null, domain = solr.core.collection1, service url = null, agent id = null] for registry solr.core.collection1 / com.codahale.metrics.MetricRegistry@27919ea1
   [junit4]   2> NOTE: leaving temporary files on disk at: /Users/jenkins/workspace/Lucene-Solr-master-MacOSX/solr/build/solr-core/test/J0/temp/solr.handler.RequestLoggingTest_45FBB5EF6BEC0895-001
   [junit4]   2> NOTE: test params are: codec=Asserting(Lucene80): {}, docValues:{}, maxPointsInLeafNode=262, maxMBSortInHeap=7.560925412664299, sim=Asserting(org.apache.lucene.search.similarities.AssertingSimilarity@4ef8e5f4), locale=fr-NC, timezone=America/Rosario
   [junit4]   2> NOTE: Mac OS X 10.11.6 x86_64/Oracle Corporation 9 (64-bit)/cpus=3,threads=1,free=159445256,total=518979584
   [junit4]   2> NOTE: All tests run in this JVM: [SolrRequestParserTest, RAMDirectoryFactoryTest, CdcrBidirectionalTest, ShardRoutingCustomTest, TestJavabinTupleStreamParser, SuggestComponentContextFilterQueryTest, TestStressCloudBlindAtomicUpdates, TestFieldResource, SpellingQueryConverterTest, CdcrRequestHandlerTest, TestDistribIDF, SimpleMLTQParserTest, RecoveryAfterSoftCommitTest, CloneFieldUpdateProcessorFactoryTest, TestRTGBase, CollectionsAPIAsyncDistributedZkTest, TestExpandComponent, TestSortableTextField, ClusterStateUpdateTest, FieldMutatingUpdateProcessorTest, DateFieldTest, SolrIndexSplitterTest, EmbeddedSolrNoSerializeTest, TestDFRSimilarityFactory, SolrJmxReporterTest, TransactionLogTest, TestFilteredDocIdSet, TestLogWatcher, TermVectorComponentDistributedTest, DistributedQueueTest, SparseHLLTest, WordBreakSolrSpellCheckerTest, TestSimLargeCluster, MaxSizeAutoCommitTest, TestClusterProperties, TestPhraseSuggestions, TestSolrJ, InfoHandlerTest, FullSolrCloudDistribCmdsTest, AutoAddReplicasPlanActionTest, DocValuesNotIndexedTest, TestCSVLoader, TestPartialUpdateDeduplication, AutoscalingHistoryHandlerTest, ConfigureRecoveryStrategyTest, TestSimpleTextCodec, TestHashPartitioner, TestEmbeddedSolrServerConstructors, TestHalfAndHalfDocValues, FastVectorHighlighterTest, TestCloudJSONFacetJoinDomain, SolrMetricManagerTest, PreAnalyzedFieldTest, TestHdfsUpdateLog, TestZkChroot, TestSolrCoreProperties, TestFastLRUCache, TestNestedUpdateProcessor, TestManagedResource, ConcurrentCreateRoutedAliasTest, RequiredFieldsTest, TestOrdValues, TestRebalanceLeaders, TestConfigsApi, NumericFieldsTest, DirectSolrConnectionTest, TestCoreBackup, SystemLogListenerTest, TestTrie, NodeLostTriggerTest, TestSolrIndexConfig, ReplaceNodeTest, CdcrUpdateLogTest, TestCorePropertiesReload, TestWordDelimiterFilterFactory, TestFieldCacheSort, SolrGraphiteReporterTest, ResourceLoaderTest, PeerSyncWithLeaderAndIndexFingerprintCachingTest, BooleanFieldTest, TestSimClusterStateProvider, TestDistributedGrouping, TestPostingsSolrHighlighter, TestSchemaVersionResource, TestCoreContainer, TestDynamicURP, HdfsSyncSliceTest, HdfsBasicDistributedZk2Test, TestSimTriggerIntegration, OverseerModifyCollectionTest, TestConfigSetProperties, TestBackupRepositoryFactory, TestSolrCoreParser, TestDynamicFieldResource, RankQueryTest, SpellCheckComponentTest, AtomicUpdatesTest, IndexSizeTriggerTest, TestPKIAuthenticationPlugin, TestPayloadScoreQParserPlugin, TestMaxScoreQueryParser, LargeFieldTest, BasicDistributedZkTest, TestSolrCloudWithKerberosAlt, TimeZoneUtilsTest, QueryEqualityTest, TestJmxIntegration, HdfsNNFailoverTest, TestSimExecutePlanAction, DistributedMLTComponentTest, DeleteLastCustomShardedReplicaTest, TestSSLRandomization, TestRTimerTree, SuggesterWFSTTest, MetricTriggerTest, TestMultiValuedNumericRangeQuery, TermsComponentTest, UpdateParamsTest, ChaosMonkeySafeLeaderTest, TestCryptoKeys, TestApiFramework, TestCloudManagedSchema, TestSimNodeLostTrigger, LeaderElectionContextKeyTest, OutputWriterTest, TestMacros, XsltUpdateRequestHandlerTest, TestDocBasedVersionConstraints, DistanceFunctionTest, DirectUpdateHandlerTest, TestClusterStateMutator, BigEndianAscendingWordSerializerTest, TestWriterPerf, ZkSolrClientTest, TestSimpleQParserPlugin, TestRandomFaceting, HdfsAutoAddReplicasIntegrationTest, SuggesterTSTTest, IndexBasedSpellCheckerTest, TestXmlQParser, MoveReplicaHDFSTest, TolerantUpdateProcessorTest, TestReplicationHandler, TestReloadAndDeleteDocs, TestJoin, TestIntervalFaceting, ConvertedLegacyTest, TestPushWriter, MissingSegmentRecoveryTest, DistributedTermsComponentTest, SSLMigrationTest, SolrIndexConfigTest, TestJsonFacets, HdfsDirectoryTest, DistanceUnitsTest, TestRequestStatusCollectionAPI, TestNumericTerms64, TestStreamBody, TestHashQParserPlugin, MultiSolrCloudTestCaseTest, TestChildDocTransformerHierarchy, TestSort, ZookeeperStatusHandlerTest, TestSolrCLIRunExample, TestFuzzyAnalyzedSuggestions, SolrInfoBeanTest, TestStressVersions, TestPullReplica, SimpleCollectionCreateDeleteTest, BasicAuthIntegrationTest, MoreLikeThisHandlerTest, PrimUtilsTest, SolrCoreCheckLockOnStartupTest, TestRawTransformer, SpellCheckCollatorWithCollapseTest, TestElisionMultitermQuery, TestStressReorder, DistributedFacetSimpleRefinementLongTailTest, PKIAuthenticationIntegrationTest, TestSchemaManager, TestSimDistribStateManager, TestTolerantUpdateProcessorCloud, DeleteStatusTest, TestCloudPivotFacet, DOMUtilTest, FieldAnalysisRequestHandlerTest, UUIDUpdateProcessorFallbackTest, CollectionReloadTest, RemoteQueryErrorTest, PolyFieldTest, TestFieldCache, DistributedDebugComponentTest, TestCollapseQParserPlugin, CopyFieldTest, TestJsonRequest, TestLockTree, TestSearchPerf, TriggerCooldownIntegrationTest, TestAnalyzedSuggestions, ReplicaListTransformerTest, CreateRoutedAliasTest, SignificantTermsQParserPluginTest, LeaderElectionTest, LeaderVoteWaitTimeoutTest, MigrateRouteKeyTest, PeerSyncReplicationTest, SharedFSAutoReplicaFailoverTest, SliceStateTest, SolrCLIZkUtilsTest, SolrCloudExampleTest, TestAuthenticationFramework, TestCloudConsistency, TestCloudInspectUtil, TestCloudRecovery, TestConfigSetsAPIExclusivity, TestConfigSetsAPIZkFailure, TestDistribDocBasedVersion, TestDistributedMap, TestDownShardTolerantSearch, TestExclusionRuleCollectionAccess, TestLeaderElectionZkExpiry, TestOnReconnectListenerSupport, TestRandomFlRTGCloud, TestRandomRequestDistribution, TestShortCircuitedRequests, TestSizeLimitedDistributedMap, TestSkipOverseerOperations, TestStressLiveNodes, TestUtilizeNode, TestWithCollection, UnloadDistributedZkTest, ZkFailoverTest, TestCollectionsAPIViaSolrCloudCluster, TestHdfsCloudBackupRestore, TestLocalFSCloudBackupRestore, TestReplicaProperties, ComputePlanActionTest, ExecutePlanActionTest, NodeAddedTriggerTest, NodeLostTriggerIntegrationTest, RestoreTriggerStateTest, ScheduledMaintenanceTriggerTest, ScheduledTriggerIntegrationTest, ScheduledTriggerTest, SearchRateTriggerIntegrationTest, SearchRateTriggerTest, TriggerIntegrationTest, TriggerSetPropertiesIntegrationTest, CdcrOpsAndBoundariesTest, HDFSCollectionsAPITest, HdfsChaosMonkeyNothingIsSafeTest, HdfsChaosMonkeySafeLeaderTest, HdfsRecoveryZkTest, HdfsRestartWhileUpdatingTest, HdfsTlogReplayBufferedWhileIndexingTest, HdfsUnloadDistributedZkTest, HdfsWriteToMultipleCollectionsTest, StressHdfsTest, ZkStateWriterTest, ImplicitSnitchTest, RuleEngineTest, RulesTest, AlternateDirectoryTest, BlobRepositoryCloudTest, CachingDirectoryFactoryTest, DirectoryFactoryTest, ExitableDirectoryReaderTest, HdfsDirectoryFactoryTest, OpenCloseCoreStressTest, PluginInfoTest, QueryResultKeyTest, TestCodecSupport, TestConfig, TestConfigOverlay, TestConfigSetImmutable, TestDirectoryFactory, TestDynamicLoading, TestInfoStreamLogging, TestInitParams, TestMergePolicyConfig, TestNRTOpen, TestQuerySenderListener, TestQuerySenderNoQuery, TestSolrDeletionPolicy1, TestSolrDeletionPolicy2, TestXIncludeConfig, TestSolrCloudSnapshots, TestSolrCoreSnapshots, BinaryUpdateRequestHandlerTest, CSVRequestHandlerTest, DocumentAnalysisRequestHandlerTest, RequestLoggingTest]
   [junit4] Completed [584/832 (1!)] on J0 in 0.70s, 2 tests, 2 failures <<< FAILURES!

[...truncated 835 lines...]
   [junit4] ERROR: JVM J1 ended with an exception, command line: /Library/Java/JavaVirtualMachines/jdk-9.jdk/Contents/Home/bin/java -XX:+UseCompressedOops -XX:+UseSerialGC -XX:+HeapDumpOnOutOfMemoryError -XX:HeapDumpPath=/Users/jenkins/workspace/Lucene-Solr-master-MacOSX/heapdumps -ea -esa --illegal-access=deny -Dtests.prefix=tests -Dtests.seed=45FBB5EF6BEC0895 -Xmx512M -Dtests.iters= -Dtests.verbose=false -Dtests.infostream=false -Dtests.codec=random -Dtests.postingsformat=random -Dtests.docvaluesformat=random -Dtests.locale=random -Dtests.timezone=random -Dtests.directory=random -Dtests.linedocsfile=europarl.lines.txt.gz -Dtests.luceneMatchVersion=8.0.0 -Dtests.cleanthreads=perClass -Djava.util.logging.config.file=/Users/jenkins/workspace/Lucene-Solr-master-MacOSX/lucene/tools/junit4/logging.properties -Dtests.nightly=false -Dtests.weekly=false -Dtests.monster=false -Dtests.slow=true -Dtests.asserts=true -Dtests.multiplier=1 -DtempDir=./temp -Djava.io.tmpdir=./temp -Djunit4.tempDir=/Users/jenkins/workspace/Lucene-Solr-master-MacOSX/solr/build/solr-core/test/temp -Dcommon.dir=/Users/jenkins/workspace/Lucene-Solr-master-MacOSX/lucene -Dclover.db.dir=/Users/jenkins/workspace/Lucene-Solr-master-MacOSX/lucene/build/clover/db -Djava.security.policy=/Users/jenkins/workspace/Lucene-Solr-master-MacOSX/lucene/tools/junit4/solr-tests.policy -Dtests.LUCENE_VERSION=8.0.0 -Djetty.testMode=1 -Djetty.insecurerandom=1 -Dsolr.directoryFactory=org.apache.solr.core.MockDirectoryFactory -Djava.awt.headless=true -Djdk.map.althashing.threshold=0 -Dtests.src.home=/Users/jenkins/workspace/Lucene-Solr-master-MacOSX -Djava.security.egd=file:/dev/./urandom -Djunit4.childvm.cwd=/Users/jenkins/workspace/Lucene-Solr-master-MacOSX/solr/build/solr-core/test/J1 -Djunit4.childvm.id=1 -Djunit4.childvm.count=2 -Dfile.encoding=UTF-8 -Dtests.disableHdfs=true -Djava.security.manager=org.apache.lucene.util.TestSecurityManager -Dtests.filterstacks=true -Dtests.leaveTemporary=false -Dtests.badapples=false -classpath /Users/jenkins/workspace/Lucene-Solr-master-MacOSX/solr/build/solr-core/classes/test:/Users/jenkins/workspace/Lucene-Solr-master-MacOSX/solr/build/solr-test-framework/classes/java:/Users/jenkins/workspace/Lucene-Solr-master-MacOSX/solr/test-framework/lib/junit4-ant-2.6.0.jar:/Users/jenkins/workspace/Lucene-Solr-master-MacOSX/solr/core/src/test-files:/Users/jenkins/workspace/Lucene-Solr-master-MacOSX/lucene/build/test-framework/classes/java:/Users/jenkins/workspace/Lucene-Solr-master-MacOSX/lucene/build/codecs/classes/java:/Users/jenkins/workspace/Lucene-Solr-master-MacOSX/solr/build/solr-solrj/classes/java:/Users/jenkins/workspace/Lucene-Solr-master-MacOSX/solr/build/solr-core/classes/java:/Users/jenkins/workspace/Lucene-Solr-master-MacOSX/lucene/build/analysis/common/lucene-analyzers-common-8.0.0-SNAPSHOT.jar:/Users/jenkins/workspace/Lucene-Solr-master-MacOSX/lucene/build/analysis/kuromoji/lucene-analyzers-kuromoji-8.0.0-SNAPSHOT.jar:/Users/jenkins/workspace/Lucene-Solr-master-MacOSX/lucene/build/analysis/nori/lucene-analyzers-nori-8.0.0-SNAPSHOT.jar:/Users/jenkins/workspace/Lucene-Solr-master-MacOSX/lucene/build/analysis/phonetic/lucene-analyzers-phonetic-8.0.0-SNAPSHOT.jar:/Users/jenkins/workspace/Lucene-Solr-master-MacOSX/lucene/build/codecs/lucene-codecs-8.0.0-SNAPSHOT.jar:/Users/jenkins/workspace/Lucene-Solr-master-MacOSX/lucene/build/backward-codecs/lucene-backward-codecs-8.0.0-SNAPSHOT.jar:/Users/jenkins/workspace/Lucene-Solr-master-MacOSX/lucene/build/highlighter/lucene-highlighter-8.0.0-SNAPSHOT.jar:/Users/jenkins/workspace/Lucene-Solr-master-MacOSX/lucene/build/memory/lucene-memory-8.0.0-SNAPSHOT.jar:/Users/jenkins/workspace/Lucene-Solr-master-MacOSX/lucene/build/misc/lucene-misc-8.0.0-SNAPSHOT.jar:/Users/jenkins/workspace/Lucene-Solr-master-MacOSX/lucene/build/spatial-extras/lucene-spatial-extras-8.0.0-SNAPSHOT.jar:/Users/jenkins/workspace/Lucene-Solr-master-MacOSX/lucene/build/spatial3d/lucene-spatial3d-8.0.0-SNAPSHOT.jar:/Users/jenkins/workspace/Lucene-Solr-master-MacOSX/lucene/build/expressions/lucene-expressions-8.0.0-SNAPSHOT.jar:/Users/jenkins/workspace/Lucene-Solr-master-MacOSX/lucene/build/suggest/lucene-suggest-8.0.0-SNAPSHOT.jar:/Users/jenkins/workspace/Lucene-Solr-master-MacOSX/lucene/build/grouping/lucene-grouping-8.0.0-SNAPSHOT.jar:/Users/jenkins/workspace/Lucene-Solr-master-MacOSX/lucene/build/queries/lucene-queries-8.0.0-SNAPSHOT.jar:/Users/jenkins/workspace/Lucene-Solr-master-MacOSX/lucene/build/queryparser/lucene-queryparser-8.0.0-SNAPSHOT.jar:/Users/jenkins/workspace/Lucene-Solr-master-MacOSX/lucene/build/join/lucene-join-8.0.0-SNAPSHOT.jar:/Users/jenkins/workspace/Lucene-Solr-master-MacOSX/lucene/build/sandbox/lucene-sandbox-8.0.0-SNAPSHOT.jar:/Users/jenkins/workspace/Lucene-Solr-master-MacOSX/lucene/build/classification/lucene-classification-8.0.0-SNAPSHOT.jar:/Users/jenkins/workspace/Lucene-Solr-master-MacOSX/solr/core/lib/antlr4-runtime-4.5.1-1.jar:/Users/jenkins/workspace/Lucene-Solr-master-MacOSX/solr/core/lib/asm-5.1.jar:/Users/jenkins/workspace/Lucene-Solr-master-MacOSX/solr/core/lib/asm-commons-5.1.jar:/Users/jenkins/workspace/Lucene-Solr-master-MacOSX/solr/core/lib/avatica-core-1.10.0.jar:/Users/jenkins/workspace/Lucene-Solr-master-MacOSX/solr/core/lib/caffeine-2.4.0.jar:/Users/jenkins/workspace/Lucene-Solr-master-MacOSX/solr/core/lib/calcite-core-1.13.0.jar:/Users/jenkins/workspace/Lucene-Solr-master-MacOSX/solr/core/lib/calcite-linq4j-1.13.0.jar:/Users/jenkins/workspace/Lucene-Solr-master-MacOSX/solr/core/lib/commons-cli-1.2.jar:/Users/jenkins/workspace/Lucene-Solr-master-MacOSX/solr/core/lib/commons-codec-1.10.jar:/Users/jenkins/workspace/Lucene-Solr-master-MacOSX/solr/core/lib/commons-collections-3.2.2.jar:/Users/jenkins/workspace/Lucene-Solr-master-MacOSX/solr/core/lib/commons-compiler-2.7.6.jar:/Users/jenkins/workspace/Lucene-Solr-master-MacOSX/solr/core/lib/commons-configuration-1.6.jar:/Users/jenkins/workspace/Lucene-Solr-master-MacOSX/solr/core/lib/commons-exec-1.3.jar:/Users/jenkins/workspace/Lucene-Solr-master-MacOSX/solr/core/lib/commons-fileupload-1.3.3.jar:/Users/jenkins/workspace/Lucene-Solr-master-MacOSX/solr/core/lib/commons-io-2.5.jar:/Users/jenkins/workspace/Lucene-Solr-master-MacOSX/solr/core/lib/commons-lang-2.6.jar:/Users/jenkins/workspace/Lucene-Solr-master-MacOSX/solr/core/lib/commons-lang3-3.6.jar:/Users/jenkins/workspace/Lucene-Solr-master-MacOSX/solr/core/lib/curator-client-2.8.0.jar:/Users/jenkins/workspace/Lucene-Solr-master-MacOSX/solr/core/lib/curator-framework-2.8.0.jar:/Users/jenkins/workspace/Lucene-Solr-master-MacOSX/solr/core/lib/curator-recipes-2.8.0.jar:/Users/jenkins/workspace/Lucene-Solr-master-MacOSX/solr/core/lib/disruptor-3.4.0.jar:/Users/jenkins/workspace/Lucene-Solr-master-MacOSX/solr/core/lib/dom4j-1.6.1.jar:/Users/jenkins/workspace/Lucene-Solr-master-MacOSX/solr/core/lib/eigenbase-properties-1.1.5.jar:/Users/jenkins/workspace/Lucene-Solr-master-MacOSX/solr/core/lib/guava-14.0.1.jar:/Users/jenkins/workspace/Lucene-Solr-master-MacOSX/solr/core/lib/hadoop-annotations-2.7.4.jar:/Users/jenkins/workspace/Lucene-Solr-master-MacOSX/solr/core/lib/hadoop-auth-2.7.4.jar:/Users/jenkins/workspace/Lucene-Solr-master-MacOSX/solr/core/lib/hadoop-common-2.7.4.jar:/Users/jenkins/workspace/Lucene-Solr-master-MacOSX/solr/core/lib/hadoop-hdfs-2.7.4.jar:/Users/jenkins/workspace/Lucene-Solr-master-MacOSX/solr/core/lib/hppc-0.8.1.jar:/Users/jenkins/workspace/Lucene-Solr-master-MacOSX/solr/core/lib/htrace-core-3.2.0-incubating.jar:/Users/jenkins/workspace/Lucene-Solr-master-MacOSX/solr/core/lib/jackson-annotations-2.9.5.jar:/Users/jenkins/workspace/Lucene-Solr-master-MacOSX/solr/core/lib/jackson-core-2.9.5.jar:/Users/jenkins/workspace/Lucene-Solr-master-MacOSX/solr/core/lib/jackson-core-asl-1.9.13.jar:/Users/jenkins/workspace/Lucene-Solr-master-MacOSX/solr/core/lib/jackson-databind-2.9.5.jar:/Users/jenkins/workspace/Lucene-Solr-master-MacOSX/solr/core/lib/jackson-dataformat-smile-2.9.5.jar:/Users/jenkins/workspace/Lucene-Solr-master-MacOSX/solr/core/lib/jackson-mapper-asl-1.9.13.jar:/Users/jenkins/workspace/Lucene-Solr-master-MacOSX/solr/core/lib/janino-2.7.6.jar:/Users/jenkins/workspace/Lucene-Solr-master-MacOSX/solr/core/lib/jcl-over-slf4j-1.7.24.jar:/Users/jenkins/workspace/Lucene-Solr-master-MacOSX/solr/core/lib/log4j-1.2-api-2.11.0.jar:/Users/jenkins/workspace/Lucene-Solr-master-MacOSX/solr/core/lib/log4j-api-2.11.0.jar:/Users/jenkins/workspace/Lucene-Solr-master-MacOSX/solr/core/lib/log4j-core-2.11.0.jar:/Users/jenkins/workspace/Lucene-Solr-master-MacOSX/solr/core/lib/log4j-slf4j-impl-2.11.0.jar:/Users/jenkins/workspace/Lucene-Solr-master-MacOSX/solr/core/lib/org.restlet-2.3.0.jar:/Users/jenkins/workspace/Lucene-Solr-master-MacOSX/solr/core/lib/org.restlet.ext.servlet-2.3.0.jar:/Users/jenkins/workspace/Lucene-Solr-master-MacOSX/solr/core/lib/protobuf-java-3.1.0.jar:/Users/jenkins/workspace/Lucene-Solr-master-MacOSX/solr/core/lib/rrd4j-3.2.jar:/Users/jenkins/workspace/Lucene-Solr-master-MacOSX/solr/core/lib/spatial4j-0.7.jar:/Users/jenkins/workspace/Lucene-Solr-master-MacOSX/solr/core/lib/t-digest-3.1.jar:/Users/jenkins/workspace/Lucene-Solr-master-MacOSX/solr/solrj/lib/commons-io-2.5.jar:/Users/jenkins/workspace/Lucene-Solr-master-MacOSX/solr/solrj/lib/commons-math3-3.6.1.jar:/Users/jenkins/workspace/Lucene-Solr-master-MacOSX/solr/solrj/lib/httpclient-4.5.3.jar:/Users/jenkins/workspace/Lucene-Solr-master-MacOSX/solr/solrj/lib/httpcore-4.4.6.jar:/Users/jenkins/workspace/Lucene-Solr-master-MacOSX/solr/solrj/lib/httpmime-4.5.3.jar:/Users/jenkins/workspace/Lucene-Solr-master-MacOSX/solr/solrj/lib/jcl-over-slf4j-1.7.24.jar:/Users/jenkins/workspace/Lucene-Solr-master-MacOSX/solr/solrj/lib/noggit-0.8.jar:/Users/jenkins/workspace/Lucene-Solr-master-MacOSX/solr/solrj/lib/slf4j-api-1.7.24.jar:/Users/jenkins/workspace/Lucene-Solr-master-MacOSX/solr/solrj/lib/stax2-api-3.1.4.jar:/Users/jenkins/workspace/Lucene-Solr-master-MacOSX/solr/solrj/lib/woodstox-core-asl-4.4.1.jar:/Users/jenkins/workspace/Lucene-Solr-master-MacOSX/solr/solrj/lib/zookeeper-3.4.11.jar:/Users/jenkins/workspace/Lucene-Solr-master-MacOSX/solr/server/lib/gmetric4j-1.0.7.jar:/Users/jenkins/workspace/Lucene-Solr-master-MacOSX/solr/server/lib/javax.servlet-api-3.1.0.jar:/Users/jenkins/workspace/Lucene-Solr-master-MacOSX/solr/server/lib/jetty-continuation-9.4.11.v20180605.jar:/Users/jenkins/workspace/Lucene-Solr-master-MacOSX/solr/server/lib/jetty-deploy-9.4.11.v20180605.jar:/Users/jenkins/workspace/Lucene-Solr-master-MacOSX/solr/server/lib/jetty-http-9.4.11.v20180605.jar:/Users/jenkins/workspace/Lucene-Solr-master-MacOSX/solr/server/lib/jetty-io-9.4.11.v20180605.jar:/Users/jenkins/workspace/Lucene-Solr-master-MacOSX/solr/server/lib/jetty-jmx-9.4.11.v20180605.jar:/Users/jenkins/workspace/Lucene-Solr-master-MacOSX/solr/server/lib/jetty-rewrite-9.4.11.v20180605.jar:/Users/jenkins/workspace/Lucene-Solr-master-MacOSX/solr/server/lib/jetty-security-9.4.11.v20180605.jar:/Users/jenkins/workspace/Lucene-Solr-master-MacOSX/solr/server/lib/jetty-server-9.4.11.v20180605.jar:/Users/jenkins/workspace/Lucene-Solr-master-MacOSX/solr/server/lib/jetty-servlet-9.4.11.v20180605.jar:/Users/jenkins/workspace/Lucene-Solr-master-MacOSX/solr/server/lib/jetty-servlets-9.4.11.v20180605.jar:/Users/jenkins/workspace/Lucene-Solr-master-MacOSX/solr/server/lib/jetty-util-9.4.11.v20180605.jar:/Users/jenkins/workspace/Lucene-Solr-master-MacOSX/solr/server/lib/jetty-webapp-9.4.11.v20180605.jar:/Users/jenkins/workspace/Lucene-Solr-master-MacOSX/solr/server/lib/jetty-xml-9.4.11.v20180605.jar:/Users/jenkins/workspace/Lucene-Solr-master-MacOSX/solr/server/lib/metrics-core-3.2.6.jar:/Users/jenkins/workspace/Lucene-Solr-master-MacOSX/solr/server/lib/metrics-ganglia-3.2.6.jar:/Users/jenkins/workspace/Lucene-Solr-master-MacOSX/solr/server/lib/metrics-graphite-3.2.6.jar:/Users/jenkins/workspace/Lucene-Solr-master-MacOSX/solr/server/lib/metrics-jetty9-3.2.6.jar:/Users/jenkins/workspace/Lucene-Solr-master-MacOSX/solr/server/lib/metrics-jvm-3.2.6.jar:/Users/jenkins/workspace/Lucene-Solr-master-MacOSX/solr/example/example-DIH/solr/db/lib/derby-10.9.1.0.jar:/Users/jenkins/workspace/Lucene-Solr-master-MacOSX/solr/example/example-DIH/solr/db/lib/hsqldb-2.4.0.jar:/Users/jenkins/workspace/Lucene-Solr-master-MacOSX/lucene/build/core/classes/java:/Users/jenkins/workspace/Lucene-Solr-master-MacOSX/lucene/test-framework/lib/junit-4.10.jar:/Users/jenkins/workspace/Lucene-Solr-master-MacOSX/lucene/test-framework/lib/randomizedtesting-runner-2.6.0.jar:/Users/jenkins/workspace/Lucene-Solr-master-MacOSX/solr/core/test-lib/antlr-2.7.7.jar:/Users/jenkins/workspace/Lucene-Solr-master-MacOSX/solr/core/test-lib/antlr4-runtime-4.5.1-1.jar:/Users/jenkins/workspace/Lucene-Solr-master-MacOSX/solr/core/test-lib/apacheds-core-2.0.0-M15.jar:/Users/jenkins/workspace/Lucene-Solr-master-MacOSX/solr/core/test-lib/apacheds-core-api-2.0.0-M15.jar:/Users/jenkins/workspace/Lucene-Solr-master-MacOSX/solr/core/test-lib/apacheds-core-avl-2.0.0-M15.jar:/Users/jenkins/workspace/Lucene-Solr-master-MacOSX/solr/core/test-lib/apacheds-core-shared-2.0.0-M15.jar:/Users/jenkins/workspace/Lucene-Solr-master-MacOSX/solr/core/test-lib/apacheds-i18n-2.0.0-M15.jar:/Users/jenkins/workspace/Lucene-Solr-master-MacOSX/solr/core/test-lib/apacheds-interceptor-kerberos-2.0.0-M15.jar:/Users/jenkins/workspace/Lucene-Solr-master-MacOSX/solr/core/test-lib/apacheds-interceptors-admin-2.0.0-M15.jar:/Users/jenkins/workspace/Lucene-Solr-master-MacOSX/solr/core/test-lib/apacheds-interceptors-authn-2.0.0-M15.jar:/Users/jenkins/workspace/Lucene-Solr-master-MacOSX/solr/core/test-lib/apacheds-interceptors-authz-2.0.0-M15.jar:/Users/jenkins/workspace/Lucene-Solr-master-MacOSX/solr/core/test-lib/apacheds-interceptors-changelog-2.0.0-M15.jar:/Users/jenkins/workspace/Lucene-Solr-master-MacOSX/solr/core/test-lib/apacheds-interceptors-collective-2.0.0-M15.jar:/Users/jenkins/workspace/Lucene-Solr-master-MacOSX/solr/core/test-lib/apacheds-interceptors-event-2.0.0-M15.jar:/Users/jenkins/workspace/Lucene-Solr-master-MacOSX/solr/core/test-lib/apacheds-interceptors-exception-2.0.0-M15.jar:/Users/jenkins/workspace/Lucene-Solr-master-MacOSX/solr/core/test-lib/apacheds-interceptors-journal-2.0.0-M15.jar:/Users/jenkins/workspace/Lucene-Solr-master-MacOSX/solr/core/test-lib/apacheds-interceptors-normalization-2.0.0-M15.jar:/Users/jenkins/workspace/Lucene-Solr-master-MacOSX/solr/core/test-lib/apacheds-interceptors-operational-2.0.0-M15.jar:/Users/jenkins/workspace/Lucene-Solr-master-MacOSX/solr/core/test-lib/apacheds-interceptors-referral-2.0.0-M15.jar:/Users/jenkins/workspace/Lucene-Solr-master-MacOSX/solr/core/test-lib/apacheds-interceptors-schema-2.0.0-M15.jar:/Users/jenkins/workspace/Lucene-Solr-master-MacOSX/solr/core/test-lib/apacheds-interceptors-subtree-2.0.0-M15.jar:/Users/jenkins/workspace/Lucene-Solr-master-MacOSX/solr/core/test-lib/apacheds-interceptors-trigger-2.0.0-M15.jar:/Users/jenkins/workspace/Lucene-Solr-master-MacOSX/solr/core/test-lib/apacheds-jdbm-partition-2.0.0-M15.jar:/Users/jenkins/workspace/Lucene-Solr-master-MacOSX/solr/core/test-lib/apacheds-jdbm1-2.0.0-M2.jar:/Users/jenkins/workspace/Lucene-Solr-master-MacOSX/solr/core/test-lib/apacheds-kerberos-codec-2.0.0-M15.jar:/Users/jenkins/workspace/Lucene-Solr-master-MacOSX/solr/core/test-lib/apacheds-ldif-partition-2.0.0-M15.jar:/Users/jenkins/workspace/Lucene-Solr-master-MacOSX/solr/core/test-lib/apacheds-mavibot-partition-2.0.0-M15.jar:/Users/jenkins/workspace/Lucene-Solr-master-MacOSX/solr/core/test-lib/apacheds-protocol-kerberos-2.0.0-M15.jar:/Users/jenkins/workspace/Lucene-Solr-master-MacOSX/solr/core/test-lib/apacheds-protocol-ldap-2.0.0-M15.jar:/Users/jenkins/workspace/Lucene-Solr-master-MacOSX/solr/core/test-lib/apacheds-protocol-shared-2.0.0-M15.jar:/Users/jenkins/workspace/Lucene-Solr-master-MacOSX/solr/core/test-lib/apacheds-xdbm-partition-2.0.0-M15.jar:/Users/jenkins/workspace/Lucene-Solr-master-MacOSX/solr/core/test-lib/api-all-1.0.0-M20.jar:/Users/jenkins/workspace/Lucene-Solr-master-MacOSX/solr/core/test-lib/bcprov-jdk15on-1.54.jar:/Users/jenkins/workspace/Lucene-Solr-master-MacOSX/solr/core/test-lib/byte-buddy-1.6.2.jar:/Users/jenkins/workspace/Lucene-Solr-master-MacOSX/solr/core/test-lib/commons-collections-3.2.2.jar:/Users/jenkins/workspace/Lucene-Solr-master-MacOSX/solr/core/test-lib/commons-math3-3.6.1.jar:/Users/jenkins/workspace/Lucene-Solr-master-MacOSX/solr/core/test-lib/ehcache-core-2.4.4.jar:/Users/jenkins/workspace/Lucene-Solr-master-MacOSX/solr/core/test-lib/hadoop-common-2.7.4-tests.jar:/Users/jenkins/workspace/Lucene-Solr-master-MacOSX/solr/core/test-lib/hadoop-hdfs-2.7.4-tests.jar:/Users/jenkins/workspace/Lucene-Solr-master-MacOSX/solr/core/test-lib/hadoop-minikdc-2.7.4.jar:/Users/jenkins/workspace/Lucene-Solr-master-MacOSX/solr/core/test-lib/htrace-core-3.2.0-incubating.jar:/Users/jenkins/workspace/Lucene-Solr-master-MacOSX/solr/core/test-lib/jersey-core-1.9.jar:/Users/jenkins/workspace/Lucene-Solr-master-MacOSX/solr/core/test-lib/jersey-server-1.9.jar:/Users/jenkins/workspace/Lucene-Solr-master-MacOSX/solr/core/test-lib/jetty-6.1.26.jar:/Users/jenkins/workspace/Lucene-Solr-master-MacOSX/solr/core/test-lib/jetty-sslengine-6.1.26.jar:/Users/jenkins/workspace/Lucene-Solr-master-MacOSX/solr/core/test-lib/jetty-util-6.1.26.jar:/Users/jenkins/workspace/Lucene-Solr-master-MacOSX/solr/core/test-lib/mina-core-2.0.0-M5.jar:/Users/jenkins/workspace/Lucene-Solr-master-MacOSX/solr/core/test-lib/mockito-core-2.6.2.jar:/Users/jenkins/workspace/Lucene-Solr-master-MacOSX/solr/core/test-lib/netty-all-4.0.36.Final.jar:/Users/jenkins/workspace/Lucene-Solr-master-MacOSX/solr/core/test-lib/objenesis-2.5.jar:/Users/jenkins/workspace/Lucene-Solr-master-MacOSX/lucene/build/analysis/icu/lucene-analyzers-icu-8.0.0-SNAPSHOT.jar:/Users/jenkins/workspace/Lucene-Solr-master-MacOSX/solr/build/contrib/solr-analysis-extras/classes/java:/Users/jenkins/workspace/Lucene-Solr-master-MacOSX/lucene/build/queryparser/classes/test:/Users/jenkins/workspace/Lucene-Solr-master-MacOSX/lucene/build/backward-codecs/classes/test:/Users/jenkins/workspace/Lucene-Solr-master-MacOSX/solr/contrib/analysis-extras/lib/icu4j-62.1.jar:/Users/jenkins/tools/hudson.tasks.Ant_AntInstallation/ANT_1.8.2/lib/ant-launcher.jar:/Users/jenkins/.ant/lib/ivy-2.4.0.jar:/Users/jenkins/tools/hudson.tasks.Ant_AntInstallation/ANT_1.8.2/lib/ant-antlr.jar:/Users/jenkins/tools/hudson.tasks.Ant_AntInstallation/ANT_1.8.2/lib/ant-apache-bcel.jar:/Users/jenkins/tools/hudson.tasks.Ant_AntInstallation/ANT_1.8.2/lib/ant-apache-bsf.jar:/Users/jenkins/tools/hudson.tasks.Ant_AntInstallation/ANT_1.8.2/lib/ant-apache-log4j.jar:/Users/jenkins/tools/hudson.tasks.Ant_AntInstallation/ANT_1.8.2/lib/ant-apache-oro.jar:/Users/jenkins/tools/hudson.tasks.Ant_AntInstallation/ANT_1.8.2/lib/ant-apache-regexp.jar:/Users/jenkins/tools/hudson.tasks.Ant_AntInstallation/ANT_1.8.2/lib/ant-apache-resolver.jar:/Users/jenkins/tools/hudson.tasks.Ant_AntInstallation/ANT_1.8.2/lib/ant-apache-xalan2.jar:/Users/jenkins/tools/hudson.tasks.Ant_AntInstallation/ANT_1.8.2/lib/ant-commons-logging.jar:/Users/jenkins/tools/hudson.tasks.Ant_AntInstallation/ANT_1.8.2/lib/ant-commons-net.jar:/Users/jenkins/tools/hudson.tasks.Ant_AntInstallation/ANT_1.8.2/lib/ant-jai.jar:/Users/jenkins/tools/hudson.tasks.Ant_AntInstallation/ANT_1.8.2/lib/ant-javamail.jar:/Users/jenkins/tools/hudson.tasks.Ant_AntInstallation/ANT_1.8.2/lib/ant-jdepend.jar:/Users/jenkins/tools/hudson.tasks.Ant_AntInstallation/ANT_1.8.2/lib/ant-jmf.jar:/Users/jenkins/tools/hudson.tasks.Ant_AntInstallation/ANT_1.8.2/lib/ant-jsch.jar:/Users/jenkins/tools/hudson.tasks.Ant_AntInstallation/ANT_1.8.2/lib/ant-junit.jar:/Users/jenkins/tools/hudson.tasks.Ant_AntInstallation/ANT_1.8.2/lib/ant-junit4.jar:/Users/jenkins/tools/hudson.tasks.Ant_AntInstallation/ANT_1.8.2/lib/ant-netrexx.jar:/Users/jenkins/tools/hudson.tasks.Ant_AntInstallation/ANT_1.8.2/lib/ant-swing.jar:/Users/jenkins/tools/hudson.tasks.Ant_AntInstallation/ANT_1.8.2/lib/ant-testutil.jar:/Users/jenkins/tools/hudson.tasks.Ant_AntInstallation/ANT_1.8.2/lib/ant.jar:/Users/jenkins/.ivy2/cache/com.carrotsearch.randomizedtesting/junit4-ant/jars/junit4-ant-2.6.0.jar com.carrotsearch.ant.tasks.junit4.slave.SlaveMainSafe -eventsfile /Users/jenkins/workspace/Lucene-Solr-master-MacOSX/solr/build/solr-core/test/temp/junit4-J1-20180903_115833_51911943559479308566875.events @/Users/jenkins/workspace/Lucene-Solr-master-MacOSX/solr/build/solr-core/test/temp/junit4-J1-20180903_115833_51910516495899766671252.suites -stdin
   [junit4] ERROR: JVM J1 ended with an exception: Forked process returned with error code: 134. Very likely a JVM crash.  See process stdout at: /Users/jenkins/workspace/Lucene-Solr-master-MacOSX/solr/build/solr-core/test/temp/junit4-J1-20180903_115833_5197090797972741318997.sysout
   [junit4] 	at com.carrotsearch.ant.tasks.junit4.JUnit4.executeSlave(JUnit4.java:1519)
   [junit4] 	at com.carrotsearch.ant.tasks.junit4.JUnit4.access$000(JUnit4.java:126)
   [junit4] 	at com.carrotsearch.ant.tasks.junit4.JUnit4$2.call(JUnit4.java:982)
   [junit4] 	at com.carrotsearch.ant.tasks.junit4.JUnit4$2.call(JUnit4.java:979)
   [junit4] 	at java.base/java.util.concurrent.FutureTask.run(FutureTask.java:264)
   [junit4] 	at java.base/java.util.concurrent.ThreadPoolExecutor.runWorker(ThreadPoolExecutor.java:1167)
   [junit4] 	at java.base/java.util.concurrent.ThreadPoolExecutor$Worker.run(ThreadPoolExecutor.java:641)
   [junit4] 	at java.base/java.lang.Thread.run(Thread.java:844)

BUILD FAILED
/Users/jenkins/workspace/Lucene-Solr-master-MacOSX/build.xml:633: The following error occurred while executing this line:
/Users/jenkins/workspace/Lucene-Solr-master-MacOSX/build.xml:577: The following error occurred while executing this line:
/Users/jenkins/workspace/Lucene-Solr-master-MacOSX/build.xml:59: The following error occurred while executing this line:
/Users/jenkins/workspace/Lucene-Solr-master-MacOSX/solr/build.xml:267: The following error occurred while executing this line:
/Users/jenkins/workspace/Lucene-Solr-master-MacOSX/solr/common-build.xml:558: The following error occurred while executing this line:
/Users/jenkins/workspace/Lucene-Solr-master-MacOSX/lucene/common-build.xml:1568: The following error occurred while executing this line:
/Users/jenkins/workspace/Lucene-Solr-master-MacOSX/lucene/common-build.xml:1092: At least one slave process threw an exception, first: Forked process returned with error code: 134. Very likely a JVM crash.  See process stdout at: /Users/jenkins/workspace/Lucene-Solr-master-MacOSX/solr/build/solr-core/test/temp/junit4-J1-20180903_115833_5197090797972741318997.sysout

Total time: 109 minutes 10 seconds
Build step 'Invoke Ant' marked build as failure
Archiving artifacts
Setting ANT_1_8_2_HOME=/Users/jenkins/tools/hudson.tasks.Ant_AntInstallation/ANT_1.8.2
[WARNINGS] Skipping publisher since build result is FAILURE
Recording test results
Setting ANT_1_8_2_HOME=/Users/jenkins/tools/hudson.tasks.Ant_AntInstallation/ANT_1.8.2
Email was triggered for: Failure - Any
Sending email for trigger: Failure - Any
Setting ANT_1_8_2_HOME=/Users/jenkins/tools/hudson.tasks.Ant_AntInstallation/ANT_1.8.2
Setting ANT_1_8_2_HOME=/Users/jenkins/tools/hudson.tasks.Ant_AntInstallation/ANT_1.8.2
Setting ANT_1_8_2_HOME=/Users/jenkins/tools/hudson.tasks.Ant_AntInstallation/ANT_1.8.2
Setting ANT_1_8_2_HOME=/Users/jenkins/tools/hudson.tasks.Ant_AntInstallation/ANT_1.8.2

Mime
View raw message