lucene-dev mailing list archives

Site index · List index
Message view « Date » · « Thread »
Top « Date » · « Thread »
From Policeman Jenkins Server <jenk...@thetaphi.de>
Subject [JENKINS] Lucene-Solr-master-Linux (64bit/jdk1.8.0_172) - Build # 22900 - Still Unstable!
Date Sat, 22 Sep 2018 00:10:24 GMT
Build: https://jenkins.thetaphi.de/job/Lucene-Solr-master-Linux/22900/
Java: 64bit/jdk1.8.0_172 -XX:+UseCompressedOops -XX:+UseConcMarkSweepGC

4 tests failed.
FAILED:  org.apache.solr.cloud.AddReplicaTest.testAddMultipleReplicas

Error Message:
expected:<COMPLETED> but was:<FAILED>

Stack Trace:
java.lang.AssertionError: expected:<COMPLETED> but was:<FAILED>
	at __randomizedtesting.SeedInfo.seed([8ECB21C4F94E3823:699BFE1E49BD004D]:0)
	at org.junit.Assert.fail(Assert.java:93)
	at org.junit.Assert.failNotEquals(Assert.java:647)
	at org.junit.Assert.assertEquals(Assert.java:128)
	at org.junit.Assert.assertEquals(Assert.java:147)
	at org.apache.solr.cloud.AddReplicaTest.testAddMultipleReplicas(AddReplicaTest.java:110)
	at sun.reflect.NativeMethodAccessorImpl.invoke0(Native Method)
	at sun.reflect.NativeMethodAccessorImpl.invoke(NativeMethodAccessorImpl.java:62)
	at sun.reflect.DelegatingMethodAccessorImpl.invoke(DelegatingMethodAccessorImpl.java:43)
	at java.lang.reflect.Method.invoke(Method.java:498)
	at com.carrotsearch.randomizedtesting.RandomizedRunner.invoke(RandomizedRunner.java:1742)
	at com.carrotsearch.randomizedtesting.RandomizedRunner$8.evaluate(RandomizedRunner.java:935)
	at com.carrotsearch.randomizedtesting.RandomizedRunner$9.evaluate(RandomizedRunner.java:971)
	at com.carrotsearch.randomizedtesting.RandomizedRunner$10.evaluate(RandomizedRunner.java:985)
	at com.carrotsearch.randomizedtesting.rules.SystemPropertiesRestoreRule$1.evaluate(SystemPropertiesRestoreRule.java:57)
	at org.apache.lucene.util.TestRuleSetupTeardownChained$1.evaluate(TestRuleSetupTeardownChained.java:49)
	at org.apache.lucene.util.AbstractBeforeAfterRule$1.evaluate(AbstractBeforeAfterRule.java:45)
	at org.apache.lucene.util.TestRuleThreadAndTestName$1.evaluate(TestRuleThreadAndTestName.java:48)
	at org.apache.lucene.util.TestRuleIgnoreAfterMaxFailures$1.evaluate(TestRuleIgnoreAfterMaxFailures.java:64)
	at org.apache.lucene.util.TestRuleMarkFailure$1.evaluate(TestRuleMarkFailure.java:47)
	at com.carrotsearch.randomizedtesting.rules.StatementAdapter.evaluate(StatementAdapter.java:36)
	at com.carrotsearch.randomizedtesting.ThreadLeakControl$StatementRunner.run(ThreadLeakControl.java:368)
	at com.carrotsearch.randomizedtesting.ThreadLeakControl.forkTimeoutingTask(ThreadLeakControl.java:817)
	at com.carrotsearch.randomizedtesting.ThreadLeakControl$3.evaluate(ThreadLeakControl.java:468)
	at com.carrotsearch.randomizedtesting.RandomizedRunner.runSingleTest(RandomizedRunner.java:944)
	at com.carrotsearch.randomizedtesting.RandomizedRunner$5.evaluate(RandomizedRunner.java:830)
	at com.carrotsearch.randomizedtesting.RandomizedRunner$6.evaluate(RandomizedRunner.java:880)
	at com.carrotsearch.randomizedtesting.RandomizedRunner$7.evaluate(RandomizedRunner.java:891)
	at com.carrotsearch.randomizedtesting.rules.StatementAdapter.evaluate(StatementAdapter.java:36)
	at com.carrotsearch.randomizedtesting.rules.SystemPropertiesRestoreRule$1.evaluate(SystemPropertiesRestoreRule.java:57)
	at org.apache.lucene.util.AbstractBeforeAfterRule$1.evaluate(AbstractBeforeAfterRule.java:45)
	at com.carrotsearch.randomizedtesting.rules.StatementAdapter.evaluate(StatementAdapter.java:36)
	at org.apache.lucene.util.TestRuleStoreClassName$1.evaluate(TestRuleStoreClassName.java:41)
	at com.carrotsearch.randomizedtesting.rules.NoShadowingOrOverridesOnMethodsRule$1.evaluate(NoShadowingOrOverridesOnMethodsRule.java:40)
	at com.carrotsearch.randomizedtesting.rules.NoShadowingOrOverridesOnMethodsRule$1.evaluate(NoShadowingOrOverridesOnMethodsRule.java:40)
	at com.carrotsearch.randomizedtesting.rules.StatementAdapter.evaluate(StatementAdapter.java:36)
	at com.carrotsearch.randomizedtesting.rules.StatementAdapter.evaluate(StatementAdapter.java:36)
	at com.carrotsearch.randomizedtesting.rules.StatementAdapter.evaluate(StatementAdapter.java:36)
	at org.apache.lucene.util.TestRuleAssertionsRequired$1.evaluate(TestRuleAssertionsRequired.java:53)
	at org.apache.lucene.util.TestRuleMarkFailure$1.evaluate(TestRuleMarkFailure.java:47)
	at org.apache.lucene.util.TestRuleIgnoreAfterMaxFailures$1.evaluate(TestRuleIgnoreAfterMaxFailures.java:64)
	at org.apache.lucene.util.TestRuleIgnoreTestSuites$1.evaluate(TestRuleIgnoreTestSuites.java:54)
	at com.carrotsearch.randomizedtesting.rules.StatementAdapter.evaluate(StatementAdapter.java:36)
	at com.carrotsearch.randomizedtesting.ThreadLeakControl$StatementRunner.run(ThreadLeakControl.java:368)
	at java.lang.Thread.run(Thread.java:748)


FAILED:  org.apache.solr.cloud.AddReplicaTest.testAddMultipleReplicas

Error Message:
expected:<COMPLETED> but was:<FAILED>

Stack Trace:
java.lang.AssertionError: expected:<COMPLETED> but was:<FAILED>
	at __randomizedtesting.SeedInfo.seed([8ECB21C4F94E3823:699BFE1E49BD004D]:0)
	at org.junit.Assert.fail(Assert.java:93)
	at org.junit.Assert.failNotEquals(Assert.java:647)
	at org.junit.Assert.assertEquals(Assert.java:128)
	at org.junit.Assert.assertEquals(Assert.java:147)
	at org.apache.solr.cloud.AddReplicaTest.testAddMultipleReplicas(AddReplicaTest.java:110)
	at sun.reflect.NativeMethodAccessorImpl.invoke0(Native Method)
	at sun.reflect.NativeMethodAccessorImpl.invoke(NativeMethodAccessorImpl.java:62)
	at sun.reflect.DelegatingMethodAccessorImpl.invoke(DelegatingMethodAccessorImpl.java:43)
	at java.lang.reflect.Method.invoke(Method.java:498)
	at com.carrotsearch.randomizedtesting.RandomizedRunner.invoke(RandomizedRunner.java:1742)
	at com.carrotsearch.randomizedtesting.RandomizedRunner$8.evaluate(RandomizedRunner.java:935)
	at com.carrotsearch.randomizedtesting.RandomizedRunner$9.evaluate(RandomizedRunner.java:971)
	at com.carrotsearch.randomizedtesting.RandomizedRunner$10.evaluate(RandomizedRunner.java:985)
	at com.carrotsearch.randomizedtesting.rules.SystemPropertiesRestoreRule$1.evaluate(SystemPropertiesRestoreRule.java:57)
	at org.apache.lucene.util.TestRuleSetupTeardownChained$1.evaluate(TestRuleSetupTeardownChained.java:49)
	at org.apache.lucene.util.AbstractBeforeAfterRule$1.evaluate(AbstractBeforeAfterRule.java:45)
	at org.apache.lucene.util.TestRuleThreadAndTestName$1.evaluate(TestRuleThreadAndTestName.java:48)
	at org.apache.lucene.util.TestRuleIgnoreAfterMaxFailures$1.evaluate(TestRuleIgnoreAfterMaxFailures.java:64)
	at org.apache.lucene.util.TestRuleMarkFailure$1.evaluate(TestRuleMarkFailure.java:47)
	at com.carrotsearch.randomizedtesting.rules.StatementAdapter.evaluate(StatementAdapter.java:36)
	at com.carrotsearch.randomizedtesting.ThreadLeakControl$StatementRunner.run(ThreadLeakControl.java:368)
	at com.carrotsearch.randomizedtesting.ThreadLeakControl.forkTimeoutingTask(ThreadLeakControl.java:817)
	at com.carrotsearch.randomizedtesting.ThreadLeakControl$3.evaluate(ThreadLeakControl.java:468)
	at com.carrotsearch.randomizedtesting.RandomizedRunner.runSingleTest(RandomizedRunner.java:944)
	at com.carrotsearch.randomizedtesting.RandomizedRunner$5.evaluate(RandomizedRunner.java:830)
	at com.carrotsearch.randomizedtesting.RandomizedRunner$6.evaluate(RandomizedRunner.java:880)
	at com.carrotsearch.randomizedtesting.RandomizedRunner$7.evaluate(RandomizedRunner.java:891)
	at com.carrotsearch.randomizedtesting.rules.StatementAdapter.evaluate(StatementAdapter.java:36)
	at com.carrotsearch.randomizedtesting.rules.SystemPropertiesRestoreRule$1.evaluate(SystemPropertiesRestoreRule.java:57)
	at org.apache.lucene.util.AbstractBeforeAfterRule$1.evaluate(AbstractBeforeAfterRule.java:45)
	at com.carrotsearch.randomizedtesting.rules.StatementAdapter.evaluate(StatementAdapter.java:36)
	at org.apache.lucene.util.TestRuleStoreClassName$1.evaluate(TestRuleStoreClassName.java:41)
	at com.carrotsearch.randomizedtesting.rules.NoShadowingOrOverridesOnMethodsRule$1.evaluate(NoShadowingOrOverridesOnMethodsRule.java:40)
	at com.carrotsearch.randomizedtesting.rules.NoShadowingOrOverridesOnMethodsRule$1.evaluate(NoShadowingOrOverridesOnMethodsRule.java:40)
	at com.carrotsearch.randomizedtesting.rules.StatementAdapter.evaluate(StatementAdapter.java:36)
	at com.carrotsearch.randomizedtesting.rules.StatementAdapter.evaluate(StatementAdapter.java:36)
	at com.carrotsearch.randomizedtesting.rules.StatementAdapter.evaluate(StatementAdapter.java:36)
	at org.apache.lucene.util.TestRuleAssertionsRequired$1.evaluate(TestRuleAssertionsRequired.java:53)
	at org.apache.lucene.util.TestRuleMarkFailure$1.evaluate(TestRuleMarkFailure.java:47)
	at org.apache.lucene.util.TestRuleIgnoreAfterMaxFailures$1.evaluate(TestRuleIgnoreAfterMaxFailures.java:64)
	at org.apache.lucene.util.TestRuleIgnoreTestSuites$1.evaluate(TestRuleIgnoreTestSuites.java:54)
	at com.carrotsearch.randomizedtesting.rules.StatementAdapter.evaluate(StatementAdapter.java:36)
	at com.carrotsearch.randomizedtesting.ThreadLeakControl$StatementRunner.run(ThreadLeakControl.java:368)
	at java.lang.Thread.run(Thread.java:748)


FAILED:  org.apache.solr.cloud.AddReplicaTest.testAddMultipleReplicas

Error Message:
expected:<COMPLETED> but was:<FAILED>

Stack Trace:
java.lang.AssertionError: expected:<COMPLETED> but was:<FAILED>
	at __randomizedtesting.SeedInfo.seed([8ECB21C4F94E3823:699BFE1E49BD004D]:0)
	at org.junit.Assert.fail(Assert.java:93)
	at org.junit.Assert.failNotEquals(Assert.java:647)
	at org.junit.Assert.assertEquals(Assert.java:128)
	at org.junit.Assert.assertEquals(Assert.java:147)
	at org.apache.solr.cloud.AddReplicaTest.testAddMultipleReplicas(AddReplicaTest.java:110)
	at sun.reflect.NativeMethodAccessorImpl.invoke0(Native Method)
	at sun.reflect.NativeMethodAccessorImpl.invoke(NativeMethodAccessorImpl.java:62)
	at sun.reflect.DelegatingMethodAccessorImpl.invoke(DelegatingMethodAccessorImpl.java:43)
	at java.lang.reflect.Method.invoke(Method.java:498)
	at com.carrotsearch.randomizedtesting.RandomizedRunner.invoke(RandomizedRunner.java:1742)
	at com.carrotsearch.randomizedtesting.RandomizedRunner$8.evaluate(RandomizedRunner.java:935)
	at com.carrotsearch.randomizedtesting.RandomizedRunner$9.evaluate(RandomizedRunner.java:971)
	at com.carrotsearch.randomizedtesting.RandomizedRunner$10.evaluate(RandomizedRunner.java:985)
	at com.carrotsearch.randomizedtesting.rules.SystemPropertiesRestoreRule$1.evaluate(SystemPropertiesRestoreRule.java:57)
	at org.apache.lucene.util.TestRuleSetupTeardownChained$1.evaluate(TestRuleSetupTeardownChained.java:49)
	at org.apache.lucene.util.AbstractBeforeAfterRule$1.evaluate(AbstractBeforeAfterRule.java:45)
	at org.apache.lucene.util.TestRuleThreadAndTestName$1.evaluate(TestRuleThreadAndTestName.java:48)
	at org.apache.lucene.util.TestRuleIgnoreAfterMaxFailures$1.evaluate(TestRuleIgnoreAfterMaxFailures.java:64)
	at org.apache.lucene.util.TestRuleMarkFailure$1.evaluate(TestRuleMarkFailure.java:47)
	at com.carrotsearch.randomizedtesting.rules.StatementAdapter.evaluate(StatementAdapter.java:36)
	at com.carrotsearch.randomizedtesting.ThreadLeakControl$StatementRunner.run(ThreadLeakControl.java:368)
	at com.carrotsearch.randomizedtesting.ThreadLeakControl.forkTimeoutingTask(ThreadLeakControl.java:817)
	at com.carrotsearch.randomizedtesting.ThreadLeakControl$3.evaluate(ThreadLeakControl.java:468)
	at com.carrotsearch.randomizedtesting.RandomizedRunner.runSingleTest(RandomizedRunner.java:944)
	at com.carrotsearch.randomizedtesting.RandomizedRunner$5.evaluate(RandomizedRunner.java:830)
	at com.carrotsearch.randomizedtesting.RandomizedRunner$6.evaluate(RandomizedRunner.java:880)
	at com.carrotsearch.randomizedtesting.RandomizedRunner$7.evaluate(RandomizedRunner.java:891)
	at com.carrotsearch.randomizedtesting.rules.StatementAdapter.evaluate(StatementAdapter.java:36)
	at com.carrotsearch.randomizedtesting.rules.SystemPropertiesRestoreRule$1.evaluate(SystemPropertiesRestoreRule.java:57)
	at org.apache.lucene.util.AbstractBeforeAfterRule$1.evaluate(AbstractBeforeAfterRule.java:45)
	at com.carrotsearch.randomizedtesting.rules.StatementAdapter.evaluate(StatementAdapter.java:36)
	at org.apache.lucene.util.TestRuleStoreClassName$1.evaluate(TestRuleStoreClassName.java:41)
	at com.carrotsearch.randomizedtesting.rules.NoShadowingOrOverridesOnMethodsRule$1.evaluate(NoShadowingOrOverridesOnMethodsRule.java:40)
	at com.carrotsearch.randomizedtesting.rules.NoShadowingOrOverridesOnMethodsRule$1.evaluate(NoShadowingOrOverridesOnMethodsRule.java:40)
	at com.carrotsearch.randomizedtesting.rules.StatementAdapter.evaluate(StatementAdapter.java:36)
	at com.carrotsearch.randomizedtesting.rules.StatementAdapter.evaluate(StatementAdapter.java:36)
	at com.carrotsearch.randomizedtesting.rules.StatementAdapter.evaluate(StatementAdapter.java:36)
	at org.apache.lucene.util.TestRuleAssertionsRequired$1.evaluate(TestRuleAssertionsRequired.java:53)
	at org.apache.lucene.util.TestRuleMarkFailure$1.evaluate(TestRuleMarkFailure.java:47)
	at org.apache.lucene.util.TestRuleIgnoreAfterMaxFailures$1.evaluate(TestRuleIgnoreAfterMaxFailures.java:64)
	at org.apache.lucene.util.TestRuleIgnoreTestSuites$1.evaluate(TestRuleIgnoreTestSuites.java:54)
	at com.carrotsearch.randomizedtesting.rules.StatementAdapter.evaluate(StatementAdapter.java:36)
	at com.carrotsearch.randomizedtesting.ThreadLeakControl$StatementRunner.run(ThreadLeakControl.java:368)
	at java.lang.Thread.run(Thread.java:748)


FAILED:  org.apache.solr.cloud.AddReplicaTest.testAddMultipleReplicas

Error Message:
expected:<COMPLETED> but was:<FAILED>

Stack Trace:
java.lang.AssertionError: expected:<COMPLETED> but was:<FAILED>
	at __randomizedtesting.SeedInfo.seed([8ECB21C4F94E3823:699BFE1E49BD004D]:0)
	at org.junit.Assert.fail(Assert.java:93)
	at org.junit.Assert.failNotEquals(Assert.java:647)
	at org.junit.Assert.assertEquals(Assert.java:128)
	at org.junit.Assert.assertEquals(Assert.java:147)
	at org.apache.solr.cloud.AddReplicaTest.testAddMultipleReplicas(AddReplicaTest.java:110)
	at sun.reflect.NativeMethodAccessorImpl.invoke0(Native Method)
	at sun.reflect.NativeMethodAccessorImpl.invoke(NativeMethodAccessorImpl.java:62)
	at sun.reflect.DelegatingMethodAccessorImpl.invoke(DelegatingMethodAccessorImpl.java:43)
	at java.lang.reflect.Method.invoke(Method.java:498)
	at com.carrotsearch.randomizedtesting.RandomizedRunner.invoke(RandomizedRunner.java:1742)
	at com.carrotsearch.randomizedtesting.RandomizedRunner$8.evaluate(RandomizedRunner.java:935)
	at com.carrotsearch.randomizedtesting.RandomizedRunner$9.evaluate(RandomizedRunner.java:971)
	at com.carrotsearch.randomizedtesting.RandomizedRunner$10.evaluate(RandomizedRunner.java:985)
	at com.carrotsearch.randomizedtesting.rules.SystemPropertiesRestoreRule$1.evaluate(SystemPropertiesRestoreRule.java:57)
	at org.apache.lucene.util.TestRuleSetupTeardownChained$1.evaluate(TestRuleSetupTeardownChained.java:49)
	at org.apache.lucene.util.AbstractBeforeAfterRule$1.evaluate(AbstractBeforeAfterRule.java:45)
	at org.apache.lucene.util.TestRuleThreadAndTestName$1.evaluate(TestRuleThreadAndTestName.java:48)
	at org.apache.lucene.util.TestRuleIgnoreAfterMaxFailures$1.evaluate(TestRuleIgnoreAfterMaxFailures.java:64)
	at org.apache.lucene.util.TestRuleMarkFailure$1.evaluate(TestRuleMarkFailure.java:47)
	at com.carrotsearch.randomizedtesting.rules.StatementAdapter.evaluate(StatementAdapter.java:36)
	at com.carrotsearch.randomizedtesting.ThreadLeakControl$StatementRunner.run(ThreadLeakControl.java:368)
	at com.carrotsearch.randomizedtesting.ThreadLeakControl.forkTimeoutingTask(ThreadLeakControl.java:817)
	at com.carrotsearch.randomizedtesting.ThreadLeakControl$3.evaluate(ThreadLeakControl.java:468)
	at com.carrotsearch.randomizedtesting.RandomizedRunner.runSingleTest(RandomizedRunner.java:944)
	at com.carrotsearch.randomizedtesting.RandomizedRunner$5.evaluate(RandomizedRunner.java:830)
	at com.carrotsearch.randomizedtesting.RandomizedRunner$6.evaluate(RandomizedRunner.java:880)
	at com.carrotsearch.randomizedtesting.RandomizedRunner$7.evaluate(RandomizedRunner.java:891)
	at com.carrotsearch.randomizedtesting.rules.StatementAdapter.evaluate(StatementAdapter.java:36)
	at com.carrotsearch.randomizedtesting.rules.SystemPropertiesRestoreRule$1.evaluate(SystemPropertiesRestoreRule.java:57)
	at org.apache.lucene.util.AbstractBeforeAfterRule$1.evaluate(AbstractBeforeAfterRule.java:45)
	at com.carrotsearch.randomizedtesting.rules.StatementAdapter.evaluate(StatementAdapter.java:36)
	at org.apache.lucene.util.TestRuleStoreClassName$1.evaluate(TestRuleStoreClassName.java:41)
	at com.carrotsearch.randomizedtesting.rules.NoShadowingOrOverridesOnMethodsRule$1.evaluate(NoShadowingOrOverridesOnMethodsRule.java:40)
	at com.carrotsearch.randomizedtesting.rules.NoShadowingOrOverridesOnMethodsRule$1.evaluate(NoShadowingOrOverridesOnMethodsRule.java:40)
	at com.carrotsearch.randomizedtesting.rules.StatementAdapter.evaluate(StatementAdapter.java:36)
	at com.carrotsearch.randomizedtesting.rules.StatementAdapter.evaluate(StatementAdapter.java:36)
	at com.carrotsearch.randomizedtesting.rules.StatementAdapter.evaluate(StatementAdapter.java:36)
	at org.apache.lucene.util.TestRuleAssertionsRequired$1.evaluate(TestRuleAssertionsRequired.java:53)
	at org.apache.lucene.util.TestRuleMarkFailure$1.evaluate(TestRuleMarkFailure.java:47)
	at org.apache.lucene.util.TestRuleIgnoreAfterMaxFailures$1.evaluate(TestRuleIgnoreAfterMaxFailures.java:64)
	at org.apache.lucene.util.TestRuleIgnoreTestSuites$1.evaluate(TestRuleIgnoreTestSuites.java:54)
	at com.carrotsearch.randomizedtesting.rules.StatementAdapter.evaluate(StatementAdapter.java:36)
	at com.carrotsearch.randomizedtesting.ThreadLeakControl$StatementRunner.run(ThreadLeakControl.java:368)
	at java.lang.Thread.run(Thread.java:748)




Build Log:
[...truncated 12843 lines...]
   [junit4] Suite: org.apache.solr.cloud.AddReplicaTest
   [junit4]   2> Creating dataDir: /home/jenkins/workspace/Lucene-Solr-master-Linux/solr/build/solr-core/test/J2/temp/solr.cloud.AddReplicaTest_8ECB21C4F94E3823-001/init-core-data-001
   [junit4]   2> 655071 INFO  (SUITE-AddReplicaTest-seed#[8ECB21C4F94E3823]-worker) [    ] o.a.s.c.MiniSolrCloudCluster Starting cluster of 4 servers in /home/jenkins/workspace/Lucene-Solr-master-Linux/solr/build/solr-core/test/J2/temp/solr.cloud.AddReplicaTest_8ECB21C4F94E3823-001/tempDir-001
   [junit4]   2> 655071 INFO  (SUITE-AddReplicaTest-seed#[8ECB21C4F94E3823]-worker) [    ] o.a.s.c.ZkTestServer STARTING ZK TEST SERVER
   [junit4]   2> 655071 INFO  (Thread-861) [    ] o.a.s.c.ZkTestServer client port:0.0.0.0/0.0.0.0:0
   [junit4]   2> 655071 INFO  (Thread-861) [    ] o.a.s.c.ZkTestServer Starting server
   [junit4]   2> 655073 ERROR (Thread-861) [    ] o.a.z.s.ZooKeeperServer ZKShutdownHandler is not registered, so ZooKeeper server won't take any action on ERROR or SHUTDOWN server state changes
   [junit4]   2> 655171 INFO  (SUITE-AddReplicaTest-seed#[8ECB21C4F94E3823]-worker) [    ] o.a.s.c.ZkTestServer start zk server on port:38739
   [junit4]   2> 655173 INFO  (zkConnectionManagerCallback-1468-thread-1) [    ] o.a.s.c.c.ConnectionManager zkClient has connected
   [junit4]   2> 655177 INFO  (jetty-launcher-1465-thread-4) [    ] o.e.j.s.Server jetty-9.4.11.v20180605; built: 2018-06-05T18:24:03.829Z; git: d5fc0523cfa96bfebfbda19606cad384d772f04c; jvm 1.8.0_172-b11
   [junit4]   2> 655177 INFO  (jetty-launcher-1465-thread-2) [    ] o.e.j.s.Server jetty-9.4.11.v20180605; built: 2018-06-05T18:24:03.829Z; git: d5fc0523cfa96bfebfbda19606cad384d772f04c; jvm 1.8.0_172-b11
   [junit4]   2> 655177 INFO  (jetty-launcher-1465-thread-1) [    ] o.e.j.s.Server jetty-9.4.11.v20180605; built: 2018-06-05T18:24:03.829Z; git: d5fc0523cfa96bfebfbda19606cad384d772f04c; jvm 1.8.0_172-b11
   [junit4]   2> 655177 INFO  (jetty-launcher-1465-thread-3) [    ] o.e.j.s.Server jetty-9.4.11.v20180605; built: 2018-06-05T18:24:03.829Z; git: d5fc0523cfa96bfebfbda19606cad384d772f04c; jvm 1.8.0_172-b11
   [junit4]   2> 655178 INFO  (jetty-launcher-1465-thread-2) [    ] o.e.j.s.session DefaultSessionIdManager workerName=node0
   [junit4]   2> 655178 INFO  (jetty-launcher-1465-thread-2) [    ] o.e.j.s.session No SessionScavenger set, using defaults
   [junit4]   2> 655178 INFO  (jetty-launcher-1465-thread-1) [    ] o.e.j.s.session DefaultSessionIdManager workerName=node0
   [junit4]   2> 655178 INFO  (jetty-launcher-1465-thread-2) [    ] o.e.j.s.session node0 Scavenging every 660000ms
   [junit4]   2> 655178 INFO  (jetty-launcher-1465-thread-1) [    ] o.e.j.s.session No SessionScavenger set, using defaults
   [junit4]   2> 655178 INFO  (jetty-launcher-1465-thread-1) [    ] o.e.j.s.session node0 Scavenging every 660000ms
   [junit4]   2> 655178 INFO  (jetty-launcher-1465-thread-3) [    ] o.e.j.s.session DefaultSessionIdManager workerName=node0
   [junit4]   2> 655178 INFO  (jetty-launcher-1465-thread-3) [    ] o.e.j.s.session No SessionScavenger set, using defaults
   [junit4]   2> 655178 INFO  (jetty-launcher-1465-thread-3) [    ] o.e.j.s.session node0 Scavenging every 660000ms
   [junit4]   2> 655178 INFO  (jetty-launcher-1465-thread-2) [    ] o.e.j.s.h.ContextHandler Started o.e.j.s.ServletContextHandler@56ea26f6{/solr,null,AVAILABLE}
   [junit4]   2> 655179 INFO  (jetty-launcher-1465-thread-2) [    ] o.e.j.s.AbstractConnector Started ServerConnector@608c36d{SSL,[ssl, http/1.1]}{127.0.0.1:37497}
   [junit4]   2> 655179 INFO  (jetty-launcher-1465-thread-2) [    ] o.e.j.s.Server Started @655213ms
   [junit4]   2> 655179 INFO  (jetty-launcher-1465-thread-2) [    ] o.a.s.c.s.e.JettySolrRunner Jetty properties: {hostContext=/solr, hostPort=37497}
   [junit4]   2> 655179 INFO  (jetty-launcher-1465-thread-1) [    ] o.e.j.s.h.ContextHandler Started o.e.j.s.ServletContextHandler@bd78ce7{/solr,null,AVAILABLE}
   [junit4]   2> 655179 ERROR (jetty-launcher-1465-thread-2) [    ] o.a.s.u.StartupLoggingUtils Missing Java Option solr.log.dir. Logging may be missing or incomplete.
   [junit4]   2> 655179 INFO  (jetty-launcher-1465-thread-2) [    ] o.a.s.s.SolrDispatchFilter Using logger factory org.apache.logging.slf4j.Log4jLoggerFactory
   [junit4]   2> 655179 INFO  (jetty-launcher-1465-thread-2) [    ] o.a.s.s.SolrDispatchFilter  ___      _       Welcome to Apache Solr™ version 8.0.0
   [junit4]   2> 655179 INFO  (jetty-launcher-1465-thread-2) [    ] o.a.s.s.SolrDispatchFilter / __| ___| |_ _   Starting in cloud mode on port null
   [junit4]   2> 655179 INFO  (jetty-launcher-1465-thread-2) [    ] o.a.s.s.SolrDispatchFilter \__ \/ _ \ | '_|  Install dir: null
   [junit4]   2> 655179 INFO  (jetty-launcher-1465-thread-2) [    ] o.a.s.s.SolrDispatchFilter |___/\___/_|_|    Start time: 2018-09-21T23:09:47.611Z
   [junit4]   2> 655180 INFO  (jetty-launcher-1465-thread-3) [    ] o.e.j.s.h.ContextHandler Started o.e.j.s.ServletContextHandler@299f1341{/solr,null,AVAILABLE}
   [junit4]   2> 655180 INFO  (jetty-launcher-1465-thread-1) [    ] o.e.j.s.AbstractConnector Started ServerConnector@559629e7{SSL,[ssl, http/1.1]}{127.0.0.1:43267}
   [junit4]   2> 655180 INFO  (jetty-launcher-1465-thread-1) [    ] o.e.j.s.Server Started @655214ms
   [junit4]   2> 655180 INFO  (jetty-launcher-1465-thread-1) [    ] o.a.s.c.s.e.JettySolrRunner Jetty properties: {hostContext=/solr, hostPort=43267}
   [junit4]   2> 655180 ERROR (jetty-launcher-1465-thread-1) [    ] o.a.s.u.StartupLoggingUtils Missing Java Option solr.log.dir. Logging may be missing or incomplete.
   [junit4]   2> 655180 INFO  (jetty-launcher-1465-thread-1) [    ] o.a.s.s.SolrDispatchFilter Using logger factory org.apache.logging.slf4j.Log4jLoggerFactory
   [junit4]   2> 655180 INFO  (jetty-launcher-1465-thread-1) [    ] o.a.s.s.SolrDispatchFilter  ___      _       Welcome to Apache Solr™ version 8.0.0
   [junit4]   2> 655180 INFO  (jetty-launcher-1465-thread-1) [    ] o.a.s.s.SolrDispatchFilter / __| ___| |_ _   Starting in cloud mode on port null
   [junit4]   2> 655180 INFO  (jetty-launcher-1465-thread-1) [    ] o.a.s.s.SolrDispatchFilter \__ \/ _ \ | '_|  Install dir: null
   [junit4]   2> 655180 INFO  (jetty-launcher-1465-thread-1) [    ] o.a.s.s.SolrDispatchFilter |___/\___/_|_|    Start time: 2018-09-21T23:09:47.612Z
   [junit4]   2> 655180 INFO  (jetty-launcher-1465-thread-3) [    ] o.e.j.s.AbstractConnector Started ServerConnector@53cda32b{SSL,[ssl, http/1.1]}{127.0.0.1:35859}
   [junit4]   2> 655180 INFO  (jetty-launcher-1465-thread-4) [    ] o.e.j.s.session DefaultSessionIdManager workerName=node0
   [junit4]   2> 655180 INFO  (jetty-launcher-1465-thread-3) [    ] o.e.j.s.Server Started @655214ms
   [junit4]   2> 655180 INFO  (jetty-launcher-1465-thread-4) [    ] o.e.j.s.session No SessionScavenger set, using defaults
   [junit4]   2> 655180 INFO  (jetty-launcher-1465-thread-3) [    ] o.a.s.c.s.e.JettySolrRunner Jetty properties: {hostContext=/solr, hostPort=35859}
   [junit4]   2> 655180 INFO  (jetty-launcher-1465-thread-4) [    ] o.e.j.s.session node0 Scavenging every 660000ms
   [junit4]   2> 655181 ERROR (jetty-launcher-1465-thread-3) [    ] o.a.s.u.StartupLoggingUtils Missing Java Option solr.log.dir. Logging may be missing or incomplete.
   [junit4]   2> 655181 INFO  (jetty-launcher-1465-thread-3) [    ] o.a.s.s.SolrDispatchFilter Using logger factory org.apache.logging.slf4j.Log4jLoggerFactory
   [junit4]   2> 655181 INFO  (jetty-launcher-1465-thread-3) [    ] o.a.s.s.SolrDispatchFilter  ___      _       Welcome to Apache Solr™ version 8.0.0
   [junit4]   2> 655181 INFO  (zkConnectionManagerCallback-1470-thread-1) [    ] o.a.s.c.c.ConnectionManager zkClient has connected
   [junit4]   2> 655181 INFO  (jetty-launcher-1465-thread-4) [    ] o.e.j.s.h.ContextHandler Started o.e.j.s.ServletContextHandler@36af5c64{/solr,null,AVAILABLE}
   [junit4]   2> 655181 INFO  (jetty-launcher-1465-thread-3) [    ] o.a.s.s.SolrDispatchFilter / __| ___| |_ _   Starting in cloud mode on port null
   [junit4]   2> 655181 INFO  (jetty-launcher-1465-thread-3) [    ] o.a.s.s.SolrDispatchFilter \__ \/ _ \ | '_|  Install dir: null
   [junit4]   2> 655181 INFO  (jetty-launcher-1465-thread-3) [    ] o.a.s.s.SolrDispatchFilter |___/\___/_|_|    Start time: 2018-09-21T23:09:47.613Z
   [junit4]   2> 655181 INFO  (jetty-launcher-1465-thread-2) [    ] o.a.s.s.SolrDispatchFilter solr.xml found in ZooKeeper. Loading...
   [junit4]   2> 655182 INFO  (jetty-launcher-1465-thread-4) [    ] o.e.j.s.AbstractConnector Started ServerConnector@337cb699{SSL,[ssl, http/1.1]}{127.0.0.1:35861}
   [junit4]   2> 655182 INFO  (jetty-launcher-1465-thread-4) [    ] o.e.j.s.Server Started @655216ms
   [junit4]   2> 655182 INFO  (jetty-launcher-1465-thread-4) [    ] o.a.s.c.s.e.JettySolrRunner Jetty properties: {hostContext=/solr, hostPort=35861}
   [junit4]   2> 655182 ERROR (jetty-launcher-1465-thread-4) [    ] o.a.s.u.StartupLoggingUtils Missing Java Option solr.log.dir. Logging may be missing or incomplete.
   [junit4]   2> 655182 INFO  (jetty-launcher-1465-thread-4) [    ] o.a.s.s.SolrDispatchFilter Using logger factory org.apache.logging.slf4j.Log4jLoggerFactory
   [junit4]   2> 655182 INFO  (jetty-launcher-1465-thread-4) [    ] o.a.s.s.SolrDispatchFilter  ___      _       Welcome to Apache Solr™ version 8.0.0
   [junit4]   2> 655182 INFO  (jetty-launcher-1465-thread-4) [    ] o.a.s.s.SolrDispatchFilter / __| ___| |_ _   Starting in cloud mode on port null
   [junit4]   2> 655182 INFO  (jetty-launcher-1465-thread-4) [    ] o.a.s.s.SolrDispatchFilter \__ \/ _ \ | '_|  Install dir: null
   [junit4]   2> 655182 INFO  (jetty-launcher-1465-thread-4) [    ] o.a.s.s.SolrDispatchFilter |___/\___/_|_|    Start time: 2018-09-21T23:09:47.614Z
   [junit4]   2> 655182 INFO  (zkConnectionManagerCallback-1474-thread-1) [    ] o.a.s.c.c.ConnectionManager zkClient has connected
   [junit4]   2> 655183 INFO  (jetty-launcher-1465-thread-3) [    ] o.a.s.s.SolrDispatchFilter solr.xml found in ZooKeeper. Loading...
   [junit4]   2> 655186 WARN  (NIOServerCxn.Factory:0.0.0.0/0.0.0.0:0) [    ] o.a.z.s.NIOServerCnxn Unable to read additional data from client sessionid 0x100bcc5942d0003, likely client has closed socket
   [junit4]   2> 655191 INFO  (zkConnectionManagerCallback-1472-thread-1) [    ] o.a.s.c.c.ConnectionManager zkClient has connected
   [junit4]   2> 655192 INFO  (jetty-launcher-1465-thread-1) [    ] o.a.s.s.SolrDispatchFilter solr.xml found in ZooKeeper. Loading...
   [junit4]   2> 655200 INFO  (zkConnectionManagerCallback-1476-thread-1) [    ] o.a.s.c.c.ConnectionManager zkClient has connected
   [junit4]   2> 655201 INFO  (jetty-launcher-1465-thread-4) [    ] o.a.s.s.SolrDispatchFilter solr.xml found in ZooKeeper. Loading...
   [junit4]   2> 655269 INFO  (jetty-launcher-1465-thread-1) [    ] o.a.s.c.ZkContainer Zookeeper client=127.0.0.1:38739/solr
   [junit4]   2> 655270 INFO  (zkConnectionManagerCallback-1480-thread-1) [    ] o.a.s.c.c.ConnectionManager zkClient has connected
   [junit4]   2> 655271 DEBUG (jetty-launcher-1465-thread-1) [n:127.0.0.1:43267_solr    ] o.a.s.c.ZkController Added new OnReconnect listener org.apache.solr.cloud.ZkController$$Lambda$93/2005577218@6c2714ab
   [junit4]   2> 655283 INFO  (zkConnectionManagerCallback-1482-thread-1) [    ] o.a.s.c.c.ConnectionManager zkClient has connected
   [junit4]   2> 655297 INFO  (jetty-launcher-1465-thread-3) [    ] o.a.s.c.ZkContainer Zookeeper client=127.0.0.1:38739/solr
   [junit4]   2> 655297 INFO  (jetty-launcher-1465-thread-4) [    ] o.a.s.c.ZkContainer Zookeeper client=127.0.0.1:38739/solr
   [junit4]   2> 655299 INFO  (zkConnectionManagerCallback-1490-thread-1) [    ] o.a.s.c.c.ConnectionManager zkClient has connected
   [junit4]   2> 655299 INFO  (zkConnectionManagerCallback-1492-thread-1) [    ] o.a.s.c.c.ConnectionManager zkClient has connected
   [junit4]   2> 655300 DEBUG (jetty-launcher-1465-thread-3) [n:127.0.0.1:35859_solr    ] o.a.s.c.ZkController Added new OnReconnect listener org.apache.solr.cloud.ZkController$$Lambda$93/2005577218@710e02f2
   [junit4]   2> 655311 DEBUG (jetty-launcher-1465-thread-4) [n:127.0.0.1:35861_solr    ] o.a.s.c.ZkController Added new OnReconnect listener org.apache.solr.cloud.ZkController$$Lambda$93/2005577218@10e89a51
   [junit4]   2> 655315 INFO  (zkConnectionManagerCallback-1494-thread-1) [    ] o.a.s.c.c.ConnectionManager zkClient has connected
   [junit4]   2> 655316 INFO  (zkConnectionManagerCallback-1496-thread-1) [    ] o.a.s.c.c.ConnectionManager zkClient has connected
   [junit4]   2> 655319 DEBUG (SyncThread:0) [    ] o.a.s.c.ZkTestServer Watch added: data: /solr/clusterprops.json
   [junit4]   2> 655319 DEBUG (SyncThread:0) [    ] o.a.s.c.ZkTestServer Watch added: children: /solr/live_nodes
   [junit4]   2> 655319 DEBUG (SyncThread:0) [    ] o.a.s.c.ZkTestServer Watch added: data: /solr/clusterstate.json
   [junit4]   2> 655320 DEBUG (SyncThread:0) [    ] o.a.s.c.ZkTestServer Watch added: children: /solr/collections
   [junit4]   2> 655320 DEBUG (SyncThread:0) [    ] o.a.s.c.ZkTestServer Watch added: create/delete: /solr/aliases.json
   [junit4]   2> 655320 DEBUG (SyncThread:0) [    ] o.a.s.c.ZkTestServer Watch added: data: /solr/clusterprops.json
   [junit4]   2> 655320 DEBUG (SyncThread:0) [    ] o.a.s.c.ZkTestServer Watch added: create/delete: /solr/security.json
   [junit4]   2> 655320 DEBUG (SyncThread:0) [    ] o.a.s.c.ZkTestServer Watch added: children: /solr/live_nodes
   [junit4]   2> 655320 DEBUG (SyncThread:0) [    ] o.a.s.c.ZkTestServer Watch added: data: /solr/clusterstate.json
   [junit4]   2> 655320 DEBUG (SyncThread:0) [    ] o.a.s.c.ZkTestServer Watch added: children: /solr/collections
   [junit4]   2> 655320 DEBUG (SyncThread:0) [    ] o.a.s.c.ZkTestServer Watch added: create/delete: /solr/aliases.json
   [junit4]   2> 655321 DEBUG (SyncThread:0) [    ] o.a.s.c.ZkTestServer Watch added: create/delete: /solr/security.json
   [junit4]   2> 655322 DEBUG (jetty-launcher-1465-thread-4) [n:127.0.0.1:35861_solr    ] o.a.s.c.LeaderElector Joined leadership election with path: /overseer_elect/election/72265150818484234-127.0.0.1:35861_solr-n_0000000000
   [junit4]   2> 655322 DEBUG (jetty-launcher-1465-thread-3) [n:127.0.0.1:35859_solr    ] o.a.s.c.LeaderElector Joined leadership election with path: /overseer_elect/election/72265150818484233-127.0.0.1:35859_solr-n_0000000001
   [junit4]   2> 655322 INFO  (jetty-launcher-1465-thread-4) [n:127.0.0.1:35861_solr    ] o.a.s.c.OverseerElectionContext I am going to be the leader 127.0.0.1:35861_solr
   [junit4]   2> 655322 DEBUG (SyncThread:0) [    ] o.a.s.c.ZkTestServer Watch added: data: /solr/overseer_elect/election/72265150818484234-127.0.0.1:35861_solr-n_0000000000
   [junit4]   2> 655322 DEBUG (jetty-launcher-1465-thread-3) [n:127.0.0.1:35859_solr    ] o.a.s.c.LeaderElector Watching path /overseer_elect/election/72265150818484234-127.0.0.1:35861_solr-n_0000000000 to know if I could be the leader
   [junit4]   2> 655322 INFO  (jetty-launcher-1465-thread-3) [n:127.0.0.1:35859_solr    ] o.a.s.c.ZkController Register node as live in ZooKeeper:/live_nodes/127.0.0.1:35859_solr
   [junit4]   2> 655322 DEBUG (SyncThread:0) [    ] o.a.s.c.ZkTestServer Watch fired: children: /solr/live_nodes
   [junit4]   2> 655322 DEBUG (SyncThread:0) [    ] o.a.s.c.ZkTestServer Watch fired: children: /solr/live_nodes
   [junit4]   2> 655322 INFO  (jetty-launcher-1465-thread-4) [n:127.0.0.1:35861_solr    ] o.a.s.c.Overseer Overseer (id=72265150818484234-127.0.0.1:35861_solr-n_0000000000) starting
   [junit4]   2> 655323 DEBUG (SyncThread:0) [    ] o.a.s.c.ZkTestServer Watch added: children: /solr/live_nodes
   [junit4]   2> 655323 INFO  (zkCallback-1493-thread-1) [    ] o.a.s.c.c.ZkStateReader Updated live nodes from ZooKeeper... (0) -> (1)
   [junit4]   2> 655324 DEBUG (SyncThread:0) [    ] o.a.s.c.ZkTestServer Watch added: children: /solr/live_nodes
   [junit4]   2> 655324 INFO  (zkCallback-1495-thread-1) [    ] o.a.s.c.c.ZkStateReader Updated live nodes from ZooKeeper... (0) -> (1)
   [junit4]   2> 655325 DEBUG (SyncThread:0) [    ] o.a.s.c.ZkTestServer Watch added: data: /solr/clusterprops.json
   [junit4]   2> 655325 DEBUG (SyncThread:0) [    ] o.a.s.c.ZkTestServer Watch added: children: /solr/live_nodes
   [junit4]   2> 655325 INFO  (jetty-launcher-1465-thread-1) [n:127.0.0.1:43267_solr    ] o.a.s.c.c.ZkStateReader Updated live nodes from ZooKeeper... (0) -> (1)
   [junit4]   2> 655325 DEBUG (SyncThread:0) [    ] o.a.s.c.ZkTestServer Watch added: data: /solr/clusterstate.json
   [junit4]   2> 655325 DEBUG (SyncThread:0) [    ] o.a.s.c.ZkTestServer Watch added: children: /solr/collections
   [junit4]   2> 655325 DEBUG (SyncThread:0) [    ] o.a.s.c.ZkTestServer Watch added: create/delete: /solr/aliases.json
   [junit4]   2> 655326 DEBUG (SyncThread:0) [    ] o.a.s.c.ZkTestServer Watch added: create/delete: /solr/security.json
   [junit4]   2> 655326 DEBUG (jetty-launcher-1465-thread-1) [n:127.0.0.1:43267_solr    ] o.a.s.c.LeaderElector Joined leadership election with path: /overseer_elect/election/72265150818484230-127.0.0.1:43267_solr-n_0000000002
   [junit4]   2> 655326 DEBUG (SyncThread:0) [    ] o.a.s.c.ZkTestServer Watch added: data: /solr/overseer_elect/election/72265150818484233-127.0.0.1:35859_solr-n_0000000001
   [junit4]   2> 655326 DEBUG (jetty-launcher-1465-thread-1) [n:127.0.0.1:43267_solr    ] o.a.s.c.LeaderElector Watching path /overseer_elect/election/72265150818484233-127.0.0.1:35859_solr-n_0000000001 to know if I could be the leader
   [junit4]   2> 655326 DEBUG (jetty-launcher-1465-thread-1) [n:127.0.0.1:43267_solr    ] o.a.s.c.ZkController Publish node=127.0.0.1:43267_solr as DOWN
   [junit4]   2> 655330 INFO  (jetty-launcher-1465-thread-1) [n:127.0.0.1:43267_solr    ] o.a.s.c.TransientSolrCoreCacheDefault Allocating transient cache for 2147483647 transient cores
   [junit4]   2> 655330 INFO  (jetty-launcher-1465-thread-1) [n:127.0.0.1:43267_solr    ] o.a.s.c.ZkController Register node as live in ZooKeeper:/live_nodes/127.0.0.1:43267_solr
   [junit4]   2> 655331 DEBUG (SyncThread:0) [    ] o.a.s.c.ZkTestServer Watch fired: children: /solr/live_nodes
   [junit4]   2> 655332 DEBUG (SyncThread:0) [    ] o.a.s.c.ZkTestServer Watch fired: children: /solr/live_nodes
   [junit4]   2> 655332 DEBUG (SyncThread:0) [    ] o.a.s.c.ZkTestServer Watch fired: children: /solr/live_nodes
   [junit4]   2> 655335 INFO  (zkConnectionManagerCallback-1505-thread-1) [    ] o.a.s.c.c.ConnectionManager zkClient has connected
   [junit4]   2> 655337 DEBUG (SyncThread:0) [    ] o.a.s.c.ZkTestServer Watch added: children: /solr/live_nodes
   [junit4]   2> 655337 DEBUG (SyncThread:0) [    ] o.a.s.c.ZkTestServer Watch added: children: /solr/live_nodes
   [junit4]   2> 655337 DEBUG (SyncThread:0) [    ] o.a.s.c.ZkTestServer Watch added: children: /solr/live_nodes
   [junit4]   2> 655337 INFO  (zkCallback-1493-thread-1) [    ] o.a.s.c.c.ZkStateReader Updated live nodes from ZooKeeper... (1) -> (2)
   [junit4]   2> 655338 INFO  (zkCallback-1481-thread-1) [    ] o.a.s.c.c.ZkStateReader Updated live nodes from ZooKeeper... (1) -> (2)
   [junit4]   2> 655338 INFO  (zkCallback-1495-thread-1) [    ] o.a.s.c.c.ZkStateReader Updated live nodes from ZooKeeper... (1) -> (2)
   [junit4]   2> 655338 DEBUG (SyncThread:0) [    ] o.a.s.c.ZkTestServer Watch added: data: /solr/clusterprops.json
   [junit4]   2> 655338 DEBUG (SyncThread:0) [    ] o.a.s.c.ZkTestServer Watch added: children: /solr/live_nodes
   [junit4]   2> 655338 INFO  (jetty-launcher-1465-thread-4) [n:127.0.0.1:35861_solr    ] o.a.s.c.c.ZkStateReader Updated live nodes from ZooKeeper... (0) -> (2)
   [junit4]   2> 655338 DEBUG (SyncThread:0) [    ] o.a.s.c.ZkTestServer Watch added: data: /solr/clusterstate.json
   [junit4]   2> 655338 DEBUG (SyncThread:0) [    ] o.a.s.c.ZkTestServer Watch added: children: /solr/collections
   [junit4]   2> 655338 DEBUG (SyncThread:0) [    ] o.a.s.c.ZkTestServer Watch added: create/delete: /solr/aliases.json
   [junit4]   2> 655339 INFO  (jetty-launcher-1465-thread-4) [n:127.0.0.1:35861_solr    ] o.a.s.c.s.i.ZkClientClusterStateProvider Cluster at 127.0.0.1:38739/solr ready
   [junit4]   2> 655340 DEBUG (OverseerCollectionConfigSetProcessor-72265150818484234-127.0.0.1:35861_solr-n_0000000000) [n:127.0.0.1:35861_solr    ] o.a.s.c.OverseerTaskProcessor Process current queue of overseer operations
   [junit4]   2> 655340 INFO  (zkConnectionManagerCallback-1510-thread-1) [    ] o.a.s.c.c.ConnectionManager zkClient has connected
   [junit4]   2> 655340 INFO  (OverseerStateUpdate-72265150818484234-127.0.0.1:35861_solr-n_0000000000) [n:127.0.0.1:35861_solr    ] o.a.s.c.Overseer Starting to work on the main queue : 127.0.0.1:35861_solr
   [junit4]   2> 655340 DEBUG (jetty-launcher-1465-thread-4) [n:127.0.0.1:35861_solr    ] o.a.s.c.ZkController Publish node=127.0.0.1:35861_solr as DOWN
   [junit4]   2> 655340 DEBUG (SyncThread:0) [    ] o.a.s.c.ZkTestServer Watch added: data: /solr/clusterprops.json
   [junit4]   2> 655340 DEBUG (OverseerCollectionConfigSetProcessor-72265150818484234-127.0.0.1:35861_solr-n_0000000000) [n:127.0.0.1:35861_solr    ] o.a.s.c.OverseerTaskProcessor Cleaning up work-queue. #Running tasks: 0
   [junit4]   2> 655340 DEBUG (SyncThread:0) [    ] o.a.s.c.ZkTestServer Watch added: children: /solr/live_nodes
   [junit4]   2> 655341 INFO  (jetty-launcher-1465-thread-3) [n:127.0.0.1:35859_solr    ] o.a.s.c.c.ZkStateReader Updated live nodes from ZooKeeper... (0) -> (2)
   [junit4]   2> 655341 DEBUG (OverseerCollectionConfigSetProcessor-72265150818484234-127.0.0.1:35861_solr-n_0000000000) [n:127.0.0.1:35861_solr    ] o.a.s.c.OverseerTaskProcessor RunningTasks: []
   [junit4]   2> 655341 DEBUG (OverseerCollectionConfigSetProcessor-72265150818484234-127.0.0.1:35861_solr-n_0000000000) [n:127.0.0.1:35861_solr    ] o.a.s.c.OverseerTaskProcessor BlockedTasks: []
   [junit4]   2> 655341 DEBUG (OverseerCollectionConfigSetProcessor-72265150818484234-127.0.0.1:35861_solr-n_0000000000) [n:127.0.0.1:35861_solr    ] o.a.s.c.OverseerTaskProcessor CompletedTasks: []
   [junit4]   2> 655341 DEBUG (OverseerCollectionConfigSetProcessor-72265150818484234-127.0.0.1:35861_solr-n_0000000000) [n:127.0.0.1:35861_solr    ] o.a.s.c.OverseerTaskProcessor RunningZKTasks: []
   [junit4]   2> 655341 DEBUG (OverseerCollectionConfigSetProcessor-72265150818484234-127.0.0.1:35861_solr-n_0000000000) [n:127.0.0.1:35861_solr    ] o.a.s.c.OverseerTaskQueue Peeking for top 100 elements. ExcludeSet: []
   [junit4]   2> 655341 DEBUG (SyncThread:0) [    ] o.a.s.c.ZkTestServer Watch added: data: /solr/autoscaling.json
   [junit4]   2> 655341 DEBUG (SyncThread:0) [    ] o.a.s.c.ZkTestServer Watch added: data: /solr/clusterstate.json
   [junit4]   2> 655341 DEBUG (SyncThread:0) [    ] o.a.s.c.ZkTestServer Watch added: children: /solr/overseer/queue-work
   [junit4]   2> 655341 DEBUG (SyncThread:0) [    ] o.a.s.c.ZkTestServer Watch added: children: /solr/overseer/collection-queue-work
   [junit4]   2> 655341 INFO  (jetty-launcher-1465-thread-4) [n:127.0.0.1:35861_solr    ] o.a.s.c.TransientSolrCoreCacheDefault Allocating transient cache for 2147483647 transient cores
   [junit4]   2> 655341 INFO  (jetty-launcher-1465-thread-4) [n:127.0.0.1:35861_solr    ] o.a.s.c.ZkController Register node as live in ZooKeeper:/live_nodes/127.0.0.1:35861_solr
   [junit4]   2> 655342 DEBUG (SyncThread:0) [    ] o.a.s.c.ZkTestServer Watch added: children: /solr/collections
   [junit4]   2> 655342 DEBUG (SyncThread:0) [    ] o.a.s.c.ZkTestServer Watch added: children: /solr/overseer/queue
   [junit4]   2> 655343 DEBUG (SyncThread:0) [    ] o.a.s.c.ZkTestServer Watch added: create/delete: /solr/aliases.json
   [junit4]   2> 655343 INFO  (jetty-launcher-1465-thread-3) [n:127.0.0.1:35859_solr    ] o.a.s.c.s.i.ZkClientClusterStateProvider Cluster at 127.0.0.1:38739/solr ready
   [junit4]   2> 655343 DEBUG (SyncThread:0) [    ] o.a.s.c.ZkTestServer Watch fired: children: /solr/live_nodes
   [junit4]   2> 655343 DEBUG (SyncThread:0) [    ] o.a.s.c.ZkTestServer Watch fired: children: /solr/live_nodes
   [junit4]   2> 655343 DEBUG (SyncThread:0) [    ] o.a.s.c.ZkTestServer Watch fired: children: /solr/live_nodes
   [junit4]   2> 655343 INFO  (jetty-launcher-1465-thread-3) [n:127.0.0.1:35859_solr    ] o.a.s.h.a.MetricsHistoryHandler No .system collection, keeping metrics history in memory.
   [junit4]   2> 655343 DEBUG (SyncThread:0) [    ] o.a.s.c.ZkTestServer Watch fired: children: /solr/live_nodes
   [junit4]   2> 655343 DEBUG (SyncThread:0) [    ] o.a.s.c.ZkTestServer Watch fired: children: /solr/live_nodes
   [junit4]   2> 655343 DEBUG (OverseerStateUpdate-72265150818484234-127.0.0.1:35861_solr-n_0000000000) [n:127.0.0.1:35861_solr    ] o.a.s.c.Overseer processMessage: queueSize: 2, message = {
   [junit4]   2>   "operation":"downnode",
   [junit4]   2>   "node_name":"127.0.0.1:43267_solr"} current state version: 0
   [junit4]   2> 655343 DEBUG (OverseerStateUpdate-72265150818484234-127.0.0.1:35861_solr-n_0000000000) [n:127.0.0.1:35861_solr    ] o.a.s.c.o.NodeMutator DownNode state invoked for node: 127.0.0.1:43267_solr
   [junit4]   2> 655343 DEBUG (OverseerStateUpdate-72265150818484234-127.0.0.1:35861_solr-n_0000000000) [n:127.0.0.1:35861_solr    ] o.a.s.c.Overseer processMessage: queueSize: 2, message = {
   [junit4]   2>   "operation":"downnode",
   [junit4]   2>   "node_name":"127.0.0.1:35861_solr"} current state version: 0
   [junit4]   2> 655343 DEBUG (OverseerStateUpdate-72265150818484234-127.0.0.1:35861_solr-n_0000000000) [n:127.0.0.1:35861_solr    ] o.a.s.c.o.NodeMutator DownNode state invoked for node: 127.0.0.1:35861_solr
   [junit4]   2> 655347 DEBUG (SyncThread:0) [    ] o.a.s.c.ZkTestServer Watch added: children: /solr/live_nodes
   [junit4]   2> 655347 DEBUG (SyncThread:0) [    ] o.a.s.c.ZkTestServer Watch added: children: /solr/live_nodes
   [junit4]   2> 655347 INFO  (zkCallback-1481-thread-1) [    ] o.a.s.c.c.ZkStateReader Updated live nodes from ZooKeeper... (2) -> (3)
   [junit4]   2> 655348 DEBUG (SyncThread:0) [    ] o.a.s.c.ZkTestServer Watch added: children: /solr/live_nodes
   [junit4]   2> 655348 INFO  (zkCallback-1493-thread-1) [    ] o.a.s.c.c.ZkStateReader Updated live nodes from ZooKeeper... (2) -> (3)
   [junit4]   2> 655348 DEBUG (SyncThread:0) [    ] o.a.s.c.ZkTestServer Watch added: children: /solr/live_nodes
   [junit4]   2> 655348 INFO  (zkCallback-1495-thread-1) [    ] o.a.s.c.c.ZkStateReader Updated live nodes from ZooKeeper... (2) -> (3)
   [junit4]   2> 655351 DEBUG (SyncThread:0) [    ] o.a.s.c.ZkTestServer Watch added: children: /solr/live_nodes
   [junit4]   2> 655352 INFO  (zkCallback-1509-thread-1) [    ] o.a.s.c.c.ZkStateReader Updated live nodes from ZooKeeper... (2) -> (3)
   [junit4]   2> 655352 INFO  (zkCallback-1504-thread-1) [    ] o.a.s.c.c.ZkStateReader Updated live nodes from ZooKeeper... (2) -> (3)
   [junit4]   2> 655352 DEBUG (SyncThread:0) [    ] o.a.s.c.ZkTestServer Watch added: children: /solr/autoscaling/events/.scheduled_maintenance
   [junit4]   2> 655352 INFO  (jetty-launcher-1465-thread-4) [n:127.0.0.1:35861_solr    ] o.a.s.h.a.MetricsHistoryHandler No .system collection, keeping metrics history in memory.
   [junit4]   2> 655352 INFO  (zkConnectionManagerCallback-1516-thread-1) [    ] o.a.s.c.c.ConnectionManager zkClient has connected
   [junit4]   2> 655356 DEBUG (SyncThread:0) [    ] o.a.s.c.ZkTestServer Watch added: data: /solr/clusterprops.json
   [junit4]   2> 655356 DEBUG (SyncThread:0) [    ] o.a.s.c.ZkTestServer Watch added: children: /solr/live_nodes
   [junit4]   2> 655356 INFO  (jetty-launcher-1465-thread-1) [n:127.0.0.1:43267_solr    ] o.a.s.c.c.ZkStateReader Updated live nodes from ZooKeeper... (0) -> (3)
   [junit4]   2> 655356 DEBUG (SyncThread:0) [    ] o.a.s.c.ZkTestServer Watch added: data: /solr/clusterstate.json
   [junit4]   2> 655357 DEBUG (SyncThread:0) [    ] o.a.s.c.ZkTestServer Watch added: children: /solr/collections
   [junit4]   2> 655357 DEBUG (SyncThread:0) [    ] o.a.s.c.ZkTestServer Watch added: create/delete: /solr/aliases.json
   [junit4]   2> 655357 INFO  (jetty-launcher-1465-thread-1) [n:127.0.0.1:43267_solr    ] o.a.s.c.s.i.ZkClientClusterStateProvider Cluster at 127.0.0.1:38739/solr ready
   [junit4]   2> 655360 INFO  (jetty-launcher-1465-thread-1) [n:127.0.0.1:43267_solr    ] o.a.s.h.a.MetricsHistoryHandler No .system collection, keeping metrics history in memory.
   [junit4]   2> 655366 DEBUG (SyncThread:0) [    ] o.a.s.c.ZkTestServer Watch added: children: /solr/autoscaling/events/.auto_add_replicas
   [junit4]   2> 655367 INFO  (jetty-launcher-1465-thread-2) [    ] o.a.s.c.ZkContainer Zookeeper client=127.0.0.1:38739/solr
   [junit4]   2> 655368 INFO  (zkConnectionManagerCallback-1522-thread-1) [    ] o.a.s.c.c.ConnectionManager zkClient has connected
   [junit4]   2> 655368 DEBUG (jetty-launcher-1465-thread-2) [n:127.0.0.1:37497_solr    ] o.a.s.c.ZkController Added new OnReconnect listener org.apache.solr.cloud.ZkController$$Lambda$93/2005577218@471aaca0
   [junit4]   2> 655369 INFO  (zkConnectionManagerCallback-1524-thread-1) [    ] o.a.s.c.c.ConnectionManager zkClient has connected
   [junit4]   2> 655371 INFO  (jetty-launcher-1465-thread-3) [n:127.0.0.1:35859_solr    ] o.a.s.m.r.SolrJmxReporter JMX monitoring for 'solr_35859.solr.node' (registry 'solr.node') enabled at server: com.sun.jmx.mbeanserver.JmxMBeanServer@4736b2fe
   [junit4]   2> 655372 DEBUG (SyncThread:0) [    ] o.a.s.c.ZkTestServer Watch added: data: /solr/clusterprops.json
   [junit4]   2> 655372 DEBUG (SyncThread:0) [    ] o.a.s.c.ZkTestServer Watch added: children: /solr/live_nodes
   [junit4]   2> 655372 INFO  (jetty-launcher-1465-thread-2) [n:127.0.0.1:37497_solr    ] o.a.s.c.c.ZkStateReader Updated live nodes from ZooKeeper... (0) -> (3)
   [junit4]   2> 655372 DEBUG (SyncThread:0) [    ] o.a.s.c.ZkTestServer Watch added: data: /solr/clusterstate.json
   [junit4]   2> 655372 DEBUG (SyncThread:0) [    ] o.a.s.c.ZkTestServer Watch added: children: /solr/collections
   [junit4]   2> 655372 DEBUG (SyncThread:0) [    ] o.a.s.c.ZkTestServer Watch added: create/delete: /solr/aliases.json
   [junit4]   2> 655372 DEBUG (SyncThread:0) [    ] o.a.s.c.ZkTestServer Watch added: create/delete: /solr/security.json
   [junit4]   2> 655373 DEBUG (jetty-launcher-1465-thread-2) [n:127.0.0.1:37497_solr    ] o.a.s.c.LeaderElector Joined leadership election with path: /overseer_elect/election/72265150818484239-127.0.0.1:37497_solr-n_0000000003
   [junit4]   2> 655373 DEBUG (SyncThread:0) [    ] o.a.s.c.ZkTestServer Watch added: data: /solr/overseer_elect/election/72265150818484230-127.0.0.1:43267_solr-n_0000000002
   [junit4]   2> 655373 DEBUG (jetty-launcher-1465-thread-2) [n:127.0.0.1:37497_solr    ] o.a.s.c.LeaderElector Watching path /overseer_elect/election/72265150818484230-127.0.0.1:43267_solr-n_0000000002 to know if I could be the leader
   [junit4]   2> 655373 DEBUG (jetty-launcher-1465-thread-2) [n:127.0.0.1:37497_solr    ] o.a.s.c.ZkController Publish node=127.0.0.1:37497_solr as DOWN
   [junit4]   2> 655374 DEBUG (SyncThread:0) [    ] o.a.s.c.ZkTestServer Watch fired: children: /solr/overseer/queue
   [junit4]   2> 655374 INFO  (jetty-launcher-1465-thread-2) [n:127.0.0.1:37497_solr    ] o.a.s.c.TransientSolrCoreCacheDefault Allocating transient cache for 2147483647 transient cores
   [junit4]   2> 655374 INFO  (jetty-launcher-1465-thread-2) [n:127.0.0.1:37497_solr    ] o.a.s.c.ZkController Register node as live in ZooKeeper:/live_nodes/127.0.0.1:37497_solr
   [junit4]   2> 655374 DEBUG (SyncThread:0) [    ] o.a.s.c.ZkTestServer Watch added: children: /solr/overseer/queue
   [junit4]   2> 655374 DEBUG (OverseerStateUpdate-72265150818484234-127.0.0.1:35861_solr-n_0000000000) [n:127.0.0.1:35861_solr    ] o.a.s.c.Overseer processMessage: queueSize: 3, message = {
   [junit4]   2>   "operation":"downnode",
   [junit4]   2>   "node_name":"127.0.0.1:37497_solr"} current state version: 0
   [junit4]   2> 655374 DEBUG (SyncThread:0) [    ] o.a.s.c.ZkTestServer Watch fired: children: /solr/live_nodes
   [junit4]   2> 655374 DEBUG (OverseerStateUpdate-72265150818484234-127.0.0.1:35861_solr-n_0000000000) [n:127.0.0.1:35861_solr    ] o.a.s.c.o.NodeMutator DownNode state invoked for node: 127.0.0.1:37497_solr
   [junit4]   2> 655374 DEBUG (SyncThread:0) [    ] o.a.s.c.ZkTestServer Watch fired: children: /solr/live_nodes
   [junit4]   2> 655374 DEBUG (SyncThread:0) [    ] o.a.s.c.ZkTestServer Watch fired: children: /solr/live_nodes
   [junit4]   2> 655374 DEBUG (SyncThread:0) [    ] o.a.s.c.ZkTestServer Watch fired: children: /solr/live_nodes
   [junit4]   2> 655374 DEBUG (SyncThread:0) [    ] o.a.s.c.ZkTestServer Watch fired: children: /solr/live_nodes
   [junit4]   2> 655374 DEBUG (SyncThread:0) [    ] o.a.s.c.ZkTestServer Watch fired: children: /solr/live_nodes
   [junit4]   2> 655374 DEBUG (SyncThread:0) [    ] o.a.s.c.ZkTestServer Watch fired: children: /solr/live_nodes
   [junit4]   2> 655374 INFO  (jetty-launcher-1465-thread-4) [n:127.0.0.1:35861_solr    ] o.a.s.m.r.SolrJmxReporter JMX monitoring for 'solr_35861.solr.node' (registry 'solr.node') enabled at server: com.sun.jmx.mbeanserver.JmxMBeanServer@4736b2fe
   [junit4]   2> 655374 DEBUG (SyncThread:0) [    ] o.a.s.c.ZkTestServer Watch added: children: /solr/live_nodes
   [junit4]   2> 655374 DEBUG (SyncThread:0) [    ] o.a.s.c.ZkTestServer Watch added: children: /solr/live_nodes
   [junit4]   2> 655374 INFO  (zkCallback-1493-thread-1) [    ] o.a.s.c.c.ZkStateReader Updated live nodes from ZooKeeper... (3) -> (4)
   [junit4]   2> 655374 DEBUG (SyncThread:0) [    ] o.a.s.c.ZkTestServer Watch added: children: /solr/live_nodes
   [junit4]   2> 655374 DEBUG (SyncThread:0) [    ] o.a.s.c.ZkTestServer Watch added: children: /solr/live_nodes
   [junit4]   2> 655374 INFO  (zkCallback-1495-thread-1) [    ] o.a.s.c.c.ZkStateReader Updated live nodes from ZooKeeper... (3) -> (4)
   [junit4]   2> 655374 INFO  (zkCallback-1481-thread-1) [    ] o.a.s.c.c.ZkStateReader Updated live nodes from ZooKeeper... (3) -> (4)
   [junit4]   2> 655374 INFO  (zkCallback-1504-thread-1) [    ] o.a.s.c.c.ZkStateReader Updated live nodes from ZooKeeper... (3) -> (4)
   [junit4]   2> 655375 DEBUG (SyncThread:0) [    ] o.a.s.c.ZkTestServer Watch added: children: /solr/live_nodes
   [junit4]   2> 655375 DEBUG (SyncThread:0) [    ] o.a.s.c.ZkTestServer Watch added: children: /solr/live_nodes
   [junit4]   2> 655375 INFO  (zkCallback-1509-thread-1) [    ] o.a.s.c.c.ZkStateReader Updated live nodes from ZooKeeper... (3) -> (4)
   [junit4]   2> 655376 INFO  (zkCallback-1523-thread-1) [    ] o.a.s.c.c.ZkStateReader Updated live nodes from ZooKeeper... (3) -> (4)
   [junit4]   2> 655376 DEBUG (SyncThread:0) [    ] o.a.s.c.ZkTestServer Watch added: children: /solr/live_nodes
   [junit4]   2> 655377 INFO  (zkCallback-1515-thread-1) [    ] o.a.s.c.c.ZkStateReader Updated live nodes from ZooKeeper... (3) -> (4)
   [junit4]   2> 655378 INFO  (jetty-launcher-1465-thread-3) [n:127.0.0.1:35859_solr    ] o.a.s.m.r.SolrJmxReporter JMX monitoring for 'solr_35859.solr.jvm' (registry 'solr.jvm') enabled at server: com.sun.jmx.mbeanserver.JmxMBeanServer@4736b2fe
   [junit4]   2> 655378 INFO  (jetty-launcher-1465-thread-3) [n:127.0.0.1:35859_solr    ] o.a.s.m.r.SolrJmxReporter JMX monitoring for 'solr_35859.solr.jetty' (registry 'solr.jetty') enabled at server: com.sun.jmx.mbeanserver.JmxMBeanServer@4736b2fe
   [junit4]   2> 655379 INFO  (jetty-launcher-1465-thread-3) [n:127.0.0.1:35859_solr    ] o.a.s.c.CorePropertiesLocator Found 0 core definitions underneath /home/jenkins/workspace/Lucene-Solr-master-Linux/solr/build/solr-core/test/J2/temp/solr.cloud.AddReplicaTest_8ECB21C4F94E3823-001/tempDir-001/node3/.
   [junit4]   2> 655379 INFO  (jetty-launcher-1465-thread-1) [n:127.0.0.1:43267_solr    ] o.a.s.m.r.SolrJmxReporter JMX monitoring for 'solr_43267.solr.node' (registry 'solr.node') enabled at server: com.sun.jmx.mbeanserver.JmxMBeanServer@4736b2fe
   [junit4]   2> 655380 INFO  (jetty-launcher-1465-thread-4) [n:127.0.0.1:35861_solr    ] o.a.s.m.r.SolrJmxReporter JMX monitoring for 'solr_35861.solr.jvm' (registry 'solr.jvm') enabled at server: com.sun.jmx.mbeanserver.JmxMBeanServer@4736b2fe
   [junit4]   2> 655380 INFO  (jetty-launcher-1465-thread-4) [n:127.0.0.1:35861_solr    ] o.a.s.m.r.SolrJmxReporter JMX monitoring for 'solr_35861.solr.jetty' (registry 'solr.jetty') enabled at server: com.sun.jmx.mbeanserver.JmxMBeanServer@4736b2fe
   [junit4]   2> 655381 INFO  (jetty-launcher-1465-thread-4) [n:127.0.0.1:35861_solr    ] o.a.s.c.CorePropertiesLocator Found 0 core definitions underneath /home/jenkins/workspace/Lucene-Solr-master-Linux/solr/build/solr-core/test/J2/temp/solr.cloud.AddReplicaTest_8ECB21C4F94E3823-001/tempDir-001/node4/.
   [junit4]   2> 655383 INFO  (jetty-launcher-1465-thread-1) [n:127.0.0.1:43267_solr    ] o.a.s.m.r.SolrJmxReporter JMX monitoring for 'solr_43267.solr.jvm' (registry 'solr.jvm') enabled at server: com.sun.jmx.mbeanserver.JmxMBeanServer@4736b2fe
   [junit4]   2> 655384 INFO  (jetty-launcher-1465-thread-1) [n:127.0.0.1:43267_solr    ] o.a.s.m.r.SolrJmxReporter JMX monitoring for 'solr_43267.solr.jetty' (registry 'solr.jetty') enabled at server: com.sun.jmx.mbeanserver.JmxMBeanServer@4736b2fe
   [junit4]   2> 655384 INFO  (jetty-launcher-1465-thread-1) [n:127.0.0.1:43267_solr    ] o.a.s.c.CorePropertiesLocator Found 0 core definitions underneath /home/jenkins/workspace/Lucene-Solr-master-Linux/solr/build/solr-core/test/J2/temp/solr.cloud.AddReplicaTest_8ECB21C4F94E3823-001/tempDir-001/node1/.
   [junit4]   2> 655386 INFO  (zkConnectionManagerCallback-1531-thread-1) [    ] o.a.s.c.c.ConnectionManager zkClient has connected
   [junit4]   2> 655387 DEBUG (SyncThread:0) [    ] o.a.s.c.ZkTestServer Watch added: data: /solr/clusterprops.json
   [junit4]   2> 655387 DEBUG (SyncThread:0) [    ] o.a.s.c.ZkTestServer Watch added: children: /solr/live_nodes
   [junit4]   2> 655387 INFO  (jetty-launcher-1465-thread-2) [n:127.0.0.1:37497_solr    ] o.a.s.c.c.ZkStateReader Updated live nodes from ZooKeeper... (0) -> (4)
   [junit4]   2> 655387 DEBUG (SyncThread:0) [    ] o.a.s.c.ZkTestServer Watch added: data: /solr/clusterstate.json
   [junit4]   2> 655387 DEBUG (SyncThread:0) [    ] o.a.s.c.ZkTestServer Watch added: children: /solr/collections
   [junit4]   2> 655387 DEBUG (SyncThread:0) [    ] o.a.s.c.ZkTestServer Watch added: create/delete: /solr/aliases.json
   [junit4]   2> 655387 INFO  (jetty-launcher-1465-thread-2) [n:127.0.0.1:37497_solr    ] o.a.s.c.s.i.ZkClientClusterStateProvider Cluster at 127.0.0.1:38739/solr ready
   [junit4]   2> 655387 INFO  (jetty-launcher-1465-thread-2) [n:127.0.0.1:37497_solr    ] o.a.s.h.a.MetricsHistoryHandler No .system collection, keeping metrics history in memory.
   [junit4]   2> 655404 INFO  (jetty-launcher-1465-thread-2) [n:127.0.0.1:37497_solr    ] o.a.s.m.r.SolrJmxReporter JMX monitoring for 'solr_37497.solr.node' (registry 'solr.node') enabled at server: com.sun.jmx.mbeanserver.JmxMBeanServer@4736b2fe
   [junit4]   2> 655409 INFO  (jetty-launcher-1465-thread-2) [n:127.0.0.1:37497_solr    ] o.a.s.m.r.SolrJmxReporter JMX monitoring for 'solr_37497.solr.jvm' (registry 'solr.jvm') enabled at server: com.sun.jmx.mbeanserver.JmxMBeanServer@4736b2fe
   [junit4]   2> 655409 INFO  (jetty-launcher-1465-thread-2) [n:127.0.0.1:37497_solr    ] o.a.s.m.r.SolrJmxReporter JMX monitoring for 'solr_37497.solr.jetty' (registry 'solr.jetty') enabled at server: com.sun.jmx.mbeanserver.JmxMBeanServer@4736b2fe
   [junit4]   2> 655410 INFO  (jetty-launcher-1465-thread-2) [n:127.0.0.1:37497_solr    ] o.a.s.c.CorePropertiesLocator Found 0 core definitions underneath /home/jenkins/workspace/Lucene-Solr-master-Linux/solr/build/solr-core/test/J2/temp/solr.cloud.AddReplicaTest_8ECB21C4F94E3823-001/tempDir-001/node2/.
   [junit4]   2> 655465 INFO  (zkConnectionManagerCallback-1534-thread-1) [    ] o.a.s.c.c.ConnectionManager zkClient has connected
   [junit4]   2> 655468 INFO  (zkConnectionManagerCallback-1539-thread-1) [    ] o.a.s.c.c.ConnectionManager zkClient has connected
   [junit4]   2> 655468 DEBUG (SyncThread:0) [    ] o.a.s.c.ZkTestServer Watch added: data: /solr/clusterprops.json
   [junit4]   2> 655468 DEBUG (SyncThread:0) [    ] o.a.s.c.ZkTestServer Watch added: children: /solr/live_nodes
   [junit4]   2> 655468 INFO  (SUITE-AddReplicaTest-seed#[8ECB21C4F94E3823]-worker) [    ] o.a.s.c.c.ZkStateReader Updated live nodes from ZooKeeper... (0) -> (4)
   [junit4]   2> 655469 DEBUG (SyncThread:0) [    ] o.a.s.c.ZkTestServer Watch added: data: /solr/clusterstate.json
   [junit4]   2> 655469 DEBUG (SyncThread:0) [    ] o.a.s.c.ZkTestServer Watch added: children: /solr/collections
   [junit4]   2> 655469 DEBUG (SyncThread:0) [    ] o.a.s.c.ZkTestServer Watch added: create/delete: /solr/aliases.json
   [junit4]   2> 655469 INFO  (SUITE-AddReplicaTest-seed#[8ECB21C4F94E3823]-worker) [    ] o.a.s.c.s.i.ZkClientClusterStateProvider Cluster at 127.0.0.1:38739/solr ready
   [junit4]   2> 655476 DEBUG (SyncThread:0) [    ] o.a.s.c.ZkTestServer Watch fired: children: /solr/overseer/queue
   [junit4]   2> 655478 DEBUG (SyncThread:0) [    ] o.a.s.c.ZkTestServer Watch added: children: /solr/overseer/queue
   [junit4]   2> 655493 DEBUG (SyncThread:0) [    ] o.a.s.c.ZkTestServer Watch added: data: /solr/clusterprops.json
   [junit4]   2> 655493 DEBUG (SyncThread:0) [    ] o.a.s.c.ZkTestServer Watch added: children: /solr/live_nodes
   [junit4]   2> 655493 INFO  (TEST-AddReplicaTest.testAddMultipleReplicas-seed#[8ECB21C4F94E3823]) [    ] o.a.s.c.c.ZkStateReader Updated live nodes from ZooKeeper... (0) -> (4)
   [junit4]   2> 655493 DEBUG (SyncThread:0) [    ] o.a.s.c.ZkTestServer Watch added: data: /solr/clusterstate.json
   [junit4]   2> 655494 DEBUG (SyncThread:0) [    ] o.a.s.c.ZkTestServer Watch added: children: /solr/collections
   [junit4]   2> 655494 DEBUG (SyncThread:0) [    ] o.a.s.c.ZkTestServer Watch added: create/delete: /solr/aliases.json
   [junit4]   2> 655494 DEBUG (SyncThread:0) [    ] o.a.s.c.ZkTestServer Watch fired: data: /solr/aliases.json
   [junit4]   2> 655494 DEBUG (SyncThread:0) [    ] o.a.s.c.ZkTestServer Watch fired: data: /solr/aliases.json
   [junit4]   2> 655494 DEBUG (SyncThread:0) [    ] o.a.s.c.ZkTestServer Watch fired: data: /solr/aliases.json
   [junit4]   2> 655494 DEBUG (SyncThread:0) [    ] o.a.s.c.ZkTestServer Watch fired: data: /solr/aliases.json
   [junit4]   2> 655494 DEBUG (SyncThread:0) [    ] o.a.s.c.ZkTestServer Watch fired: data: /solr/aliases.json
   [junit4]   2> 655494 DEBUG (SyncThread:0) [    ] o.a.s.c.ZkTestServer Watch fired: data: /solr/aliases.json
   [junit4]   2> 655494 DEBUG (SyncThread:0) [    ] o.a.s.c.ZkTestServer Watch fired: data: /solr/aliases.json
   [junit4]   2> 655494 DEBUG (SyncThread:0) [    ] o.a.s.c.ZkTestServer Watch fired: data: /solr/aliases.json
   [junit4]   2> 655494 DEBUG (SyncThread:0) [    ] o.a.s.c.ZkTestServer Watch fired: data: /solr/aliases.json
   [junit4]   2> 655494 DEBUG (SyncThread:0) [    ] o.a.s.c.ZkTestServer Watch added: data: /solr/aliases.json
   [junit4]   2> 655494 DEBUG (SyncThread:0) [    ] o.a.s.c.ZkTestServer Watch added: data: /solr/aliases.json
   [junit4]   2> 655494 DEBUG (SyncThread:0) [    ] o.a.s.c.ZkTestServer Watch added: data: /solr/aliases.json
   [junit4]   2> 655494 DEBUG (SyncThread:0) [    ] o.a.s.c.ZkTestServer Watch added: data: /solr/aliases.json
   [junit4]   2> 655494 DEBUG (SyncThread:0) [    ] o.a.s.c.ZkTestServer Watch added: data: /solr/aliases.json
   [junit4]   2> 655494 DEBUG (SyncThread:0) [    ] o.a.s.c.ZkTestServer Watch added: data: /solr/aliases.json
   [junit4]   2> 655495 DEBUG (SyncThread:0) [    ] o.a.s.c.ZkTestServer Watch added: data: /solr/aliases.json
   [junit4]   2> 655495 DEBUG (SyncThread:0) [    ] o.a.s.c.ZkTestServer Watch added: data: /solr/aliases.json
   [junit4]   2> 655495 DEBUG (SyncThread:0) [    ] o.a.s.c.ZkTestServer Watch added: data: /solr/aliases.json
   [junit4]   2> 655495 DEBUG (SyncThread:0) [    ] o.a.s.c.ZkTestServer Watch added: data: /solr/aliases.json
   [junit4]   2> 655495 INFO  (zkConnectionManagerCallback-1543-thread-1) [    ] o.a.s.c.c.ConnectionManager zkClient has connected
   [junit4]   2> 655505 INFO  (qtp1452980935-5096) [n:127.0.0.1:35859_solr    ] o.a.s.h.a.CollectionsHandler Invoked Collection Action :create with params collection.configName=conf1&maxShardsPerNode=2&name=testAddMultipleReplicas&nrtReplicas=1&action=CREATE&numShards=1&wt=javabin&version=2 and sendToOCPQueue=true
   [junit4]   2> 655505 DEBUG (SyncThread:0) [    ] o.a.s.c.ZkTestServer Watch fired: children: /solr/overseer/collection-queue-work
   [junit4]   2> 655506 DEBUG (SyncThread:0) [    ] o.a.s.c.ZkTestServer Watch added: create/delete: /solr/overseer/collection-queue-work/qnr-0000000000
   [junit4]   2> 655506 DEBUG (SyncThread:0) [    ] o.a.s.c.ZkTestServer Watch added: children: /solr/overseer/collection-queue-work
   [junit4]   2> 655506 DEBUG (OverseerCollectionConfigSetProcessor-72265150818484234-127.0.0.1:35861_solr-n_0000000000) [n:127.0.0.1:35861_solr    ] o.a.s.c.ZkDistributedQueue Found child node with improper name: qnr-0000000000
   [junit4]   2> 655506 DEBUG (SyncThread:0) [    ] o.a.s.c.ZkTestServer Watch fired: children: /solr/overseer/collection-queue-work
   [junit4]   2> 655506 DEBUG (SyncThread:0) [    ] o.a.s.c.ZkTestServer Watch added: children: /solr/overseer/collection-queue-work
   [junit4]   2> 655506 DEBUG (OverseerCollectionConfigSetProcessor-72265150818484234-127.0.0.1:35861_solr-n_0000000000) [n:127.0.0.1:35861_solr    ] o.a.s.c.ZkDistributedQueue Found child node with improper name: qnr-0000000000
   [junit4]   2> 655506 DEBUG (OverseerCollectionConfigSetProcessor-72265150818484234-127.0.0.1:35861_solr-n_0000000000) [n:127.0.0.1:35861_solr    ] o.a.s.c.OverseerTaskQueue Returning topN elements: [/overseer/collection-queue-work/qn-0000000000, ]
   [junit4]   2> 655506 DEBUG (OverseerCollectionConfigSetProcessor-72265150818484234-127.0.0.1:35861_solr-n_0000000000) [n:127.0.0.1:35861_solr    ] o.a.s.c.OverseerTaskProcessor Got 1 tasks from work-queue : [[org.apache.solr.cloud.OverseerTaskQueue$QueueEvent@2e684ecf]]
   [junit4]   2> 655506 DEBUG (OverseerCollectionConfigSetProcessor-72265150818484234-127.0.0.1:35861_solr-n_0000000000) [n:127.0.0.1:35861_solr    ] o.a.s.c.OverseerTaskProcessor Marked task [/overseer/collection-queue-work/qn-0000000000] as running
   [junit4]   2> 655506 DEBUG (OverseerCollectionConfigSetProcessor-72265150818484234-127.0.0.1:35861_solr-n_0000000000) [n:127.0.0.1:35861_solr    ] o.a.s.c.OverseerTaskProcessor Overseer Collection Message Handler: Get the message id:/overseer/collection-queue-work/qn-0000000000 message:{
   [junit4]   2>   "name":"testAddMultipleReplicas",
   [junit4]   2>   "fromApi":"true",
   [junit4]   2>   "collection.configName":"conf1",
   [junit4]   2>   "numShards":"1",
   [junit4]   2>   "maxShardsPerNode":"2",
   [junit4]   2>   "nrtReplicas":"1",
   [junit4]   2>   "stateFormat":"2",
   [junit4]   2>   "replicationFactor":"1",
   [junit4]   2>   "operation":"create"}
   [junit4]   2> 655506 DEBUG (OverseerThreadFactory-1978-thread-1-processing-n:127.0.0.1:35861_solr) [n:127.0.0.1:35861_solr    ] o.a.s.c.OverseerTaskProcessor Runner processing /overseer/collection-queue-work/qn-0000000000
   [junit4]   2> 655506 DEBUG (OverseerThreadFactory-1978-thread-1-processing-n:127.0.0.1:35861_solr) [n:127.0.0.1:35861_solr    ] o.a.s.c.a.c.OverseerCollectionMessageHandler OverseerCollectionMessageHandler.processMessage : create , {
   [junit4]   2>   "name":"testAddMultipleReplicas",
   [junit4]   2>   "fromApi":"true",
   [junit4]   2>   "collection.configName":"conf1",
   [junit4]   2>   "numShards":"1",
   [junit4]   2>   "maxShardsPerNode":"2",
   [junit4]   2>   "nrtReplicas":"1",
   [junit4]   2>   "stateFormat":"2",
   [junit4]   2>   "replicationFactor":"1",
   [junit4]   2>   "operation":"create"}
   [junit4]   2> 655506 DEBUG (OverseerCollectionConfigSetProcessor-72265150818484234-127.0.0.1:35861_solr-n_0000000000) [n:127.0.0.1:35861_solr    ] o.a.s.c.OverseerTaskProcessor Cleaning up work-queue. #Running tasks: 1
   [junit4]   2> 655506 DEBUG (OverseerCollectionConfigSetProcessor-72265150818484234-127.0.0.1:35861_solr-n_0000000000) [n:127.0.0.1:35861_solr    ] o.a.s.c.OverseerTaskProcessor RunningTasks: [/overseer/collection-queue-work/qn-0000000000]
   [junit4]   2> 655507 DEBUG (OverseerCollectionConfigSetProcessor-72265150818484234-127.0.0.1:35861_solr-n_0000000000) [n:127.0.0.1:35861_solr    ] o.a.s.c.OverseerTaskProcessor BlockedTasks: []
   [junit4]   2> 655507 DEBUG (OverseerCollectionConfigSetProcessor-72265150818484234-127.0.0.1:35861_solr-n_0000000000) [n:127.0.0.1:35861_solr    ] o.a.s.c.OverseerTaskProcessor CompletedTasks: []
   [junit4]   2> 655506 INFO  (OverseerThreadFactory-1978-thread-1-processing-n:127.0.0.1:35861_solr) [n:127.0.0.1:35861_solr    ] o.a.s.c.a.c.CreateCollectionCmd Create collection testAddMultipleReplicas
   [junit4]   2> 655507 DEBUG (OverseerCollectionConfigSetProcessor-72265150818484234-127.0.0.1:35861_solr-n_0000000000) [n:127.0.0.1:35861_solr    ] o.a.s.c.OverseerTaskProcessor RunningZKTasks: [/overseer/collection-queue-work/qn-0000000000]
   [junit4]   2> 655507 DEBUG (OverseerCollectionConfigSetProcessor-72265150818484234-127.0.0.1:35861_solr-n_0000000000) [n:127.0.0.1:35861_solr    ] o.a.s.c.OverseerTaskQueue Peeking for top 99 elements. ExcludeSet: [/overseer/collection-queue-work/qn-0000000000],[]
   [junit4]   2> 655507 DEBUG (OverseerThreadFactory-1978-thread-1-processing-n:127.0.0.1:35861_solr) [n:127.0.0.1:35861_solr    ] o.a.s.c.a.c.OverseerCollectionMessageHandler creating collections conf node /collections/testAddMultipleReplicas 
   [junit4]   2> 655507 DEBUG (SyncThread:0) [    ] o.a.s.c.ZkTestServer Watch fired: children: /solr/collections
   [junit4]   2> 655507 DEBUG (SyncThread:0) [    ] o.a.s.c.ZkTestServer Watch fired: children: /solr/collections
   [junit4]   2> 655507 DEBUG (SyncThread:0) [    ] o.a.s.c.ZkTestServer Watch fired: children: /solr/collections
   [junit4]   2> 655507 DEBUG (SyncThread:0) [    ] o.a.s.c.ZkTestServer Watch fired: children: /solr/collections
   [junit4]   2> 655507 DEBUG (SyncThread:0) [    ] o.a.s.c.ZkTestServer Watch fired: children: /solr/collections
   [junit4]   2> 655507 DEBUG (SyncThread:0) [    ] o.a.s.c.ZkTestServer Watch fired: children: /solr/collections
   [junit4]   2> 655507 DEBUG (SyncThread:0) [    ] o.a.s.c.ZkTestServer Watch fired: children: /solr/collections
   [junit4]   2> 655507 DEBUG (SyncThread:0) [    ] o.a.s.c.ZkTestServer Watch fired: children: /solr/collections
   [junit4]   2> 655507 DEBUG (SyncThread:0) [    ] o.a.s.c.ZkTestServer Watch fired: children: /solr/collections
   [junit4]   2> 655507 DEBUG (SyncThread:0) [    ] o.a.s.c.ZkTestServer Watch added: children: /solr/collections
   [junit4]   2> 655507 DEBUG (SyncThread:0) [    ] o.a.s.c.ZkTestServer Watch added: children: /solr/collections
   [junit4]   2> 655507 DEBUG (SyncThread:0) [    ] o.a.s.c.ZkTestServer Watch added: children: /solr/collections
   [junit4]   2> 655507 DEBUG (SyncThread:0) [    ] o.a.s.c.ZkTestServer Watch added: children: /solr/collections
   [junit4]   2> 655507 DEBUG (SyncThread:0) [    ] o.a.s.c.ZkTestServer Watch added: children: /solr/collections
   [junit4]   2> 655507 DEBUG (SyncThread:0) [    ] o.a.s.c.ZkTestServer Watch added: children: /solr/collections
   [junit4]   2> 655508 DEBUG (SyncThread:0) [    ] o.a.s.c.ZkTestServer Watch added: children: /solr/collections
   [junit4]   2> 655508 DEBUG (SyncThread:0) [    ] o.a.s.c.ZkTestServer Watch added: children: /solr/collections
   [junit4]   2> 655508 DEBUG (OverseerThreadFactory-1978-thread-1-processing-n:127.0.0.1:35861_solr) [n:127.0.0.1:35861_solr    ] o.a.s.c.a.c.CreateCollectionCmd Check for collection zkNode:testAddMultipleReplicas
   [junit4]   2> 655508 DEBUG (SyncThread:0) [    ] o.a.s.c.ZkTestServer Watch added: children: /solr/collections
   [junit4]   2> 655509 DEBUG (OverseerThreadFactory-1978-thread-1-processing-n:127.0.0.1:35861_solr) [n:127.0.0.1:35861_solr    ] o.a.s.c.a.c.CreateCollectionCmd Collection zkNode exists
   [junit4]   2> 655509 DEBUG (SyncThread:0) [    ] o.a.s.c.ZkTestServer Watch fired: children: /solr/overseer/queue
   [junit4]   2> 655509 DEBUG (SyncThread:0) [    ] o.a.s.c.ZkTestServer Watch added: children: /solr/overseer/queue
   [junit4]   2> 655510 DEBUG (OverseerStateUpdate-72265150818484234-127.0.0.1:35861_solr-n_0000000000) [n:127.0.0.1:35861_solr    ] o.a.s.c.Overseer processMessage: queueSize: 1, message = {
   [junit4]   2>   "name":"testAddMultipleReplicas",
   [junit4]   2>   "fromApi":"true",
   [junit4]   2>   "collection.configName":"conf1",
   [junit4]   2>   "numShards":"1",
   [junit4]   2>   "maxShardsPerNode":"2",
   [junit4]   2>   "nrtReplicas":"1",
   [junit4]   2>   "stateFormat":"2",
   [junit4]   2>   "replicationFactor":"1",
   [junit4]   2>   "operation":"create"} current state version: 0
   [junit4]   2> 655510 DEBUG (OverseerStateUpdate-72265150818484234-127.0.0.1:35861_solr-n_0000000000) [n:127.0.0.1:35861_solr    ] o.a.s.c.o.ClusterStateMutator building a new cName: testAddMultipleReplicas
   [junit4]   2> 655510 DEBUG (OverseerStateUpdate-72265150818484234-127.0.0.1:35861_solr-n_0000000000) [n:127.0.0.1:35861_solr    ] o.a.s.c.o.ZkStateWriter going to create_collection /collections/testAddMultipleReplicas/state.json
   [junit4]   2> 655510 DEBUG (SyncThread:0) [    ] o.a.s.c.ZkTestServer Watch fired: children: /solr/overseer/queue
   [junit4]   2> 655510 DEBUG (SyncThread:0) [    ] o.a.s.c.ZkTestServer Watch added: children: /solr/overseer/queue
   [junit4]   2> 655514 DEBUG (SyncThread:0) [    ] o.a.s.c.ZkTestServer Watch added: children: /solr/collections
   [junit4]   2> 655610 DEBUG (OverseerThreadFactory-1978-thread-1-processing-n:127.0.0.1:35861_solr) [n:127.0.0.1:35861_solr    ] o.a.s.c.a.c.Assign Identify nodes using default
   [junit4]   2> 655611 DEBUG (OverseerThreadFactory-1978-thread-1-processing-n:127.0.0.1:35861_solr) [n:127.0.0.1:35861_solr    ] o.a.s.c.a.c.CreateCollectionCmd Creating SolrCores for new collection testAddMultipleReplicas, shardNames [shard1] , message : {
   [junit4]   2>   "name":"testAddMultipleReplicas",
   [junit4]   2>   "fromApi":"true",
   [junit4]   2>   "collection.configName":"conf1",
   [junit4]   2>   "numShards":"1",
   [junit4]   2>   "maxShardsPerNode":"2",
   [junit4]   2>   "nrtReplicas":"1",
   [junit4]   2>   "stateFormat":"2",
   [junit4]   2>   "replicationFactor":"1",
   [junit4]   2>   "operation":"create"}
   [junit4]   2> 655611 DEBUG (OverseerThreadFactory-1978-thread-1-processing-n:127.0.0.1:35861_solr) [n:127.0.0.1:35861_solr    ] o.a.s.c.a.c.CreateCollectionCmd Creating core testAddMultipleReplicas_shard1_replica_n1 as part of shard shard1 of collection testAddMultipleReplicas on 127.0.0.1:43267_solr
   [junit4]   2> 655612 DEBUG (SyncThread:0) [    ] o.a.s.c.ZkTestServer Watch fired: children: /solr/overseer/queue
   [junit4]   2> 655612 DEBUG (SyncThread:0) [    ] o.a.s.c.ZkTestServer Watch added: children: /solr/overseer/queue
   [junit4]   2> 655612 DEBUG (OverseerThreadFactory-1978-thread-1-processing-n:127.0.0.1:35861_solr) [n:127.0.0.1:35861_solr    ] o.a.s.c.a.c.OverseerCollectionMessageHandler Expecting [testAddMultipleReplicas_shard1_replica_n1] cores but found {}
   [junit4]   2> 655612 DEBUG (OverseerStateUpdate-72265150818484234-127.0.0.1:35861_solr-n_0000000000) [n:127.0.0.1:35861_solr    ] o.a.s.c.Overseer processMessage: queueSize: 1, message = {
   [junit4]   2>   "operation":"ADDREPLICA",
   [junit4]   2>   "collection":"testAddMultipleReplicas",
   [junit4]   2>   "shard":"shard1",
   [junit4]   2>   "core":"testAddMultipleReplicas_shard1_replica_n1",
   [junit4]   2>   "state":"down",
   [junit4]   2>   "base_url":"https://127.0.0.1:43267/solr",
   [junit4]   2>   "type":"NRT",
   [junit4]   2>   "waitForFinalState":"false"} current state version: 0
   [junit4]   2> 655613 INFO  (OverseerStateUpdate-72265150818484234-127.0.0.1:35861_solr-n_0000000000) [n:127.0.0.1:35861_solr    ] o.a.s.c.o.SliceMutator createReplica() {
   [junit4]   2>   "operation":"ADDREPLICA",
   [junit4]   2>   "collection":"testAddMultipleReplicas",
   [junit4]   2>   "shard":"shard1",
   [junit4]   2>   "core":"testAddMultipleReplicas_shard1_replica_n1",
   [junit4]   2>   "state":"down",
   [junit4]   2>   "base_url":"https://127.0.0.1:43267/solr",
   [junit4]   2>   "type":"NRT",
   [junit4]   2>   "waitForFinalState":"false"} 
   [junit4]   2> 655613 DEBUG (OverseerStateUpdate-72265150818484234-127.0.0.1:35861_solr-n_0000000000) [n:127.0.0.1:35861_solr    ] o.a.s.c.o.SliceMutator Old Slice: shard1:{
   [junit4]   2>   "range":"80000000-7fffffff",
   [junit4]   2>   "state":"active",
   [junit4]   2>   "replicas":{}}
   [junit4]   2> 655613 DEBUG (OverseerStateUpdate-72265150818484234-127.0.0.1:35861_solr-n_0000000000) [n:127.0.0.1:35861_solr    ] o.a.s.c.o.SliceMutator New Slice: shard1:{
   [junit4]   2>   "range":"80000000-7fffffff",
   [junit4]   2>   "state":"active",
   [junit4]   2>   "replicas":{"core_node2":{
   [junit4]   2>       "core":"testAddMultipleReplicas_shard1_replica_n1",
   [junit4]   2>       "base_url":"https://127.0.0.1:43267/solr",
   [junit4]   2>       "state":"down",
   [junit4]   2>       "node_name":null,
   [junit4]   2>       "type":"NRT"}}}
   [junit4]   2> 655713 DEBUG (OverseerThreadFactory-1978-thread-1-processing-n:127.0.0.1:35861_solr) [n:127.0.0.1:35861_solr    ] o.a.s.c.a.c.OverseerCollectionMessageHandler Expecting [testAddMultipleReplicas_shard1_replica_n1] cores but found {}
   [junit4]   2> 655713 DEBUG (OverseerStateUpdate-72265150818484234-127.0.0.1:35861_solr-n_0000000000) [n:127.0.0.1:35861_solr    ] o.a.s.c.o.ZkStateWriter going to update_collection /collections/testAddMultipleReplicas/state.json version: 0
   [junit4]   2> 655714 DEBUG (SyncThread:0) [    ] o.a.s.c.ZkTestServer Watch fired: children: /solr/overseer/queue
   [junit4]   2> 655714 DEBUG (SyncThread:0) [    ] o.a.s.c.ZkTestServer Watch added: children: /solr/overseer/queue
   [junit4]   2> 655824 INFO  (qtp1401939512-5094) [n:127.0.0.1:43267_solr    x:testAddMultipleReplicas_shard1_replica_n1] o.a.s.h.a.CoreAdminOperation core create command qt=/admin/cores&coreNodeName=core_node2&collection.configName=conf1&newCollection=true&name=testAddMultipleReplicas_shard1_replica_n1&action=CREATE&numShards=1&collection=testAddMultipleReplicas&shard=shard1&wt=javabin&version=2&replicaType=NRT
   [junit4]   2> 655825 DEBUG (SyncThread:0) [    ] o.a.s.c.ZkTestServer Watch added: data: /solr/collections/testAddMultipleReplicas/state.json
   [junit4]   2> 655825 DEBUG (qtp1401939512-5094) [n:127.0.0.1:43267_solr c:testAddMultipleReplicas s:shard1 r:core_node2 x:testAddMultipleReplicas_shard1_replica_n1] o.a.s.c.ZkController publishing state=down
   [junit4]   2> 655826 DEBUG (SyncThread:0) [    ] o.a.s.c.ZkTestServer Watch fired: children: /solr/overseer/queue
   [junit4]   2> 655826 DEBUG (SyncThread:0) [    ] o.a.s.c.ZkTestServer Watch added: children: /solr/overseer/queue
   [junit4]   2> 655826 DEBUG (qtp1401939512-5094) [n:127.0.0.1:43267_solr c:testAddMultipleReplicas s:shard1 r:core_node2 x:testAddMultipleReplicas_shard1_replica_n1] o.a.s.c.ZkController Registering watch for collection testAddMultipleReplicas
   [junit4]   2> 655826 DEBUG (qtp1401939512-5094) [n:127.0.0.1:43267_solr c:testAddMultipleReplicas s:shard1 r:core_node2 x:testAddMultipleReplicas_shard1_replica_n1] o.a.s.c.ZkController waiting to find shard id in clusterstate for testAddMultipleReplicas_shard1_replica_n1
   [junit4]   2> 655827 DEBUG (OverseerStateUpdate-72265150818484234-127.0.0.1:35861_solr-n_0000000000) [n:127.0.0.1:35861_solr    ] o.a.s.c.Overseer processMessage: queueSize: 1, message = {
   [junit4]   2>   "core":"testAddMultipleReplicas_shard1_replica_n1",
   [junit4]   2>   "core_node_name":"core_node2",
   [junit4]   2>   "roles":null,
   [junit4]   2>   "base_url":"https://127.0.0.1:43267/solr",
   [junit4]   2>   "node_name":"127.0.0.1:43267_solr",
   [junit4]   2>   "numShards":"1",
   [junit4]   2>   "state":"down",
   [junit4]   2>   "shard":"shard1",
   [junit4]   2>   "collection":"testAddMultipleReplicas",
   [junit4]   2>   "type":"NRT",
   [junit4]   2>   "force_set_state":"false",
   [junit4]   2>   "operation":"state"} current state version: 0
   [junit4]   2> 655827 DEBUG (OverseerStateUpdate-72265150818484234-127.0.0.1:35861_solr-n_0000000000) [n:127.0.0.1:35861_solr    ] o.a.s.c.o.ReplicaMutator Update state numShards=1 message={
   [junit4]   2>   "core":"testAddMultipleReplicas_shard1_replica_n1",
   [junit4]   2>   "core_node_name":"core_node2",
   [junit4]   2>   "roles":null,
   [junit4]   2>   "base_url":"https://127.0.0.1:43267/solr",
   [junit4]   2>   "node_name":"127.0.0.1:43267_solr",
   [junit4]   2>   "numShards":"1",
   [junit4]   2>   "state":"down",
   [junit4]   2>   "shard":"shard1",
   [junit4]   2>   "collection":"testAddMultipleReplicas",
   [junit4]   2>   "type":"NRT",
   [junit4]   2>   "force_set_state":"false",
   [junit4]   2>   "operation":"state"}
   [junit4]   2> 655827 DEBUG (OverseerStateUpdate-72265150818484234-127.0.0.1:35861_solr-n_0000000000) [n:127.0.0.1:35861_solr    ] o.a.s.c.o.ReplicaMutator Will update state for replica: core_node2:{"core":"testAddMultipleReplicas_shard1_replica_n1","base_url":"https://127.0.0.1:43267/solr","node_name":"127.0.0.1:43267_solr","state":"down","type":"NRT","force_set_state":"false"}
   [junit4]   2> 655827 DEBUG (OverseerStateUpdate-72265150818484234-127.0.0.1:35861_solr-n_0000000000) [n:127.0.0.1:35861_solr    ] o.a.s.c.o.ReplicaMutator Collection is now: DocCollection(testAddMultipleReplicas//collections/testAddMultipleReplicas/state.json/1)={
   [junit4]   2>   "pullReplicas":"0",
   [junit4]   2>   "replicationFactor":"1",
   [junit4]   2>   "router":{"name":"compositeId"},
   [junit4]   2>   "maxShardsPerNode":"2",
   [junit4]   2>   "autoAddReplicas":"false",
   [junit4]   2>   "nrtReplicas":"1",
   [junit4]   2>   "tlogReplicas":"0",
   [junit4]   2>   "shards":{"shard1":{
   [junit4]   2>       "range":"80000000-7fffffff",
   [junit4]   2>       "state":"active",
   [junit4]   2>       "replicas":{"core_node2":{
   [junit4]   2>           "core":"testAddMultipleReplicas_shard1_replica_n1",
   [junit4]   2>           "base_url":"https://127.0.0.1:43267/solr",
   [junit4]   2>           "node_name":"127.0.0.1:43267_solr",
   [junit4]   2>           "state":"down",
   [junit4]   2>           "type":"NRT",
   [junit4]   2>           "force_set_state":"false"}}}}}
   [junit4]   2> 655927 DEBUG (OverseerStateUpdate-72265150818484234-127.0.0.1:35861_solr-n_0000000000) [n:127.0.0.1:35861_solr    ] o.a.s.c.o.ZkStateWriter going to update_collection /collections/testAddMultipleReplicas/state.json version: 1
   [junit4]   2> 655928 DEBUG (SyncThread:0) [    ] o.a.s.c.ZkTestServer Watch fired: data: /solr/collections/testAddMultipleReplicas/state.json
   [junit4]   2> 655928 DEBUG (SyncThread:0) [    ] o.a.s.c.ZkTestServer Watch fired: children: /solr/overseer/queue
   [junit4]   2> 655929 DEBUG (SyncThread:0) [    ] o.a.s.c.ZkTestServer Watch added: children: /solr/overseer/queue
   [junit4]   2> 656833 INFO  (qtp1401939512-5094) [n:127.0.0.1:43267_solr c:testAddMultipleReplicas s:shard1 r:core_node2 x:testAddMultipleReplicas_shard1_replica_n1] o.a.s.c.SolrConfig Using Lucene MatchVersion: 8.0.0
   [junit4]   2> 656837 INFO  (qtp1401939512-5094) [n:127.0.0.1:43267_solr c:testAddMultipleReplicas s:shard1 r:core_node2 x:testAddMultipleReplicas_shard1_replica_n1] o.a.s.s.IndexSchema [testAddMultipleReplicas_shard1_replica_n1] Schema name=minimal
   [junit4]   2> 656838 INFO  (qtp1401939512-5094) [n:127.0.0.1:43267_solr c:testAddMultipleReplicas s:shard1 r:core_node2 x:testAddMultipleReplicas_shard1_replica_n1] o.a.s.s.IndexSchema Loaded schema minimal/1.1 with uniqueid field id
   [junit4]   2> 656838 INFO  (qtp1401939512-5094) [n:127.0.0.1:43267_solr c:testAddMultipleReplicas s:shard1 r:core_node2 x:testAddMultipleReplicas_shard1_replica_n1] o.a.s.c.CoreContainer Creating SolrCore 'testAddMultipleReplicas_shard1_replica_n1' using configuration from collection testAddMultipleReplicas, trusted=true
   [junit4]   2> 656839 INFO  (qtp1401939512-5094) [n:127.0.0.1:43267_solr c:testAddMultipleReplicas s:shard1 r:core_node2 x:testAddMultipleReplicas_shard1_replica_n1] o.a.s.m.r.SolrJmxReporter JMX monitoring for 'solr_43267.solr.core.testAddMultipleReplicas.shard1.replica_n1' (registry 'solr.core.testAddMultipleReplicas.shard1.replica_n1') enabled at server: com.sun.jmx.mbeanserver.JmxMBeanServer@4736b2fe
   [junit4]   2> 656839 INFO  (qtp1401939512-5094) [n:127.0.0.1:43267_solr c:testAddMultipleReplicas s:shard1 r:core_node2 x:testAddMultipleReplicas_shard1_replica_n1] o.a.s.c.SolrCore [[testAddMultipleReplicas_shard1_replica_n1] ] Opening new SolrCore at [/home/jenkins/workspace/Lucene-Solr-master-Linux/solr/build/solr-core/test/J2/temp/solr.cloud.AddReplicaTest_8ECB21C4F94E3823-001/tempDir-001/node1/testAddMultipleReplicas_shard1_replica_n1], dataDir=[/home/jenkins/workspace/Lucene-Solr-master-Linux/solr/build/solr-core/test/J2/temp/solr.cloud.AddReplicaTest_8ECB21C4F94E3823-001/tempDir-001/node1/./testAddMultipleReplicas_shard1_replica_n1/data/]
   [junit4]   2> 656867 INFO  (qtp1401939512-5094) [n:127.0.0.1:43267_solr c:testAddMultipleReplicas s:shard1 r:core_node2 x:testAddMultipleReplicas_shard1_replica_n1] o.a.s.u.UpdateHandler Using UpdateLog implementation: org.apache.solr.update.UpdateLog
   [junit4]   2> 656867 INFO  (qtp1401939512-5094) [n:127.0.0.1:43267_solr c:testAddMultipleReplicas s:shard1 r:core_node2 x:testAddMultipleReplicas_shard1_replica_n1] o.a.s.u.UpdateLog Initializing UpdateLog: dataDir=null defaultSyncLevel=FLUSH numRecordsToKeep=100 maxNumLogsToKeep=10 numVersionBuckets=65536
   [junit4]   2> 656867 INFO  (qtp1401939512-5094) [n:127.0.0.1:43267_solr c:testAddMultipleReplicas s:shard1 r:core_node2 x:testAddMultipleReplicas_shard1_replica_n1] o.a.s.u.CommitTracker Hard AutoCommit: disabled
   [junit4]   2> 656867 INFO  (qtp1401939512-5094) [n:127.0.0.1:43267_solr c:testAddMultipleReplicas s:shard1 r:core_node2 x:testAddMultipleReplicas_shard1_replica_n1] o.a.s.u.CommitTracker Soft AutoCommit: disabled
   [junit4]   2> 656868 INFO  (qtp1401939512-5094) [n:127.0.0.1:43267_solr c:testAddMultipleReplicas s:shard1 r:core_node2 x:testAddMultipleReplicas_shard1_replica_n1] o.a.s.s.SolrIndexSearcher Opening [Searcher@188efb52[testAddMultipleReplicas_shard1_replica_n1] main]
   [junit4]   2> 656869 INFO  (qtp1401939512-5094) [n:127.0.0.1:43267_solr c:testAddMultipleReplicas s:shard1 r:core_node2 x:testAddMultipleReplicas_shard1_replica_n1] o.a.s.r.ManagedResourceStorage Configured ZooKeeperStorageIO with znodeBase: /configs/conf1
   [junit4]   2> 656870 INFO  (qtp1401939512-5094) [n:127.0.0.1:43267_solr c:testAddMultipleReplicas s:shard1 r:core_node2 x:testAddMultipleReplicas_shard1_replica_n1] o.a.s.r.ManagedResourceStorage Loaded null at path _rest_managed.json using ZooKeeperStorageIO:path=/configs/conf1
   [junit4]   2> 656870 INFO  (qtp1401939512-5094) [n:127.0.0.1:43267_solr c:testAddMultipleReplicas s:shard1 r:core_node2 x:testAddMultipleReplicas_shard1_replica_n1] o.a.s.h.ReplicationHandler Commits will be reserved for 10000ms.
   [junit4]   2> 656870 INFO  (qtp1401939512-5094) [n:127.0.0.1:43267_solr c:testAddMultipleReplicas s:shard1 r:core_node2 x:testAddMultipleReplicas_shard1_replica_n1] o.a.s.u.UpdateLog Could not find max version in index or recent updates, using new clock 1612260457108733952
   [junit4]   2> 656871 INFO  (searcherExecutor-1997-thread-1-processing-n:127.0.0.1:43267_solr x:testAddMultipleReplicas_shard1_replica_n1 c:testAddMultipleReplicas s:shard1 r:core_node2) [n:127.0.0.1:43267_solr c:testAddMultipleReplicas s:shard1 r:core_node2 x:testAddMultipleReplicas_shard1_replica_n1] o.a.s.c.SolrCore [testAddMultipleReplicas_shard1_replica_n1] Registered new searcher Searcher@188efb52[testAddMultipleReplicas_shard1_replica_n1] main{ExitableDirectoryReader(UninvertingDirectoryReader())}
   [junit4]   2> 656872 DEBUG (qtp1401939512-5094) [n:127.0.0.1:43267_solr c:testAddMultipleReplicas s:shard1 r:core_node2 x:testAddMultipleReplicas_shard1_replica_n1] o.a.s.c.ZkController watch zkdir /configs/conf1
   [junit4]   2> 656872 DEBUG (SyncThread:0) [    ] o.a.s.c.ZkTestServer Watch added: create/delete: /solr/configs/conf1
   [junit4]   2> 656872 DEBUG (SyncThread:0) [    ] o.a.s.c.ZkTestServer Watch added: data: /solr/collections/testAddMultipleReplicas/state.json
   [junit4]   2> 656873 DEBUG (SyncThread:0) [    ] o.a.s.c.ZkTestServer Watch added: create/delete: /solr/collections/testAddMultipleReplicas/terms/shard1
   [junit4]   2> 656873 DEBUG (SyncThread:0) [    ] o.a.s.c.ZkTestServer Watch fired: data: /solr/collections/testAddMultipleReplicas/terms/shard1
   [junit4]   2> 656873 INFO  (qtp1401939512-5094) [n:127.0.0.1:43267_solr c:testAddMultipleReplicas s:shard1 r:core_node2 x:testAddMultipleReplicas_shard1_replica_n1] o.a.s.c.ZkShardTerms Successful update of terms at /collections/testAddMultipleReplicas/terms/shard1 to Terms{values={core_node2=0}, version=0}
   [junit4]   2> 656873 DEBUG (qtp1401939512-5094) [n:127.0.0.1:43267_solr c:testAddMultipleReplicas s:shard1 r:core_node2 x:testAddMultipleReplicas_shard1_replica_n1] o.a.s.c.ZkController Register replica - core:testAddMultipleReplicas_shard1_replica_n1 address:https://127.0.0.1:43267/solr collection:testAddMultipleReplicas shard:shard1
   [junit4]   2> 656873 DEBUG (SyncThread:0) [    ] o.a.s.c.ZkTestServer Watch added: create/delete: /solr/collections/testAddMultipleReplicas/terms/shard1
   [junit4]   2> 656874 DEBUG (qtp1401939512-5094) [n:127.0.0.1:43267_solr c:testAddMultipleReplicas s:shard1 r:core_node2 x:testAddMultipleReplicas_shard1_replica_n1] o.a.s.c.LeaderElector Joined leadership election with path: /collections/testAddMultipleReplicas/leader_elect/shard1/election/72265150818484230-core_node2-n_0000000000
   [junit4]   2> 656875 DEBUG (qtp1401939512-5094) [n:127.0.0.1:43267_solr c:testAddMultipleReplicas s:shard1 r:core_node2 x:testAddMultipleReplicas_shard1_replica_n1] o.a.s.c.ShardLeaderElectionContext Running the leader process for shard=shard1 and weAreReplacement=false and leaderVoteWait=10000
   [junit4]   2> 656875 INFO  (qtp1401939512-5094) [n:127.0.0.1:43267_solr c:testAddMultipleReplicas s:shard1 r:core_node2 x:testAddMultipleReplicas_shard1_replica_n1] o.a.s.c.ShardLeaderElectionContext Enough replicas found to continue.
   [junit4]   2> 656875 INFO  (qtp1401939512-5094) [n:127.0.0.1:43267_solr c:testAddMultipleReplicas s:shard1 r:core_node2 x:testAddMultipleReplicas_shard1_replica_n1] o.a.s.c.ShardLeaderElectionContext I may be the new leader - try and sync
   [junit4]   2> 656875 INFO  (qtp1401939512-5094) [n:127.0.0.1:43267_solr c:testAddMultipleReplicas s:shard1 r:core_node2 x:testAddMultipleReplicas_shard1_replica_n1] o.a.s.c.SyncStrategy Sync replicas to https://127.0.0.1:43267/solr/testAddMultipleReplicas_shard1_replica_n1/
   [junit4]   2> 656875 INFO  (qtp1401939512-5094) [n:127.0.0.1:43267_solr c:testAddMultipleReplicas s:shard1 r:core_node2 x:testAddMultipleReplicas_shard1_replica_n1] o.a.s.c.SyncStrategy Sync Success - now sync replicas to me
   [junit4]   2> 656875 INFO  (qtp1401939512-5094) [n:127.0.0.1:43267_solr c:testAddMultipleReplicas s:shard1 r:core_node2 x:testAddMultipleReplicas_shard1_replica_n1] o.a.s.c.SyncStrategy https://127.0.0.1:43267/solr/testAddMultipleReplicas_shard1_replica_n1/ has no replicas
   [junit4]   2> 656875 DEBUG (qtp1401939512-5094) [n:127.0.0.1:43267_solr c:testAddMultipleReplicas s:shard1 r:core_node2 x:testAddMultipleReplicas_shard1_replica_n1] o.a.s.c.ShardLeaderElectionContext 127.0.0.1:43267_solr synched 0
   [junit4]   2> 656875 INFO  (qtp1401939512-5094) [n:127.0.0.1:43267_solr c:testAddMultipleReplicas s:shard1 r:core_node2 x:testAddMultipleReplicas_sh

[...truncated too long message...]

oll_shard1_replica_n5] o.a.s.c.ZkController No more listeners for config directory [/configs/conf1]
   [junit4]   2> 44744 INFO  (coreCloseExecutor-182-thread-1) [n:127.0.0.1:37955_solr c:addreplicatest_coll s:shard1 r:core_node3 x:addreplicatest_coll_shard1_replica_n1] o.a.s.m.SolrMetricManager Closing metric reporters for registry=solr.collection.addreplicatest_coll.shard1.leader, tag=3c4b64c1
   [junit4]   2> 44745 DEBUG (coreCloseExecutor-182-thread-1) [n:127.0.0.1:37955_solr c:addreplicatest_coll s:shard1 r:core_node3 x:addreplicatest_coll_shard1_replica_n1] o.a.s.c.ZkController removed listener for config directory [/configs/conf1]
   [junit4]   2> 44745 DEBUG (coreCloseExecutor-182-thread-1) [n:127.0.0.1:37955_solr c:addreplicatest_coll s:shard1 r:core_node3 x:addreplicatest_coll_shard1_replica_n1] o.a.s.c.ZkController No more listeners for config directory [/configs/conf1]
   [junit4]   2> 44755 WARN  (NIOServerCxn.Factory:0.0.0.0/0.0.0.0:0) [    ] o.a.z.s.NIOServerCnxn Unable to read additional data from client sessionid 0x100bcf67cf4000d, likely client has closed socket
   [junit4]   2> 44760 INFO  (jetty-closer-89-thread-2) [    ] o.a.s.c.Overseer Overseer (id=72265360882270217-127.0.0.1:45589_solr-n_0000000000) closing
   [junit4]   2> 44760 INFO  (OverseerStateUpdate-72265360882270217-127.0.0.1:45589_solr-n_0000000000) [n:127.0.0.1:45589_solr    ] o.a.s.c.Overseer Overseer Loop exiting : 127.0.0.1:45589_solr
   [junit4]   2> 44760 DEBUG (SyncThread:0) [    ] o.a.s.c.ZkTestServer Watch fired: create/delete: /solr/collections/addreplicatest_coll/leader_elect/shard1/election/72265360882270223-core_node6-n_0000000001
   [junit4]   2> 44760 WARN  (OverseerAutoScalingTriggerThread-72265360882270217-127.0.0.1:45589_solr-n_0000000000) [    ] o.a.s.c.a.OverseerTriggerThread OverseerTriggerThread woken up but we are closed, exiting.
   [junit4]   2> 44761 DEBUG (jetty-closer-89-thread-2) [    ] o.a.s.c.a.ScheduledTriggers Shutting down scheduled thread pool executor now
   [junit4]   2> 44761 DEBUG (jetty-closer-89-thread-2) [    ] o.a.s.c.a.ScheduledTriggers Shutting down action executor now
   [junit4]   2> 44761 DEBUG (jetty-closer-89-thread-2) [    ] o.a.s.c.a.ScheduledTriggers Awaiting termination for action executor
   [junit4]   2> 44761 DEBUG (jetty-closer-89-thread-2) [    ] o.a.s.c.a.ScheduledTriggers Awaiting termination for scheduled thread pool executor
   [junit4]   2> 44761 DEBUG (jetty-closer-89-thread-2) [    ] o.a.s.c.a.ScheduledTriggers ScheduledTriggers closed completely
   [junit4]   2> 44761 DEBUG (jetty-closer-89-thread-2) [    ] o.a.s.c.a.OverseerTriggerThread OverseerTriggerThread has been closed explicitly
   [junit4]   2> 44761 DEBUG (SyncThread:0) [    ] o.a.s.c.ZkTestServer Watch fired: create/delete: /solr/overseer_elect/election/72265360882270218-127.0.0.1:37955_solr-n_0000000001
   [junit4]   2> 44761 DEBUG (SyncThread:0) [    ] o.a.s.c.ZkTestServer Watch fired: create/delete: /solr/collections/addreplicatest_coll/leader_elect/shard1/election/72265360882270218-core_node3-n_0000000000
   [junit4]   2> 44762 WARN  (NIOServerCxn.Factory:0.0.0.0/0.0.0.0:0) [    ] o.a.z.s.NIOServerCnxn Unable to read additional data from client sessionid 0x100bcf67cf4000f, likely client has closed socket
   [junit4]   2> 44762 WARN  (NIOServerCxn.Factory:0.0.0.0/0.0.0.0:0) [    ] o.a.z.s.NIOServerCnxn Unable to read additional data from client sessionid 0x100bcf67cf4000a, likely client has closed socket
   [junit4]   2> 44763 INFO  (jetty-closer-89-thread-1) [    ] o.e.j.s.h.ContextHandler Stopped o.e.j.s.ServletContextHandler@74ef7dd4{/solr,null,UNAVAILABLE}
   [junit4]   2> 44763 INFO  (jetty-closer-89-thread-1) [    ] o.e.j.s.session node0 Stopped scavenging
   [junit4]   2> 44764 INFO  (jetty-closer-89-thread-4) [    ] o.e.j.s.h.ContextHandler Stopped o.e.j.s.ServletContextHandler@53f668b3{/solr,null,UNAVAILABLE}
   [junit4]   2> 44765 INFO  (jetty-closer-89-thread-4) [    ] o.e.j.s.session node0 Stopped scavenging
   [junit4]   2> 44765 INFO  (jetty-closer-89-thread-2) [    ] o.e.j.s.h.ContextHandler Stopped o.e.j.s.ServletContextHandler@69409a5{/solr,null,UNAVAILABLE}
   [junit4]   2> 44765 INFO  (jetty-closer-89-thread-2) [    ] o.e.j.s.session node0 Stopped scavenging
   [junit4]   2> 46265 INFO  (jetty-closer-89-thread-3) [    ] o.e.j.s.h.ContextHandler Stopped o.e.j.s.ServletContextHandler@52a7aabe{/solr,null,UNAVAILABLE}
   [junit4]   2> 46265 INFO  (jetty-closer-89-thread-3) [    ] o.e.j.s.session node0 Stopped scavenging
   [junit4]   2> 46266 ERROR (SUITE-AddReplicaTest-seed#[8ECB21C4F94E3823]-worker) [    ] o.a.z.s.ZooKeeperServer ZKShutdownHandler is not registered, so ZooKeeper server won't take any action on ERROR or SHUTDOWN server state changes
   [junit4]   2> 46266 INFO  (SUITE-AddReplicaTest-seed#[8ECB21C4F94E3823]-worker) [    ] o.a.s.c.ZkTestServer connecting to 127.0.0.1:37923 37923
   [junit4]   2> 46305 INFO  (Thread-50) [    ] o.a.s.c.ZkTestServer connecting to 127.0.0.1:37923 37923
   [junit4]   2> 46305 WARN  (Thread-50) [    ] o.a.s.c.ZkTestServer Watch limit violations: 
   [junit4]   2> Maximum concurrent create/delete watches above limit:
   [junit4]   2> 
   [junit4]   2> 	29	/solr/collections/testAddMultipleReplicas/terms/shard1
   [junit4]   2> 	20	/solr/collections/addreplicatest_coll/terms/shard1
   [junit4]   2> 	11	/solr/aliases.json
   [junit4]   2> 	8	/solr/configs/conf1
   [junit4]   2> 	4	/solr/security.json
   [junit4]   2> 	3	/solr/collections/testAddMultipleReplicas/state.json
   [junit4]   2> 	2	/solr/collections/addreplicatest_coll/terms/shard2
   [junit4]   2> 
   [junit4]   2> Maximum concurrent data watches above limit:
   [junit4]   2> 
   [junit4]   2> 	23	/solr/collections/testAddMultipleReplicas/state.json
   [junit4]   2> 	22	/solr/collections/addreplicatest_coll/state.json
   [junit4]   2> 	11	/solr/clusterprops.json
   [junit4]   2> 	11	/solr/clusterstate.json
   [junit4]   2> 	3	/solr/aliases.json
   [junit4]   2> 
   [junit4]   2> Maximum concurrent children watches above limit:
   [junit4]   2> 
   [junit4]   2> 	16	/solr/collections
   [junit4]   2> 	11	/solr/live_nodes
   [junit4]   2> 
   [junit4]   2> NOTE: leaving temporary files on disk at: /home/jenkins/workspace/Lucene-Solr-master-Linux/solr/build/solr-core/test/J2/temp/solr.cloud.AddReplicaTest_8ECB21C4F94E3823-002
   [junit4]   2> Sep 22, 2018 12:03:30 AM com.carrotsearch.randomizedtesting.ThreadLeakControl checkThreadLeaks
   [junit4]   2> WARNING: Will linger awaiting termination of 1 leaked thread(s).
   [junit4]   2> NOTE: test params are: codec=FastDecompressionCompressingStoredFields(storedFieldsFormat=CompressingStoredFieldsFormat(compressionMode=FAST_DECOMPRESSION, chunkSize=2, maxDocsPerChunk=588, blockSize=9), termVectorsFormat=CompressingTermVectorsFormat(compressionMode=FAST_DECOMPRESSION, chunkSize=2, blockSize=9)), sim=Asserting(org.apache.lucene.search.similarities.AssertingSimilarity@66bb321f), locale=en-US, timezone=Arctic/Longyearbyen
   [junit4]   2> NOTE: Linux 4.15.0-32-generic amd64/Oracle Corporation 1.8.0_172 (64-bit)/cpus=8,threads=1,free=400865368,total=518979584
   [junit4]   2> NOTE: All tests run in this JVM: [AddReplicaTest, AddReplicaTest]
   [junit4] Completed [5/5 (5!)] on J2 in 18.68s, 2 tests, 1 failure <<< FAILURES!
   [junit4] 
   [junit4] 
   [junit4] Tests with failures [seed: 8ECB21C4F94E3823]:
   [junit4]   - org.apache.solr.cloud.AddReplicaTest.testAddMultipleReplicas
   [junit4]   - org.apache.solr.cloud.AddReplicaTest.testAddMultipleReplicas
   [junit4]   - org.apache.solr.cloud.AddReplicaTest.testAddMultipleReplicas
   [junit4]   - org.apache.solr.cloud.AddReplicaTest.testAddMultipleReplicas
   [junit4]   - org.apache.solr.cloud.AddReplicaTest.testAddMultipleReplicas
   [junit4] 
   [junit4] 
   [junit4] JVM J0:     0.73 ..    29.64 =    28.91s
   [junit4] JVM J1:     0.73 ..    45.51 =    44.78s
   [junit4] JVM J2:     0.74 ..    47.51 =    46.77s
   [junit4] Execution time total: 47 seconds
   [junit4] Tests summary: 5 suites, 10 tests, 5 failures

BUILD FAILED
/home/jenkins/workspace/Lucene-Solr-master-Linux/lucene/common-build.xml:1567: The following error occurred while executing this line:
/home/jenkins/workspace/Lucene-Solr-master-Linux/lucene/common-build.xml:1092: There were test failures: 5 suites, 10 tests, 5 failures [seed: 8ECB21C4F94E3823]

Total time: 49 seconds

[repro] Setting last failure code to 256

[repro] Failures:
[repro]   5/5 failed: org.apache.solr.cloud.AddReplicaTest
[repro] Exiting with code 256
+ mv lucene/build lucene/build.repro
+ mv solr/build solr/build.repro
+ mv lucene/build.orig lucene/build
+ mv solr/build.orig solr/build
Archiving artifacts
Setting ANT_1_8_2_HOME=/var/lib/jenkins/tools/hudson.tasks.Ant_AntInstallation/ANT_1.8.2
[WARNINGS] Parsing warnings in console log with parser Java Compiler (javac)
Setting ANT_1_8_2_HOME=/var/lib/jenkins/tools/hudson.tasks.Ant_AntInstallation/ANT_1.8.2
Setting ANT_1_8_2_HOME=/var/lib/jenkins/tools/hudson.tasks.Ant_AntInstallation/ANT_1.8.2
<Git Blamer> Using GitBlamer to create author and commit information for all warnings.
<Git Blamer> GIT_COMMIT=4bcace571ee1e512b2ca4aa3d93bc7bd522b55fe, workspace=/var/lib/jenkins/workspace/Lucene-Solr-master-Linux
[WARNINGS] Computing warning deltas based on reference build #22899
Recording test results
Setting ANT_1_8_2_HOME=/var/lib/jenkins/tools/hudson.tasks.Ant_AntInstallation/ANT_1.8.2
Build step 'Publish JUnit test result report' changed build result to UNSTABLE
Email was triggered for: Unstable (Test Failures)
Sending email for trigger: Unstable (Test Failures)
Setting ANT_1_8_2_HOME=/var/lib/jenkins/tools/hudson.tasks.Ant_AntInstallation/ANT_1.8.2
Setting ANT_1_8_2_HOME=/var/lib/jenkins/tools/hudson.tasks.Ant_AntInstallation/ANT_1.8.2
Setting ANT_1_8_2_HOME=/var/lib/jenkins/tools/hudson.tasks.Ant_AntInstallation/ANT_1.8.2
Setting ANT_1_8_2_HOME=/var/lib/jenkins/tools/hudson.tasks.Ant_AntInstallation/ANT_1.8.2

Mime
View raw message