lucene-dev mailing list archives

Site index · List index
Message view « Date » · « Thread »
Top « Date » · « Thread »
From Policeman Jenkins Server <jenk...@thetaphi.de>
Subject [JENKINS] Lucene-Solr-master-MacOSX (64bit/jdk1.8.0) - Build # 4842 - Unstable!
Date Mon, 24 Sep 2018 18:20:45 GMT
Build: https://jenkins.thetaphi.de/job/Lucene-Solr-master-MacOSX/4842/
Java: 64bit/jdk1.8.0 -XX:+UseCompressedOops -XX:+UseG1GC

3 tests failed.
FAILED:  org.apache.solr.update.processor.TimeRoutedAliasUpdateProcessorTest.test

Error Message:
Error from server at https://127.0.0.1:63126/solr: no such collection or alias

Stack Trace:
org.apache.solr.client.solrj.impl.HttpSolrClient$RemoteExecutionException: Error from server at https://127.0.0.1:63126/solr: no such collection or alias
	at __randomizedtesting.SeedInfo.seed([2B9F1478C9677CDC:A3CB2BA2679B1124]:0)
	at org.apache.solr.client.solrj.impl.HttpSolrClient$RemoteExecutionException.create(HttpSolrClient.java:829)
	at org.apache.solr.client.solrj.impl.HttpSolrClient.executeMethod(HttpSolrClient.java:620)
	at org.apache.solr.client.solrj.impl.HttpSolrClient.request(HttpSolrClient.java:255)
	at org.apache.solr.client.solrj.impl.HttpSolrClient.request(HttpSolrClient.java:244)
	at org.apache.solr.client.solrj.impl.LBHttpSolrClient.doRequest(LBHttpSolrClient.java:483)
	at org.apache.solr.client.solrj.impl.LBHttpSolrClient.request(LBHttpSolrClient.java:413)
	at org.apache.solr.client.solrj.impl.CloudSolrClient.sendRequest(CloudSolrClient.java:1107)
	at org.apache.solr.client.solrj.impl.CloudSolrClient.requestWithRetryOnStaleState(CloudSolrClient.java:884)
	at org.apache.solr.client.solrj.impl.CloudSolrClient.request(CloudSolrClient.java:817)
	at org.apache.solr.client.solrj.SolrClient.request(SolrClient.java:1219)
	at org.apache.solr.update.processor.TimeRoutedAliasUpdateProcessorTest.createConfigSet(TimeRoutedAliasUpdateProcessorTest.java:231)
	at org.apache.solr.update.processor.TimeRoutedAliasUpdateProcessorTest.test(TimeRoutedAliasUpdateProcessorTest.java:120)
	at sun.reflect.NativeMethodAccessorImpl.invoke0(Native Method)
	at sun.reflect.NativeMethodAccessorImpl.invoke(NativeMethodAccessorImpl.java:62)
	at sun.reflect.DelegatingMethodAccessorImpl.invoke(DelegatingMethodAccessorImpl.java:43)
	at java.lang.reflect.Method.invoke(Method.java:498)
	at com.carrotsearch.randomizedtesting.RandomizedRunner.invoke(RandomizedRunner.java:1742)
	at com.carrotsearch.randomizedtesting.RandomizedRunner$8.evaluate(RandomizedRunner.java:935)
	at com.carrotsearch.randomizedtesting.RandomizedRunner$9.evaluate(RandomizedRunner.java:971)
	at com.carrotsearch.randomizedtesting.RandomizedRunner$10.evaluate(RandomizedRunner.java:985)
	at com.carrotsearch.randomizedtesting.rules.SystemPropertiesRestoreRule$1.evaluate(SystemPropertiesRestoreRule.java:57)
	at org.apache.lucene.util.TestRuleSetupTeardownChained$1.evaluate(TestRuleSetupTeardownChained.java:49)
	at org.apache.lucene.util.AbstractBeforeAfterRule$1.evaluate(AbstractBeforeAfterRule.java:45)
	at org.apache.lucene.util.TestRuleThreadAndTestName$1.evaluate(TestRuleThreadAndTestName.java:48)
	at org.apache.lucene.util.TestRuleIgnoreAfterMaxFailures$1.evaluate(TestRuleIgnoreAfterMaxFailures.java:64)
	at org.apache.lucene.util.TestRuleMarkFailure$1.evaluate(TestRuleMarkFailure.java:47)
	at com.carrotsearch.randomizedtesting.rules.StatementAdapter.evaluate(StatementAdapter.java:36)
	at com.carrotsearch.randomizedtesting.ThreadLeakControl$StatementRunner.run(ThreadLeakControl.java:368)
	at com.carrotsearch.randomizedtesting.ThreadLeakControl.forkTimeoutingTask(ThreadLeakControl.java:817)
	at com.carrotsearch.randomizedtesting.ThreadLeakControl$3.evaluate(ThreadLeakControl.java:468)
	at com.carrotsearch.randomizedtesting.RandomizedRunner.runSingleTest(RandomizedRunner.java:944)
	at com.carrotsearch.randomizedtesting.RandomizedRunner$5.evaluate(RandomizedRunner.java:830)
	at com.carrotsearch.randomizedtesting.RandomizedRunner$6.evaluate(RandomizedRunner.java:880)
	at com.carrotsearch.randomizedtesting.RandomizedRunner$7.evaluate(RandomizedRunner.java:891)
	at com.carrotsearch.randomizedtesting.rules.StatementAdapter.evaluate(StatementAdapter.java:36)
	at com.carrotsearch.randomizedtesting.rules.SystemPropertiesRestoreRule$1.evaluate(SystemPropertiesRestoreRule.java:57)
	at org.apache.lucene.util.AbstractBeforeAfterRule$1.evaluate(AbstractBeforeAfterRule.java:45)
	at com.carrotsearch.randomizedtesting.rules.StatementAdapter.evaluate(StatementAdapter.java:36)
	at org.apache.lucene.util.TestRuleStoreClassName$1.evaluate(TestRuleStoreClassName.java:41)
	at com.carrotsearch.randomizedtesting.rules.NoShadowingOrOverridesOnMethodsRule$1.evaluate(NoShadowingOrOverridesOnMethodsRule.java:40)
	at com.carrotsearch.randomizedtesting.rules.NoShadowingOrOverridesOnMethodsRule$1.evaluate(NoShadowingOrOverridesOnMethodsRule.java:40)
	at com.carrotsearch.randomizedtesting.rules.StatementAdapter.evaluate(StatementAdapter.java:36)
	at com.carrotsearch.randomizedtesting.rules.StatementAdapter.evaluate(StatementAdapter.java:36)
	at com.carrotsearch.randomizedtesting.rules.StatementAdapter.evaluate(StatementAdapter.java:36)
	at org.apache.lucene.util.TestRuleAssertionsRequired$1.evaluate(TestRuleAssertionsRequired.java:53)
	at org.apache.lucene.util.TestRuleMarkFailure$1.evaluate(TestRuleMarkFailure.java:47)
	at org.apache.lucene.util.TestRuleIgnoreAfterMaxFailures$1.evaluate(TestRuleIgnoreAfterMaxFailures.java:64)
	at org.apache.lucene.util.TestRuleIgnoreTestSuites$1.evaluate(TestRuleIgnoreTestSuites.java:54)
	at com.carrotsearch.randomizedtesting.rules.StatementAdapter.evaluate(StatementAdapter.java:36)
	at com.carrotsearch.randomizedtesting.ThreadLeakControl$StatementRunner.run(ThreadLeakControl.java:368)
	at java.lang.Thread.run(Thread.java:748)


FAILED:  org.apache.solr.update.processor.TimeRoutedAliasUpdateProcessorTest.testPreemptiveCreation

Error Message:
Error from server at https://127.0.0.1:63123/solr: no such collection or alias

Stack Trace:
org.apache.solr.client.solrj.impl.HttpSolrClient$RemoteExecutionException: Error from server at https://127.0.0.1:63123/solr: no such collection or alias
	at __randomizedtesting.SeedInfo.seed([2B9F1478C9677CDC:46F591D3F10591E8]:0)
	at org.apache.solr.client.solrj.impl.HttpSolrClient$RemoteExecutionException.create(HttpSolrClient.java:829)
	at org.apache.solr.client.solrj.impl.HttpSolrClient.executeMethod(HttpSolrClient.java:620)
	at org.apache.solr.client.solrj.impl.HttpSolrClient.request(HttpSolrClient.java:255)
	at org.apache.solr.client.solrj.impl.HttpSolrClient.request(HttpSolrClient.java:244)
	at org.apache.solr.client.solrj.impl.LBHttpSolrClient.doRequest(LBHttpSolrClient.java:483)
	at org.apache.solr.client.solrj.impl.LBHttpSolrClient.request(LBHttpSolrClient.java:413)
	at org.apache.solr.client.solrj.impl.CloudSolrClient.sendRequest(CloudSolrClient.java:1107)
	at org.apache.solr.client.solrj.impl.CloudSolrClient.requestWithRetryOnStaleState(CloudSolrClient.java:884)
	at org.apache.solr.client.solrj.impl.CloudSolrClient.request(CloudSolrClient.java:817)
	at org.apache.solr.client.solrj.SolrClient.request(SolrClient.java:1219)
	at org.apache.solr.update.processor.TimeRoutedAliasUpdateProcessorTest.createConfigSet(TimeRoutedAliasUpdateProcessorTest.java:231)
	at org.apache.solr.update.processor.TimeRoutedAliasUpdateProcessorTest.testPreemptiveCreation(TimeRoutedAliasUpdateProcessorTest.java:340)
	at sun.reflect.NativeMethodAccessorImpl.invoke0(Native Method)
	at sun.reflect.NativeMethodAccessorImpl.invoke(NativeMethodAccessorImpl.java:62)
	at sun.reflect.DelegatingMethodAccessorImpl.invoke(DelegatingMethodAccessorImpl.java:43)
	at java.lang.reflect.Method.invoke(Method.java:498)
	at com.carrotsearch.randomizedtesting.RandomizedRunner.invoke(RandomizedRunner.java:1742)
	at com.carrotsearch.randomizedtesting.RandomizedRunner$8.evaluate(RandomizedRunner.java:935)
	at com.carrotsearch.randomizedtesting.RandomizedRunner$9.evaluate(RandomizedRunner.java:971)
	at com.carrotsearch.randomizedtesting.RandomizedRunner$10.evaluate(RandomizedRunner.java:985)
	at com.carrotsearch.randomizedtesting.rules.SystemPropertiesRestoreRule$1.evaluate(SystemPropertiesRestoreRule.java:57)
	at org.apache.lucene.util.TestRuleSetupTeardownChained$1.evaluate(TestRuleSetupTeardownChained.java:49)
	at org.apache.lucene.util.AbstractBeforeAfterRule$1.evaluate(AbstractBeforeAfterRule.java:45)
	at org.apache.lucene.util.TestRuleThreadAndTestName$1.evaluate(TestRuleThreadAndTestName.java:48)
	at org.apache.lucene.util.TestRuleIgnoreAfterMaxFailures$1.evaluate(TestRuleIgnoreAfterMaxFailures.java:64)
	at org.apache.lucene.util.TestRuleMarkFailure$1.evaluate(TestRuleMarkFailure.java:47)
	at com.carrotsearch.randomizedtesting.rules.StatementAdapter.evaluate(StatementAdapter.java:36)
	at com.carrotsearch.randomizedtesting.ThreadLeakControl$StatementRunner.run(ThreadLeakControl.java:368)
	at com.carrotsearch.randomizedtesting.ThreadLeakControl.forkTimeoutingTask(ThreadLeakControl.java:817)
	at com.carrotsearch.randomizedtesting.ThreadLeakControl$3.evaluate(ThreadLeakControl.java:468)
	at com.carrotsearch.randomizedtesting.RandomizedRunner.runSingleTest(RandomizedRunner.java:944)
	at com.carrotsearch.randomizedtesting.RandomizedRunner$5.evaluate(RandomizedRunner.java:830)
	at com.carrotsearch.randomizedtesting.RandomizedRunner$6.evaluate(RandomizedRunner.java:880)
	at com.carrotsearch.randomizedtesting.RandomizedRunner$7.evaluate(RandomizedRunner.java:891)
	at com.carrotsearch.randomizedtesting.rules.StatementAdapter.evaluate(StatementAdapter.java:36)
	at com.carrotsearch.randomizedtesting.rules.SystemPropertiesRestoreRule$1.evaluate(SystemPropertiesRestoreRule.java:57)
	at org.apache.lucene.util.AbstractBeforeAfterRule$1.evaluate(AbstractBeforeAfterRule.java:45)
	at com.carrotsearch.randomizedtesting.rules.StatementAdapter.evaluate(StatementAdapter.java:36)
	at org.apache.lucene.util.TestRuleStoreClassName$1.evaluate(TestRuleStoreClassName.java:41)
	at com.carrotsearch.randomizedtesting.rules.NoShadowingOrOverridesOnMethodsRule$1.evaluate(NoShadowingOrOverridesOnMethodsRule.java:40)
	at com.carrotsearch.randomizedtesting.rules.NoShadowingOrOverridesOnMethodsRule$1.evaluate(NoShadowingOrOverridesOnMethodsRule.java:40)
	at com.carrotsearch.randomizedtesting.rules.StatementAdapter.evaluate(StatementAdapter.java:36)
	at com.carrotsearch.randomizedtesting.rules.StatementAdapter.evaluate(StatementAdapter.java:36)
	at com.carrotsearch.randomizedtesting.rules.StatementAdapter.evaluate(StatementAdapter.java:36)
	at org.apache.lucene.util.TestRuleAssertionsRequired$1.evaluate(TestRuleAssertionsRequired.java:53)
	at org.apache.lucene.util.TestRuleMarkFailure$1.evaluate(TestRuleMarkFailure.java:47)
	at org.apache.lucene.util.TestRuleIgnoreAfterMaxFailures$1.evaluate(TestRuleIgnoreAfterMaxFailures.java:64)
	at org.apache.lucene.util.TestRuleIgnoreTestSuites$1.evaluate(TestRuleIgnoreTestSuites.java:54)
	at com.carrotsearch.randomizedtesting.rules.StatementAdapter.evaluate(StatementAdapter.java:36)
	at com.carrotsearch.randomizedtesting.ThreadLeakControl$StatementRunner.run(ThreadLeakControl.java:368)
	at java.lang.Thread.run(Thread.java:748)


FAILED:  org.apache.solr.update.processor.TimeRoutedAliasUpdateProcessorTest.testSliceRouting

Error Message:
Error from server at https://127.0.0.1:63124/solr: no such collection or alias

Stack Trace:
org.apache.solr.client.solrj.impl.HttpSolrClient$RemoteExecutionException: Error from server at https://127.0.0.1:63124/solr: no such collection or alias
	at __randomizedtesting.SeedInfo.seed([2B9F1478C9677CDC:1A0F98946D3183F5]:0)
	at org.apache.solr.client.solrj.impl.HttpSolrClient$RemoteExecutionException.create(HttpSolrClient.java:829)
	at org.apache.solr.client.solrj.impl.HttpSolrClient.executeMethod(HttpSolrClient.java:620)
	at org.apache.solr.client.solrj.impl.HttpSolrClient.request(HttpSolrClient.java:255)
	at org.apache.solr.client.solrj.impl.HttpSolrClient.request(HttpSolrClient.java:244)
	at org.apache.solr.client.solrj.impl.LBHttpSolrClient.doRequest(LBHttpSolrClient.java:483)
	at org.apache.solr.client.solrj.impl.LBHttpSolrClient.request(LBHttpSolrClient.java:413)
	at org.apache.solr.client.solrj.impl.CloudSolrClient.sendRequest(CloudSolrClient.java:1107)
	at org.apache.solr.client.solrj.impl.CloudSolrClient.requestWithRetryOnStaleState(CloudSolrClient.java:884)
	at org.apache.solr.client.solrj.impl.CloudSolrClient.request(CloudSolrClient.java:817)
	at org.apache.solr.client.solrj.SolrClient.request(SolrClient.java:1219)
	at org.apache.solr.update.processor.TimeRoutedAliasUpdateProcessorTest.createConfigSet(TimeRoutedAliasUpdateProcessorTest.java:231)
	at org.apache.solr.update.processor.TimeRoutedAliasUpdateProcessorTest.testSliceRouting(TimeRoutedAliasUpdateProcessorTest.java:275)
	at sun.reflect.NativeMethodAccessorImpl.invoke0(Native Method)
	at sun.reflect.NativeMethodAccessorImpl.invoke(NativeMethodAccessorImpl.java:62)
	at sun.reflect.DelegatingMethodAccessorImpl.invoke(DelegatingMethodAccessorImpl.java:43)
	at java.lang.reflect.Method.invoke(Method.java:498)
	at com.carrotsearch.randomizedtesting.RandomizedRunner.invoke(RandomizedRunner.java:1742)
	at com.carrotsearch.randomizedtesting.RandomizedRunner$8.evaluate(RandomizedRunner.java:935)
	at com.carrotsearch.randomizedtesting.RandomizedRunner$9.evaluate(RandomizedRunner.java:971)
	at com.carrotsearch.randomizedtesting.RandomizedRunner$10.evaluate(RandomizedRunner.java:985)
	at com.carrotsearch.randomizedtesting.rules.SystemPropertiesRestoreRule$1.evaluate(SystemPropertiesRestoreRule.java:57)
	at org.apache.lucene.util.TestRuleSetupTeardownChained$1.evaluate(TestRuleSetupTeardownChained.java:49)
	at org.apache.lucene.util.AbstractBeforeAfterRule$1.evaluate(AbstractBeforeAfterRule.java:45)
	at org.apache.lucene.util.TestRuleThreadAndTestName$1.evaluate(TestRuleThreadAndTestName.java:48)
	at org.apache.lucene.util.TestRuleIgnoreAfterMaxFailures$1.evaluate(TestRuleIgnoreAfterMaxFailures.java:64)
	at org.apache.lucene.util.TestRuleMarkFailure$1.evaluate(TestRuleMarkFailure.java:47)
	at com.carrotsearch.randomizedtesting.rules.StatementAdapter.evaluate(StatementAdapter.java:36)
	at com.carrotsearch.randomizedtesting.ThreadLeakControl$StatementRunner.run(ThreadLeakControl.java:368)
	at com.carrotsearch.randomizedtesting.ThreadLeakControl.forkTimeoutingTask(ThreadLeakControl.java:817)
	at com.carrotsearch.randomizedtesting.ThreadLeakControl$3.evaluate(ThreadLeakControl.java:468)
	at com.carrotsearch.randomizedtesting.RandomizedRunner.runSingleTest(RandomizedRunner.java:944)
	at com.carrotsearch.randomizedtesting.RandomizedRunner$5.evaluate(RandomizedRunner.java:830)
	at com.carrotsearch.randomizedtesting.RandomizedRunner$6.evaluate(RandomizedRunner.java:880)
	at com.carrotsearch.randomizedtesting.RandomizedRunner$7.evaluate(RandomizedRunner.java:891)
	at com.carrotsearch.randomizedtesting.rules.StatementAdapter.evaluate(StatementAdapter.java:36)
	at com.carrotsearch.randomizedtesting.rules.SystemPropertiesRestoreRule$1.evaluate(SystemPropertiesRestoreRule.java:57)
	at org.apache.lucene.util.AbstractBeforeAfterRule$1.evaluate(AbstractBeforeAfterRule.java:45)
	at com.carrotsearch.randomizedtesting.rules.StatementAdapter.evaluate(StatementAdapter.java:36)
	at org.apache.lucene.util.TestRuleStoreClassName$1.evaluate(TestRuleStoreClassName.java:41)
	at com.carrotsearch.randomizedtesting.rules.NoShadowingOrOverridesOnMethodsRule$1.evaluate(NoShadowingOrOverridesOnMethodsRule.java:40)
	at com.carrotsearch.randomizedtesting.rules.NoShadowingOrOverridesOnMethodsRule$1.evaluate(NoShadowingOrOverridesOnMethodsRule.java:40)
	at com.carrotsearch.randomizedtesting.rules.StatementAdapter.evaluate(StatementAdapter.java:36)
	at com.carrotsearch.randomizedtesting.rules.StatementAdapter.evaluate(StatementAdapter.java:36)
	at com.carrotsearch.randomizedtesting.rules.StatementAdapter.evaluate(StatementAdapter.java:36)
	at org.apache.lucene.util.TestRuleAssertionsRequired$1.evaluate(TestRuleAssertionsRequired.java:53)
	at org.apache.lucene.util.TestRuleMarkFailure$1.evaluate(TestRuleMarkFailure.java:47)
	at org.apache.lucene.util.TestRuleIgnoreAfterMaxFailures$1.evaluate(TestRuleIgnoreAfterMaxFailures.java:64)
	at org.apache.lucene.util.TestRuleIgnoreTestSuites$1.evaluate(TestRuleIgnoreTestSuites.java:54)
	at com.carrotsearch.randomizedtesting.rules.StatementAdapter.evaluate(StatementAdapter.java:36)
	at com.carrotsearch.randomizedtesting.ThreadLeakControl$StatementRunner.run(ThreadLeakControl.java:368)
	at java.lang.Thread.run(Thread.java:748)




Build Log:
[...truncated 15286 lines...]
   [junit4] Suite: org.apache.solr.update.processor.TimeRoutedAliasUpdateProcessorTest
   [junit4]   2> Creating dataDir: /Users/jenkins/workspace/Lucene-Solr-master-MacOSX/solr/build/solr-core/test/J1/temp/solr.update.processor.TimeRoutedAliasUpdateProcessorTest_2B9F1478C9677CDC-001/init-core-data-001
   [junit4]   2> 4424686 INFO  (SUITE-TimeRoutedAliasUpdateProcessorTest-seed#[2B9F1478C9677CDC]-worker) [    ] o.a.s.c.MiniSolrCloudCluster Starting cluster of 4 servers in /Users/jenkins/workspace/Lucene-Solr-master-MacOSX/solr/build/solr-core/test/J1/temp/solr.update.processor.TimeRoutedAliasUpdateProcessorTest_2B9F1478C9677CDC-001/tempDir-001
   [junit4]   2> 4424686 INFO  (SUITE-TimeRoutedAliasUpdateProcessorTest-seed#[2B9F1478C9677CDC]-worker) [    ] o.a.s.c.ZkTestServer STARTING ZK TEST SERVER
   [junit4]   2> 4424686 INFO  (Thread-7572) [    ] o.a.s.c.ZkTestServer client port:0.0.0.0/0.0.0.0:0
   [junit4]   2> 4424686 INFO  (Thread-7572) [    ] o.a.s.c.ZkTestServer Starting server
   [junit4]   2> 4424690 ERROR (Thread-7572) [    ] o.a.z.s.ZooKeeperServer ZKShutdownHandler is not registered, so ZooKeeper server won't take any action on ERROR or SHUTDOWN server state changes
   [junit4]   2> 4424796 INFO  (SUITE-TimeRoutedAliasUpdateProcessorTest-seed#[2B9F1478C9677CDC]-worker) [    ] o.a.s.c.ZkTestServer start zk server on port:63120
   [junit4]   2> 4424816 INFO  (zkConnectionManagerCallback-18214-thread-1) [    ] o.a.s.c.c.ConnectionManager zkClient has connected
   [junit4]   2> 4424835 INFO  (jetty-launcher-18211-thread-3) [    ] o.e.j.s.Server jetty-9.4.11.v20180605; built: 2018-06-05T18:24:03.829Z; git: d5fc0523cfa96bfebfbda19606cad384d772f04c; jvm 1.8.0_172-b11
   [junit4]   2> 4424835 INFO  (jetty-launcher-18211-thread-4) [    ] o.e.j.s.Server jetty-9.4.11.v20180605; built: 2018-06-05T18:24:03.829Z; git: d5fc0523cfa96bfebfbda19606cad384d772f04c; jvm 1.8.0_172-b11
   [junit4]   2> 4424835 INFO  (jetty-launcher-18211-thread-2) [    ] o.e.j.s.Server jetty-9.4.11.v20180605; built: 2018-06-05T18:24:03.829Z; git: d5fc0523cfa96bfebfbda19606cad384d772f04c; jvm 1.8.0_172-b11
   [junit4]   2> 4424835 INFO  (jetty-launcher-18211-thread-1) [    ] o.e.j.s.Server jetty-9.4.11.v20180605; built: 2018-06-05T18:24:03.829Z; git: d5fc0523cfa96bfebfbda19606cad384d772f04c; jvm 1.8.0_172-b11
   [junit4]   2> 4424837 INFO  (jetty-launcher-18211-thread-3) [    ] o.e.j.s.session DefaultSessionIdManager workerName=node0
   [junit4]   2> 4424837 INFO  (jetty-launcher-18211-thread-3) [    ] o.e.j.s.session No SessionScavenger set, using defaults
   [junit4]   2> 4424837 INFO  (jetty-launcher-18211-thread-3) [    ] o.e.j.s.session node0 Scavenging every 600000ms
   [junit4]   2> 4424838 INFO  (jetty-launcher-18211-thread-3) [    ] o.e.j.s.h.ContextHandler Started o.e.j.s.ServletContextHandler@471ab6e3{/solr,null,AVAILABLE}
   [junit4]   2> 4424840 INFO  (jetty-launcher-18211-thread-2) [    ] o.e.j.s.session DefaultSessionIdManager workerName=node0
   [junit4]   2> 4424840 INFO  (jetty-launcher-18211-thread-2) [    ] o.e.j.s.session No SessionScavenger set, using defaults
   [junit4]   2> 4424840 INFO  (jetty-launcher-18211-thread-2) [    ] o.e.j.s.session node0 Scavenging every 660000ms
   [junit4]   2> 4424840 INFO  (jetty-launcher-18211-thread-2) [    ] o.e.j.s.h.ContextHandler Started o.e.j.s.ServletContextHandler@2c4e2de1{/solr,null,AVAILABLE}
   [junit4]   2> 4424841 INFO  (jetty-launcher-18211-thread-2) [    ] o.e.j.s.AbstractConnector Started ServerConnector@13c9b7da{SSL,[ssl, http/1.1]}{127.0.0.1:63123}
   [junit4]   2> 4424841 INFO  (jetty-launcher-18211-thread-2) [    ] o.e.j.s.Server Started @4424921ms
   [junit4]   2> 4424841 INFO  (jetty-launcher-18211-thread-2) [    ] o.a.s.c.s.e.JettySolrRunner Jetty properties: {hostContext=/solr, hostPort=63123}
   [junit4]   2> 4424841 ERROR (jetty-launcher-18211-thread-2) [    ] o.a.s.u.StartupLoggingUtils Missing Java Option solr.log.dir. Logging may be missing or incomplete.
   [junit4]   2> 4424841 INFO  (jetty-launcher-18211-thread-2) [    ] o.a.s.s.SolrDispatchFilter Using logger factory org.apache.logging.slf4j.Log4jLoggerFactory
   [junit4]   2> 4424842 INFO  (jetty-launcher-18211-thread-2) [    ] o.a.s.s.SolrDispatchFilter  ___      _       Welcome to Apache Solr? version 8.0.0
   [junit4]   2> 4424842 INFO  (jetty-launcher-18211-thread-2) [    ] o.a.s.s.SolrDispatchFilter / __| ___| |_ _   Starting in cloud mode on port null
   [junit4]   2> 4424842 INFO  (jetty-launcher-18211-thread-2) [    ] o.a.s.s.SolrDispatchFilter \__ \/ _ \ | '_|  Install dir: null
   [junit4]   2> 4424842 INFO  (jetty-launcher-18211-thread-2) [    ] o.a.s.s.SolrDispatchFilter |___/\___/_|_|    Start time: 2018-09-24T17:41:38.642Z
   [junit4]   2> 4424843 INFO  (jetty-launcher-18211-thread-4) [    ] o.e.j.s.session DefaultSessionIdManager workerName=node0
   [junit4]   2> 4424843 INFO  (jetty-launcher-18211-thread-4) [    ] o.e.j.s.session No SessionScavenger set, using defaults
   [junit4]   2> 4424843 INFO  (jetty-launcher-18211-thread-4) [    ] o.e.j.s.session node0 Scavenging every 600000ms
   [junit4]   2> 4424843 INFO  (jetty-launcher-18211-thread-4) [    ] o.e.j.s.h.ContextHandler Started o.e.j.s.ServletContextHandler@1afa5257{/solr,null,AVAILABLE}
   [junit4]   2> 4424844 INFO  (jetty-launcher-18211-thread-4) [    ] o.e.j.s.AbstractConnector Started ServerConnector@36c84080{SSL,[ssl, http/1.1]}{127.0.0.1:63124}
   [junit4]   2> 4424844 INFO  (jetty-launcher-18211-thread-4) [    ] o.e.j.s.Server Started @4424923ms
   [junit4]   2> 4424844 INFO  (jetty-launcher-18211-thread-4) [    ] o.a.s.c.s.e.JettySolrRunner Jetty properties: {hostContext=/solr, hostPort=63124}
   [junit4]   2> 4424844 ERROR (jetty-launcher-18211-thread-4) [    ] o.a.s.u.StartupLoggingUtils Missing Java Option solr.log.dir. Logging may be missing or incomplete.
   [junit4]   2> 4424844 INFO  (jetty-launcher-18211-thread-4) [    ] o.a.s.s.SolrDispatchFilter Using logger factory org.apache.logging.slf4j.Log4jLoggerFactory
   [junit4]   2> 4424844 INFO  (jetty-launcher-18211-thread-3) [    ] o.e.j.s.AbstractConnector Started ServerConnector@12ebc066{SSL,[ssl, http/1.1]}{127.0.0.1:63122}
   [junit4]   2> 4424844 INFO  (jetty-launcher-18211-thread-3) [    ] o.e.j.s.Server Started @4424924ms
   [junit4]   2> 4424844 INFO  (jetty-launcher-18211-thread-3) [    ] o.a.s.c.s.e.JettySolrRunner Jetty properties: {hostContext=/solr, hostPort=63122}
   [junit4]   2> 4424844 ERROR (jetty-launcher-18211-thread-3) [    ] o.a.s.u.StartupLoggingUtils Missing Java Option solr.log.dir. Logging may be missing or incomplete.
   [junit4]   2> 4424844 INFO  (jetty-launcher-18211-thread-3) [    ] o.a.s.s.SolrDispatchFilter Using logger factory org.apache.logging.slf4j.Log4jLoggerFactory
   [junit4]   2> 4424846 INFO  (jetty-launcher-18211-thread-4) [    ] o.a.s.s.SolrDispatchFilter  ___      _       Welcome to Apache Solr? version 8.0.0
   [junit4]   2> 4424846 INFO  (jetty-launcher-18211-thread-4) [    ] o.a.s.s.SolrDispatchFilter / __| ___| |_ _   Starting in cloud mode on port null
   [junit4]   2> 4424846 INFO  (jetty-launcher-18211-thread-4) [    ] o.a.s.s.SolrDispatchFilter \__ \/ _ \ | '_|  Install dir: null
   [junit4]   2> 4424846 INFO  (jetty-launcher-18211-thread-4) [    ] o.a.s.s.SolrDispatchFilter |___/\___/_|_|    Start time: 2018-09-24T17:41:38.646Z
   [junit4]   2> 4424847 INFO  (jetty-launcher-18211-thread-3) [    ] o.a.s.s.SolrDispatchFilter  ___      _       Welcome to Apache Solr? version 8.0.0
   [junit4]   2> 4424847 INFO  (jetty-launcher-18211-thread-3) [    ] o.a.s.s.SolrDispatchFilter / __| ___| |_ _   Starting in cloud mode on port null
   [junit4]   2> 4424847 INFO  (jetty-launcher-18211-thread-3) [    ] o.a.s.s.SolrDispatchFilter \__ \/ _ \ | '_|  Install dir: null
   [junit4]   2> 4424847 INFO  (jetty-launcher-18211-thread-3) [    ] o.a.s.s.SolrDispatchFilter |___/\___/_|_|    Start time: 2018-09-24T17:41:38.647Z
   [junit4]   2> 4424850 INFO  (jetty-launcher-18211-thread-1) [    ] o.e.j.s.session DefaultSessionIdManager workerName=node0
   [junit4]   2> 4424850 INFO  (jetty-launcher-18211-thread-1) [    ] o.e.j.s.session No SessionScavenger set, using defaults
   [junit4]   2> 4424850 INFO  (jetty-launcher-18211-thread-1) [    ] o.e.j.s.session node0 Scavenging every 660000ms
   [junit4]   2> 4424851 INFO  (jetty-launcher-18211-thread-1) [    ] o.e.j.s.h.ContextHandler Started o.e.j.s.ServletContextHandler@4a12bfaf{/solr,null,AVAILABLE}
   [junit4]   2> 4424852 INFO  (jetty-launcher-18211-thread-1) [    ] o.e.j.s.AbstractConnector Started ServerConnector@5eb503b2{SSL,[ssl, http/1.1]}{127.0.0.1:63126}
   [junit4]   2> 4424852 INFO  (jetty-launcher-18211-thread-1) [    ] o.e.j.s.Server Started @4424931ms
   [junit4]   2> 4424852 INFO  (jetty-launcher-18211-thread-1) [    ] o.a.s.c.s.e.JettySolrRunner Jetty properties: {hostContext=/solr, hostPort=63126}
   [junit4]   2> 4424852 ERROR (jetty-launcher-18211-thread-1) [    ] o.a.s.u.StartupLoggingUtils Missing Java Option solr.log.dir. Logging may be missing or incomplete.
   [junit4]   2> 4424852 INFO  (jetty-launcher-18211-thread-1) [    ] o.a.s.s.SolrDispatchFilter Using logger factory org.apache.logging.slf4j.Log4jLoggerFactory
   [junit4]   2> 4424852 INFO  (jetty-launcher-18211-thread-1) [    ] o.a.s.s.SolrDispatchFilter  ___      _       Welcome to Apache Solr? version 8.0.0
   [junit4]   2> 4424852 INFO  (jetty-launcher-18211-thread-1) [    ] o.a.s.s.SolrDispatchFilter / __| ___| |_ _   Starting in cloud mode on port null
   [junit4]   2> 4424853 INFO  (jetty-launcher-18211-thread-1) [    ] o.a.s.s.SolrDispatchFilter \__ \/ _ \ | '_|  Install dir: null
   [junit4]   2> 4424853 INFO  (jetty-launcher-18211-thread-1) [    ] o.a.s.s.SolrDispatchFilter |___/\___/_|_|    Start time: 2018-09-24T17:41:38.653Z
   [junit4]   2> 4424855 INFO  (zkConnectionManagerCallback-18216-thread-1) [    ] o.a.s.c.c.ConnectionManager zkClient has connected
   [junit4]   2> 4424855 INFO  (zkConnectionManagerCallback-18218-thread-1) [    ] o.a.s.c.c.ConnectionManager zkClient has connected
   [junit4]   2> 4424856 INFO  (jetty-launcher-18211-thread-2) [    ] o.a.s.s.SolrDispatchFilter solr.xml found in ZooKeeper. Loading...
   [junit4]   2> 4424856 INFO  (zkConnectionManagerCallback-18220-thread-1) [    ] o.a.s.c.c.ConnectionManager zkClient has connected
   [junit4]   2> 4424857 INFO  (zkConnectionManagerCallback-18222-thread-1) [    ] o.a.s.c.c.ConnectionManager zkClient has connected
   [junit4]   2> 4424857 INFO  (jetty-launcher-18211-thread-4) [    ] o.a.s.s.SolrDispatchFilter solr.xml found in ZooKeeper. Loading...
   [junit4]   2> 4424858 INFO  (jetty-launcher-18211-thread-3) [    ] o.a.s.s.SolrDispatchFilter solr.xml found in ZooKeeper. Loading...
   [junit4]   2> 4424859 INFO  (jetty-launcher-18211-thread-1) [    ] o.a.s.s.SolrDispatchFilter solr.xml found in ZooKeeper. Loading...
   [junit4]   2> 4424988 INFO  (jetty-launcher-18211-thread-2) [    ] o.a.s.c.ZkContainer Zookeeper client=127.0.0.1:63120/solr
   [junit4]   2> 4424989 INFO  (zkConnectionManagerCallback-18226-thread-1) [    ] o.a.s.c.c.ConnectionManager zkClient has connected
   [junit4]   2> 4424999 INFO  (zkConnectionManagerCallback-18228-thread-1) [    ] o.a.s.c.c.ConnectionManager zkClient has connected
   [junit4]   2> 4425003 INFO  (jetty-launcher-18211-thread-4) [    ] o.a.s.c.ZkContainer Zookeeper client=127.0.0.1:63120/solr
   [junit4]   2> 4425005 INFO  (zkConnectionManagerCallback-18232-thread-1) [    ] o.a.s.c.c.ConnectionManager zkClient has connected
   [junit4]   2> 4425013 INFO  (zkConnectionManagerCallback-18234-thread-1) [    ] o.a.s.c.c.ConnectionManager zkClient has connected
   [junit4]   2> 4425093 INFO  (jetty-launcher-18211-thread-1) [    ] o.a.s.c.ZkContainer Zookeeper client=127.0.0.1:63120/solr
   [junit4]   2> 4425095 INFO  (zkConnectionManagerCallback-18242-thread-1) [    ] o.a.s.c.c.ConnectionManager zkClient has connected
   [junit4]   2> 4425103 INFO  (zkConnectionManagerCallback-18244-thread-1) [    ] o.a.s.c.c.ConnectionManager zkClient has connected
   [junit4]   2> 4425145 INFO  (jetty-launcher-18211-thread-1) [n:127.0.0.1:63126_solr    ] o.a.s.c.OverseerElectionContext I am going to be the leader 127.0.0.1:63126_solr
   [junit4]   2> 4425147 INFO  (jetty-launcher-18211-thread-1) [n:127.0.0.1:63126_solr    ] o.a.s.c.Overseer Overseer (id=72063144044265482-127.0.0.1:63126_solr-n_0000000000) starting
   [junit4]   2> 4425180 INFO  (zkConnectionManagerCallback-18251-thread-1) [    ] o.a.s.c.c.ConnectionManager zkClient has connected
   [junit4]   2> 4425186 INFO  (jetty-launcher-18211-thread-1) [n:127.0.0.1:63126_solr    ] o.a.s.c.s.i.ZkClientClusterStateProvider Cluster at 127.0.0.1:63120/solr ready
   [junit4]   2> 4425187 INFO  (OverseerStateUpdate-72063144044265482-127.0.0.1:63126_solr-n_0000000000) [n:127.0.0.1:63126_solr    ] o.a.s.c.Overseer Starting to work on the main queue : 127.0.0.1:63126_solr
   [junit4]   2> 4425200 INFO  (jetty-launcher-18211-thread-1) [n:127.0.0.1:63126_solr    ] o.a.s.c.ZkController Register node as live in ZooKeeper:/live_nodes/127.0.0.1:63126_solr
   [junit4]   2> 4425227 INFO  (zkCallback-18243-thread-1) [    ] o.a.s.c.c.ZkStateReader Updated live nodes from ZooKeeper... (0) -> (1)
   [junit4]   2> 4425227 INFO  (zkCallback-18250-thread-1) [    ] o.a.s.c.c.ZkStateReader Updated live nodes from ZooKeeper... (0) -> (1)
   [junit4]   2> 4425264 INFO  (jetty-launcher-18211-thread-2) [n:127.0.0.1:63123_solr    ] o.a.s.c.c.ZkStateReader Updated live nodes from ZooKeeper... (0) -> (1)
   [junit4]   2> 4425272 INFO  (jetty-launcher-18211-thread-2) [n:127.0.0.1:63123_solr    ] o.a.s.c.TransientSolrCoreCacheDefault Allocating transient cache for 2147483647 transient cores
   [junit4]   2> 4425272 INFO  (jetty-launcher-18211-thread-2) [n:127.0.0.1:63123_solr    ] o.a.s.c.ZkController Register node as live in ZooKeeper:/live_nodes/127.0.0.1:63123_solr
   [junit4]   2> 4425274 INFO  (zkCallback-18250-thread-1) [    ] o.a.s.c.c.ZkStateReader Updated live nodes from ZooKeeper... (1) -> (2)
   [junit4]   2> 4425274 INFO  (zkCallback-18243-thread-1) [    ] o.a.s.c.c.ZkStateReader Updated live nodes from ZooKeeper... (1) -> (2)
   [junit4]   2> 4425274 INFO  (zkCallback-18227-thread-1) [    ] o.a.s.c.c.ZkStateReader Updated live nodes from ZooKeeper... (1) -> (2)
   [junit4]   2> 4425274 INFO  (jetty-launcher-18211-thread-4) [n:127.0.0.1:63124_solr    ] o.a.s.c.c.ZkStateReader Updated live nodes from ZooKeeper... (0) -> (2)
   [junit4]   2> 4425291 INFO  (jetty-launcher-18211-thread-4) [n:127.0.0.1:63124_solr    ] o.a.s.c.TransientSolrCoreCacheDefault Allocating transient cache for 2147483647 transient cores
   [junit4]   2> 4425291 INFO  (jetty-launcher-18211-thread-4) [n:127.0.0.1:63124_solr    ] o.a.s.c.ZkController Register node as live in ZooKeeper:/live_nodes/127.0.0.1:63124_solr
   [junit4]   2> 4425293 INFO  (zkCallback-18243-thread-1) [    ] o.a.s.c.c.ZkStateReader Updated live nodes from ZooKeeper... (2) -> (3)
   [junit4]   2> 4425293 INFO  (zkCallback-18233-thread-1) [    ] o.a.s.c.c.ZkStateReader Updated live nodes from ZooKeeper... (2) -> (3)
   [junit4]   2> 4425293 INFO  (zkCallback-18250-thread-1) [    ] o.a.s.c.c.ZkStateReader Updated live nodes from ZooKeeper... (2) -> (3)
   [junit4]   2> 4425294 INFO  (zkCallback-18227-thread-1) [    ] o.a.s.c.c.ZkStateReader Updated live nodes from ZooKeeper... (2) -> (3)
   [junit4]   2> 4425329 INFO  (jetty-launcher-18211-thread-1) [n:127.0.0.1:63126_solr    ] o.a.s.h.a.MetricsHistoryHandler No .system collection, keeping metrics history in memory.
   [junit4]   2> 4425332 INFO  (zkConnectionManagerCallback-18257-thread-1) [    ] o.a.s.c.c.ConnectionManager zkClient has connected
   [junit4]   2> 4425333 INFO  (jetty-launcher-18211-thread-2) [n:127.0.0.1:63123_solr    ] o.a.s.c.c.ZkStateReader Updated live nodes from ZooKeeper... (0) -> (3)
   [junit4]   2> 4425367 INFO  (zkConnectionManagerCallback-18262-thread-1) [    ] o.a.s.c.c.ConnectionManager zkClient has connected
   [junit4]   2> 4425368 INFO  (jetty-launcher-18211-thread-2) [n:127.0.0.1:63123_solr    ] o.a.s.c.s.i.ZkClientClusterStateProvider Cluster at 127.0.0.1:63120/solr ready
   [junit4]   2> 4425368 INFO  (jetty-launcher-18211-thread-2) [n:127.0.0.1:63123_solr    ] o.a.s.h.a.MetricsHistoryHandler No .system collection, keeping metrics history in memory.
   [junit4]   2> 4425369 INFO  (jetty-launcher-18211-thread-4) [n:127.0.0.1:63124_solr    ] o.a.s.c.c.ZkStateReader Updated live nodes from ZooKeeper... (0) -> (3)
   [junit4]   2> 4425371 INFO  (jetty-launcher-18211-thread-4) [n:127.0.0.1:63124_solr    ] o.a.s.c.s.i.ZkClientClusterStateProvider Cluster at 127.0.0.1:63120/solr ready
   [junit4]   2> 4425371 INFO  (jetty-launcher-18211-thread-4) [n:127.0.0.1:63124_solr    ] o.a.s.h.a.MetricsHistoryHandler No .system collection, keeping metrics history in memory.
   [junit4]   2> 4425453 INFO  (jetty-launcher-18211-thread-1) [n:127.0.0.1:63126_solr    ] o.a.s.m.r.SolrJmxReporter JMX monitoring for 'solr_63126.solr.node' (registry 'solr.node') enabled at server: com.sun.jmx.mbeanserver.JmxMBeanServer@5b5ee1a6
   [junit4]   2> 4425466 INFO  (jetty-launcher-18211-thread-3) [    ] o.a.s.c.ZkContainer Zookeeper client=127.0.0.1:63120/solr
   [junit4]   2> 4425470 INFO  (zkConnectionManagerCallback-18268-thread-1) [    ] o.a.s.c.c.ConnectionManager zkClient has connected
   [junit4]   2> 4425475 INFO  (zkConnectionManagerCallback-18270-thread-1) [    ] o.a.s.c.c.ConnectionManager zkClient has connected
   [junit4]   2> 4425479 INFO  (jetty-launcher-18211-thread-2) [n:127.0.0.1:63123_solr    ] o.a.s.m.r.SolrJmxReporter JMX monitoring for 'solr_63123.solr.node' (registry 'solr.node') enabled at server: com.sun.jmx.mbeanserver.JmxMBeanServer@5b5ee1a6
   [junit4]   2> 4425487 INFO  (jetty-launcher-18211-thread-3) [n:127.0.0.1:63122_solr    ] o.a.s.c.c.ZkStateReader Updated live nodes from ZooKeeper... (0) -> (3)
   [junit4]   2> 4425495 INFO  (jetty-launcher-18211-thread-4) [n:127.0.0.1:63124_solr    ] o.a.s.m.r.SolrJmxReporter JMX monitoring for 'solr_63124.solr.node' (registry 'solr.node') enabled at server: com.sun.jmx.mbeanserver.JmxMBeanServer@5b5ee1a6
   [junit4]   2> 4425496 INFO  (jetty-launcher-18211-thread-1) [n:127.0.0.1:63126_solr    ] o.a.s.m.r.SolrJmxReporter JMX monitoring for 'solr_63126.solr.jvm' (registry 'solr.jvm') enabled at server: com.sun.jmx.mbeanserver.JmxMBeanServer@5b5ee1a6
   [junit4]   2> 4425496 INFO  (jetty-launcher-18211-thread-1) [n:127.0.0.1:63126_solr    ] o.a.s.m.r.SolrJmxReporter JMX monitoring for 'solr_63126.solr.jetty' (registry 'solr.jetty') enabled at server: com.sun.jmx.mbeanserver.JmxMBeanServer@5b5ee1a6
   [junit4]   2> 4425498 INFO  (jetty-launcher-18211-thread-1) [n:127.0.0.1:63126_solr    ] o.a.s.c.CorePropertiesLocator Found 0 core definitions underneath /Users/jenkins/workspace/Lucene-Solr-master-MacOSX/solr/build/solr-core/test/J1/temp/solr.update.processor.TimeRoutedAliasUpdateProcessorTest_2B9F1478C9677CDC-001/tempDir-001/node1/.
   [junit4]   2> 4425503 INFO  (jetty-launcher-18211-thread-2) [n:127.0.0.1:63123_solr    ] o.a.s.m.r.SolrJmxReporter JMX monitoring for 'solr_63123.solr.jvm' (registry 'solr.jvm') enabled at server: com.sun.jmx.mbeanserver.JmxMBeanServer@5b5ee1a6
   [junit4]   2> 4425504 INFO  (jetty-launcher-18211-thread-2) [n:127.0.0.1:63123_solr    ] o.a.s.m.r.SolrJmxReporter JMX monitoring for 'solr_63123.solr.jetty' (registry 'solr.jetty') enabled at server: com.sun.jmx.mbeanserver.JmxMBeanServer@5b5ee1a6
   [junit4]   2> 4425506 INFO  (jetty-launcher-18211-thread-4) [n:127.0.0.1:63124_solr    ] o.a.s.m.r.SolrJmxReporter JMX monitoring for 'solr_63124.solr.jvm' (registry 'solr.jvm') enabled at server: com.sun.jmx.mbeanserver.JmxMBeanServer@5b5ee1a6
   [junit4]   2> 4425506 INFO  (jetty-launcher-18211-thread-2) [n:127.0.0.1:63123_solr    ] o.a.s.c.CorePropertiesLocator Found 0 core definitions underneath /Users/jenkins/workspace/Lucene-Solr-master-MacOSX/solr/build/solr-core/test/J1/temp/solr.update.processor.TimeRoutedAliasUpdateProcessorTest_2B9F1478C9677CDC-001/tempDir-001/node2/.
   [junit4]   2> 4425506 INFO  (jetty-launcher-18211-thread-4) [n:127.0.0.1:63124_solr    ] o.a.s.m.r.SolrJmxReporter JMX monitoring for 'solr_63124.solr.jetty' (registry 'solr.jetty') enabled at server: com.sun.jmx.mbeanserver.JmxMBeanServer@5b5ee1a6
   [junit4]   2> 4425508 INFO  (jetty-launcher-18211-thread-4) [n:127.0.0.1:63124_solr    ] o.a.s.c.CorePropertiesLocator Found 0 core definitions underneath /Users/jenkins/workspace/Lucene-Solr-master-MacOSX/solr/build/solr-core/test/J1/temp/solr.update.processor.TimeRoutedAliasUpdateProcessorTest_2B9F1478C9677CDC-001/tempDir-001/node4/.
   [junit4]   2> 4425510 INFO  (jetty-launcher-18211-thread-3) [n:127.0.0.1:63122_solr    ] o.a.s.c.TransientSolrCoreCacheDefault Allocating transient cache for 2147483647 transient cores
   [junit4]   2> 4425510 INFO  (jetty-launcher-18211-thread-3) [n:127.0.0.1:63122_solr    ] o.a.s.c.ZkController Register node as live in ZooKeeper:/live_nodes/127.0.0.1:63122_solr
   [junit4]   2> 4425512 INFO  (zkCallback-18269-thread-1) [    ] o.a.s.c.c.ZkStateReader Updated live nodes from ZooKeeper... (3) -> (4)
   [junit4]   2> 4425512 INFO  (zkCallback-18250-thread-1) [    ] o.a.s.c.c.ZkStateReader Updated live nodes from ZooKeeper... (3) -> (4)
   [junit4]   2> 4425512 INFO  (zkCallback-18243-thread-1) [    ] o.a.s.c.c.ZkStateReader Updated live nodes from ZooKeeper... (3) -> (4)
   [junit4]   2> 4425512 INFO  (zkCallback-18256-thread-1) [    ] o.a.s.c.c.ZkStateReader Updated live nodes from ZooKeeper... (3) -> (4)
   [junit4]   2> 4425512 INFO  (zkCallback-18261-thread-1) [    ] o.a.s.c.c.ZkStateReader Updated live nodes from ZooKeeper... (3) -> (4)
   [junit4]   2> 4425513 INFO  (zkCallback-18233-thread-1) [    ] o.a.s.c.c.ZkStateReader Updated live nodes from ZooKeeper... (3) -> (4)
   [junit4]   2> 4425513 INFO  (zkCallback-18227-thread-1) [    ] o.a.s.c.c.ZkStateReader Updated live nodes from ZooKeeper... (3) -> (4)
   [junit4]   2> 4425575 INFO  (zkConnectionManagerCallback-18277-thread-1) [    ] o.a.s.c.c.ConnectionManager zkClient has connected
   [junit4]   2> 4425577 INFO  (jetty-launcher-18211-thread-3) [n:127.0.0.1:63122_solr    ] o.a.s.c.c.ZkStateReader Updated live nodes from ZooKeeper... (0) -> (4)
   [junit4]   2> 4425579 INFO  (jetty-launcher-18211-thread-3) [n:127.0.0.1:63122_solr    ] o.a.s.c.s.i.ZkClientClusterStateProvider Cluster at 127.0.0.1:63120/solr ready
   [junit4]   2> 4425579 INFO  (jetty-launcher-18211-thread-3) [n:127.0.0.1:63122_solr    ] o.a.s.h.a.MetricsHistoryHandler No .system collection, keeping metrics history in memory.
   [junit4]   2> 4425628 INFO  (jetty-launcher-18211-thread-3) [n:127.0.0.1:63122_solr    ] o.a.s.m.r.SolrJmxReporter JMX monitoring for 'solr_63122.solr.node' (registry 'solr.node') enabled at server: com.sun.jmx.mbeanserver.JmxMBeanServer@5b5ee1a6
   [junit4]   2> 4425639 INFO  (jetty-launcher-18211-thread-3) [n:127.0.0.1:63122_solr    ] o.a.s.m.r.SolrJmxReporter JMX monitoring for 'solr_63122.solr.jvm' (registry 'solr.jvm') enabled at server: com.sun.jmx.mbeanserver.JmxMBeanServer@5b5ee1a6
   [junit4]   2> 4425640 INFO  (jetty-launcher-18211-thread-3) [n:127.0.0.1:63122_solr    ] o.a.s.m.r.SolrJmxReporter JMX monitoring for 'solr_63122.solr.jetty' (registry 'solr.jetty') enabled at server: com.sun.jmx.mbeanserver.JmxMBeanServer@5b5ee1a6
   [junit4]   2> 4425642 INFO  (jetty-launcher-18211-thread-3) [n:127.0.0.1:63122_solr    ] o.a.s.c.CorePropertiesLocator Found 0 core definitions underneath /Users/jenkins/workspace/Lucene-Solr-master-MacOSX/solr/build/solr-core/test/J1/temp/solr.update.processor.TimeRoutedAliasUpdateProcessorTest_2B9F1478C9677CDC-001/tempDir-001/node3/.
   [junit4]   2> 4425715 INFO  (zkConnectionManagerCallback-18280-thread-1) [    ] o.a.s.c.c.ConnectionManager zkClient has connected
   [junit4]   2> 4425784 INFO  (TEST-TimeRoutedAliasUpdateProcessorTest.test-seed#[2B9F1478C9677CDC]) [    ] o.a.s.u.p.TimeRoutedAliasUpdateProcessorTest SolrClient: org.apache.solr.client.solrj.impl.CloudSolrClient@58adbde1
   [junit4]   2> 4425784 INFO  (TEST-TimeRoutedAliasUpdateProcessorTest.test-seed#[2B9F1478C9677CDC]) [    ] o.a.s.u.p.TimeRoutedAliasUpdateProcessorTest ClusterStateProvider 127.0.0.1:63120/solr
   [junit4]   2> 4425786 INFO  (zkConnectionManagerCallback-18286-thread-1) [    ] o.a.s.c.c.ConnectionManager zkClient has connected
   [junit4]   2> 4425787 DEBUG (SyncThread:0) [    ] o.a.s.c.ZkTestServer Watch added: data: /solr/clusterprops.json
   [junit4]   2> 4425788 DEBUG (SyncThread:0) [    ] o.a.s.c.ZkTestServer Watch added: children: /solr/live_nodes
   [junit4]   2> 4425788 INFO  (TEST-TimeRoutedAliasUpdateProcessorTest.test-seed#[2B9F1478C9677CDC]) [    ] o.a.s.c.c.ZkStateReader Updated live nodes from ZooKeeper... (0) -> (4)
   [junit4]   2> 4425789 DEBUG (SyncThread:0) [    ] o.a.s.c.ZkTestServer Watch added: data: /solr/clusterstate.json
   [junit4]   2> 4425789 DEBUG (SyncThread:0) [    ] o.a.s.c.ZkTestServer Watch added: children: /solr/collections
   [junit4]   2> 4425790 DEBUG (SyncThread:0) [    ] o.a.s.c.ZkTestServer Watch added: create/delete: /solr/aliases.json
   [junit4]   2> 4425791 INFO  (TEST-TimeRoutedAliasUpdateProcessorTest.test-seed#[2B9F1478C9677CDC]) [    ] o.a.s.c.s.i.ZkClientClusterStateProvider Cluster at 127.0.0.1:63120/solr ready
   [junit4]   2> 4425807 INFO  (qtp1171177089-49789) [n:127.0.0.1:63126_solr    ] o.a.s.h.a.ConfigSetsHandler Invoked ConfigSet Action :create with params baseConfigSet=_default&name=timeConfigtest&action=CREATE&wt=javabin&version=2 
   [junit4]   2> 4425808 DEBUG (SyncThread:0) [    ] o.a.s.c.ZkTestServer Watch fired: children: /solr/overseer/collection-queue-work
   [junit4]   2> 4425808 DEBUG (SyncThread:0) [    ] o.a.s.c.ZkTestServer Watch added: create/delete: /solr/overseer/collection-queue-work/qnr-0000000000
   [junit4]   2> 4425808 DEBUG (SyncThread:0) [    ] o.a.s.c.ZkTestServer Watch added: children: /solr/overseer/collection-queue-work
   [junit4]   2> 4425809 DEBUG (OverseerCollectionConfigSetProcessor-72063144044265482-127.0.0.1:63126_solr-n_0000000000) [n:127.0.0.1:63126_solr    ] o.a.s.c.ZkDistributedQueue Found child node with improper name: qnr-0000000000
   [junit4]   2> 4425809 DEBUG (SyncThread:0) [    ] o.a.s.c.ZkTestServer Watch fired: children: /solr/overseer/collection-queue-work
   [junit4]   2> 4425809 DEBUG (SyncThread:0) [    ] o.a.s.c.ZkTestServer Watch added: children: /solr/overseer/collection-queue-work
   [junit4]   2> 4425810 DEBUG (OverseerCollectionConfigSetProcessor-72063144044265482-127.0.0.1:63126_solr-n_0000000000) [n:127.0.0.1:63126_solr    ] o.a.s.c.ZkDistributedQueue Found child node with improper name: qnr-0000000000
   [junit4]   2> 4425810 DEBUG (OverseerCollectionConfigSetProcessor-72063144044265482-127.0.0.1:63126_solr-n_0000000000) [n:127.0.0.1:63126_solr    ] o.a.s.c.OverseerTaskQueue Returning topN elements: [/overseer/collection-queue-work/qn-0000000000, ]
   [junit4]   2> 4425810 DEBUG (OverseerCollectionConfigSetProcessor-72063144044265482-127.0.0.1:63126_solr-n_0000000000) [n:127.0.0.1:63126_solr    ] o.a.s.c.OverseerTaskProcessor Got 1 tasks from work-queue : [[org.apache.solr.cloud.OverseerTaskQueue$QueueEvent@2e684ecf]]
   [junit4]   2> 4425810 DEBUG (OverseerCollectionConfigSetProcessor-72063144044265482-127.0.0.1:63126_solr-n_0000000000) [n:127.0.0.1:63126_solr    ] o.a.s.c.OverseerTaskProcessor Marked task [/overseer/collection-queue-work/qn-0000000000] as running
   [junit4]   2> 4425810 DEBUG (OverseerCollectionConfigSetProcessor-72063144044265482-127.0.0.1:63126_solr-n_0000000000) [n:127.0.0.1:63126_solr    ] o.a.s.c.OverseerTaskProcessor Overseer ConfigSet Message Handler: Get the message id:/overseer/collection-queue-work/qn-0000000000 message:{
   [junit4]   2>   "name":"timeConfigtest",
   [junit4]   2>   "baseConfigSet":"_default",
   [junit4]   2>   "immutable":"false",
   [junit4]   2>   "operation":"configsets:create"}
   [junit4]   2> 4425811 DEBUG (OverseerThreadFactory-18165-thread-1-processing-n:127.0.0.1:63126_solr) [n:127.0.0.1:63126_solr    ] o.a.s.c.OverseerTaskProcessor Runner processing /overseer/collection-queue-work/qn-0000000000
   [junit4]   2> 4425811 INFO  (OverseerThreadFactory-18165-thread-1-processing-n:127.0.0.1:63126_solr) [n:127.0.0.1:63126_solr    ] o.a.s.c.OverseerConfigSetMessageHandler OverseerConfigSetMessageHandler.processMessage : create , {
   [junit4]   2>   "name":"timeConfigtest",
   [junit4]   2>   "baseConfigSet":"_default",
   [junit4]   2>   "immutable":"false",
   [junit4]   2>   "operation":"configsets:create"}
   [junit4]   2> 4425811 DEBUG (OverseerCollectionConfigSetProcessor-72063144044265482-127.0.0.1:63126_solr-n_0000000000) [n:127.0.0.1:63126_solr    ] o.a.s.c.OverseerTaskProcessor Cleaning up work-queue. #Running tasks: 1
   [junit4]   2> 4425811 DEBUG (OverseerCollectionConfigSetProcessor-72063144044265482-127.0.0.1:63126_solr-n_0000000000) [n:127.0.0.1:63126_solr    ] o.a.s.c.OverseerTaskProcessor RunningTasks: [/overseer/collection-queue-work/qn-0000000000]
   [junit4]   2> 4425811 DEBUG (OverseerCollectionConfigSetProcessor-72063144044265482-127.0.0.1:63126_solr-n_0000000000) [n:127.0.0.1:63126_solr    ] o.a.s.c.OverseerTaskProcessor BlockedTasks: []
   [junit4]   2> 4425811 DEBUG (OverseerCollectionConfigSetProcessor-72063144044265482-127.0.0.1:63126_solr-n_0000000000) [n:127.0.0.1:63126_solr    ] o.a.s.c.OverseerTaskProcessor CompletedTasks: []
   [junit4]   2> 4425811 DEBUG (OverseerCollectionConfigSetProcessor-72063144044265482-127.0.0.1:63126_solr-n_0000000000) [n:127.0.0.1:63126_solr    ] o.a.s.c.OverseerTaskProcessor RunningZKTasks: [/overseer/collection-queue-work/qn-0000000000]
   [junit4]   2> 4425811 DEBUG (OverseerCollectionConfigSetProcessor-72063144044265482-127.0.0.1:63126_solr-n_0000000000) [n:127.0.0.1:63126_solr    ] o.a.s.c.OverseerTaskQueue Peeking for top 99 elements. ExcludeSet: [/overseer/collection-queue-work/qn-0000000000],[]
   [junit4]   2> 4425817 INFO  (OverseerThreadFactory-18165-thread-1-processing-n:127.0.0.1:63126_solr) [n:127.0.0.1:63126_solr    ] o.a.s.c.c.ZkConfigManager Copying zk node /configs/_default/managed-schema to /configs/timeConfigtest/managed-schema
   [junit4]   2> 4425822 INFO  (OverseerThreadFactory-18165-thread-1-processing-n:127.0.0.1:63126_solr) [n:127.0.0.1:63126_solr    ] o.a.s.c.c.ZkConfigManager Copying zk node /configs/_default/protwords.txt to /configs/timeConfigtest/protwords.txt
   [junit4]   2> 4425825 INFO  (OverseerThreadFactory-18165-thread-1-processing-n:127.0.0.1:63126_solr) [n:127.0.0.1:63126_solr    ] o.a.s.c.c.ZkConfigManager Copying zk node /configs/_default/solrconfig.xml to /configs/timeConfigtest/solrconfig.xml
   [junit4]   2> 4425828 INFO  (OverseerThreadFactory-18165-thread-1-processing-n:127.0.0.1:63126_solr) [n:127.0.0.1:63126_solr    ] o.a.s.c.c.ZkConfigManager Copying zk node /configs/_default/synonyms.txt to /configs/timeConfigtest/synonyms.txt
   [junit4]   2> 4425832 INFO  (OverseerThreadFactory-18165-thread-1-processing-n:127.0.0.1:63126_solr) [n:127.0.0.1:63126_solr    ] o.a.s.c.c.ZkConfigManager Copying zk node /configs/_default/stopwords.txt to /configs/timeConfigtest/stopwords.txt
   [junit4]   2> 4425836 INFO  (OverseerThreadFactory-18165-thread-1-processing-n:127.0.0.1:63126_solr) [n:127.0.0.1:63126_solr    ] o.a.s.c.c.ZkConfigManager Copying zk node /configs/_default/lang/contractions_it.txt to /configs/timeConfigtest/lang/contractions_it.txt
   [junit4]   2> 4425841 INFO  (OverseerThreadFactory-18165-thread-1-processing-n:127.0.0.1:63126_solr) [n:127.0.0.1:63126_solr    ] o.a.s.c.c.ZkConfigManager Copying zk node /configs/_default/lang/stemdict_nl.txt to /configs/timeConfigtest/lang/stemdict_nl.txt
   [junit4]   2> 4425846 INFO  (OverseerThreadFactory-18165-thread-1-processing-n:127.0.0.1:63126_solr) [n:127.0.0.1:63126_solr    ] o.a.s.c.c.ZkConfigManager Copying zk node /configs/_default/lang/stopwords_hy.txt to /configs/timeConfigtest/lang/stopwords_hy.txt
   [junit4]   2> 4425849 INFO  (OverseerThreadFactory-18165-thread-1-processing-n:127.0.0.1:63126_solr) [n:127.0.0.1:63126_solr    ] o.a.s.c.c.ZkConfigManager Copying zk node /configs/_default/lang/stopwords_no.txt to /configs/timeConfigtest/lang/stopwords_no.txt
   [junit4]   2> 4425853 INFO  (OverseerThreadFactory-18165-thread-1-processing-n:127.0.0.1:63126_solr) [n:127.0.0.1:63126_solr    ] o.a.s.c.c.ZkConfigManager Copying zk node /configs/_default/lang/stopwords_id.txt to /configs/timeConfigtest/lang/stopwords_id.txt
   [junit4]   2> 4425856 INFO  (OverseerThreadFactory-18165-thread-1-processing-n:127.0.0.1:63126_solr) [n:127.0.0.1:63126_solr    ] o.a.s.c.c.ZkConfigManager Copying zk node /configs/_default/lang/stopwords_da.txt to /configs/timeConfigtest/lang/stopwords_da.txt
   [junit4]   2> 4425863 INFO  (OverseerThreadFactory-18165-thread-1-processing-n:127.0.0.1:63126_solr) [n:127.0.0.1:63126_solr    ] o.a.s.c.c.ZkConfigManager Copying zk node /configs/_default/lang/stopwords_ga.txt to /configs/timeConfigtest/lang/stopwords_ga.txt
   [junit4]   2> 4425874 INFO  (OverseerThreadFactory-18165-thread-1-processing-n:127.0.0.1:63126_solr) [n:127.0.0.1:63126_solr    ] o.a.s.c.c.ZkConfigManager Copying zk node /configs/_default/lang/stopwords_hi.txt to /configs/timeConfigtest/lang/stopwords_hi.txt
   [junit4]   2> 4425878 INFO  (OverseerThreadFactory-18165-thread-1-processing-n:127.0.0.1:63126_solr) [n:127.0.0.1:63126_solr    ] o.a.s.c.c.ZkConfigManager Copying zk node /configs/_default/lang/stopwords_ja.txt to /configs/timeConfigtest/lang/stopwords_ja.txt
   [junit4]   2> 4425882 INFO  (OverseerThreadFactory-18165-thread-1-processing-n:127.0.0.1:63126_solr) [n:127.0.0.1:63126_solr    ] o.a.s.c.c.ZkConfigManager Copying zk node /configs/_default/lang/stopwords_pt.txt to /configs/timeConfigtest/lang/stopwords_pt.txt
   [junit4]   2> 4425886 INFO  (OverseerThreadFactory-18165-thread-1-processing-n:127.0.0.1:63126_solr) [n:127.0.0.1:63126_solr    ] o.a.s.c.c.ZkConfigManager Copying zk node /configs/_default/lang/stopwords_hu.txt to /configs/timeConfigtest/lang/stopwords_hu.txt
   [junit4]   2> 4425892 INFO  (OverseerThreadFactory-18165-thread-1-processing-n:127.0.0.1:63126_solr) [n:127.0.0.1:63126_solr    ] o.a.s.c.c.ZkConfigManager Copying zk node /configs/_default/lang/stopwords_el.txt to /configs/timeConfigtest/lang/stopwords_el.txt
   [junit4]   2> 4425897 INFO  (OverseerThreadFactory-18165-thread-1-processing-n:127.0.0.1:63126_solr) [n:127.0.0.1:63126_solr    ] o.a.s.c.c.ZkConfigManager Copying zk node /configs/_default/lang/stopwords_ru.txt to /configs/timeConfigtest/lang/stopwords_ru.txt
   [junit4]   2> 4425901 INFO  (OverseerThreadFactory-18165-thread-1-processing-n:127.0.0.1:63126_solr) [n:127.0.0.1:63126_solr    ] o.a.s.c.c.ZkConfigManager Copying zk node /configs/_default/lang/stopwords_tr.txt to /configs/timeConfigtest/lang/stopwords_tr.txt
   [junit4]   2> 4425905 INFO  (OverseerThreadFactory-18165-thread-1-processing-n:127.0.0.1:63126_solr) [n:127.0.0.1:63126_solr    ] o.a.s.c.c.ZkConfigManager Copying zk node /configs/_default/lang/stopwords_ar.txt to /configs/timeConfigtest/lang/stopwords_ar.txt
   [junit4]   2> 4425909 INFO  (OverseerThreadFactory-18165-thread-1-processing-n:127.0.0.1:63126_solr) [n:127.0.0.1:63126_solr    ] o.a.s.c.c.ZkConfigManager Copying zk node /configs/_default/lang/userdict_ja.txt to /configs/timeConfigtest/lang/userdict_ja.txt
   [junit4]   2> 4425913 INFO  (OverseerThreadFactory-18165-thread-1-processing-n:127.0.0.1:63126_solr) [n:127.0.0.1:63126_solr    ] o.a.s.c.c.ZkConfigManager Copying zk node /configs/_default/lang/stopwords_eu.txt to /configs/timeConfigtest/lang/stopwords_eu.txt
   [junit4]   2> 4425918 INFO  (OverseerThreadFactory-18165-thread-1-processing-n:127.0.0.1:63126_solr) [n:127.0.0.1:63126_solr    ] o.a.s.c.c.ZkConfigManager Copying zk node /configs/_default/lang/stopwords_it.txt to /configs/timeConfigtest/lang/stopwords_it.txt
   [junit4]   2> 4425922 INFO  (OverseerThreadFactory-18165-thread-1-processing-n:127.0.0.1:63126_solr) [n:127.0.0.1:63126_solr    ] o.a.s.c.c.ZkConfigManager Copying zk node /configs/_default/lang/stopwords_cz.txt to /configs/timeConfigtest/lang/stopwords_cz.txt
   [junit4]   2> 4425929 INFO  (OverseerThreadFactory-18165-thread-1-processing-n:127.0.0.1:63126_solr) [n:127.0.0.1:63126_solr    ] o.a.s.c.c.ZkConfigManager Copying zk node /configs/_default/lang/stoptags_ja.txt to /configs/timeConfigtest/lang/stoptags_ja.txt
   [junit4]   2> 4425934 INFO  (OverseerThreadFactory-18165-thread-1-processing-n:127.0.0.1:63126_solr) [n:127.0.0.1:63126_solr    ] o.a.s.c.c.ZkConfigManager Copying zk node /configs/_default/lang/contractions_fr.txt to /configs/timeConfigtest/lang/contractions_fr.txt
   [junit4]   2> 4425938 INFO  (OverseerThreadFactory-18165-thread-1-processing-n:127.0.0.1:63126_solr) [n:127.0.0.1:63126_solr    ] o.a.s.c.c.ZkConfigManager Copying zk node /configs/_default/lang/stopwords_de.txt to /configs/timeConfigtest/lang/stopwords_de.txt
   [junit4]   2> 4425942 INFO  (OverseerThreadFactory-18165-thread-1-processing-n:127.0.0.1:63126_solr) [n:127.0.0.1:63126_solr    ] o.a.s.c.c.ZkConfigManager Copying zk node /configs/_default/lang/stopwords_fa.txt to /configs/timeConfigtest/lang/stopwords_fa.txt
   [junit4]   2> 4425946 INFO  (OverseerThreadFactory-18165-thread-1-processing-n:127.0.0.1:63126_solr) [n:127.0.0.1:63126_solr    ] o.a.s.c.c.ZkConfigManager Copying zk node /configs/_default/lang/contractions_ga.txt to /configs/timeConfigtest/lang/contractions_ga.txt
   [junit4]   2> 4425951 INFO  (OverseerThreadFactory-18165-thread-1-processing-n:127.0.0.1:63126_solr) [n:127.0.0.1:63126_solr    ] o.a.s.c.c.ZkConfigManager Copying zk node /configs/_default/lang/stopwords_ca.txt to /configs/timeConfigtest/lang/stopwords_ca.txt
   [junit4]   2> 4425959 INFO  (OverseerThreadFactory-18165-thread-1-processing-n:127.0.0.1:63126_solr) [n:127.0.0.1:63126_solr    ] o.a.s.c.c.ZkConfigManager Copying zk node /configs/_default/lang/stopwords_nl.txt to /configs/timeConfigtest/lang/stopwords_nl.txt
   [junit4]   2> 4425963 INFO  (OverseerThreadFactory-18165-thread-1-processing-n:127.0.0.1:63126_solr) [n:127.0.0.1:63126_solr    ] o.a.s.c.c.ZkConfigManager Copying zk node /configs/_default/lang/stopwords_bg.txt to /configs/timeConfigtest/lang/stopwords_bg.txt
   [junit4]   2> 4425968 INFO  (OverseerThreadFactory-18165-thread-1-processing-n:127.0.0.1:63126_solr) [n:127.0.0.1:63126_solr    ] o.a.s.c.c.ZkConfigManager Copying zk node /configs/_default/lang/stopwords_en.txt to /configs/timeConfigtest/lang/stopwords_en.txt
   [junit4]   2> 4425972 INFO  (OverseerThreadFactory-18165-thread-1-processing-n:127.0.0.1:63126_solr) [n:127.0.0.1:63126_solr    ] o.a.s.c.c.ZkConfigManager Copying zk node /configs/_default/lang/stopwords_es.txt to /configs/timeConfigtest/lang/stopwords_es.txt
   [junit4]   2> 4425975 INFO  (OverseerThreadFactory-18165-thread-1-processing-n:127.0.0.1:63126_solr) [n:127.0.0.1:63126_solr    ] o.a.s.c.c.ZkConfigManager Copying zk node /configs/_default/lang/stopwords_lv.txt to /configs/timeConfigtest/lang/stopwords_lv.txt
   [junit4]   2> 4425980 INFO  (OverseerThreadFactory-18165-thread-1-processing-n:127.0.0.1:63126_solr) [n:127.0.0.1:63126_solr    ] o.a.s.c.c.ZkConfigManager Copying zk node /configs/_default/lang/stopwords_ro.txt to /configs/timeConfigtest/lang/stopwords_ro.txt
   [junit4]   2> 4425983 INFO  (OverseerThreadFactory-18165-thread-1-processing-n:127.0.0.1:63126_solr) [n:127.0.0.1:63126_solr    ] o.a.s.c.c.ZkConfigManager Copying zk node /configs/_default/lang/stopwords_th.txt to /configs/timeConfigtest/lang/stopwords_th.txt
   [junit4]   2> 4425988 INFO  (OverseerThreadFactory-18165-thread-1-processing-n:127.0.0.1:63126_solr) [n:127.0.0.1:63126_solr    ] o.a.s.c.c.ZkConfigManager Copying zk node /configs/_default/lang/stopwords_fr.txt to /configs/timeConfigtest/lang/stopwords_fr.txt
   [junit4]   2> 4425992 INFO  (OverseerThreadFactory-18165-thread-1-processing-n:127.0.0.1:63126_solr) [n:127.0.0.1:63126_solr    ] o.a.s.c.c.ZkConfigManager Copying zk node /configs/_default/lang/stopwords_sv.txt to /configs/timeConfigtest/lang/stopwords_sv.txt
   [junit4]   2> 4425996 INFO  (OverseerThreadFactory-18165-thread-1-processing-n:127.0.0.1:63126_solr) [n:127.0.0.1:63126_solr    ] o.a.s.c.c.ZkConfigManager Copying zk node /configs/_default/lang/stopwords_fi.txt to /configs/timeConfigtest/lang/stopwords_fi.txt
   [junit4]   2> 4426000 INFO  (OverseerThreadFactory-18165-thread-1-processing-n:127.0.0.1:63126_solr) [n:127.0.0.1:63126_solr    ] o.a.s.c.c.ZkConfigManager Copying zk node /configs/_default/lang/hyphenations_ga.txt to /configs/timeConfigtest/lang/hyphenations_ga.txt
   [junit4]   2> 4426004 INFO  (OverseerThreadFactory-18165-thread-1-processing-n:127.0.0.1:63126_solr) [n:127.0.0.1:63126_solr    ] o.a.s.c.c.ZkConfigManager Copying zk node /configs/_default/lang/stopwords_gl.txt to /configs/timeConfigtest/lang/stopwords_gl.txt
   [junit4]   2> 4426009 INFO  (OverseerThreadFactory-18165-thread-1-processing-n:127.0.0.1:63126_solr) [n:127.0.0.1:63126_solr    ] o.a.s.c.c.ZkConfigManager Copying zk node /configs/_default/params.json to /configs/timeConfigtest/params.json
   [junit4]   2> 4426012 DEBUG (OverseerThreadFactory-18165-thread-1-processing-n:127.0.0.1:63126_solr) [n:127.0.0.1:63126_solr    ] o.a.s.c.OverseerTaskProcessor Completed task:[/overseer/collection-queue-work/qn-0000000000]
   [junit4]   2> 4426013 DEBUG (SyncThread:0) [    ] o.a.s.c.ZkTestServer Watch fired: data: /solr/overseer/collection-queue-work/qnr-0000000000
   [junit4]   2> 4426013 DEBUG (zkCallback-18243-thread-1) [    ] o.a.s.c.OverseerTaskQueue NodeDataChanged fired on path /overseer/collection-queue-work/qnr-0000000000 state SyncConnected latchEventType null
   [junit4]   2> 4426013 DEBUG (SyncThread:0) [    ] o.a.s.c.ZkTestServer Watch fired: children: /solr/overseer/collection-queue-work
   [junit4]   2> 4426014 DEBUG (OverseerThreadFactory-18165-thread-1-processing-n:127.0.0.1:63126_solr) [n:127.0.0.1:63126_solr    ] o.a.s.c.OverseerTaskProcessor Marked task [/overseer/collection-queue-work/qn-0000000000] as completed.
   [junit4]   2> 4426014 DEBUG (OverseerThreadFactory-18165-thread-1-processing-n:127.0.0.1:63126_solr) [n:127.0.0.1:63126_solr    ] o.a.s.c.OverseerTaskProcessor RunningTasks: []
   [junit4]   2> 4426014 DEBUG (OverseerThreadFactory-18165-thread-1-processing-n:127.0.0.1:63126_solr) [n:127.0.0.1:63126_solr    ] o.a.s.c.OverseerTaskProcessor BlockedTasks: []
   [junit4]   2> 4426014 DEBUG (OverseerThreadFactory-18165-thread-1-processing-n:127.0.0.1:63126_solr) [n:127.0.0.1:63126_solr    ] o.a.s.c.OverseerTaskProcessor CompletedTasks: [/overseer/collection-queue-work/qn-0000000000]
   [junit4]   2> 4426014 DEBUG (OverseerThreadFactory-18165-thread-1-processing-n:127.0.0.1:63126_solr) [n:127.0.0.1:63126_solr    ] o.a.s.c.OverseerTaskProcessor RunningZKTasks: [/overseer/collection-queue-work/qn-0000000000]
   [junit4]   2> 4426014 DEBUG (OverseerThreadFactory-18165-thread-1-processing-n:127.0.0.1:63126_solr) [n:127.0.0.1:63126_solr    ] o.a.s.c.OverseerTaskProcessor Overseer ConfigSet Message Handler: Message id:/overseer/collection-queue-work/qn-0000000000 complete, response:{}
   [junit4]   2> 4426015 DEBUG (SyncThread:0) [    ] o.a.s.c.ZkTestServer Watch added: children: /solr/overseer/collection-queue-work
   [junit4]   2> 4426015 INFO  (qtp1171177089-49789) [n:127.0.0.1:63126_solr    ] o.a.s.s.HttpSolrCall [admin] webapp=null path=/admin/configs params={baseConfigSet=_default&name=timeConfigtest&action=CREATE&wt=javabin&version=2} status=0 QTime=207
   [junit4]   2> 4426017 INFO  (qtp1171177089-49791) [n:127.0.0.1:63126_solr    ] o.a.s.h.a.CollectionsHandler Invoked Collection Action :create with params collection.configName=timeConfigtest&name=timeConfigtest&nrtReplicas=1&action=CREATE&numShards=1&wt=javabin&version=2 and sendToOCPQueue=true
   [junit4]   2> 4426018 DEBUG (SyncThread:0) [    ] o.a.s.c.ZkTestServer Watch fired: children: /solr/overseer/collection-queue-work
   [junit4]   2> 4426019 DEBUG (SyncThread:0) [    ] o.a.s.c.ZkTestServer Watch added: create/delete: /solr/overseer/collection-queue-work/qnr-0000000002
   [junit4]   2> 4426019 DEBUG (SyncThread:0) [    ] o.a.s.c.ZkTestServer Watch added: children: /solr/overseer/collection-queue-work
   [junit4]   2> 4426019 DEBUG (OverseerCollectionConfigSetProcessor-72063144044265482-127.0.0.1:63126_solr-n_0000000000) [n:127.0.0.1:63126_solr    ] o.a.s.c.ZkDistributedQueue Found child node with improper name: qnr-0000000002
   [junit4]   2> 4426020 DEBUG (SyncThread:0) [    ] o.a.s.c.ZkTestServer Watch fired: children: /solr/overseer/collection-queue-work
   [junit4]   2> 4426020 DEBUG (SyncThread:0) [    ] o.a.s.c.ZkTestServer Watch added: children: /solr/overseer/collection-queue-work
   [junit4]   2> 4426021 DEBUG (OverseerCollectionConfigSetProcessor-72063144044265482-127.0.0.1:63126_solr-n_0000000000) [n:127.0.0.1:63126_solr    ] o.a.s.c.ZkDistributedQueue Found child node with improper name: qnr-0000000002
   [junit4]   2> 4426021 DEBUG (OverseerCollectionConfigSetProcessor-72063144044265482-127.0.0.1:63126_solr-n_0000000000) [n:127.0.0.1:63126_solr    ] o.a.s.c.OverseerTaskQueue Returning topN elements: [/overseer/collection-queue-work/qn-0000000002, ]
   [junit4]   2> 4426021 DEBUG (OverseerCollectionConfigSetProcessor-72063144044265482-127.0.0.1:63126_solr-n_0000000000) [n:127.0.0.1:63126_solr    ] o.a.s.c.OverseerTaskProcessor Got 1 tasks from work-queue : [[org.apache.solr.cloud.OverseerTaskQueue$QueueEvent@2e684ed1]]
   [junit4]   2> 4426021 DEBUG (OverseerCollectionConfigSetProcessor-72063144044265482-127.0.0.1:63126_solr-n_0000000000) [n:127.0.0.1:63126_solr    ] o.a.s.c.OverseerTaskProcessor Marked task [/overseer/collection-queue-work/qn-0000000002] as running
   [junit4]   2> 4426021 DEBUG (OverseerCollectionConfigSetProcessor-72063144044265482-127.0.0.1:63126_solr-n_0000000000) [n:127.0.0.1:63126_solr    ] o.a.s.c.OverseerTaskProcessor Overseer Collection Message Handler: Get the message id:/overseer/collection-queue-work/qn-0000000002 message:{
   [junit4]   2>   "name":"timeConfigtest",
   [junit4]   2>   "fromApi":"true",
   [junit4]   2>   "collection.configName":"timeConfigtest",
   [junit4]   2>   "numShards":"1",
   [junit4]   2>   "nrtReplicas":"1",
   [junit4]   2>   "stateFormat":"2",
   [junit4]   2>   "replicationFactor":"1",
   [junit4]   2>   "operation":"create"}
   [junit4]   2> 4426022 DEBUG (OverseerThreadFactory-18165-thread-2-processing-n:127.0.0.1:63126_solr) [n:127.0.0.1:63126_solr    ] o.a.s.c.OverseerTaskProcessor Runner processing /overseer/collection-queue-work/qn-0000000002
   [junit4]   2> 4426022 DEBUG (OverseerThreadFactory-18165-thread-2-processing-n:127.0.0.1:63126_solr) [n:127.0.0.1:63126_solr    ] o.a.s.c.a.c.OverseerCollectionMessageHandler OverseerCollectionMessageHandler.processMessage : create , {
   [junit4]   2>   "name":"timeConfigtest",
   [junit4]   2>   "fromApi":"true",
   [junit4]   2>   "collection.configName":"timeConfigtest",
   [junit4]   2>   "numShards":"1",
   [junit4]   2>   "nrtReplicas":"1",
   [junit4]   2>   "stateFormat":"2",
   [junit4]   2>   "replicationFactor":"1",
   [junit4]   2>   "operation":"create"}
   [junit4]   2> 4426022 INFO  (OverseerThreadFactory-18165-thread-2-processing-n:127.0.0.1:63126_solr) [n:127.0.0.1:63126_solr    ] o.a.s.c.a.c.CreateCollectionCmd Create collection timeConfigtest
   [junit4]   2> 4426022 DEBUG (OverseerCollectionConfigSetProcessor-72063144044265482-127.0.0.1:63126_solr-n_0000000000) [n:127.0.0.1:63126_solr    ] o.a.s.c.OverseerTaskProcessor Cleaning up work-queue. #Running tasks: 1
   [junit4]   2> 4426022 INFO  (OverseerCollectionConfigSetProcessor-72063144044265482-127.0.0.1:63126_solr-n_0000000000) [n:127.0.0.1:63126_solr    ] o.a.s.c.OverseerTaskQueue Response ZK path: /overseer/collection-queue-work/qnr-0000000000 doesn't exist.  Requestor may have disconnected from ZooKeeper
   [junit4]   2> 4426023 DEBUG (OverseerThreadFactory-18165-thread-2-processing-n:127.0.0.1:63126_solr) [n:127.0.0.1:63126_solr    ] o.a.s.c.a.c.OverseerCollectionMessageHandler creating collections conf node /collections/timeConfigtest 
   [junit4]   2> 4426023 DEBUG (OverseerCollectionConfigSetProcessor-72063144044265482-127.0.0.1:63126_solr-n_0000000000) [n:127.0.0.1:63126_solr    ] o.a.s.c.OverseerTaskProcessor RunningTasks: [/overseer/collection-queue-work/qn-0000000002]
   [junit4]   2> 4426023 DEBUG (OverseerCollectionConfigSetProcessor-72063144044265482-127.0.0.1:63126_solr-n_0000000000) [n:127.0.0.1:63126_solr    ] o.a.s.c.OverseerTaskProcessor BlockedTasks: []
   [junit4]   2> 4426023 DEBUG (OverseerCollectionConfigSetProcessor-72063144044265482-127.0.0.1:63126_solr-n_0000000000) [n:127.0.0.1:63126_solr    ] o.a.s.c.OverseerTaskProcessor CompletedTasks: []
   [junit4]   2> 4426023 DEBUG (OverseerCollectionConfigSetProcessor-72063144044265482-127.0.0.1:63126_solr-n_0000000000) [n:127.0.0.1:63126_solr    ] o.a.s.c.OverseerTaskProcessor RunningZKTasks: [/overseer/collection-queue-work/qn-0000000002]
   [junit4]   2> 4426023 DEBUG (OverseerCollectionConfigSetProcessor-72063144044265482-127.0.0.1:63126_solr-n_0000000000) [n:127.0.0.1:63126_solr    ] o.a.s.c.OverseerTaskQueue Peeking for top 99 elements. ExcludeSet: [/overseer/collection-queue-work/qn-0000000002],[]
   [junit4]   2> 4426024 DEBUG (SyncThread:0) [    ] o.a.s.c.ZkTestServer Watch fired: children: /solr/collections
   [junit4]   2> 4426024 DEBUG (SyncThread:0) [    ] o.a.s.c.ZkTestServer Watch fired: children: /solr/collections
   [junit4]   2> 4426024 DEBUG (SyncThread:0) [    ] o.a.s.c.ZkTestServer Watch fired: children: /solr/collections
   [junit4]   2> 4426025 DEBUG (SyncThread:0) [    ] o.a.s.c.ZkTestServer Watch fired: children: /solr/collections
   [junit4]   2> 4426025 DEBUG (SyncThread:0) [    ] o.a.s.c.ZkTestServer Watch fired: children: /solr/collections
   [junit4]   2> 4426025 DEBUG (SyncThread:0) [    ] o.a.s.c.ZkTestServer Watch fired: children: /solr/collections
   [junit4]   2> 4426025 DEBUG (SyncThread:0) [    ] o.a.s.c.ZkTestServer Watch fired: children: /solr/collections
   [junit4]   2> 4426025 DEBUG (SyncThread:0) [    ] o.a.s.c.ZkTestServer Watch fired: children: /solr/collections
   [junit4]   2> 4426025 DEBUG (SyncThread:0) [    ] o.a.s.c.ZkTestServer Watch fired: children: /solr/collections
   [junit4]   2> 4426026 DEBUG (SyncThread:0) [    ] o.a.s.c.ZkTestServer Watch added: children: /solr/collections
   [junit4]   2> 4426026 DEBUG (SyncThread:0) [    ] o.a.s.c.ZkTestServer Watch added: children: /solr/collections
   [junit4]   2> 4426027 DEBUG (SyncThread:0) [    ] o.a.s.c.ZkTestServer Watch added: children: /solr/collections
   [junit4]   2> 4426027 DEBUG (SyncThread:0) [    ] o.a.s.c.ZkTestServer Watch added: children: /solr/collections
   [junit4]   2> 4426027 DEBUG (SyncThread:0) [    ] o.a.s.c.ZkTestServer Watch added: children: /solr/collections
   [junit4]   2> 4426027 DEBUG (SyncThread:0) [    ] o.a.s.c.ZkTestServer Watch added: children: /solr/collections
   [junit4]   2> 4426027 DEBUG (OverseerThreadFactory-18165-thread-2-processing-n:127.0.0.1:63126_solr) [n:127.0.0.1:63126_solr    ] o.a.s.c.a.c.CreateCollectionCmd Check for collection zkNode:timeConfigtest
   [junit4]   2> 4426027 DEBUG (SyncThread:0) [    ] o.a.s.c.ZkTestServer Watch added: children: /solr/collections
   [junit4]   2> 4426028 DEBUG (SyncThread:0) [    ] o.a.s.c.ZkTestServer Watch added: children: /solr/collections
   [junit4]   2> 4426028 DEBUG (SyncThread:0) [    ] o.a.s.c.ZkTestServer Watch added: children: /solr/collections
   [junit4]   2> 4426029 DEBUG (OverseerThreadFactory-18165-thread-2-processing-n:127.0.0.1:63126_solr) [n:127.0.0.1:63126_solr    ] o.a.s.c.a.c.CreateCollectionCmd Collection zkNode exists
   [junit4]   2> 4426031 DEBUG (SyncThread:0) [    ] o.a.s.c.ZkTestServer Watch fired: children: /solr/overseer/queue
   [junit4]   2> 4426032 DEBUG (SyncThread:0) [    ] o.a.s.c.ZkTestServer Watch added: children: /solr/overseer/queue
   [junit4]   2> 4426034 DEBUG (SyncThread:0) [    ] o.a.s.c.ZkTestServer Watch fired: children: /solr/overseer/queue
   [junit4]   2> 4426034 DEBUG (SyncThread:0) [    ] o.a.s.c.ZkTestServer Watch added: children: /solr/overseer/queue
   [junit4]   2> 4426141 DEBUG (OverseerThreadFactory-18165-thread-2-processing-n:127.0.0.1:63126_solr) [n:127.0.0.1:63126_solr    ] o.a.s.c.a.c.Assign Identify nodes using default
   [junit4]   2> 4426141 DEBUG (OverseerThreadFactory-18165-thread-2-processing-n:127.0.0.1:63126_solr) [n:127.0.0.1:63126_solr    ] o.a.s.c.a.c.CreateCollectionCmd Creating SolrCores for new collection timeConfigtest, shardNames [shard1] , message : {
   [junit4]   2>   "name":"timeConfigtest",
   [junit4]   2>   "fromApi":"true",
   [junit4]   2>   "collection.configName":"timeConfigtest",
   [junit4]   2>   "numShards":"1",
   [junit4]   2>   "nrtReplicas":"1",
   [junit4]   2>   "stateFormat":"2",
   [junit4]   2>   "replicationFactor":"1",
   [junit4]   2>   "operation":"create"}
   [junit4]   2> 4426144 DEBUG (OverseerThreadFactory-18165-thread-2-processing-n:127.0.0.1:63126_solr) [n:127.0.0.1:63126_solr    ] o.a.s.c.a.c.CreateCollectionCmd Creating core timeConfigtest_shard1_replica_n1 as part of shard shard1 of collection timeConfigtest on 127.0.0.1:63126_solr
   [junit4]   2> 4426145 DEBUG (SyncThread:0) [    ] o.a.s.c.ZkTestServer Watch fired: children: /solr/overseer/queue
   [junit4]   2> 4426146 DEBUG (SyncThread:0) [    ] o.a.s.c.ZkTestServer Watch added: children: /solr/overseer/queue
   [junit4]   2> 4426146 DEBUG (OverseerThreadFactory-18165-thread-2-processing-n:127.0.0.1:63126_solr) [n:127.0.0.1:63126_solr    ] o.a.s.c.a.c.OverseerCollectionMessageHandler Expecting [timeConfigtest_shard1_replica_n1] cores but found {}
   [junit4]   2> 4426147 INFO  (OverseerStateUpdate-72063144044265482-127.0.0.1:63126_solr-n_0000000000) [n:127.0.0.1:63126_solr    ] o.a.s.c.o.SliceMutator createReplica() {
   [junit4]   2>   "operation":"ADDREPLICA",
   [junit4]   2>   "collection":"timeConfigtest",
   [junit4]   2>   "shard":"shard1",
   [junit4]   2>   "core":"timeConfigtest_shard1_replica_n1",
   [junit4]   2>   "state":"down",
   [junit4]   2>   "base_url":"https://127.0.0.1:63126/solr",
   [junit4]   2>   "type":"NRT",
   [junit4]   2>   "waitForFinalState":"false"} 
   [junit4]   2> 4426250 DEBUG (OverseerThreadFactory-18165-thread-2-processing-n:127.0.0.1:63126_solr) [n:127.0.0.1:63126_solr    ] o.a.s.c.a.c.OverseerCollectionMessageHandler Expecting [timeConfigtest_shard1_replica_n1] cores but found {}
   [junit4]   2> 4426250 DEBUG (SyncThread:0) [    ] o.a.s.c.ZkTestServer Watch fired: children: /solr/overseer/queue
   [junit4]   2> 4426251 DEBUG (SyncThread:0) [    ] o.a.s.c.ZkTestServer Watch added: children: /solr/overseer/queue
   [junit4]   2> 4426366 INFO  (qtp1171177089-49792) [n:127.0.0.1:63126_solr    x:timeConfigtest_shard1_replica_n1] o.a.s.h.a.CoreAdminOperation core create command qt=/admin/cores&coreNodeName=core_node2&collection.configName=timeConfigtest&newCollection=true&name=timeConfigtest_shard1_replica_n1&action=CREATE&numShards=1&collection=timeConfigtest&shard=shard1&wt=javabin&version=2&replicaType=NRT
   [junit4]   2> 4426367 INFO  (qtp1171177089-49792) [n:127.0.0.1:63126_solr    x:timeConfigtest_shard1_replica_n1] o.a.s.c.TransientSolrCoreCacheDefault Allocating transient cache for 2147483647 transient cores
   [junit4]   2> 4426369 DEBUG (SyncThread:0) [    ] o.a.s.c.ZkTestServer Watch added: data: /solr/collections/timeConfigtest/state.json
   [junit4]   2> 4426369 DEBUG (qtp1171177089-49792) [n:127.0.0.1:63126_solr c:timeConfigtest s:shard1 r:core_node2 x:timeConfigtest_shard1_replica_n1] o.a.s.c.ZkController publishing state=down
   [junit4]   2> 4426370 DEBUG (SyncThread:0) [    ] o.a.s.c.ZkTestServer Watch fired: children: /solr/overseer/queue
   [junit4]   2> 4426372 DEBUG (SyncThread:0) [    ] o.a.s.c.ZkTestServer Watch added: children: /solr/overseer/queue
   [junit4]   2> 4426372 DEBUG (qtp1171177089-49792) [n:127.0.0.1:63126_solr c:timeConfigtest s:shard1 r:core_node2 x:timeConfigtest_shard1_replica_n1] o.a.s.c.ZkController Registering watch for collection timeConfigtest
   [junit4]   2> 4426372 DEBUG (qtp1171177089-49792) [n:127.0.0.1:63126_solr c:timeConfigtest s:shard1 r:core_node2 x:timeConfigtest_shard1_replica_n1] o.a.s.c.ZkController waiting to find shard id in clusterstate for timeConfigtest_shard1_replica_n1
   [junit4]   2> 4426474 DEBUG (SyncThread:0) [    ] o.a.s.c.ZkTestServer Watch fired: data: /solr/collections/timeConfigtest/state.json
   [junit4]   2> 4426474 DEBUG (SyncThread:0) [    ] o.a.s.c.ZkTestServer Watch fired: children: /solr/overseer/queue
   [junit4]   2> 4426476 DEBUG (SyncThread:0) [    ] o.a.s.c.ZkTestServer Watch added: children: /solr/overseer/queue
   [junit4]   2> 4427405 INFO  (qtp1171177089-49792) [n:127.0.0.1:63126_solr c:timeConfigtest s:shard1 r:core_node2 x:timeConfigtest_shard1_replica_n1] o.a.s.c.RequestParams conf resource params.json loaded . version : 0 
   [junit4]   2> 4427405 INFO  (qtp1171177089-49792) [n:127.0.0.1:63126_solr c:timeConfigtest s:shard1 r:core_node2 x:timeConfigtest_shard1_replica_n1] o.a.s.c.RequestParams request params refreshed to version 0
   [junit4]   2> 4427406 WARN  (qtp1171177089-49792) [n:127.0.0.1:63126_solr c:timeConfigtest s:shard1 r:core_node2 x:timeConfigtest_shard1_replica_n1] o.a.s.c.SolrConfig Couldn't add files from /Users/jenkins/workspace/Lucene-Solr-master-MacOSX/solr/build/solr-core/test/J1/temp/solr.update.processor.TimeRoutedAliasUpdateProcessorTest_2B9F1478C9677CDC-001/tempDir-001/node1/timeConfigtest_shard1_replica_n1/../../../../contrib/extraction/lib filtered by .*\.jar to classpath: /Users/jenkins/workspace/Lucene-Solr-master-MacOSX/solr/build/solr-core/test/J1/temp/solr.update.processor.TimeRoutedAliasUpdateProcessorTest_2B9F1478C9677CDC-001/tempDir-001/node1/timeConfigtest_shard1_replica_n1/../../../../contrib/extraction/lib
   [junit4]   2> 4427406 WARN  (qtp1171177089-49792) [n:127.0.0.1:63126_solr c:timeConfigtest s:shard1 r:core_node2 x:timeConfigtest_shard1_replica_n1] o.a.s.c.SolrConfig Couldn't add files from /Users/jenkins/workspace/Lucene-Solr-master-MacOSX/solr/build/solr-core/test/J1/temp/solr.update.processor.TimeRoutedAliasUpdateProcessorTest_2B9F1478C9677CDC-001/tempDir-001/node1/timeConfigtest_shard1_replica_n1/../../../../dist filtered by solr-cell-\d.*\.jar to classpath: /Users/jenkins/workspace/Lucene-Solr-master-MacOSX/solr/build/solr-core/test/J1/temp/solr.update.processor.TimeRoutedAliasUpdateProcessorTest_2B9F1478C9677CDC-001/tempDir-001/node1/timeConfigtest_shard1_replica_n1/../../../../dist
   [junit4]   2> 4427407 WARN  (qtp1171177089-49792) [n:127.0.0.1:63126_solr c:timeConfigtest s:shard1 r:core_node2 x:timeConfigtest_shard1_replica_n1] o.a.s.c.SolrConfig Couldn't add files from /Users/jenkins/workspace/Lucene-Solr-master-MacOSX/solr/build/solr-core/test/J1/temp/solr.update.processor.TimeRoutedAliasUpdateProcessorTest_2B9F1478C9677CDC-001/tempDir-001/node1/timeConfigtest_shard1_replica_n1/../../../../contrib/clustering/lib filtered by .*\.jar to classpath: /Users/jenkins/workspace/Lucene-Solr-master-MacOSX/solr/build/solr-core/test/J1/temp/solr.update.processor.TimeRoutedAliasUpdateProcessorTest_2B9F1478C9677CDC-001/tempDir-001/node1/timeConfigtest_shard1_replica_n1/../../../../contrib/clustering/lib
   [junit4]   2> 4427407 WARN  (qtp1171177089-49792) [n:127.0.0.1:63126_solr c:timeConfigtest s:shard1 r:core_node2 x:timeConfigtest_shard1_replica_n1] o.a.s.c.SolrConfig Couldn't add files from /Users/jenkins/workspace/Lucene-Solr-master-MacOSX/solr/build/solr-core/test/J1/temp/solr.update.processor.TimeRoutedAliasUpdateProcessorTest_2B9F1478C9677CDC-001/tempDir-001/node1/timeConfigtest_shard1_replica_n1/../../../../dist filtered by solr-clustering-\d.*\.jar to classpath: /Users/jenkins/workspace/Lucene-Solr-master-MacOSX/solr/build/solr-core/test/J1/temp/solr.update.processor.TimeRoutedAliasUpdateProcessorTest_2B9F1478C9677CDC-001/tempDir-001/node1/timeConfigtest_shard1_replica_n1/../../../../dist
   [junit4]   2> 4427407 WARN  (qtp1171177089-49792) [n:127.0.0.1:63126_solr c:timeConfigtest s:shard1 r:core_node2 x:timeConfigtest_shard1_replica_n1] o.a.s.c.SolrConfig Couldn't add files from /Users/jenkins/workspace/Lucene-Solr-master-MacOSX/solr/build/solr-core/test/J1/temp/solr.update.processor.TimeRoutedAliasUpdateProcessorTest_2B9F1478C9677CDC-001/tempDir-001/node1/timeConfigtest_shard1_replica_n1/../../../../contrib/langid/lib filtered by .*\.jar to classpath: /Users/jenkins/workspace/Lucene-Solr-master-MacOSX/solr/build/solr-core/test/J1/temp/solr.update.processor.TimeRoutedAliasUpdateProcessorTest_2B9F1478C9677CDC-001/tempDir-001/node1/timeConfigtest_shard1_replica_n1/../../../../contrib/langid/lib
   [junit4]   2> 4427408 WARN  (qtp1171177089-49792) [n:127.0.0.1:63126_solr c:timeConfigtest s:shard1 r:core_node2 x:timeConfigtest_shard1_replica_n1] o.a.s.c.SolrConfig Couldn't add files from /Users/jenkins/workspace/Lucene-Solr-master-MacOSX/solr/build/solr-core/test/J1/temp/solr.update.processor.TimeRoutedAliasUpdateProcessorTest_2B9F1478C9677CDC-001/tempDir-001/node1/timeConfigtest_shard1_replica_n1/../../../../dist filtered by solr-langid-\d.*\.jar to classpath: /Users/jenkins/workspace/Lucene-Solr-master-MacOSX/solr/build/solr-core/test/J1/temp/solr.update.processor.TimeRoutedAliasUpdateProcessorTest_2B9F1478C9677CDC-001/tempDir-001/node1/timeConfigtest_shard1_replica_n1/../../../../dist
   [junit4]   2> 4427408 WARN  (qtp1171177089-49792) [n:127.0.0.1:63126_solr c:timeConfigtest s:shard1 r:core_node2 x:timeConfigtest_shard1_replica_n1] o.a.s.c.SolrConfig Couldn't add files from /Users/jenkins/workspace/Lucene-Solr-master-MacOSX/solr/build/solr-core/test/J1/temp/solr.update.processor.TimeRoutedAliasUpdateProcessorTest_2B9F1478C9677CDC-001/tempDir-001/node1/timeConfigtest_shard1_replica_n1/../../../../contrib/velocity/lib filtered by .*\.jar to classpath: /Users/jenkins/workspace/Lucene-Solr-master-MacOSX/solr/build/solr-core/test/J1/temp/solr.update.processor.TimeRoutedAliasUpdateProcessorTest_2B9F1478C9677CDC-001/tempDir-001/node1/timeConfigtest_shard1_replica_n1/../../../../contrib/velocity/lib
   [junit4]   2> 4427408 WARN  (qtp1171177089-49792) [n:127.0.0.1:63126_solr c:timeConfigtest s:shard1 r:core_node2 x:timeConfigtest_shard1_replica_n1] o.a.s.c.SolrConfig Couldn't add files from /Users/jenkins/workspace/Lucene-Solr-master-MacOSX/solr/build/solr-core/test/J1/temp/solr.update.processor.TimeRoutedAliasUpdateProcessorTest_2B9F1478C9677CDC-001/tempDir-001/node1/timeConfigtest_shard1_replica_n1/../../../../dist filtered by solr-velocity-\d.*\.jar to classpath: /Users/jenkins/workspace/Lucene-Solr-master-MacOSX/solr/build/solr-core/test/J1/temp/solr.update.processor.TimeRoutedAliasUpdateProcessorTest_2B9F1478C9677CDC-001/tempDir-001/node1/timeConfigtest_shard1_replica_n1/../../../../dist
   [junit4]   2> 4427408 WARN  (qtp1171177089-49792) [n:127.0.0.1:63126_solr c:timeConfigtest s:shard1 r:core_node2 x:timeConfigtest_shard1_replica_n1] o.a.s.c.SolrConfig Couldn't add files from /Users/jenkins/workspace/Lucene-Solr-master-MacOSX/solr/build/solr-core/test/J1/temp/solr.update.processor.TimeRoutedAliasUpdateProcessorTest_2B9F1478C9677CDC-001/tempDir-001/node1/timeConfigtest_shard1_replica_n1/../../../../dist filtered by solr-ltr-\d.*\.jar to classpath: /Users/jenkins/workspace/Lucene-Solr-master-MacOSX/solr/build/solr-core/test/J1/temp/solr.update.processor.TimeRoutedAliasUpdateProcessorTest_2B9F1478C9677CDC-001/tempDir-001/node1/timeConfigtest_shard1_replica_n1/../../../../dist
   [junit4]   2> 4427412 INFO  (qtp1171177089-49792) [n:127.0.0.1:63126_solr c:timeConfigtest s:shard1 r:core_node2 x:timeConfigtest_shard1_replica_n1] o.a.s.c.SolrConfig Using Lucene MatchVersion: 8.0.0
   [junit4]   2> 4427427 INFO  (qtp1171177089-49792) [n:127.0.0.1:63126_solr c:timeConfigtest s:shard1 r:core_node2 x:timeConfigtest_shard1_replica_n1] o.a.s.s.IndexSchema [timeConfigtest_shard1_replica_n1] Schema name=default-config
   [junit4]   2> 4427594 ERROR (qtp1171177089-49792) [n:127.0.0.1:63126_solr c:timeConfigtest s:shard1 r:core_node2 x:timeConfigtest_shard1_replica_n1] o.a.s.h.RequestHandlerBase org.apache.solr.common.SolrException: Error CREATEing SolrCore 'timeConfigtest_shard1_replica_n1': Unable to create core [timeConfigtest_shard1_replica_n1] Caused by: Can't find resource 'lang/contractions_ca.txt' in classpath or '/configs/timeConfigtest', cwd=/Users/jenkins/workspace/Lucene-Solr-master-MacOSX/solr/build/solr-core/test/J1
   [junit4]   2> 	at org.apache.solr.core.CoreContainer.create(CoreContainer.java:1092)
   [junit4]   2> 	at org.apache.solr.handler.admin.CoreAdminOperation.lambda$static$0(CoreAdminOperation.java:92)
   [junit4]   2> 	at org.apache.solr.handler.admin.CoreAdminOperation.execute(CoreAdminOperation.java:360)
   [junit4]   2> 	at org.apache.solr.handler.admin.CoreAdminHandler$CallInfo.call(CoreAdminHandler.java:395)
   [junit4]   2> 	at org.apache.solr.handler.admin.CoreAdminHandler.handleRequestBody(CoreAdminHandler.java:180)
   [junit4]   2> 	at org.apache.solr.handler.RequestHandlerBase.handleRequest(RequestHandlerBase.java:199)
   [junit4]   2> 	at org.apache.solr.servlet.HttpSolrCall.handleAdmin(HttpSolrCall.java:734)
   [junit4]   2> 	at org.apache.solr.servlet.HttpSolrCall.handleAdminRequest(HttpSolrCall.java:715)
   [junit4]   2> 	at org.apache.solr.servlet.HttpSolrCall.call(HttpSolrCall.java:496)
   [junit4]   2> 	at org.apache.solr.servlet.SolrDispatchFilter.doFilter(SolrDispatchFilter.java:377)
   [junit4]   2> 	at org.apache.solr.servlet.SolrDispatchFilter.doFilter(SolrDispatchFilter.java:323)
   [junit4]   2> 	at org.eclipse.jetty.servlet.ServletHandler$CachedChain.doFilter(ServletHandler.java:1642)
   [junit4]   2> 	at org.apache.solr.client.solrj.embedded.JettySolrRunner$DebugFilter.doFilter(JettySolrRunner.java:139)
   [junit4]   2> 	at org.eclipse.jetty.servlet.ServletHandler$CachedChain.doFilter(ServletHandler.java:1642)
   [junit4]   2> 	at org.eclipse.jetty.servlet.ServletHandler.doHandle(ServletHandler.java:533)
   [junit4]   2> 	at org.eclipse.jetty.server.handler.ScopedHandler.nextHandle(ScopedHandler.java:255)
   [junit4]   2> 	at org.eclipse.jetty.server.session.SessionHandler.doHandle(SessionHandler.java:1595)
   [junit4]   2> 	at org.eclipse.jetty.server.handler.ScopedHandler.nextHandle(ScopedHandler.java:255)
   [junit4]   2> 	at org.eclipse.jetty.server.handler.ContextHandler.doHandle(ContextHandler.java:1317)
   [junit4]   2> 	at org.eclipse.jetty.server.handler.ScopedHandler.nextScope(ScopedHandler.java:203)
   [junit4]   2> 	at org.eclipse.jetty.servlet.ServletHandler.doScope(ServletHandler.java:473)
   [junit4]   2> 	at org.eclipse.jetty.server.session.SessionHandler.doScope(SessionHandler.java:1564)
   [junit4]   2> 	at org.eclipse.jetty.server.handler.ScopedHandler.nextScope(ScopedHandler.java:201)
   [junit4]   2> 	at org.eclipse.jetty.server.handler.ContextHandler.doScope(ContextHandler.java:1219)
   [junit4]   2> 	at org.eclipse.jetty.server.handler.ScopedHandler.handle(ScopedHandler.java:144)
   [junit4]   2> 	at org.eclipse.jetty.server.handler.gzip.GzipHandler.handle(GzipHandler.java:674)
   [junit4]   2> 	at org.eclipse.jetty.server.handler.HandlerWrapper.handle(HandlerWrapper.java:132)
   [junit4]   2> 	at org.eclipse.jetty.server.Server.handle(Server.java:531)
   [junit4]   2> 	at org.eclipse.jetty.server.HttpChannel.handle(HttpChannel.java:352)
   [junit4]   2> 	at org.eclipse.jetty.server.HttpConnection.onFillable(HttpConnection.java:260)
   [junit4]   2> 	at org.eclipse.jetty.io.AbstractConnection$ReadCallback.succeeded(AbstractConnection.java:281)
   [junit4]   2> 	at org.eclipse.jetty.io.FillInterest.fillable(FillInterest.java:102)
   [junit4]   2> 	at org.eclipse.jetty.io.ssl.SslConnection.onFillable(SslConnection.java:291)
   [junit4]   2> 	at org.eclipse.jetty.io.ssl.SslConnection$3.succeeded(SslConnection.java:151)
   [junit4]   2> 	at org.eclipse.jetty.io.FillInterest.fillable(FillInterest.java:102)
   [junit4]   2> 	at org.eclipse.jetty.io.ChannelEndPoint$2.run(ChannelEndPoint.java:118)
   [junit4]   2> 	at org.eclipse.jetty.util.thread.strategy.EatWhatYouKill.runTask(EatWhatYouKill.java:333)
   [junit4]   2> 	at org.eclipse.jetty.util.thread.strategy.EatWhatYouKill.doProduce(EatWhatYouKill.java:310)
   [junit4]   2> 	at org.eclipse.jetty.util.thread.strategy.EatWhatYouKill.tryProduce(EatWhatYouKill.java:168)
   [junit4]   2> 	at org.eclipse.jetty.util.thread.strategy.EatWhatYouKill.run(EatWhatYouKill.java:126)
   [junit4]   2> 	at org.eclipse.jetty.util.thread.ReservedThreadExecutor$ReservedThread.run(ReservedThreadExecutor.java:366)
   [junit4]   2> 	at org.eclipse.jetty.util.thread.QueuedThreadPool.runJob(QueuedThreadPool.java:762)
   [junit4]   2> 	at org.eclipse.jetty.util.thread.QueuedThreadPool$2.run(QueuedThreadPool.java:680)
   [junit4]   2> 	at java.lang.Thread.run(Thread.java:748)
   [junit4]   2> Caused by: org.apache.solr.common.SolrException: Unable to create core [timeConfigtest_shard1_replica_n1]
   [junit4]   2> 	at org.apache.solr.core.CoreContainer.createFromDescriptor(CoreContainer.java:1164)
   [junit4]   2> 	at org.apache.solr.core.CoreContainer.create(CoreContainer.java:1053)
   [junit4]   2> 	... 43 more
   [junit4]   2> Caused by: org.apache.solr.common.SolrException: Could not load conf for core timeConfigtest_shard1_replica_n1: Can't load schema managed-schema: org.apache.solr.core.SolrResourceNotFoundException: Can't find resource 'lang/contractions_ca.txt' in classpath or '/configs/timeConfigtest', cwd=/Users/jenkins/workspace/Lucene-Solr-master-MacOSX/solr/build/solr-core/test/J1
   [junit4]   2> 	at org.apache.solr.core.ConfigSetService.getConfig(ConfigSetService.java:96)
   [junit4]   2> 	at org.apache.solr.core.CoreContainer.getConfigSet(CoreContainer.java:1192)
   [junit4]   2> 	at org.apache.solr.core.CoreContainer.createFromDescriptor(CoreContainer.java:1139)
   [junit4]   2> 	... 44 more
   [junit4]   2> Caused by: org.apache.solr.common.SolrException: Can't load schema managed-schema: org.apache.solr.core.SolrResourceNotFoundException: Can't find resource 'lang/contractions_ca.txt' in classpath or '/configs/timeConfigtest', cwd=/Users/jenkins/workspace/Lucene-Solr-master-MacOSX/solr/build/solr-core/test/J1
   [junit4]   2> 	at org.apache.solr.schema.IndexSchema.readSchema(IndexSchema.java:582)
   [junit4]   2> 	at org.apache.solr.schema.IndexSchema.<init>(IndexSchema.java:180)
   [junit4]   2> 	at org.apache.solr.schema.ManagedIndexSchema.<init>(ManagedIndexSchema.java:105)
   [junit4]   2> 	at org.apache.solr.schema.ManagedIndexSchemaFactory.create(ManagedIndexSchemaFactory.java:173)
   [junit4]   2> 	at org.apache.solr.schema.ManagedIndexSchemaFactory.create(ManagedIndexSchemaFactory.java:45)
   [junit4]   2> 	at org.apache.solr.schema.IndexSchemaFactory.buildIndexSchema(IndexSchemaFactory.java:70)
   [junit4]   2> 	at org.apache.solr.core.ConfigSetService.createIndexSchema(ConfigSetService.java:118)
   [junit4]   2> 	at org.apache.solr.core.ConfigSetService.getConfig(ConfigSetService.java:91)
   [junit4]   2> 	... 46 more
   [junit4]   2> Caused by: org.apache.solr.common.SolrException: org.apache.solr.core.SolrResourceNotFoundException: Can't find resource 'lang/contractions_ca.txt' in classpath or '/configs/timeConfigtest', cwd=/Users/jenkins/workspace/Lucene-Solr-master-MacOSX/solr/build/solr-core/test/J1
   [junit4]   2> 	at org.apache.solr.schema.ManagedIndexSchema.informResourceLoaderAwareObjectsInChain(ManagedIndexSchema.java:1317)
   [junit4]   2> 	at org.apache.solr.schema.ManagedIndexSchema.informResourceLoaderAwareObjectsForFieldType(ManagedIndexSchema.java:1168)
   [junit4]   2> 	at org.apache.solr.schema.ManagedIndexSchema.postReadInform(ManagedIndexSchema.java:1153)
   [junit4]   2> 	at org.apache.solr.schema.IndexSchema.readSchema(IndexSchema.java:578)
   [junit4]   2> 	... 53 more
   [junit4]   2> Caused by: org.apache.solr.core.SolrResourceNotFoundException: Can't find resource 'lang/contractions_ca.txt' in classpath or '/configs/timeConfigtest', cwd=/Users/jenkins/workspace/Lucene-Solr-master-MacOSX/solr/build/solr-core/test/J1
   [junit4]   2> 	at org.apache.solr.cloud.ZkSolrResourceLoader.openResource(ZkSolrResourceLoader.java:130)
   [junit4]   2> 	at org.apache.lucene.analysis.util.AbstractAnalysisFactory.getLines(AbstractAnalysisFactory.java:254)
   [junit4]   2> 	at org.apache.lucene.analysis.util.AbstractAnalysisFactory.getWordSet(AbstractAnalysisFactory.java:243)
   [junit4]   2> 	at org.apache.lucene.analysis.util.ElisionFilterFactory.inform(ElisionFilterFactory.java:59)
   [junit4]   2> 	at org.apache.solr.schema.ManagedIndexSchema.informResourceLoaderAwareObjectsInChain(ManagedIndexSchema.java:1315)
   [junit4]   2> 	... 56 more
   [junit4]   2> 
   [junit4]   2> 4427595 INFO  (qtp1171177089-49792) [n:127.0.0.1:63126_solr c:timeConfigtest s:shard1 r:core_node2 x:timeConfigtest_shard1_replica_n1] o.a.s.s.HttpSolrCall [admin] webapp=null path=/admin/cores params={qt=/admin/cores&coreNodeName=core_node2&collection.configName=timeConfigtest&newCollection=true&name=timeConfig

[...truncated too long message...]

: resolving dependencies :: org.codehaus.groovy#groovy-all-caller;working
[ivy:cachepath] 	confs: [default]
[ivy:cachepath] 	found org.codehaus.groovy#groovy-all;2.4.15 in public
[ivy:cachepath] :: resolution report :: resolve 22ms :: artifacts dl 1ms
	---------------------------------------------------------------------
	|                  |            modules            ||   artifacts   |
	|       conf       | number| search|dwnlded|evicted|| number|dwnlded|
	---------------------------------------------------------------------
	|      default     |   1   |   0   |   0   |   0   ||   1   |   0   |
	---------------------------------------------------------------------

-init-totals:

-test:
    [mkdir] Created dir: /Users/jenkins/workspace/Lucene-Solr-master-MacOSX/solr/build/solr-core/test
[junit4:pickseed] Seed property 'tests.seed' already defined: 2B9F1478C9677CDC
    [mkdir] Created dir: /Users/jenkins/workspace/Lucene-Solr-master-MacOSX/solr/build/solr-core/test/temp
   [junit4] <JUnit4> says olá! Master seed: 2B9F1478C9677CDC
   [junit4] Executing 5 suites with 2 JVMs.
   [junit4] 
   [junit4] Started J1 PID(16798@serv1-vm2.sd-datasolutions.de).
   [junit4] Started J0 PID(16797@serv1-vm2.sd-datasolutions.de).
   [junit4] Suite: org.apache.solr.update.processor.TimeRoutedAliasUpdateProcessorTest
   [junit4] OK      42.5s J1 | TimeRoutedAliasUpdateProcessorTest.test
   [junit4] OK      0.09s J1 | TimeRoutedAliasUpdateProcessorTest.testParse
   [junit4] OK      41.9s J1 | TimeRoutedAliasUpdateProcessorTest.testPreemptiveCreation
   [junit4] OK      25.1s J1 | TimeRoutedAliasUpdateProcessorTest.testSliceRouting
   [junit4] Completed [1/5] on J1 in 129.03s, 4 tests
   [junit4] 
   [junit4] Suite: org.apache.solr.update.processor.TimeRoutedAliasUpdateProcessorTest
   [junit4] OK      42.2s J0 | TimeRoutedAliasUpdateProcessorTest.test
   [junit4] OK      0.09s J0 | TimeRoutedAliasUpdateProcessorTest.testParse
   [junit4] OK      42.2s J0 | TimeRoutedAliasUpdateProcessorTest.testPreemptiveCreation
   [junit4] OK      24.2s J0 | TimeRoutedAliasUpdateProcessorTest.testSliceRouting
   [junit4] Completed [2/5] on J0 in 129.62s, 4 tests
   [junit4] 
   [junit4] Duplicate suite name used with XML reports: org.apache.solr.update.processor.TimeRoutedAliasUpdateProcessorTest. This may confuse tools that process XML reports. Set 'ignoreDuplicateSuites' to true to skip this message.
   [junit4] Suite: org.apache.solr.update.processor.TimeRoutedAliasUpdateProcessorTest
   [junit4] OK      27.5s J0 | TimeRoutedAliasUpdateProcessorTest.test
   [junit4] OK      0.07s J0 | TimeRoutedAliasUpdateProcessorTest.testParse
   [junit4] OK      42.8s J0 | TimeRoutedAliasUpdateProcessorTest.testPreemptiveCreation
   [junit4] OK      25.6s J0 | TimeRoutedAliasUpdateProcessorTest.testSliceRouting
   [junit4] Completed [3/5] on J0 in 100.49s, 4 tests
   [junit4] 
   [junit4] Suite: org.apache.solr.update.processor.TimeRoutedAliasUpdateProcessorTest
   [junit4] OK      27.5s J1 | TimeRoutedAliasUpdateProcessorTest.test
   [junit4] OK      0.08s J1 | TimeRoutedAliasUpdateProcessorTest.testParse
   [junit4] OK      42.8s J1 | TimeRoutedAliasUpdateProcessorTest.testPreemptiveCreation
   [junit4] OK      25.6s J1 | TimeRoutedAliasUpdateProcessorTest.testSliceRouting
   [junit4] Completed [4/5] on J1 in 100.26s, 4 tests
   [junit4] 
   [junit4] Suite: org.apache.solr.update.processor.TimeRoutedAliasUpdateProcessorTest
   [junit4] OK      26.9s J0 | TimeRoutedAliasUpdateProcessorTest.test
   [junit4] OK      0.07s J0 | TimeRoutedAliasUpdateProcessorTest.testParse
   [junit4] OK      40.8s J0 | TimeRoutedAliasUpdateProcessorTest.testPreemptiveCreation
   [junit4] OK      21.0s J0 | TimeRoutedAliasUpdateProcessorTest.testSliceRouting
   [junit4] Completed [5/5] on J0 in 91.73s, 4 tests
   [junit4] 
   [junit4] JVM J0:     1.02 ..   324.87 =   323.85s
   [junit4] JVM J1:     1.02 ..   232.92 =   231.90s
   [junit4] Execution time total: 5 minutes 24 seconds
   [junit4] Tests summary: 5 suites, 20 tests
   [junit4] Could not remove temporary path: /Users/jenkins/workspace/Lucene-Solr-master-MacOSX/solr/build/solr-core/test/J0 (java.nio.file.DirectoryNotEmptyException: Remaining files: [/Users/jenkins/workspace/Lucene-Solr-master-MacOSX/solr/build/solr-core/test/J0/temp])
   [junit4] Could not remove temporary path: /Users/jenkins/workspace/Lucene-Solr-master-MacOSX/solr/build/solr-core/test/J1 (java.nio.file.DirectoryNotEmptyException: Remaining files: [/Users/jenkins/workspace/Lucene-Solr-master-MacOSX/solr/build/solr-core/test/J1/temp])
     [echo] 5 slowest tests:
[junit4:tophints] 575.65s | org.apache.solr.cloud.BasicDistributedZkTest
[junit4:tophints] 396.52s | org.apache.solr.cloud.api.collections.ShardSplitTest
[junit4:tophints] 241.51s | org.apache.solr.cloud.cdcr.CdcrOpsAndBoundariesTest
[junit4:tophints] 224.36s | org.apache.solr.cloud.cdcr.CdcrWithNodesRestartsTest
[junit4:tophints] 217.71s | org.apache.solr.update.TestInPlaceUpdatesDistrib

-check-totals:

test-nocompile:

BUILD SUCCESSFUL
Total time: 5 minutes 27 seconds
[repro] Failures:
[repro]   0/5 failed: org.apache.solr.update.processor.TimeRoutedAliasUpdateProcessorTest
[repro] Exiting with code 0
+ mv lucene/build lucene/build.repro
+ mv solr/build solr/build.repro
+ mv lucene/build.orig lucene/build
+ mv solr/build.orig solr/build
Archiving artifacts
Setting ANT_1_8_2_HOME=/Users/jenkins/tools/hudson.tasks.Ant_AntInstallation/ANT_1.8.2
java.lang.InterruptedException: no matches found within 10000
	at hudson.FilePath$ValidateAntFileMask.hasMatch(FilePath.java:2845)
	at hudson.FilePath$ValidateAntFileMask.invoke(FilePath.java:2724)
	at hudson.FilePath$ValidateAntFileMask.invoke(FilePath.java:2705)
	at hudson.FilePath$FileCallableWrapper.call(FilePath.java:3084)
Also:   hudson.remoting.Channel$CallSiteStackTrace: Remote call to MacOSX VBOX
		at hudson.remoting.Channel.attachCallSiteStackTrace(Channel.java:1741)
		at hudson.remoting.UserRequest$ExceptionResponse.retrieve(UserRequest.java:357)
		at hudson.remoting.Channel.call(Channel.java:955)
		at hudson.FilePath.act(FilePath.java:1070)
		at hudson.FilePath.act(FilePath.java:1059)
		at hudson.FilePath.validateAntFileMask(FilePath.java:2703)
		at hudson.tasks.ArtifactArchiver.perform(ArtifactArchiver.java:243)
		at hudson.tasks.BuildStepCompatibilityLayer.perform(BuildStepCompatibilityLayer.java:81)
		at hudson.tasks.BuildStepMonitor$1.perform(BuildStepMonitor.java:20)
		at hudson.model.AbstractBuild$AbstractBuildExecution.perform(AbstractBuild.java:744)
		at hudson.model.AbstractBuild$AbstractBuildExecution.performAllBuildSteps(AbstractBuild.java:690)
		at hudson.model.Build$BuildExecution.post2(Build.java:186)
		at hudson.model.AbstractBuild$AbstractBuildExecution.post(AbstractBuild.java:635)
		at hudson.model.Run.execute(Run.java:1831)
		at hudson.model.FreeStyleBuild.run(FreeStyleBuild.java:43)
		at hudson.model.ResourceController.execute(ResourceController.java:97)
		at hudson.model.Executor.run(Executor.java:429)
Caused: hudson.FilePath$TunneledInterruptedException
	at hudson.FilePath$FileCallableWrapper.call(FilePath.java:3086)
	at hudson.remoting.UserRequest.perform(UserRequest.java:212)
	at hudson.remoting.UserRequest.perform(UserRequest.java:54)
	at hudson.remoting.Request$2.run(Request.java:369)
	at hudson.remoting.InterceptingExecutorService$1.call(InterceptingExecutorService.java:72)
	at java.util.concurrent.FutureTask.run(FutureTask.java:266)
	at java.util.concurrent.ThreadPoolExecutor.runWorker(ThreadPoolExecutor.java:1149)
	at java.util.concurrent.ThreadPoolExecutor$Worker.run(ThreadPoolExecutor.java:624)
	at java.lang.Thread.run(Thread.java:748)
Caused: java.lang.InterruptedException: java.lang.InterruptedException: no matches found within 10000
	at hudson.FilePath.act(FilePath.java:1072)
	at hudson.FilePath.act(FilePath.java:1059)
	at hudson.FilePath.validateAntFileMask(FilePath.java:2703)
	at hudson.tasks.ArtifactArchiver.perform(ArtifactArchiver.java:243)
	at hudson.tasks.BuildStepCompatibilityLayer.perform(BuildStepCompatibilityLayer.java:81)
	at hudson.tasks.BuildStepMonitor$1.perform(BuildStepMonitor.java:20)
	at hudson.model.AbstractBuild$AbstractBuildExecution.perform(AbstractBuild.java:744)
	at hudson.model.AbstractBuild$AbstractBuildExecution.performAllBuildSteps(AbstractBuild.java:690)
	at hudson.model.Build$BuildExecution.post2(Build.java:186)
	at hudson.model.AbstractBuild$AbstractBuildExecution.post(AbstractBuild.java:635)
	at hudson.model.Run.execute(Run.java:1831)
	at hudson.model.FreeStyleBuild.run(FreeStyleBuild.java:43)
	at hudson.model.ResourceController.execute(ResourceController.java:97)
	at hudson.model.Executor.run(Executor.java:429)
No artifacts found that match the file pattern "**/*.events,heapdumps/**,**/*_pid*.log". Configuration error?
[WARNINGS] Parsing warnings in console log with parser Java Compiler (javac)
Setting ANT_1_8_2_HOME=/Users/jenkins/tools/hudson.tasks.Ant_AntInstallation/ANT_1.8.2
Setting ANT_1_8_2_HOME=/Users/jenkins/tools/hudson.tasks.Ant_AntInstallation/ANT_1.8.2
<Git Blamer> Using GitBlamer to create author and commit information for all warnings.
<Git Blamer> GIT_COMMIT=3f2975c27c520ed7543779cd731a7cd525243479, workspace=/Users/jenkins/workspace/Lucene-Solr-master-MacOSX
[WARNINGS] Computing warning deltas based on reference build #4841
Recording test results
Setting ANT_1_8_2_HOME=/Users/jenkins/tools/hudson.tasks.Ant_AntInstallation/ANT_1.8.2
Build step 'Publish JUnit test result report' changed build result to UNSTABLE
Email was triggered for: Unstable (Test Failures)
Sending email for trigger: Unstable (Test Failures)
Setting ANT_1_8_2_HOME=/Users/jenkins/tools/hudson.tasks.Ant_AntInstallation/ANT_1.8.2
Setting ANT_1_8_2_HOME=/Users/jenkins/tools/hudson.tasks.Ant_AntInstallation/ANT_1.8.2
Setting ANT_1_8_2_HOME=/Users/jenkins/tools/hudson.tasks.Ant_AntInstallation/ANT_1.8.2
Setting ANT_1_8_2_HOME=/Users/jenkins/tools/hudson.tasks.Ant_AntInstallation/ANT_1.8.2

Mime
View raw message