lucene-dev mailing list archives

Site index · List index
Message view « Date » · « Thread »
Top « Date » · « Thread »
From Policeman Jenkins Server <jenk...@thetaphi.de>
Subject [JENKINS] Lucene-Solr-master-Linux (64bit/jdk-9.0.4) - Build # 22784 - Still Unstable!
Date Sat, 01 Sep 2018 19:10:31 GMT
Build: https://jenkins.thetaphi.de/job/Lucene-Solr-master-Linux/22784/
Java: 64bit/jdk-9.0.4 -XX:-UseCompressedOops -XX:+UseSerialGC

2 tests failed.
FAILED:  org.apache.solr.handler.RequestLoggingTest.testLogBeforeExecuteWithRequestLogger

Error Message:


Stack Trace:
java.lang.AssertionError
	at __randomizedtesting.SeedInfo.seed([31ABC4CD976733E6:80C2E4C23A918BA8]:0)
	at org.junit.Assert.fail(Assert.java:92)
	at org.junit.Assert.assertTrue(Assert.java:43)
	at org.junit.Assert.assertTrue(Assert.java:54)
	at org.apache.solr.handler.RequestLoggingTest.testLogBeforeExecute(RequestLoggingTest.java:88)
	at org.apache.solr.handler.RequestLoggingTest.testLogBeforeExecuteWithRequestLogger(RequestLoggingTest.java:71)
	at java.base/jdk.internal.reflect.NativeMethodAccessorImpl.invoke0(Native Method)
	at java.base/jdk.internal.reflect.NativeMethodAccessorImpl.invoke(NativeMethodAccessorImpl.java:62)
	at java.base/jdk.internal.reflect.DelegatingMethodAccessorImpl.invoke(DelegatingMethodAccessorImpl.java:43)
	at java.base/java.lang.reflect.Method.invoke(Method.java:564)
	at com.carrotsearch.randomizedtesting.RandomizedRunner.invoke(RandomizedRunner.java:1737)
	at com.carrotsearch.randomizedtesting.RandomizedRunner$8.evaluate(RandomizedRunner.java:934)
	at com.carrotsearch.randomizedtesting.RandomizedRunner$9.evaluate(RandomizedRunner.java:970)
	at com.carrotsearch.randomizedtesting.RandomizedRunner$10.evaluate(RandomizedRunner.java:984)
	at com.carrotsearch.randomizedtesting.rules.SystemPropertiesRestoreRule$1.evaluate(SystemPropertiesRestoreRule.java:57)
	at org.apache.lucene.util.TestRuleSetupTeardownChained$1.evaluate(TestRuleSetupTeardownChained.java:49)
	at org.apache.lucene.util.AbstractBeforeAfterRule$1.evaluate(AbstractBeforeAfterRule.java:45)
	at org.apache.lucene.util.TestRuleThreadAndTestName$1.evaluate(TestRuleThreadAndTestName.java:48)
	at org.apache.lucene.util.TestRuleIgnoreAfterMaxFailures$1.evaluate(TestRuleIgnoreAfterMaxFailures.java:64)
	at org.apache.lucene.util.TestRuleMarkFailure$1.evaluate(TestRuleMarkFailure.java:47)
	at com.carrotsearch.randomizedtesting.rules.StatementAdapter.evaluate(StatementAdapter.java:36)
	at com.carrotsearch.randomizedtesting.ThreadLeakControl$StatementRunner.run(ThreadLeakControl.java:368)
	at com.carrotsearch.randomizedtesting.ThreadLeakControl.forkTimeoutingTask(ThreadLeakControl.java:817)
	at com.carrotsearch.randomizedtesting.ThreadLeakControl$3.evaluate(ThreadLeakControl.java:468)
	at com.carrotsearch.randomizedtesting.RandomizedRunner.runSingleTest(RandomizedRunner.java:943)
	at com.carrotsearch.randomizedtesting.RandomizedRunner$5.evaluate(RandomizedRunner.java:829)
	at com.carrotsearch.randomizedtesting.RandomizedRunner$6.evaluate(RandomizedRunner.java:879)
	at com.carrotsearch.randomizedtesting.RandomizedRunner$7.evaluate(RandomizedRunner.java:890)
	at com.carrotsearch.randomizedtesting.rules.StatementAdapter.evaluate(StatementAdapter.java:36)
	at com.carrotsearch.randomizedtesting.rules.SystemPropertiesRestoreRule$1.evaluate(SystemPropertiesRestoreRule.java:57)
	at org.apache.lucene.util.AbstractBeforeAfterRule$1.evaluate(AbstractBeforeAfterRule.java:45)
	at com.carrotsearch.randomizedtesting.rules.StatementAdapter.evaluate(StatementAdapter.java:36)
	at org.apache.lucene.util.TestRuleStoreClassName$1.evaluate(TestRuleStoreClassName.java:41)
	at com.carrotsearch.randomizedtesting.rules.NoShadowingOrOverridesOnMethodsRule$1.evaluate(NoShadowingOrOverridesOnMethodsRule.java:40)
	at com.carrotsearch.randomizedtesting.rules.NoShadowingOrOverridesOnMethodsRule$1.evaluate(NoShadowingOrOverridesOnMethodsRule.java:40)
	at com.carrotsearch.randomizedtesting.rules.StatementAdapter.evaluate(StatementAdapter.java:36)
	at com.carrotsearch.randomizedtesting.rules.StatementAdapter.evaluate(StatementAdapter.java:36)
	at org.apache.lucene.util.TestRuleAssertionsRequired$1.evaluate(TestRuleAssertionsRequired.java:53)
	at org.apache.lucene.util.TestRuleMarkFailure$1.evaluate(TestRuleMarkFailure.java:47)
	at org.apache.lucene.util.TestRuleIgnoreAfterMaxFailures$1.evaluate(TestRuleIgnoreAfterMaxFailures.java:64)
	at org.apache.lucene.util.TestRuleIgnoreTestSuites$1.evaluate(TestRuleIgnoreTestSuites.java:54)
	at com.carrotsearch.randomizedtesting.rules.StatementAdapter.evaluate(StatementAdapter.java:36)
	at com.carrotsearch.randomizedtesting.ThreadLeakControl$StatementRunner.run(ThreadLeakControl.java:368)
	at java.base/java.lang.Thread.run(Thread.java:844)


FAILED:  org.apache.solr.handler.RequestLoggingTest.testLogBeforeExecuteWithCoreLogger

Error Message:


Stack Trace:
java.lang.AssertionError
	at __randomizedtesting.SeedInfo.seed([31ABC4CD976733E6:FD2DC44369AE5870]:0)
	at org.junit.Assert.fail(Assert.java:92)
	at org.junit.Assert.assertTrue(Assert.java:43)
	at org.junit.Assert.assertTrue(Assert.java:54)
	at org.apache.solr.handler.RequestLoggingTest.testLogBeforeExecute(RequestLoggingTest.java:88)
	at org.apache.solr.handler.RequestLoggingTest.testLogBeforeExecuteWithCoreLogger(RequestLoggingTest.java:65)
	at java.base/jdk.internal.reflect.NativeMethodAccessorImpl.invoke0(Native Method)
	at java.base/jdk.internal.reflect.NativeMethodAccessorImpl.invoke(NativeMethodAccessorImpl.java:62)
	at java.base/jdk.internal.reflect.DelegatingMethodAccessorImpl.invoke(DelegatingMethodAccessorImpl.java:43)
	at java.base/java.lang.reflect.Method.invoke(Method.java:564)
	at com.carrotsearch.randomizedtesting.RandomizedRunner.invoke(RandomizedRunner.java:1737)
	at com.carrotsearch.randomizedtesting.RandomizedRunner$8.evaluate(RandomizedRunner.java:934)
	at com.carrotsearch.randomizedtesting.RandomizedRunner$9.evaluate(RandomizedRunner.java:970)
	at com.carrotsearch.randomizedtesting.RandomizedRunner$10.evaluate(RandomizedRunner.java:984)
	at com.carrotsearch.randomizedtesting.rules.SystemPropertiesRestoreRule$1.evaluate(SystemPropertiesRestoreRule.java:57)
	at org.apache.lucene.util.TestRuleSetupTeardownChained$1.evaluate(TestRuleSetupTeardownChained.java:49)
	at org.apache.lucene.util.AbstractBeforeAfterRule$1.evaluate(AbstractBeforeAfterRule.java:45)
	at org.apache.lucene.util.TestRuleThreadAndTestName$1.evaluate(TestRuleThreadAndTestName.java:48)
	at org.apache.lucene.util.TestRuleIgnoreAfterMaxFailures$1.evaluate(TestRuleIgnoreAfterMaxFailures.java:64)
	at org.apache.lucene.util.TestRuleMarkFailure$1.evaluate(TestRuleMarkFailure.java:47)
	at com.carrotsearch.randomizedtesting.rules.StatementAdapter.evaluate(StatementAdapter.java:36)
	at com.carrotsearch.randomizedtesting.ThreadLeakControl$StatementRunner.run(ThreadLeakControl.java:368)
	at com.carrotsearch.randomizedtesting.ThreadLeakControl.forkTimeoutingTask(ThreadLeakControl.java:817)
	at com.carrotsearch.randomizedtesting.ThreadLeakControl$3.evaluate(ThreadLeakControl.java:468)
	at com.carrotsearch.randomizedtesting.RandomizedRunner.runSingleTest(RandomizedRunner.java:943)
	at com.carrotsearch.randomizedtesting.RandomizedRunner$5.evaluate(RandomizedRunner.java:829)
	at com.carrotsearch.randomizedtesting.RandomizedRunner$6.evaluate(RandomizedRunner.java:879)
	at com.carrotsearch.randomizedtesting.RandomizedRunner$7.evaluate(RandomizedRunner.java:890)
	at com.carrotsearch.randomizedtesting.rules.StatementAdapter.evaluate(StatementAdapter.java:36)
	at com.carrotsearch.randomizedtesting.rules.SystemPropertiesRestoreRule$1.evaluate(SystemPropertiesRestoreRule.java:57)
	at org.apache.lucene.util.AbstractBeforeAfterRule$1.evaluate(AbstractBeforeAfterRule.java:45)
	at com.carrotsearch.randomizedtesting.rules.StatementAdapter.evaluate(StatementAdapter.java:36)
	at org.apache.lucene.util.TestRuleStoreClassName$1.evaluate(TestRuleStoreClassName.java:41)
	at com.carrotsearch.randomizedtesting.rules.NoShadowingOrOverridesOnMethodsRule$1.evaluate(NoShadowingOrOverridesOnMethodsRule.java:40)
	at com.carrotsearch.randomizedtesting.rules.NoShadowingOrOverridesOnMethodsRule$1.evaluate(NoShadowingOrOverridesOnMethodsRule.java:40)
	at com.carrotsearch.randomizedtesting.rules.StatementAdapter.evaluate(StatementAdapter.java:36)
	at com.carrotsearch.randomizedtesting.rules.StatementAdapter.evaluate(StatementAdapter.java:36)
	at org.apache.lucene.util.TestRuleAssertionsRequired$1.evaluate(TestRuleAssertionsRequired.java:53)
	at org.apache.lucene.util.TestRuleMarkFailure$1.evaluate(TestRuleMarkFailure.java:47)
	at org.apache.lucene.util.TestRuleIgnoreAfterMaxFailures$1.evaluate(TestRuleIgnoreAfterMaxFailures.java:64)
	at org.apache.lucene.util.TestRuleIgnoreTestSuites$1.evaluate(TestRuleIgnoreTestSuites.java:54)
	at com.carrotsearch.randomizedtesting.rules.StatementAdapter.evaluate(StatementAdapter.java:36)
	at com.carrotsearch.randomizedtesting.ThreadLeakControl$StatementRunner.run(ThreadLeakControl.java:368)
	at java.base/java.lang.Thread.run(Thread.java:844)




Build Log:
[...truncated 14457 lines...]
   [junit4] Suite: org.apache.solr.handler.RequestLoggingTest
   [junit4]   2> Creating dataDir: /home/jenkins/workspace/Lucene-Solr-master-Linux/solr/build/solr-core/test/J1/temp/solr.handler.RequestLoggingTest_31ABC4CD976733E6-001/init-core-data-001
   [junit4]   2> 2800306 WARN  (SUITE-RequestLoggingTest-seed#[31ABC4CD976733E6]-worker) [    ] o.a.s.SolrTestCaseJ4 startTrackingSearchers: numOpens=3 numCloses=3
   [junit4]   2> 2800306 INFO  (SUITE-RequestLoggingTest-seed#[31ABC4CD976733E6]-worker) [    ] o.a.s.SolrTestCaseJ4 Using PointFields (NUMERIC_POINTS_SYSPROP=true) w/NUMERIC_DOCVALUES_SYSPROP=true
   [junit4]   2> 2800306 INFO  (SUITE-RequestLoggingTest-seed#[31ABC4CD976733E6]-worker) [    ] o.a.s.SolrTestCaseJ4 Randomized ssl (false) and clientAuth (true) via: @org.apache.solr.util.RandomizeSSL(reason="", ssl=0.0/0.0, value=0.0/0.0, clientAuth=0.0/0.0)
   [junit4]   2> 2800306 INFO  (SUITE-RequestLoggingTest-seed#[31ABC4CD976733E6]-worker) [    ] o.a.s.SolrTestCaseJ4 SecureRandom sanity checks: test.solr.allowed.securerandom=null & java.security.egd=file:/dev/./urandom
   [junit4]   2> 2800307 INFO  (SUITE-RequestLoggingTest-seed#[31ABC4CD976733E6]-worker) [    ] o.a.s.SolrTestCaseJ4 ####initCore
   [junit4]   2> 2800307 INFO  (SUITE-RequestLoggingTest-seed#[31ABC4CD976733E6]-worker) [    ] o.a.s.c.SolrResourceLoader [null] Added 2 libs to classloader, from paths: [/home/jenkins/workspace/Lucene-Solr-master-Linux/solr/core/src/test-files/solr/collection1/lib, /home/jenkins/workspace/Lucene-Solr-master-Linux/solr/core/src/test-files/solr/collection1/lib/classes]
   [junit4]   2> 2800324 INFO  (SUITE-RequestLoggingTest-seed#[31ABC4CD976733E6]-worker) [    ] o.a.s.c.SolrConfig Using Lucene MatchVersion: 8.0.0
   [junit4]   2> 2800339 INFO  (SUITE-RequestLoggingTest-seed#[31ABC4CD976733E6]-worker) [    ] o.a.s.s.IndexSchema [null] Schema name=test
   [junit4]   2> 2800423 INFO  (SUITE-RequestLoggingTest-seed#[31ABC4CD976733E6]-worker) [    ] o.a.s.s.IndexSchema Loaded schema test/1.0 with uniqueid field id
   [junit4]   2> 2800482 INFO  (SUITE-RequestLoggingTest-seed#[31ABC4CD976733E6]-worker) [    ] o.a.s.c.TransientSolrCoreCacheDefault Allocating transient cache for 2147483647 transient cores
   [junit4]   2> 2800482 INFO  (SUITE-RequestLoggingTest-seed#[31ABC4CD976733E6]-worker) [    ] o.a.s.h.a.MetricsHistoryHandler No .system collection, keeping metrics history in memory.
   [junit4]   2> 2800490 INFO  (SUITE-RequestLoggingTest-seed#[31ABC4CD976733E6]-worker) [    ] o.a.s.m.r.SolrJmxReporter JMX monitoring for 'solr.node' (registry 'solr.node') enabled at server: com.sun.jmx.mbeanserver.JmxMBeanServer@7f171b4d
   [junit4]   2> 2800495 INFO  (SUITE-RequestLoggingTest-seed#[31ABC4CD976733E6]-worker) [    ] o.a.s.m.r.SolrJmxReporter JMX monitoring for 'solr.jvm' (registry 'solr.jvm') enabled at server: com.sun.jmx.mbeanserver.JmxMBeanServer@7f171b4d
   [junit4]   2> 2800495 INFO  (SUITE-RequestLoggingTest-seed#[31ABC4CD976733E6]-worker) [    ] o.a.s.m.r.SolrJmxReporter JMX monitoring for 'solr.jetty' (registry 'solr.jetty') enabled at server: com.sun.jmx.mbeanserver.JmxMBeanServer@7f171b4d
   [junit4]   2> 2800496 INFO  (coreLoadExecutor-7600-thread-1) [    x:collection1] o.a.s.c.SolrResourceLoader [null] Added 2 libs to classloader, from paths: [/home/jenkins/workspace/Lucene-Solr-master-Linux/solr/core/src/test-files/solr/collection1/lib, /home/jenkins/workspace/Lucene-Solr-master-Linux/solr/core/src/test-files/solr/collection1/lib/classes]
   [junit4]   2> 2800511 INFO  (coreLoadExecutor-7600-thread-1) [    x:collection1] o.a.s.c.SolrConfig Using Lucene MatchVersion: 8.0.0
   [junit4]   2> 2800534 INFO  (coreLoadExecutor-7600-thread-1) [    x:collection1] o.a.s.s.IndexSchema [collection1] Schema name=test
   [junit4]   2> 2800607 INFO  (coreLoadExecutor-7600-thread-1) [    x:collection1] o.a.s.s.IndexSchema Loaded schema test/1.0 with uniqueid field id
   [junit4]   2> 2800611 INFO  (coreLoadExecutor-7600-thread-1) [    x:collection1] o.a.s.c.CoreContainer Creating SolrCore 'collection1' using configuration from instancedir /home/jenkins/workspace/Lucene-Solr-master-Linux/solr/core/src/test-files/solr/collection1, trusted=true
   [junit4]   2> 2800612 INFO  (coreLoadExecutor-7600-thread-1) [    x:collection1] o.a.s.m.r.SolrJmxReporter JMX monitoring for 'solr.core.collection1' (registry 'solr.core.collection1') enabled at server: com.sun.jmx.mbeanserver.JmxMBeanServer@7f171b4d
   [junit4]   2> 2800612 INFO  (coreLoadExecutor-7600-thread-1) [    x:collection1] o.a.s.c.SolrCore solr.RecoveryStrategy.Builder
   [junit4]   2> 2800612 INFO  (coreLoadExecutor-7600-thread-1) [    x:collection1] o.a.s.c.SolrCore [[collection1] ] Opening new SolrCore at [/home/jenkins/workspace/Lucene-Solr-master-Linux/solr/core/src/test-files/solr/collection1], dataDir=[/home/jenkins/workspace/Lucene-Solr-master-Linux/solr/build/solr-core/test/J1/temp/solr.handler.RequestLoggingTest_31ABC4CD976733E6-001/init-core-data-001/]
   [junit4]   2> 2800612 INFO  (coreLoadExecutor-7600-thread-1) [    x:collection1] o.a.s.u.RandomMergePolicy RandomMergePolicy wrapping class org.apache.lucene.index.TieredMergePolicy: [TieredMergePolicy: maxMergeAtOnce=44, maxMergeAtOnceExplicit=42, maxMergedSegmentMB=95.2001953125, floorSegmentMB=0.521484375, forceMergeDeletesPctAllowed=13.526535681917442, segmentsPerTier=44.0, maxCFSSegmentSizeMB=8.796093022207999E12, noCFSRatio=1.0, deletesPctAllowed=47.86223611019982
   [junit4]   2> 2800648 INFO  (coreLoadExecutor-7600-thread-1) [    x:collection1] o.a.s.u.UpdateHandler Using UpdateLog implementation: org.apache.solr.update.UpdateLog
   [junit4]   2> 2800648 INFO  (coreLoadExecutor-7600-thread-1) [    x:collection1] o.a.s.u.UpdateLog Initializing UpdateLog: dataDir= defaultSyncLevel=FLUSH numRecordsToKeep=100 maxNumLogsToKeep=10 numVersionBuckets=65536
   [junit4]   2> 2800649 INFO  (coreLoadExecutor-7600-thread-1) [    x:collection1] o.a.s.u.CommitTracker Hard AutoCommit: disabled
   [junit4]   2> 2800649 INFO  (coreLoadExecutor-7600-thread-1) [    x:collection1] o.a.s.u.CommitTracker Soft AutoCommit: disabled
   [junit4]   2> 2800649 INFO  (coreLoadExecutor-7600-thread-1) [    x:collection1] o.a.s.u.RandomMergePolicy RandomMergePolicy wrapping class org.apache.lucene.index.TieredMergePolicy: [TieredMergePolicy: maxMergeAtOnce=30, maxMergeAtOnceExplicit=27, maxMergedSegmentMB=14.1865234375, floorSegmentMB=1.3583984375, forceMergeDeletesPctAllowed=6.377601712291144, segmentsPerTier=37.0, maxCFSSegmentSizeMB=8.796093022207999E12, noCFSRatio=0.4598870128163458, deletesPctAllowed=37.64695668848309
   [junit4]   2> 2800649 INFO  (coreLoadExecutor-7600-thread-1) [    x:collection1] o.a.s.s.SolrIndexSearcher Opening [Searcher@482071ef[collection1] main]
   [junit4]   2> 2800650 INFO  (coreLoadExecutor-7600-thread-1) [    x:collection1] o.a.s.h.c.SpellCheckComponent Initializing spell checkers
   [junit4]   2> 2800709 INFO  (coreLoadExecutor-7600-thread-1) [    x:collection1] o.a.s.s.DirectSolrSpellChecker init: {name=direct,classname=DirectSolrSpellChecker,field=lowerfilt,minQueryLength=3}
   [junit4]   2> 2800981 INFO  (coreLoadExecutor-7600-thread-1) [    x:collection1] o.a.s.h.ReplicationHandler Commits will be reserved for 10000ms.
   [junit4]   2> 2800981 INFO  (coreLoadExecutor-7600-thread-1) [    x:collection1] o.a.s.u.UpdateLog Could not find max version in index or recent updates, using new clock 1610431879394099200
   [junit4]   2> 2800983 INFO  (searcherExecutor-7601-thread-1-processing-x:collection1) [    x:collection1] o.a.s.h.c.SpellCheckComponent Loading spell index for spellchecker: default
   [junit4]   2> 2800983 INFO  (searcherExecutor-7601-thread-1-processing-x:collection1) [    x:collection1] o.a.s.h.c.SpellCheckComponent Loading spell index for spellchecker: direct
   [junit4]   2> 2800983 INFO  (searcherExecutor-7601-thread-1-processing-x:collection1) [    x:collection1] o.a.s.h.c.SpellCheckComponent Loading spell index for spellchecker: wordbreak
   [junit4]   2> 2800983 INFO  (searcherExecutor-7601-thread-1-processing-x:collection1) [    x:collection1] o.a.s.h.c.SpellCheckComponent Loading spell index for spellchecker: multipleFields
   [junit4]   2> 2800984 INFO  (searcherExecutor-7601-thread-1-processing-x:collection1) [    x:collection1] o.a.s.h.c.SpellCheckComponent Loading spell index for spellchecker: jarowinkler
   [junit4]   2> 2800984 INFO  (SUITE-RequestLoggingTest-seed#[31ABC4CD976733E6]-worker) [    ] o.a.s.SolrTestCaseJ4 ####initCore end
   [junit4]   2> 2800984 INFO  (searcherExecutor-7601-thread-1-processing-x:collection1) [    x:collection1] o.a.s.h.c.SpellCheckComponent Loading spell index for spellchecker: external
   [junit4]   2> 2800984 INFO  (searcherExecutor-7601-thread-1-processing-x:collection1) [    x:collection1] o.a.s.h.c.SpellCheckComponent Loading spell index for spellchecker: freq
   [junit4]   2> 2800985 INFO  (TEST-RequestLoggingTest.testLogBeforeExecuteWithCoreLogger-seed#[31ABC4CD976733E6]) [    ] o.a.s.SolrTestCaseJ4 ###Starting testLogBeforeExecuteWithCoreLogger
   [junit4]   2> 2800994 DEBUG (TEST-RequestLoggingTest.testLogBeforeExecuteWithCoreLogger-seed#[31ABC4CD976733E6]) [    ] o.a.s.c.S.Request [collection1]  webapp=null path=null params={q=*:*&wt=xml}
   [junit4]   2> 2800994 DEBUG (TEST-RequestLoggingTest.testLogBeforeExecuteWithCoreLogger-seed#[31ABC4CD976733E6]) [    ] o.a.s.h.c.SearchHandler Adding  component:org.apache.solr.handler.component.QueryComponent@1e5b33da
   [junit4]   2> 2800994 DEBUG (TEST-RequestLoggingTest.testLogBeforeExecuteWithCoreLogger-seed#[31ABC4CD976733E6]) [    ] o.a.s.h.c.SearchHandler Adding  component:org.apache.solr.handler.component.FacetComponent@fbd07c4
   [junit4]   2> 2800994 DEBUG (TEST-RequestLoggingTest.testLogBeforeExecuteWithCoreLogger-seed#[31ABC4CD976733E6]) [    ] o.a.s.h.c.SearchHandler Adding  component:org.apache.solr.search.facet.FacetModule@7b9a40b6
   [junit4]   2> 2800994 DEBUG (TEST-RequestLoggingTest.testLogBeforeExecuteWithCoreLogger-seed#[31ABC4CD976733E6]) [    ] o.a.s.h.c.SearchHandler Adding  component:org.apache.solr.handler.component.MoreLikeThisComponent@7b3276c3
   [junit4]   2> 2800994 DEBUG (TEST-RequestLoggingTest.testLogBeforeExecuteWithCoreLogger-seed#[31ABC4CD976733E6]) [    ] o.a.s.h.c.SearchHandler Adding  component:org.apache.solr.handler.component.HighlightComponent@3c304f9c
   [junit4]   2> 2800994 DEBUG (TEST-RequestLoggingTest.testLogBeforeExecuteWithCoreLogger-seed#[31ABC4CD976733E6]) [    ] o.a.s.h.c.SearchHandler Adding  component:org.apache.solr.handler.component.StatsComponent@5bd4ecf9
   [junit4]   2> 2800994 DEBUG (TEST-RequestLoggingTest.testLogBeforeExecuteWithCoreLogger-seed#[31ABC4CD976733E6]) [    ] o.a.s.h.c.SearchHandler Adding  component:org.apache.solr.handler.component.ExpandComponent@726288c5
   [junit4]   2> 2800994 DEBUG (TEST-RequestLoggingTest.testLogBeforeExecuteWithCoreLogger-seed#[31ABC4CD976733E6]) [    ] o.a.s.h.c.SearchHandler Adding  component:org.apache.solr.handler.component.TermsComponent@1a8e6c24
   [junit4]   2> 2800994 DEBUG (TEST-RequestLoggingTest.testLogBeforeExecuteWithCoreLogger-seed#[31ABC4CD976733E6]) [    ] o.a.s.h.c.SearchHandler Adding  debug component:org.apache.solr.handler.component.DebugComponent@247c8c46
   [junit4]   2> 2800994 DEBUG (TEST-RequestLoggingTest.testLogBeforeExecuteWithCoreLogger-seed#[31ABC4CD976733E6]) [    ] o.a.s.h.c.QueryComponent process: q=*:*&df=text&wt=xml&indent=off
   [junit4]   2> 2800994 DEBUG (TEST-RequestLoggingTest.testLogBeforeExecuteWithCoreLogger-seed#[31ABC4CD976733E6]) [    ] o.a.s.s.s.LocalStatsCache ## GET LocalSolrQueryRequest{q=*:*&df=text&wt=xml&indent=off}
   [junit4]   2> 2800994 INFO  (searcherExecutor-7601-thread-1-processing-x:collection1) [    x:collection1] o.a.s.h.c.SpellCheckComponent Loading spell index for spellchecker: fqcn
   [junit4]   2> 2801012 INFO  (searcherExecutor-7601-thread-1-processing-x:collection1) [    x:collection1] o.a.s.h.c.SpellCheckComponent Loading spell index for spellchecker: perDict
   [junit4]   2> 2801012 DEBUG (searcherExecutor-7601-thread-1-processing-x:collection1) [    x:collection1] o.a.s.m.r.j.JmxMetricsReporter ## registered solr:category=CACHE,dom1=core,dom2=collection1,name=fieldValueCache,scope=searcher, tag=1d8f4bb5
   [junit4]   2> 2801013 DEBUG (searcherExecutor-7601-thread-1-processing-x:collection1) [    x:collection1] o.a.s.m.r.j.JmxMetricsReporter ## registered solr:category=CACHE,dom1=core,dom2=collection1,name=filterCache,scope=searcher, tag=1d8f4bb5
   [junit4]   2> 2801013 DEBUG (searcherExecutor-7601-thread-1-processing-x:collection1) [    x:collection1] o.a.s.m.r.j.JmxMetricsReporter ## registered solr:category=CACHE,dom1=core,dom2=collection1,name=queryResultCache,scope=searcher, tag=1d8f4bb5
   [junit4]   2> 2801013 DEBUG (searcherExecutor-7601-thread-1-processing-x:collection1) [    x:collection1] o.a.s.m.r.j.JmxMetricsReporter ## registered solr:category=CACHE,dom1=core,dom2=collection1,name=documentCache,scope=searcher, tag=1d8f4bb5
   [junit4]   2> 2801013 DEBUG (searcherExecutor-7601-thread-1-processing-x:collection1) [    x:collection1] o.a.s.m.r.j.JmxMetricsReporter ## registered solr:category=CACHE,dom1=core,dom2=collection1,name=perSegFilter,scope=searcher, tag=1d8f4bb5
   [junit4]   2> 2801013 DEBUG (searcherExecutor-7601-thread-1-processing-x:collection1) [    x:collection1] o.a.s.m.r.j.JmxMetricsReporter ## registered solr:category=SEARCHER,dom1=core,dom2=collection1,name=searcherName,scope=searcher, tag=1d8f4bb5
   [junit4]   2> 2801013 DEBUG (searcherExecutor-7601-thread-1-processing-x:collection1) [    x:collection1] o.a.s.m.r.j.JmxMetricsReporter ## registered solr:category=SEARCHER,dom1=core,dom2=collection1,name=caching,scope=searcher, tag=1d8f4bb5
   [junit4]   2> 2801013 DEBUG (searcherExecutor-7601-thread-1-processing-x:collection1) [    x:collection1] o.a.s.m.r.j.JmxMetricsReporter ## registered solr:category=SEARCHER,dom1=core,dom2=collection1,name=openedAt,scope=searcher, tag=1d8f4bb5
   [junit4]   2> 2801013 DEBUG (searcherExecutor-7601-thread-1-processing-x:collection1) [    x:collection1] o.a.s.m.r.j.JmxMetricsReporter ## registered solr:category=SEARCHER,dom1=core,dom2=collection1,name=warmupTime,scope=searcher, tag=1d8f4bb5
   [junit4]   2> 2801013 DEBUG (searcherExecutor-7601-thread-1-processing-x:collection1) [    x:collection1] o.a.s.m.r.j.JmxMetricsReporter ## registered solr:category=SEARCHER,dom1=core,dom2=collection1,name=registeredAt,scope=searcher, tag=1d8f4bb5
   [junit4]   2> 2801027 DEBUG (searcherExecutor-7601-thread-1-processing-x:collection1) [    x:collection1] o.a.s.m.r.j.JmxMetricsReporter ## registered solr:category=SEARCHER,dom1=core,dom2=collection1,name=numDocs,scope=searcher, tag=1d8f4bb5
   [junit4]   2> 2801027 DEBUG (searcherExecutor-7601-thread-1-processing-x:collection1) [    x:collection1] o.a.s.m.r.j.JmxMetricsReporter ## registered solr:category=SEARCHER,dom1=core,dom2=collection1,name=maxDoc,scope=searcher, tag=1d8f4bb5
   [junit4]   2> 2801028 DEBUG (searcherExecutor-7601-thread-1-processing-x:collection1) [    x:collection1] o.a.s.m.r.j.JmxMetricsReporter ## registered solr:category=SEARCHER,dom1=core,dom2=collection1,name=deletedDocs,scope=searcher, tag=1d8f4bb5
   [junit4]   2> 2801028 DEBUG (searcherExecutor-7601-thread-1-processing-x:collection1) [    x:collection1] o.a.s.m.r.j.JmxMetricsReporter ## registered solr:category=SEARCHER,dom1=core,dom2=collection1,name=reader,scope=searcher, tag=1d8f4bb5
   [junit4]   2> 2801028 DEBUG (searcherExecutor-7601-thread-1-processing-x:collection1) [    x:collection1] o.a.s.m.r.j.JmxMetricsReporter ## registered solr:category=SEARCHER,dom1=core,dom2=collection1,name=readerDir,scope=searcher, tag=1d8f4bb5
   [junit4]   2> 2801028 DEBUG (searcherExecutor-7601-thread-1-processing-x:collection1) [    x:collection1] o.a.s.m.r.j.JmxMetricsReporter ## registered solr:category=SEARCHER,dom1=core,dom2=collection1,name=indexVersion,scope=searcher, tag=1d8f4bb5
   [junit4]   2> 2801028 INFO  (searcherExecutor-7601-thread-1-processing-x:collection1) [    x:collection1] o.a.s.c.SolrCore [collection1] Registered new searcher Searcher@482071ef[collection1] main{ExitableDirectoryReader(UninvertingDirectoryReader())}
   [junit4]   2> 2801028 INFO  (TEST-RequestLoggingTest.testLogBeforeExecuteWithCoreLogger-seed#[31ABC4CD976733E6]) [    ] o.a.s.c.S.Request [collection1]  webapp=null path=null params={q=*:*&wt=xml} hits=0 status=0 QTime=33
   [junit4]   2> 2801032 INFO  (TEST-RequestLoggingTest.testLogBeforeExecuteWithCoreLogger-seed#[31ABC4CD976733E6]) [    ] o.a.s.SolrTestCaseJ4 ###Ending testLogBeforeExecuteWithCoreLogger
   [junit4]   2> 2801034 INFO  (TEST-RequestLoggingTest.testLogBeforeExecuteWithRequestLogger-seed#[31ABC4CD976733E6]) [    ] o.a.s.SolrTestCaseJ4 ###Starting testLogBeforeExecuteWithRequestLogger
   [junit4]   2> 2801036 DEBUG (TEST-RequestLoggingTest.testLogBeforeExecuteWithRequestLogger-seed#[31ABC4CD976733E6]) [    ] o.a.s.c.S.Request [collection1]  webapp=null path=null params={q=*:*&wt=xml}
   [junit4]   2> 2801036 DEBUG (TEST-RequestLoggingTest.testLogBeforeExecuteWithRequestLogger-seed#[31ABC4CD976733E6]) [    ] o.a.s.h.c.QueryComponent process: q=*:*&df=text&wt=xml&indent=off
   [junit4]   2> 2801036 DEBUG (TEST-RequestLoggingTest.testLogBeforeExecuteWithRequestLogger-seed#[31ABC4CD976733E6]) [    ] o.a.s.s.s.LocalStatsCache ## GET LocalSolrQueryRequest{q=*:*&df=text&wt=xml&indent=off}
   [junit4]   2> 2801036 INFO  (TEST-RequestLoggingTest.testLogBeforeExecuteWithRequestLogger-seed#[31ABC4CD976733E6]) [    ] o.a.s.c.S.Request [collection1]  webapp=null path=null params={q=*:*&wt=xml} hits=0 status=0 QTime=0
   [junit4]   2> 2801040 INFO  (TEST-RequestLoggingTest.testLogBeforeExecuteWithRequestLogger-seed#[31ABC4CD976733E6]) [    ] o.a.s.SolrTestCaseJ4 ###Ending testLogBeforeExecuteWithRequestLogger
   [junit4]   2> NOTE: reproduce with: ant test  -Dtestcase=RequestLoggingTest -Dtests.method=testLogBeforeExecuteWithRequestLogger -Dtests.seed=31ABC4CD976733E6 -Dtests.multiplier=3 -Dtests.slow=true -Dtests.locale=mk -Dtests.timezone=SystemV/HST10 -Dtests.asserts=true -Dtests.file.encoding=UTF-8
   [junit4] FAILURE 0.01s J1 | RequestLoggingTest.testLogBeforeExecuteWithRequestLogger <<<
   [junit4]    > Throwable #1: java.lang.AssertionError
   [junit4]    > 	at __randomizedtesting.SeedInfo.seed([31ABC4CD976733E6:80C2E4C23A918BA8]:0)
   [junit4]    > 	at org.apache.solr.handler.RequestLoggingTest.testLogBeforeExecute(RequestLoggingTest.java:88)
   [junit4]    > 	at org.apache.solr.handler.RequestLoggingTest.testLogBeforeExecuteWithRequestLogger(RequestLoggingTest.java:71)
   [junit4]    > 	at java.base/jdk.internal.reflect.NativeMethodAccessorImpl.invoke0(Native Method)
   [junit4]    > 	at java.base/jdk.internal.reflect.NativeMethodAccessorImpl.invoke(NativeMethodAccessorImpl.java:62)
   [junit4]    > 	at java.base/jdk.internal.reflect.DelegatingMethodAccessorImpl.invoke(DelegatingMethodAccessorImpl.java:43)
   [junit4]    > 	at java.base/java.lang.reflect.Method.invoke(Method.java:564)
   [junit4]    > 	at java.base/java.lang.Thread.run(Thread.java:844)
   [junit4]   2> 2801041 INFO  (SUITE-RequestLoggingTest-seed#[31ABC4CD976733E6]-worker) [    ] o.a.s.SolrTestCaseJ4 ###deleteCore
   [junit4]   2> 2801041 INFO  (SUITE-RequestLoggingTest-seed#[31ABC4CD976733E6]-worker) [    ] o.a.s.c.CoreContainer Shutting down CoreContainer instance=848752263
   [junit4]   2> 2801041 INFO  (SUITE-RequestLoggingTest-seed#[31ABC4CD976733E6]-worker) [    ] o.a.s.m.SolrMetricManager Closing metric reporters for registry=solr.node, tag=null
   [junit4]   2> 2801041 INFO  (SUITE-RequestLoggingTest-seed#[31ABC4CD976733E6]-worker) [    ] o.a.s.m.r.SolrJmxReporter Closing reporter [org.apache.solr.metrics.reporters.SolrJmxReporter@22f4c8d5: rootName = null, domain = solr.node, service url = null, agent id = null] for registry solr.node / com.codahale.metrics.MetricRegistry@60bce44e
   [junit4]   2> 2801052 INFO  (SUITE-RequestLoggingTest-seed#[31ABC4CD976733E6]-worker) [    ] o.a.s.m.SolrMetricManager Closing metric reporters for registry=solr.jvm, tag=null
   [junit4]   2> 2801060 INFO  (SUITE-RequestLoggingTest-seed#[31ABC4CD976733E6]-worker) [    ] o.a.s.m.r.SolrJmxReporter Closing reporter [org.apache.solr.metrics.reporters.SolrJmxReporter@3c2ae75e: rootName = null, domain = solr.jvm, service url = null, agent id = null] for registry solr.jvm / com.codahale.metrics.MetricRegistry@5bdfec10
   [junit4]   2> 2801062 INFO  (SUITE-RequestLoggingTest-seed#[31ABC4CD976733E6]-worker) [    ] o.a.s.m.SolrMetricManager Closing metric reporters for registry=solr.jetty, tag=null
   [junit4]   2> 2801064 INFO  (SUITE-RequestLoggingTest-seed#[31ABC4CD976733E6]-worker) [    ] o.a.s.m.r.SolrJmxReporter Closing reporter [org.apache.solr.metrics.reporters.SolrJmxReporter@45aadc17: rootName = null, domain = solr.jetty, service url = null, agent id = null] for registry solr.jetty / com.codahale.metrics.MetricRegistry@261a3082
   [junit4]   2> 2801072 INFO  (coreCloseExecutor-7606-thread-1) [    x:collection1] o.a.s.c.SolrCore [collection1]  CLOSING SolrCore org.apache.solr.core.SolrCore@7476fcc0
   [junit4]   2> 2801072 INFO  (coreCloseExecutor-7606-thread-1) [    x:collection1] o.a.s.m.SolrMetricManager Closing metric reporters for registry=solr.core.collection1, tag=7476fcc0
   [junit4]   2> 2801072 INFO  (coreCloseExecutor-7606-thread-1) [    x:collection1] o.a.s.m.r.SolrJmxReporter Closing reporter [org.apache.solr.metrics.reporters.SolrJmxReporter@1d8f4bb5: rootName = null, domain = solr.core.collection1, service url = null, agent id = null] for registry solr.core.collection1 / com.codahale.metrics.MetricRegistry@7ec0912e
   [junit4]   2> NOTE: leaving temporary files on disk at: /home/jenkins/workspace/Lucene-Solr-master-Linux/solr/build/solr-core/test/J1/temp/solr.handler.RequestLoggingTest_31ABC4CD976733E6-001
   [junit4]   2> NOTE: test params are: codec=Asserting(Lucene80): {}, docValues:{}, maxPointsInLeafNode=1893, maxMBSortInHeap=7.177134113675933, sim=Asserting(org.apache.lucene.search.similarities.AssertingSimilarity@6249b85a), locale=mk, timezone=SystemV/HST10
   [junit4]   2> NOTE: Linux 4.15.0-32-generic amd64/Oracle Corporation 9.0.4 (64-bit)/cpus=8,threads=1,free=186441888,total=518979584
   [junit4]   2> NOTE: All tests run in this JVM: [IndexSchemaRuntimeFieldTest, TestJsonFacetsWithNestedObjects, MetricsHandlerTest, HdfsCollectionsAPIDistributedZkTest, DistributedTermsComponentTest, TestLegacyTerms, TestPartialUpdateDeduplication, StressHdfsTest, URLClassifyProcessorTest, TestUnifiedSolrHighlighter, TestFieldCacheSort, TestLMDirichletSimilarityFactory, ZkControllerTest, TestTolerantUpdateProcessorRandomCloud, ComputePlanActionTest, TestRealTimeGet, TestCloudRecovery, DistributedMLTComponentTest, TestXIncludeConfig, TestSolrConfigHandlerCloud, TestHashPartitioner, SpatialRPTFieldTypeTest, TestConfigSetImmutable, TriggerEventQueueTest, TestBlendedInfixSuggestions, TestTolerantSearch, ActionThrottleTest, TestCloudJSONFacetSKG, TestSchemalessBufferedUpdates, DocValuesNotIndexedTest, TestManagedResource, TermVectorComponentDistributedTest, ResponseHeaderTest, ShardRoutingTest, PeerSyncWithLeaderAndIndexFingerprintCachingTest, TestTestInjection, TestSimpleTextCodec, TestSimClusterStateProvider, SolrGangliaReporterTest, SolrCmdDistributorTest, TestLegacyField, HttpTriggerListenerTest, TestCodecSupport, TestValueSourceCache, TestHighlightDedupGrouping, DistributedFacetPivotSmallAdvancedTest, MetricTriggerTest, ParsingFieldUpdateProcessorsTest, SimpleMLTQParserTest, BadIndexSchemaTest, TestExactSharedStatsCache, LargeFieldTest, TestSegmentSorting, XsltUpdateRequestHandlerTest, StatsComponentTest, TestAuthorizationFramework, TestMaxTokenLenTokenizer, TestDistributedSearch, UpdateRequestProcessorFactoryTest, TestZkChroot, BasicAuthIntegrationTest, XmlInterpolationTest, TestRangeQuery, LegacyCloudClusterPropTest, PreAnalyzedFieldTest, TestMinMaxOnMultiValuedField, TestRestoreCore, TestCloudNestedDocsSort, SimplePostToolTest, TestConfigReload, HighlighterMaxOffsetTest, BigEndianAscendingWordDeserializerTest, SchemaApiFailureTest, ProtectedTermFilterFactoryTest, SuggesterFSTTest, TestAddFieldRealTimeGet, V2ApiIntegrationTest, TestCloudDeleteByQuery, TestStressRecovery, TestRebalanceLeaders, BasicFunctionalityTest, LeaderElectionIntegrationTest, OpenExchangeRatesOrgProviderTest, LIROnShardRestartTest, NodeMutatorTest, SmileWriterTest, TestFuzzyAnalyzedSuggestions, ChaosMonkeyNothingIsSafeWithPullReplicasTest, BasicDistributedZkTest, ClassificationUpdateProcessorIntegrationTest, TestMaxScoreQueryParser, MissingSegmentRecoveryTest, HdfsDirectoryTest, StatsReloadRaceTest, TestHashQParserPlugin, SyncSliceTest, TestSearcherReuse, SuggesterWFSTTest, DisMaxRequestHandlerTest, MultiTermTest, RemoteQueryErrorTest, SignificantTermsQParserPluginTest, UtilsToolTest, DirectUpdateHandlerTest, TestFiltering, TestOnReconnectListenerSupport, TestStressVersions, CoreAdminRequestStatusTest, ZkStateWriterTest, DirectSolrSpellCheckerTest, AnalysisErrorHandlingTest, TestComplexPhraseQParserPlugin, PeerSyncTest, TestPullReplicaErrorHandling, AnalyticsQueryTest, TestSolr4Spatial, TestOmitPositions, CreateRoutedAliasTest, SolrJmxReporterTest, OverseerCollectionConfigSetProcessorTest, DistanceFunctionTest, TestFieldCacheWithThreads, DateRangeFieldTest, TestUseDocValuesAsStored2, DeleteStatusTest, TestSolrCloudWithHadoopAuthPlugin, TestQuerySenderNoQuery, TestDynamicFieldResource, MinimalSchemaTest, TestDynamicURP, TestLuceneIndexBackCompat, TestInitParams, TestPivotHelperCode, TestDistributedStatsComponentCardinality, DistributedQueryElevationComponentTest, SearchHandlerTest, SearchRateTriggerIntegrationTest, HdfsBasicDistributedZkTest, HdfsChaosMonkeyNothingIsSafeTest, HdfsChaosMonkeySafeLeaderTest, HdfsNNFailoverTest, HdfsRecoverLeaseTest, RuleEngineTest, RulesTest, QueryResultKeyTest, RAMDirectoryFactoryTest, ResourceLoaderTest, SOLR749Test, SolrCoreCheckLockOnStartupTest, SolrCoreTest, TestConfigSets, TestCoreDiscovery, TestCorePropertiesReload, TestDirectoryFactory, TestDynamicLoading, BinaryUpdateRequestHandlerTest, CSVRequestHandlerTest, DocumentAnalysisRequestHandlerTest, FieldAnalysisRequestHandlerTest, JsonLoaderTest, MoreLikeThisHandlerTest, RequestLoggingTest]
   [junit4] Completed [589/832 (1!)] on J1 in 0.80s, 2 tests, 1 failure <<< FAILURES!

[...truncated 43064 lines...]
[repro] Jenkins log URL: https://jenkins.thetaphi.de/job/Lucene-Solr-master-Linux/22784/consoleText

[repro] Revision: 606e529f9376f3b36d4e3248776fb413f111e03b

[repro] Ant options: "-Dargs=-XX:-UseCompressedOops -XX:+UseSerialGC"
[repro] Repro line:  ant test  -Dtestcase=RequestLoggingTest -Dtests.method=testLogBeforeExecuteWithRequestLogger -Dtests.seed=31ABC4CD976733E6 -Dtests.multiplier=3 -Dtests.slow=true -Dtests.locale=mk -Dtests.timezone=SystemV/HST10 -Dtests.asserts=true -Dtests.file.encoding=UTF-8

[repro] ant clean

[...truncated 6 lines...]
[repro] Test suites by module:
[repro]    solr/core
[repro]       RequestLoggingTest
[repro] ant compile-test

[...truncated 3423 lines...]
[repro] ant test-nocompile -Dtests.dups=5 -Dtests.maxfailures=5 -Dtests.class="*.RequestLoggingTest" -Dtests.showOutput=onerror "-Dargs=-XX:-UseCompressedOops -XX:+UseSerialGC" -Dtests.seed=31ABC4CD976733E6 -Dtests.multiplier=3 -Dtests.slow=true -Dtests.locale=mk -Dtests.timezone=SystemV/HST10 -Dtests.asserts=true -Dtests.file.encoding=UTF-8

[...truncated 53 lines...]
   [junit4] Suite: org.apache.solr.handler.RequestLoggingTest
   [junit4]   2> Creating dataDir: /home/jenkins/workspace/Lucene-Solr-master-Linux/solr/build/solr-core/test/J1/temp/solr.handler.RequestLoggingTest_31ABC4CD976733E6-001/init-core-data-001
   [junit4]   2> 7381 WARN  (SUITE-RequestLoggingTest-seed#[31ABC4CD976733E6]-worker) [    ] o.a.s.SolrTestCaseJ4 startTrackingSearchers: numOpens=1 numCloses=1
   [junit4]   2> 7382 INFO  (SUITE-RequestLoggingTest-seed#[31ABC4CD976733E6]-worker) [    ] o.a.s.SolrTestCaseJ4 Using PointFields (NUMERIC_POINTS_SYSPROP=true) w/NUMERIC_DOCVALUES_SYSPROP=true
   [junit4]   2> 7383 INFO  (SUITE-RequestLoggingTest-seed#[31ABC4CD976733E6]-worker) [    ] o.a.s.SolrTestCaseJ4 Randomized ssl (false) and clientAuth (true) via: @org.apache.solr.util.RandomizeSSL(reason="", ssl=0.0/0.0, value=0.0/0.0, clientAuth=0.0/0.0)
   [junit4]   2> 7383 INFO  (SUITE-RequestLoggingTest-seed#[31ABC4CD976733E6]-worker) [    ] o.a.s.SolrTestCaseJ4 SecureRandom sanity checks: test.solr.allowed.securerandom=null & java.security.egd=file:/dev/./urandom
   [junit4]   2> 7383 INFO  (SUITE-RequestLoggingTest-seed#[31ABC4CD976733E6]-worker) [    ] o.a.s.SolrTestCaseJ4 ####initCore
   [junit4]   2> 7384 INFO  (SUITE-RequestLoggingTest-seed#[31ABC4CD976733E6]-worker) [    ] o.a.s.c.SolrResourceLoader [null] Added 2 libs to classloader, from paths: [/home/jenkins/workspace/Lucene-Solr-master-Linux/solr/core/src/test-files/solr/collection1/lib, /home/jenkins/workspace/Lucene-Solr-master-Linux/solr/core/src/test-files/solr/collection1/lib/classes]
   [junit4]   2> 7436 INFO  (SUITE-RequestLoggingTest-seed#[31ABC4CD976733E6]-worker) [    ] o.a.s.c.SolrConfig Using Lucene MatchVersion: 8.0.0
   [junit4]   2> 7473 INFO  (SUITE-RequestLoggingTest-seed#[31ABC4CD976733E6]-worker) [    ] o.a.s.s.IndexSchema [null] Schema name=test
   [junit4]   2> 7618 INFO  (SUITE-RequestLoggingTest-seed#[31ABC4CD976733E6]-worker) [    ] o.a.s.s.IndexSchema Loaded schema test/1.0 with uniqueid field id
   [junit4]   2> 7861 INFO  (SUITE-RequestLoggingTest-seed#[31ABC4CD976733E6]-worker) [    ] o.a.s.c.TransientSolrCoreCacheDefault Allocating transient cache for 2147483647 transient cores
   [junit4]   2> 7861 INFO  (SUITE-RequestLoggingTest-seed#[31ABC4CD976733E6]-worker) [    ] o.a.s.h.a.MetricsHistoryHandler No .system collection, keeping metrics history in memory.
   [junit4]   2> 7895 INFO  (SUITE-RequestLoggingTest-seed#[31ABC4CD976733E6]-worker) [    ] o.a.s.m.r.SolrJmxReporter JMX monitoring for 'solr.node' (registry 'solr.node') enabled at server: com.sun.jmx.mbeanserver.JmxMBeanServer@2f81fc8d
   [junit4]   2> 7895 INFO  (SUITE-RequestLoggingTest-seed#[31ABC4CD976733E6]-worker) [    ] o.a.s.m.r.SolrJmxReporter JMX monitoring for 'solr.jvm' (registry 'solr.jvm') enabled at server: com.sun.jmx.mbeanserver.JmxMBeanServer@2f81fc8d
   [junit4]   2> 7895 INFO  (SUITE-RequestLoggingTest-seed#[31ABC4CD976733E6]-worker) [    ] o.a.s.m.r.SolrJmxReporter JMX monitoring for 'solr.jetty' (registry 'solr.jetty') enabled at server: com.sun.jmx.mbeanserver.JmxMBeanServer@2f81fc8d
   [junit4]   2> 7908 INFO  (coreLoadExecutor-25-thread-1) [    x:collection1] o.a.s.c.SolrResourceLoader [null] Added 2 libs to classloader, from paths: [/home/jenkins/workspace/Lucene-Solr-master-Linux/solr/core/src/test-files/solr/collection1/lib, /home/jenkins/workspace/Lucene-Solr-master-Linux/solr/core/src/test-files/solr/collection1/lib/classes]
   [junit4]   2> 7987 INFO  (coreLoadExecutor-25-thread-1) [    x:collection1] o.a.s.c.SolrConfig Using Lucene MatchVersion: 8.0.0
   [junit4]   2> 8019 INFO  (coreLoadExecutor-25-thread-1) [    x:collection1] o.a.s.s.IndexSchema [collection1] Schema name=test
   [junit4]   2> 8141 INFO  (coreLoadExecutor-25-thread-1) [    x:collection1] o.a.s.s.IndexSchema Loaded schema test/1.0 with uniqueid field id
   [junit4]   2> 8163 INFO  (coreLoadExecutor-25-thread-1) [    x:collection1] o.a.s.c.CoreContainer Creating SolrCore 'collection1' using configuration from instancedir /home/jenkins/workspace/Lucene-Solr-master-Linux/solr/core/src/test-files/solr/collection1, trusted=true
   [junit4]   2> 8164 INFO  (coreLoadExecutor-25-thread-1) [    x:collection1] o.a.s.m.r.SolrJmxReporter JMX monitoring for 'solr.core.collection1' (registry 'solr.core.collection1') enabled at server: com.sun.jmx.mbeanserver.JmxMBeanServer@2f81fc8d
   [junit4]   2> 8164 INFO  (coreLoadExecutor-25-thread-1) [    x:collection1] o.a.s.c.SolrCore solr.RecoveryStrategy.Builder
   [junit4]   2> 8164 INFO  (coreLoadExecutor-25-thread-1) [    x:collection1] o.a.s.c.SolrCore [[collection1] ] Opening new SolrCore at [/home/jenkins/workspace/Lucene-Solr-master-Linux/solr/core/src/test-files/solr/collection1], dataDir=[/home/jenkins/workspace/Lucene-Solr-master-Linux/solr/build/solr-core/test/J1/temp/solr.handler.RequestLoggingTest_31ABC4CD976733E6-001/init-core-data-001/]
   [junit4]   2> 8166 INFO  (coreLoadExecutor-25-thread-1) [    x:collection1] o.a.s.u.RandomMergePolicy RandomMergePolicy wrapping class org.apache.lucene.index.TieredMergePolicy: [TieredMergePolicy: maxMergeAtOnce=44, maxMergeAtOnceExplicit=42, maxMergedSegmentMB=95.2001953125, floorSegmentMB=0.521484375, forceMergeDeletesPctAllowed=13.526535681917442, segmentsPerTier=44.0, maxCFSSegmentSizeMB=8.796093022207999E12, noCFSRatio=1.0, deletesPctAllowed=47.86223611019982
   [junit4]   2> 8253 INFO  (coreLoadExecutor-25-thread-1) [    x:collection1] o.a.s.u.UpdateHandler Using UpdateLog implementation: org.apache.solr.update.UpdateLog
   [junit4]   2> 8253 INFO  (coreLoadExecutor-25-thread-1) [    x:collection1] o.a.s.u.UpdateLog Initializing UpdateLog: dataDir= defaultSyncLevel=FLUSH numRecordsToKeep=100 maxNumLogsToKeep=10 numVersionBuckets=65536
   [junit4]   2> 8255 INFO  (coreLoadExecutor-25-thread-1) [    x:collection1] o.a.s.u.CommitTracker Hard AutoCommit: disabled
   [junit4]   2> 8255 INFO  (coreLoadExecutor-25-thread-1) [    x:collection1] o.a.s.u.CommitTracker Soft AutoCommit: disabled
   [junit4]   2> 8256 INFO  (coreLoadExecutor-25-thread-1) [    x:collection1] o.a.s.u.RandomMergePolicy RandomMergePolicy wrapping class org.apache.lucene.index.TieredMergePolicy: [TieredMergePolicy: maxMergeAtOnce=30, maxMergeAtOnceExplicit=27, maxMergedSegmentMB=14.1865234375, floorSegmentMB=1.3583984375, forceMergeDeletesPctAllowed=6.377601712291144, segmentsPerTier=37.0, maxCFSSegmentSizeMB=8.796093022207999E12, noCFSRatio=0.4598870128163458, deletesPctAllowed=37.64695668848309
   [junit4]   2> 8256 INFO  (coreLoadExecutor-25-thread-1) [    x:collection1] o.a.s.s.SolrIndexSearcher Opening [Searcher@3ba36901[collection1] main]
   [junit4]   2> 8258 INFO  (coreLoadExecutor-25-thread-1) [    x:collection1] o.a.s.h.c.SpellCheckComponent Initializing spell checkers
   [junit4]   2> 8279 INFO  (coreLoadExecutor-25-thread-1) [    x:collection1] o.a.s.s.DirectSolrSpellChecker init: {name=direct,classname=DirectSolrSpellChecker,field=lowerfilt,minQueryLength=3}
   [junit4]   2> 8384 INFO  (coreLoadExecutor-25-thread-1) [    x:collection1] o.a.s.h.ReplicationHandler Commits will be reserved for 10000ms.
   [junit4]   2> 8384 INFO  (searcherExecutor-26-thread-1-processing-x:collection1) [    x:collection1] o.a.s.h.c.SpellCheckComponent Loading spell index for spellchecker: default
   [junit4]   2> 8384 INFO  (searcherExecutor-26-thread-1-processing-x:collection1) [    x:collection1] o.a.s.h.c.SpellCheckComponent Loading spell index for spellchecker: direct
   [junit4]   2> 8385 INFO  (searcherExecutor-26-thread-1-processing-x:collection1) [    x:collection1] o.a.s.h.c.SpellCheckComponent Loading spell index for spellchecker: wordbreak
   [junit4]   2> 8385 INFO  (searcherExecutor-26-thread-1-processing-x:collection1) [    x:collection1] o.a.s.h.c.SpellCheckComponent Loading spell index for spellchecker: multipleFields
   [junit4]   2> 8385 INFO  (coreLoadExecutor-25-thread-1) [    x:collection1] o.a.s.u.UpdateLog Could not find max version in index or recent updates, using new clock 1610433114353434624
   [junit4]   2> 8386 INFO  (searcherExecutor-26-thread-1-processing-x:collection1) [    x:collection1] o.a.s.h.c.SpellCheckComponent Loading spell index for spellchecker: jarowinkler
   [junit4]   2> 8386 INFO  (searcherExecutor-26-thread-1-processing-x:collection1) [    x:collection1] o.a.s.h.c.SpellCheckComponent Loading spell index for spellchecker: external
   [junit4]   2> 8386 INFO  (searcherExecutor-26-thread-1-processing-x:collection1) [    x:collection1] o.a.s.h.c.SpellCheckComponent Loading spell index for spellchecker: freq
   [junit4]   2> 8387 INFO  (searcherExecutor-26-thread-1-processing-x:collection1) [    x:collection1] o.a.s.h.c.SpellCheckComponent Loading spell index for spellchecker: fqcn
   [junit4]   2> 8387 INFO  (searcherExecutor-26-thread-1-processing-x:collection1) [    x:collection1] o.a.s.h.c.SpellCheckComponent Loading spell index for spellchecker: perDict
   [junit4]   2> 8388 INFO  (SUITE-RequestLoggingTest-seed#[31ABC4CD976733E6]-worker) [    ] o.a.s.SolrTestCaseJ4 ####initCore end
   [junit4]   2> 8391 INFO  (TEST-RequestLoggingTest.testLogBeforeExecuteWithCoreLogger-seed#[31ABC4CD976733E6]) [    ] o.a.s.SolrTestCaseJ4 ###Starting testLogBeforeExecuteWithCoreLogger
   [junit4]   2> 8391 INFO  (searcherExecutor-26-thread-1-processing-x:collection1) [    x:collection1] o.a.s.c.SolrCore [collection1] Registered new searcher Searcher@3ba36901[collection1] main{ExitableDirectoryReader(UninvertingDirectoryReader())}
   [junit4]   2> 8392 DEBUG (TEST-RequestLoggingTest.testLogBeforeExecuteWithCoreLogger-seed#[31ABC4CD976733E6]) [    ] o.a.s.c.S.Request [collection1]  webapp=null path=null params={q=*:*&wt=xml}
   [junit4]   2> 8392 DEBUG (TEST-RequestLoggingTest.testLogBeforeExecuteWithCoreLogger-seed#[31ABC4CD976733E6]) [    ] o.a.s.h.c.SearchHandler Adding  component:org.apache.solr.handler.component.QueryComponent@5db34d8c
   [junit4]   2> 8393 DEBUG (TEST-RequestLoggingTest.testLogBeforeExecuteWithCoreLogger-seed#[31ABC4CD976733E6]) [    ] o.a.s.h.c.SearchHandler Adding  component:org.apache.solr.handler.component.FacetComponent@3bec82ca
   [junit4]   2> 8393 DEBUG (TEST-RequestLoggingTest.testLogBeforeExecuteWithCoreLogger-seed#[31ABC4CD976733E6]) [    ] o.a.s.h.c.SearchHandler Adding  component:org.apache.solr.search.facet.FacetModule@4f148c01
   [junit4]   2> 8393 DEBUG (TEST-RequestLoggingTest.testLogBeforeExecuteWithCoreLogger-seed#[31ABC4CD976733E6]) [    ] o.a.s.h.c.SearchHandler Adding  component:org.apache.solr.handler.component.MoreLikeThisComponent@26595d07
   [junit4]   2> 8393 DEBUG (TEST-RequestLoggingTest.testLogBeforeExecuteWithCoreLogger-seed#[31ABC4CD976733E6]) [    ] o.a.s.h.c.SearchHandler Adding  component:org.apache.solr.handler.component.HighlightComponent@61c1ab6d
   [junit4]   2> 8393 DEBUG (TEST-RequestLoggingTest.testLogBeforeExecuteWithCoreLogger-seed#[31ABC4CD976733E6]) [    ] o.a.s.h.c.SearchHandler Adding  component:org.apache.solr.handler.component.StatsComponent@3ee48f4d
   [junit4]   2> 8393 DEBUG (TEST-RequestLoggingTest.testLogBeforeExecuteWithCoreLogger-seed#[31ABC4CD976733E6]) [    ] o.a.s.h.c.SearchHandler Adding  component:org.apache.solr.handler.component.ExpandComponent@55fb6814
   [junit4]   2> 8393 DEBUG (TEST-RequestLoggingTest.testLogBeforeExecuteWithCoreLogger-seed#[31ABC4CD976733E6]) [    ] o.a.s.h.c.SearchHandler Adding  component:org.apache.solr.handler.component.TermsComponent@39a6a6c9
   [junit4]   2> 8393 DEBUG (TEST-RequestLoggingTest.testLogBeforeExecuteWithCoreLogger-seed#[31ABC4CD976733E6]) [    ] o.a.s.h.c.SearchHandler Adding  debug component:org.apache.solr.handler.component.DebugComponent@5550f853
   [junit4]   2> 8393 DEBUG (TEST-RequestLoggingTest.testLogBeforeExecuteWithCoreLogger-seed#[31ABC4CD976733E6]) [    ] o.a.s.h.c.QueryComponent process: q=*:*&df=text&wt=xml&indent=off
   [junit4]   2> 8393 DEBUG (TEST-RequestLoggingTest.testLogBeforeExecuteWithCoreLogger-seed#[31ABC4CD976733E6]) [    ] o.a.s.s.s.LocalStatsCache ## GET LocalSolrQueryRequest{q=*:*&df=text&wt=xml&indent=off}
   [junit4]   2> 8393 INFO  (TEST-RequestLoggingTest.testLogBeforeExecuteWithCoreLogger-seed#[31ABC4CD976733E6]) [    ] o.a.s.c.S.Request [collection1]  webapp=null path=null params={q=*:*&wt=xml} hits=0 status=0 QTime=0
   [junit4]   2> 8394 INFO  (TEST-RequestLoggingTest.testLogBeforeExecuteWithCoreLogger-seed#[31ABC4CD976733E6]) [    ] o.a.s.SolrTestCaseJ4 ###Ending testLogBeforeExecuteWithCoreLogger
   [junit4]   2> NOTE: reproduce with: ant test  -Dtestcase=RequestLoggingTest -Dtests.method=testLogBeforeExecuteWithCoreLogger -Dtests.seed=31ABC4CD976733E6 -Dtests.multiplier=3 -Dtests.slow=true -Dtests.badapples=true -Dtests.locale=mk -Dtests.timezone=SystemV/HST10 -Dtests.asserts=true -Dtests.file.encoding=UTF-8
   [junit4] FAILURE 0.01s J1 | RequestLoggingTest.testLogBeforeExecuteWithCoreLogger <<<
   [junit4]    > Throwable #1: java.lang.AssertionError
   [junit4]    > 	at __randomizedtesting.SeedInfo.seed([31ABC4CD976733E6:FD2DC44369AE5870]:0)
   [junit4]    > 	at org.apache.solr.handler.RequestLoggingTest.testLogBeforeExecute(RequestLoggingTest.java:88)
   [junit4]    > 	at org.apache.solr.handler.RequestLoggingTest.testLogBeforeExecuteWithCoreLogger(RequestLoggingTest.java:65)
   [junit4]    > 	at java.base/jdk.internal.reflect.NativeMethodAccessorImpl.invoke0(Native Method)
   [junit4]    > 	at java.base/jdk.internal.reflect.NativeMethodAccessorImpl.invoke(NativeMethodAccessorImpl.java:62)
   [junit4]    > 	at java.base/jdk.internal.reflect.DelegatingMethodAccessorImpl.invoke(DelegatingMethodAccessorImpl.java:43)
   [junit4]    > 	at java.base/java.lang.reflect.Method.invoke(Method.java:564)
   [junit4]    > 	at java.base/java.lang.Thread.run(Thread.java:844)
   [junit4]   2> 8404 INFO  (TEST-RequestLoggingTest.testLogBeforeExecuteWithRequestLogger-seed#[31ABC4CD976733E6]) [    ] o.a.s.SolrTestCaseJ4 ###Starting testLogBeforeExecuteWithRequestLogger
   [junit4]   2> 8406 DEBUG (TEST-RequestLoggingTest.testLogBeforeExecuteWithRequestLogger-seed#[31ABC4CD976733E6]) [    ] o.a.s.c.S.Request [collection1]  webapp=null path=null params={q=*:*&wt=xml}
   [junit4]   2> 8406 DEBUG (TEST-RequestLoggingTest.testLogBeforeExecuteWithRequestLogger-seed#[31ABC4CD976733E6]) [    ] o.a.s.h.c.QueryComponent process: q=*:*&df=text&wt=xml&indent=off
   [junit4]   2> 8406 DEBUG (TEST-RequestLoggingTest.testLogBeforeExecuteWithRequestLogger-seed#[31ABC4CD976733E6]) [    ] o.a.s.s.s.LocalStatsCache ## GET LocalSolrQueryRequest{q=*:*&df=text&wt=xml&indent=off}
   [junit4]   2> 8406 INFO  (TEST-RequestLoggingTest.testLogBeforeExecuteWithRequestLogger-seed#[31ABC4CD976733E6]) [    ] o.a.s.c.S.Request [collection1]  webapp=null path=null params={q=*:*&wt=xml} hits=0 status=0 QTime=0
   [junit4]   2> 8407 INFO  (TEST-RequestLoggingTest.testLogBeforeExecuteWithRequestLogger-seed#[31ABC4CD976733E6]) [    ] o.a.s.SolrTestCaseJ4 ###Ending testLogBeforeExecuteWithRequestLogger
   [junit4] OK      0.01s J1 | RequestLoggingTest.testLogBeforeExecuteWithRequestLogger
   [junit4]   2> 8407 INFO  (SUITE-RequestLoggingTest-seed#[31ABC4CD976733E6]-worker) [    ] o.a.s.SolrTestCaseJ4 ###deleteCore
   [junit4]   2> 8407 INFO  (SUITE-RequestLoggingTest-seed#[31ABC4CD976733E6]-worker) [    ] o.a.s.c.CoreContainer Shutting down CoreContainer instance=1194750725
   [junit4]   2> 8407 INFO  (SUITE-RequestLoggingTest-seed#[31ABC4CD976733E6]-worker) [    ] o.a.s.m.SolrMetricManager Closing metric reporters for registry=solr.node, tag=null
   [junit4]   2> 8408 INFO  (SUITE-RequestLoggingTest-seed#[31ABC4CD976733E6]-worker) [    ] o.a.s.m.r.SolrJmxReporter Closing reporter [org.apache.solr.metrics.reporters.SolrJmxReporter@4c9d5b9d: rootName = null, domain = solr.node, service url = null, agent id = null] for registry solr.node / com.codahale.metrics.MetricRegistry@556aeda4
   [junit4]   2> 8414 INFO  (SUITE-RequestLoggingTest-seed#[31ABC4CD976733E6]-worker) [    ] o.a.s.m.SolrMetricManager Closing metric reporters for registry=solr.jvm, tag=null
   [junit4]   2> 8414 INFO  (SUITE-RequestLoggingTest-seed#[31ABC4CD976733E6]-worker) [    ] o.a.s.m.r.SolrJmxReporter Closing reporter [org.apache.solr.metrics.reporters.SolrJmxReporter@621dd7c9: rootName = null, domain = solr.jvm, service url = null, agent id = null] for registry solr.jvm / com.codahale.metrics.MetricRegistry@727421f4
   [junit4]   2> 8414 INFO  (SUITE-RequestLoggingTest-seed#[31ABC4CD976733E6]-worker) [    ] o.a.s.m.SolrMetricManager Closing metric reporters for registry=solr.jetty, tag=null
   [junit4]   2> 8414 INFO  (SUITE-RequestLoggingTest-seed#[31ABC4CD976733E6]-worker) [    ] o.a.s.m.r.SolrJmxReporter Closing reporter [org.apache.solr.metrics.reporters.SolrJmxReporter@3cfecbde: rootName = null, domain = solr.jetty, service url = null, agent id = null] for registry solr.jetty / com.codahale.metrics.MetricRegistry@39d4dda
   [junit4]   2> 8415 INFO  (coreCloseExecutor-31-thread-1) [    x:collection1] o.a.s.c.SolrCore [collection1]  CLOSING SolrCore org.apache.solr.core.SolrCore@144daf67
   [junit4]   2> 8415 INFO  (coreCloseExecutor-31-thread-1) [    x:collection1] o.a.s.m.SolrMetricManager Closing metric reporters for registry=solr.core.collection1, tag=144daf67
   [junit4]   2> 8416 INFO  (coreCloseExecutor-31-thread-1) [    x:collection1] o.a.s.m.r.SolrJmxReporter Closing reporter [org.apache.solr.metrics.reporters.SolrJmxReporter@7bff3dae: rootName = null, domain = solr.core.collection1, service url = null, agent id = null] for registry solr.core.collection1 / com.codahale.metrics.MetricRegistry@31a8873c
   [junit4]   2> NOTE: leaving temporary files on disk at: /home/jenkins/workspace/Lucene-Solr-master-Linux/solr/build/solr-core/test/J1/temp/solr.handler.RequestLoggingTest_31ABC4CD976733E6-001
   [junit4]   2> NOTE: test params are: codec=Asserting(Lucene80): {}, docValues:{}, maxPointsInLeafNode=1893, maxMBSortInHeap=7.177134113675933, sim=Asserting(org.apache.lucene.search.similarities.AssertingSimilarity@789a6978), locale=mk, timezone=SystemV/HST10
   [junit4]   2> NOTE: Linux 4.15.0-32-generic amd64/Oracle Corporation 9.0.4 (64-bit)/cpus=8,threads=1,free=336547432,total=518979584
   [junit4]   2> NOTE: All tests run in this JVM: [RequestLoggingTest, RequestLoggingTest]
   [junit4] Completed [5/5 (1!)] on J1 in 1.09s, 2 tests, 1 failure <<< FAILURES!

[...truncated 11 lines...]
BUILD FAILED
/home/jenkins/workspace/Lucene-Solr-master-Linux/lucene/common-build.xml:1568: The following error occurred while executing this line:
/home/jenkins/workspace/Lucene-Solr-master-Linux/lucene/common-build.xml:1092: There were test failures: 5 suites, 10 tests, 1 failure [seed: 31ABC4CD976733E6]

Total time: 10 seconds

[repro] Setting last failure code to 256

[repro] Failures:
[repro]   1/5 failed: org.apache.solr.handler.RequestLoggingTest
[repro] Exiting with code 256
+ mv lucene/build lucene/build.repro
+ mv solr/build solr/build.repro
+ mv lucene/build.orig lucene/build
+ mv solr/build.orig solr/build
Archiving artifacts
Setting ANT_1_8_2_HOME=/var/lib/jenkins/tools/hudson.tasks.Ant_AntInstallation/ANT_1.8.2
[WARNINGS] Parsing warnings in console log with parser Java Compiler (javac)
Setting ANT_1_8_2_HOME=/var/lib/jenkins/tools/hudson.tasks.Ant_AntInstallation/ANT_1.8.2
Setting ANT_1_8_2_HOME=/var/lib/jenkins/tools/hudson.tasks.Ant_AntInstallation/ANT_1.8.2
<Git Blamer> Using GitBlamer to create author and commit information for all warnings.
<Git Blamer> GIT_COMMIT=606e529f9376f3b36d4e3248776fb413f111e03b, workspace=/var/lib/jenkins/workspace/Lucene-Solr-master-Linux
[WARNINGS] Computing warning deltas based on reference build #22783
Recording test results
Setting ANT_1_8_2_HOME=/var/lib/jenkins/tools/hudson.tasks.Ant_AntInstallation/ANT_1.8.2
Build step 'Publish JUnit test result report' changed build result to UNSTABLE
Email was triggered for: Unstable (Test Failures)
Sending email for trigger: Unstable (Test Failures)
Setting ANT_1_8_2_HOME=/var/lib/jenkins/tools/hudson.tasks.Ant_AntInstallation/ANT_1.8.2
Setting ANT_1_8_2_HOME=/var/lib/jenkins/tools/hudson.tasks.Ant_AntInstallation/ANT_1.8.2
Setting ANT_1_8_2_HOME=/var/lib/jenkins/tools/hudson.tasks.Ant_AntInstallation/ANT_1.8.2
Setting ANT_1_8_2_HOME=/var/lib/jenkins/tools/hudson.tasks.Ant_AntInstallation/ANT_1.8.2

Mime
View raw message