lucene-dev mailing list archives

Site index · List index
Message view « Date » · « Thread »
Top « Date » · « Thread »
From Policeman Jenkins Server <jenk...@thetaphi.de>
Subject [JENKINS-EA] Lucene-Solr-7.x-Linux (64bit/jdk-12-ea+12) - Build # 2821 - Failure!
Date Fri, 28 Sep 2018 08:52:36 GMT
Build: https://jenkins.thetaphi.de/job/Lucene-Solr-7.x-Linux/2821/
Java: 64bit/jdk-12-ea+12 -XX:-UseCompressedOops -XX:+UseSerialGC

4 tests failed.
FAILED:  org.apache.solr.cloud.api.collections.CollectionsAPIAsyncDistributedZkTest.testAsyncIdRaceCondition

Error Message:
expected:<9> but was:<8>

Stack Trace:
java.lang.AssertionError: expected:<9> but was:<8>
	at __randomizedtesting.SeedInfo.seed([86AE232BCF5DDDF6:D3234EC6A333245D]:0)
	at org.junit.Assert.fail(Assert.java:93)
	at org.junit.Assert.failNotEquals(Assert.java:647)
	at org.junit.Assert.assertEquals(Assert.java:128)
	at org.junit.Assert.assertEquals(Assert.java:472)
	at org.junit.Assert.assertEquals(Assert.java:456)
	at org.apache.solr.cloud.api.collections.CollectionsAPIAsyncDistributedZkTest.testAsyncIdRaceCondition(CollectionsAPIAsyncDistributedZkTest.java:244)
	at java.base/jdk.internal.reflect.NativeMethodAccessorImpl.invoke0(Native Method)
	at java.base/jdk.internal.reflect.NativeMethodAccessorImpl.invoke(NativeMethodAccessorImpl.java:62)
	at java.base/jdk.internal.reflect.DelegatingMethodAccessorImpl.invoke(DelegatingMethodAccessorImpl.java:43)
	at java.base/java.lang.reflect.Method.invoke(Method.java:566)
	at com.carrotsearch.randomizedtesting.RandomizedRunner.invoke(RandomizedRunner.java:1742)
	at com.carrotsearch.randomizedtesting.RandomizedRunner$8.evaluate(RandomizedRunner.java:935)
	at com.carrotsearch.randomizedtesting.RandomizedRunner$9.evaluate(RandomizedRunner.java:971)
	at com.carrotsearch.randomizedtesting.RandomizedRunner$10.evaluate(RandomizedRunner.java:985)
	at com.carrotsearch.randomizedtesting.rules.SystemPropertiesRestoreRule$1.evaluate(SystemPropertiesRestoreRule.java:57)
	at org.apache.lucene.util.TestRuleSetupTeardownChained$1.evaluate(TestRuleSetupTeardownChained.java:49)
	at org.apache.lucene.util.AbstractBeforeAfterRule$1.evaluate(AbstractBeforeAfterRule.java:45)
	at org.apache.lucene.util.TestRuleThreadAndTestName$1.evaluate(TestRuleThreadAndTestName.java:48)
	at org.apache.lucene.util.TestRuleIgnoreAfterMaxFailures$1.evaluate(TestRuleIgnoreAfterMaxFailures.java:64)
	at org.apache.lucene.util.TestRuleMarkFailure$1.evaluate(TestRuleMarkFailure.java:47)
	at com.carrotsearch.randomizedtesting.rules.StatementAdapter.evaluate(StatementAdapter.java:36)
	at com.carrotsearch.randomizedtesting.ThreadLeakControl$StatementRunner.run(ThreadLeakControl.java:368)
	at com.carrotsearch.randomizedtesting.ThreadLeakControl.forkTimeoutingTask(ThreadLeakControl.java:817)
	at com.carrotsearch.randomizedtesting.ThreadLeakControl$3.evaluate(ThreadLeakControl.java:468)
	at com.carrotsearch.randomizedtesting.RandomizedRunner.runSingleTest(RandomizedRunner.java:944)
	at com.carrotsearch.randomizedtesting.RandomizedRunner$5.evaluate(RandomizedRunner.java:830)
	at com.carrotsearch.randomizedtesting.RandomizedRunner$6.evaluate(RandomizedRunner.java:880)
	at com.carrotsearch.randomizedtesting.RandomizedRunner$7.evaluate(RandomizedRunner.java:891)
	at com.carrotsearch.randomizedtesting.rules.StatementAdapter.evaluate(StatementAdapter.java:36)
	at com.carrotsearch.randomizedtesting.rules.SystemPropertiesRestoreRule$1.evaluate(SystemPropertiesRestoreRule.java:57)
	at org.apache.lucene.util.AbstractBeforeAfterRule$1.evaluate(AbstractBeforeAfterRule.java:45)
	at com.carrotsearch.randomizedtesting.rules.StatementAdapter.evaluate(StatementAdapter.java:36)
	at org.apache.lucene.util.TestRuleStoreClassName$1.evaluate(TestRuleStoreClassName.java:41)
	at com.carrotsearch.randomizedtesting.rules.NoShadowingOrOverridesOnMethodsRule$1.evaluate(NoShadowingOrOverridesOnMethodsRule.java:40)
	at com.carrotsearch.randomizedtesting.rules.NoShadowingOrOverridesOnMethodsRule$1.evaluate(NoShadowingOrOverridesOnMethodsRule.java:40)
	at com.carrotsearch.randomizedtesting.rules.StatementAdapter.evaluate(StatementAdapter.java:36)
	at com.carrotsearch.randomizedtesting.rules.StatementAdapter.evaluate(StatementAdapter.java:36)
	at org.apache.lucene.util.TestRuleAssertionsRequired$1.evaluate(TestRuleAssertionsRequired.java:53)
	at org.apache.lucene.util.TestRuleMarkFailure$1.evaluate(TestRuleMarkFailure.java:47)
	at org.apache.lucene.util.TestRuleIgnoreAfterMaxFailures$1.evaluate(TestRuleIgnoreAfterMaxFailures.java:64)
	at org.apache.lucene.util.TestRuleIgnoreTestSuites$1.evaluate(TestRuleIgnoreTestSuites.java:54)
	at com.carrotsearch.randomizedtesting.rules.StatementAdapter.evaluate(StatementAdapter.java:36)
	at com.carrotsearch.randomizedtesting.ThreadLeakControl$StatementRunner.run(ThreadLeakControl.java:368)
	at java.base/java.lang.Thread.run(Thread.java:835)


FAILED:  org.apache.solr.cloud.autoscaling.IndexSizeTriggerTest.testMixedBounds

Error Message:
failed to create testMixedBounds_collection Live Nodes: null Last available state: null

Stack Trace:
java.lang.AssertionError: failed to create testMixedBounds_collection
Live Nodes: null
Last available state: null
	at __randomizedtesting.SeedInfo.seed([86AE232BCF5DDDF6:8C2D9C8682E6D6AC]:0)
	at org.apache.solr.cloud.CloudTestUtils.waitForState(CloudTestUtils.java:70)
	at org.apache.solr.cloud.autoscaling.IndexSizeTriggerTest.testMixedBounds(IndexSizeTriggerTest.java:472)
	at java.base/jdk.internal.reflect.NativeMethodAccessorImpl.invoke0(Native Method)
	at java.base/jdk.internal.reflect.NativeMethodAccessorImpl.invoke(NativeMethodAccessorImpl.java:62)
	at java.base/jdk.internal.reflect.DelegatingMethodAccessorImpl.invoke(DelegatingMethodAccessorImpl.java:43)
	at java.base/java.lang.reflect.Method.invoke(Method.java:566)
	at com.carrotsearch.randomizedtesting.RandomizedRunner.invoke(RandomizedRunner.java:1742)
	at com.carrotsearch.randomizedtesting.RandomizedRunner$8.evaluate(RandomizedRunner.java:935)
	at com.carrotsearch.randomizedtesting.RandomizedRunner$9.evaluate(RandomizedRunner.java:971)
	at com.carrotsearch.randomizedtesting.RandomizedRunner$10.evaluate(RandomizedRunner.java:985)
	at com.carrotsearch.randomizedtesting.rules.SystemPropertiesRestoreRule$1.evaluate(SystemPropertiesRestoreRule.java:57)
	at org.apache.lucene.util.TestRuleSetupTeardownChained$1.evaluate(TestRuleSetupTeardownChained.java:49)
	at org.apache.lucene.util.AbstractBeforeAfterRule$1.evaluate(AbstractBeforeAfterRule.java:45)
	at org.apache.lucene.util.TestRuleThreadAndTestName$1.evaluate(TestRuleThreadAndTestName.java:48)
	at org.apache.lucene.util.TestRuleIgnoreAfterMaxFailures$1.evaluate(TestRuleIgnoreAfterMaxFailures.java:64)
	at org.apache.lucene.util.TestRuleMarkFailure$1.evaluate(TestRuleMarkFailure.java:47)
	at com.carrotsearch.randomizedtesting.rules.StatementAdapter.evaluate(StatementAdapter.java:36)
	at com.carrotsearch.randomizedtesting.ThreadLeakControl$StatementRunner.run(ThreadLeakControl.java:368)
	at com.carrotsearch.randomizedtesting.ThreadLeakControl.forkTimeoutingTask(ThreadLeakControl.java:817)
	at com.carrotsearch.randomizedtesting.ThreadLeakControl$3.evaluate(ThreadLeakControl.java:468)
	at com.carrotsearch.randomizedtesting.RandomizedRunner.runSingleTest(RandomizedRunner.java:944)
	at com.carrotsearch.randomizedtesting.RandomizedRunner$5.evaluate(RandomizedRunner.java:830)
	at com.carrotsearch.randomizedtesting.RandomizedRunner$6.evaluate(RandomizedRunner.java:880)
	at com.carrotsearch.randomizedtesting.RandomizedRunner$7.evaluate(RandomizedRunner.java:891)
	at com.carrotsearch.randomizedtesting.rules.StatementAdapter.evaluate(StatementAdapter.java:36)
	at com.carrotsearch.randomizedtesting.rules.SystemPropertiesRestoreRule$1.evaluate(SystemPropertiesRestoreRule.java:57)
	at org.apache.lucene.util.AbstractBeforeAfterRule$1.evaluate(AbstractBeforeAfterRule.java:45)
	at com.carrotsearch.randomizedtesting.rules.StatementAdapter.evaluate(StatementAdapter.java:36)
	at org.apache.lucene.util.TestRuleStoreClassName$1.evaluate(TestRuleStoreClassName.java:41)
	at com.carrotsearch.randomizedtesting.rules.NoShadowingOrOverridesOnMethodsRule$1.evaluate(NoShadowingOrOverridesOnMethodsRule.java:40)
	at com.carrotsearch.randomizedtesting.rules.NoShadowingOrOverridesOnMethodsRule$1.evaluate(NoShadowingOrOverridesOnMethodsRule.java:40)
	at com.carrotsearch.randomizedtesting.rules.StatementAdapter.evaluate(StatementAdapter.java:36)
	at com.carrotsearch.randomizedtesting.rules.StatementAdapter.evaluate(StatementAdapter.java:36)
	at org.apache.lucene.util.TestRuleAssertionsRequired$1.evaluate(TestRuleAssertionsRequired.java:53)
	at org.apache.lucene.util.TestRuleMarkFailure$1.evaluate(TestRuleMarkFailure.java:47)
	at org.apache.lucene.util.TestRuleIgnoreAfterMaxFailures$1.evaluate(TestRuleIgnoreAfterMaxFailures.java:64)
	at org.apache.lucene.util.TestRuleIgnoreTestSuites$1.evaluate(TestRuleIgnoreTestSuites.java:54)
	at com.carrotsearch.randomizedtesting.rules.StatementAdapter.evaluate(StatementAdapter.java:36)
	at com.carrotsearch.randomizedtesting.ThreadLeakControl$StatementRunner.run(ThreadLeakControl.java:368)
	at java.base/java.lang.Thread.run(Thread.java:835)
Caused by: java.util.concurrent.TimeoutException: last state: null
	at org.apache.solr.cloud.CloudTestUtils.waitForState(CloudTestUtils.java:112)
	at org.apache.solr.cloud.CloudTestUtils.waitForState(CloudTestUtils.java:64)
	... 39 more


FAILED:  org.apache.solr.cloud.autoscaling.IndexSizeTriggerTest.testTrigger

Error Message:
number of ops expected:<2> but was:<1>

Stack Trace:
java.lang.AssertionError: number of ops expected:<2> but was:<1>
	at __randomizedtesting.SeedInfo.seed([86AE232BCF5DDDF6:E56515A95692AEDB]:0)
	at org.junit.Assert.fail(Assert.java:93)
	at org.junit.Assert.failNotEquals(Assert.java:647)
	at org.junit.Assert.assertEquals(Assert.java:128)
	at org.junit.Assert.assertEquals(Assert.java:472)
	at org.apache.solr.cloud.autoscaling.IndexSizeTriggerTest.testTrigger(IndexSizeTriggerTest.java:193)
	at java.base/jdk.internal.reflect.NativeMethodAccessorImpl.invoke0(Native Method)
	at java.base/jdk.internal.reflect.NativeMethodAccessorImpl.invoke(NativeMethodAccessorImpl.java:62)
	at java.base/jdk.internal.reflect.DelegatingMethodAccessorImpl.invoke(DelegatingMethodAccessorImpl.java:43)
	at java.base/java.lang.reflect.Method.invoke(Method.java:566)
	at com.carrotsearch.randomizedtesting.RandomizedRunner.invoke(RandomizedRunner.java:1742)
	at com.carrotsearch.randomizedtesting.RandomizedRunner$8.evaluate(RandomizedRunner.java:935)
	at com.carrotsearch.randomizedtesting.RandomizedRunner$9.evaluate(RandomizedRunner.java:971)
	at com.carrotsearch.randomizedtesting.RandomizedRunner$10.evaluate(RandomizedRunner.java:985)
	at com.carrotsearch.randomizedtesting.rules.SystemPropertiesRestoreRule$1.evaluate(SystemPropertiesRestoreRule.java:57)
	at org.apache.lucene.util.TestRuleSetupTeardownChained$1.evaluate(TestRuleSetupTeardownChained.java:49)
	at org.apache.lucene.util.AbstractBeforeAfterRule$1.evaluate(AbstractBeforeAfterRule.java:45)
	at org.apache.lucene.util.TestRuleThreadAndTestName$1.evaluate(TestRuleThreadAndTestName.java:48)
	at org.apache.lucene.util.TestRuleIgnoreAfterMaxFailures$1.evaluate(TestRuleIgnoreAfterMaxFailures.java:64)
	at org.apache.lucene.util.TestRuleMarkFailure$1.evaluate(TestRuleMarkFailure.java:47)
	at com.carrotsearch.randomizedtesting.rules.StatementAdapter.evaluate(StatementAdapter.java:36)
	at com.carrotsearch.randomizedtesting.ThreadLeakControl$StatementRunner.run(ThreadLeakControl.java:368)
	at com.carrotsearch.randomizedtesting.ThreadLeakControl.forkTimeoutingTask(ThreadLeakControl.java:817)
	at com.carrotsearch.randomizedtesting.ThreadLeakControl$3.evaluate(ThreadLeakControl.java:468)
	at com.carrotsearch.randomizedtesting.RandomizedRunner.runSingleTest(RandomizedRunner.java:944)
	at com.carrotsearch.randomizedtesting.RandomizedRunner$5.evaluate(RandomizedRunner.java:830)
	at com.carrotsearch.randomizedtesting.RandomizedRunner$6.evaluate(RandomizedRunner.java:880)
	at com.carrotsearch.randomizedtesting.RandomizedRunner$7.evaluate(RandomizedRunner.java:891)
	at com.carrotsearch.randomizedtesting.rules.StatementAdapter.evaluate(StatementAdapter.java:36)
	at com.carrotsearch.randomizedtesting.rules.SystemPropertiesRestoreRule$1.evaluate(SystemPropertiesRestoreRule.java:57)
	at org.apache.lucene.util.AbstractBeforeAfterRule$1.evaluate(AbstractBeforeAfterRule.java:45)
	at com.carrotsearch.randomizedtesting.rules.StatementAdapter.evaluate(StatementAdapter.java:36)
	at org.apache.lucene.util.TestRuleStoreClassName$1.evaluate(TestRuleStoreClassName.java:41)
	at com.carrotsearch.randomizedtesting.rules.NoShadowingOrOverridesOnMethodsRule$1.evaluate(NoShadowingOrOverridesOnMethodsRule.java:40)
	at com.carrotsearch.randomizedtesting.rules.NoShadowingOrOverridesOnMethodsRule$1.evaluate(NoShadowingOrOverridesOnMethodsRule.java:40)
	at com.carrotsearch.randomizedtesting.rules.StatementAdapter.evaluate(StatementAdapter.java:36)
	at com.carrotsearch.randomizedtesting.rules.StatementAdapter.evaluate(StatementAdapter.java:36)
	at org.apache.lucene.util.TestRuleAssertionsRequired$1.evaluate(TestRuleAssertionsRequired.java:53)
	at org.apache.lucene.util.TestRuleMarkFailure$1.evaluate(TestRuleMarkFailure.java:47)
	at org.apache.lucene.util.TestRuleIgnoreAfterMaxFailures$1.evaluate(TestRuleIgnoreAfterMaxFailures.java:64)
	at org.apache.lucene.util.TestRuleIgnoreTestSuites$1.evaluate(TestRuleIgnoreTestSuites.java:54)
	at com.carrotsearch.randomizedtesting.rules.StatementAdapter.evaluate(StatementAdapter.java:36)
	at com.carrotsearch.randomizedtesting.ThreadLeakControl$StatementRunner.run(ThreadLeakControl.java:368)
	at java.base/java.lang.Thread.run(Thread.java:835)


FAILED:  org.apache.solr.metrics.reporters.solr.SolrCloudReportersTest.testExplicitConfiguration

Error Message:
Expected test_collection with 2 shards and 2 replicas null Live Nodes: [127.0.0.1:37639_solr, 127.0.0.1:46173_solr] Last available state: null

Stack Trace:
java.lang.AssertionError: Expected test_collection with 2 shards and 2 replicas
null
Live Nodes: [127.0.0.1:37639_solr, 127.0.0.1:46173_solr]
Last available state: null
	at __randomizedtesting.SeedInfo.seed([86AE232BCF5DDDF6:C26203D0A1670B9C]:0)
	at org.junit.Assert.fail(Assert.java:93)
	at org.apache.solr.cloud.SolrCloudTestCase.waitForState(SolrCloudTestCase.java:280)
	at org.apache.solr.metrics.reporters.solr.SolrCloudReportersTest.testExplicitConfiguration(SolrCloudReportersTest.java:71)
	at java.base/jdk.internal.reflect.NativeMethodAccessorImpl.invoke0(Native Method)
	at java.base/jdk.internal.reflect.NativeMethodAccessorImpl.invoke(NativeMethodAccessorImpl.java:62)
	at java.base/jdk.internal.reflect.DelegatingMethodAccessorImpl.invoke(DelegatingMethodAccessorImpl.java:43)
	at java.base/java.lang.reflect.Method.invoke(Method.java:566)
	at com.carrotsearch.randomizedtesting.RandomizedRunner.invoke(RandomizedRunner.java:1742)
	at com.carrotsearch.randomizedtesting.RandomizedRunner$8.evaluate(RandomizedRunner.java:935)
	at com.carrotsearch.randomizedtesting.RandomizedRunner$9.evaluate(RandomizedRunner.java:971)
	at com.carrotsearch.randomizedtesting.RandomizedRunner$10.evaluate(RandomizedRunner.java:985)
	at com.carrotsearch.randomizedtesting.rules.SystemPropertiesRestoreRule$1.evaluate(SystemPropertiesRestoreRule.java:57)
	at org.apache.lucene.util.TestRuleSetupTeardownChained$1.evaluate(TestRuleSetupTeardownChained.java:49)
	at org.apache.lucene.util.AbstractBeforeAfterRule$1.evaluate(AbstractBeforeAfterRule.java:45)
	at org.apache.lucene.util.TestRuleThreadAndTestName$1.evaluate(TestRuleThreadAndTestName.java:48)
	at org.apache.lucene.util.TestRuleIgnoreAfterMaxFailures$1.evaluate(TestRuleIgnoreAfterMaxFailures.java:64)
	at org.apache.lucene.util.TestRuleMarkFailure$1.evaluate(TestRuleMarkFailure.java:47)
	at com.carrotsearch.randomizedtesting.rules.StatementAdapter.evaluate(StatementAdapter.java:36)
	at com.carrotsearch.randomizedtesting.ThreadLeakControl$StatementRunner.run(ThreadLeakControl.java:368)
	at com.carrotsearch.randomizedtesting.ThreadLeakControl.forkTimeoutingTask(ThreadLeakControl.java:817)
	at com.carrotsearch.randomizedtesting.ThreadLeakControl$3.evaluate(ThreadLeakControl.java:468)
	at com.carrotsearch.randomizedtesting.RandomizedRunner.runSingleTest(RandomizedRunner.java:944)
	at com.carrotsearch.randomizedtesting.RandomizedRunner$5.evaluate(RandomizedRunner.java:830)
	at com.carrotsearch.randomizedtesting.RandomizedRunner$6.evaluate(RandomizedRunner.java:880)
	at com.carrotsearch.randomizedtesting.RandomizedRunner$7.evaluate(RandomizedRunner.java:891)
	at com.carrotsearch.randomizedtesting.rules.StatementAdapter.evaluate(StatementAdapter.java:36)
	at com.carrotsearch.randomizedtesting.rules.SystemPropertiesRestoreRule$1.evaluate(SystemPropertiesRestoreRule.java:57)
	at org.apache.lucene.util.AbstractBeforeAfterRule$1.evaluate(AbstractBeforeAfterRule.java:45)
	at com.carrotsearch.randomizedtesting.rules.StatementAdapter.evaluate(StatementAdapter.java:36)
	at org.apache.lucene.util.TestRuleStoreClassName$1.evaluate(TestRuleStoreClassName.java:41)
	at com.carrotsearch.randomizedtesting.rules.NoShadowingOrOverridesOnMethodsRule$1.evaluate(NoShadowingOrOverridesOnMethodsRule.java:40)
	at com.carrotsearch.randomizedtesting.rules.NoShadowingOrOverridesOnMethodsRule$1.evaluate(NoShadowingOrOverridesOnMethodsRule.java:40)
	at com.carrotsearch.randomizedtesting.rules.StatementAdapter.evaluate(StatementAdapter.java:36)
	at com.carrotsearch.randomizedtesting.rules.StatementAdapter.evaluate(StatementAdapter.java:36)
	at org.apache.lucene.util.TestRuleAssertionsRequired$1.evaluate(TestRuleAssertionsRequired.java:53)
	at org.apache.lucene.util.TestRuleMarkFailure$1.evaluate(TestRuleMarkFailure.java:47)
	at org.apache.lucene.util.TestRuleIgnoreAfterMaxFailures$1.evaluate(TestRuleIgnoreAfterMaxFailures.java:64)
	at org.apache.lucene.util.TestRuleIgnoreTestSuites$1.evaluate(TestRuleIgnoreTestSuites.java:54)
	at com.carrotsearch.randomizedtesting.rules.StatementAdapter.evaluate(StatementAdapter.java:36)
	at com.carrotsearch.randomizedtesting.ThreadLeakControl$StatementRunner.run(ThreadLeakControl.java:368)
	at java.base/java.lang.Thread.run(Thread.java:835)




Build Log:
[...truncated 13581 lines...]
   [junit4] Suite: org.apache.solr.cloud.api.collections.CollectionsAPIAsyncDistributedZkTest
   [junit4]   2> Creating dataDir: /home/jenkins/workspace/Lucene-Solr-7.x-Linux/solr/build/solr-core/test/J0/temp/solr.cloud.api.collections.CollectionsAPIAsyncDistributedZkTest_86AE232BCF5DDDF6-001/init-core-data-001
   [junit4]   2> 761244 WARN  (SUITE-CollectionsAPIAsyncDistributedZkTest-seed#[86AE232BCF5DDDF6]-worker) [    ] o.a.s.SolrTestCaseJ4 startTrackingSearchers: numOpens=1318 numCloses=1318
   [junit4]   2> 761244 INFO  (SUITE-CollectionsAPIAsyncDistributedZkTest-seed#[86AE232BCF5DDDF6]-worker) [    ] o.a.s.SolrTestCaseJ4 Using PointFields (NUMERIC_POINTS_SYSPROP=true) w/NUMERIC_DOCVALUES_SYSPROP=true
   [junit4]   2> 761245 INFO  (SUITE-CollectionsAPIAsyncDistributedZkTest-seed#[86AE232BCF5DDDF6]-worker) [    ] o.a.s.SolrTestCaseJ4 Randomized ssl (true) and clientAuth (false) via: @org.apache.solr.util.RandomizeSSL(reason="", ssl=0.0/0.0, value=0.0/0.0, clientAuth=0.0/0.0)
   [junit4]   2> 761246 INFO  (SUITE-CollectionsAPIAsyncDistributedZkTest-seed#[86AE232BCF5DDDF6]-worker) [    ] o.a.s.SolrTestCaseJ4 SecureRandom sanity checks: test.solr.allowed.securerandom=null & java.security.egd=file:/dev/./urandom
   [junit4]   2> 761246 INFO  (SUITE-CollectionsAPIAsyncDistributedZkTest-seed#[86AE232BCF5DDDF6]-worker) [    ] o.a.s.c.MiniSolrCloudCluster Starting cluster of 2 servers in /home/jenkins/workspace/Lucene-Solr-7.x-Linux/solr/build/solr-core/test/J0/temp/solr.cloud.api.collections.CollectionsAPIAsyncDistributedZkTest_86AE232BCF5DDDF6-001/tempDir-001
   [junit4]   2> 761247 INFO  (SUITE-CollectionsAPIAsyncDistributedZkTest-seed#[86AE232BCF5DDDF6]-worker) [    ] o.a.s.c.ZkTestServer STARTING ZK TEST SERVER
   [junit4]   2> 761248 INFO  (Thread-2285) [    ] o.a.s.c.ZkTestServer client port:0.0.0.0/0.0.0.0:0
   [junit4]   2> 761248 INFO  (Thread-2285) [    ] o.a.s.c.ZkTestServer Starting server
   [junit4]   2> 761276 ERROR (Thread-2285) [    ] o.a.z.s.ZooKeeperServer ZKShutdownHandler is not registered, so ZooKeeper server won't take any action on ERROR or SHUTDOWN server state changes
   [junit4]   2> 761348 INFO  (SUITE-CollectionsAPIAsyncDistributedZkTest-seed#[86AE232BCF5DDDF6]-worker) [    ] o.a.s.c.ZkTestServer start zk server on port:43521
   [junit4]   2> 761363 INFO  (zkConnectionManagerCallback-2599-thread-1) [    ] o.a.s.c.c.ConnectionManager zkClient has connected
   [junit4]   2> 761377 INFO  (jetty-launcher-2596-thread-2) [    ] o.e.j.s.Server jetty-9.4.11.v20180605; built: 2018-06-05T18:24:03.829Z; git: d5fc0523cfa96bfebfbda19606cad384d772f04c; jvm 12-ea+12
   [junit4]   2> 761399 INFO  (jetty-launcher-2596-thread-1) [    ] o.e.j.s.Server jetty-9.4.11.v20180605; built: 2018-06-05T18:24:03.829Z; git: d5fc0523cfa96bfebfbda19606cad384d772f04c; jvm 12-ea+12
   [junit4]   2> 761448 INFO  (jetty-launcher-2596-thread-2) [    ] o.e.j.s.session DefaultSessionIdManager workerName=node0
   [junit4]   2> 761448 INFO  (jetty-launcher-2596-thread-2) [    ] o.e.j.s.session No SessionScavenger set, using defaults
   [junit4]   2> 761448 INFO  (jetty-launcher-2596-thread-2) [    ] o.e.j.s.session node0 Scavenging every 660000ms
   [junit4]   2> 761489 INFO  (jetty-launcher-2596-thread-2) [    ] o.e.j.s.h.ContextHandler Started o.e.j.s.ServletContextHandler@d1ea701{/solr,null,AVAILABLE}
   [junit4]   2> 761492 INFO  (jetty-launcher-2596-thread-2) [    ] o.e.j.s.AbstractConnector Started ServerConnector@652d0067{SSL,[ssl, http/1.1]}{127.0.0.1:46467}
   [junit4]   2> 761493 INFO  (jetty-launcher-2596-thread-2) [    ] o.e.j.s.Server Started @761525ms
   [junit4]   2> 761493 INFO  (jetty-launcher-2596-thread-2) [    ] o.a.s.c.s.e.JettySolrRunner Jetty properties: {hostContext=/solr, hostPort=46467}
   [junit4]   2> 761493 ERROR (jetty-launcher-2596-thread-2) [    ] o.a.s.u.StartupLoggingUtils Missing Java Option solr.log.dir. Logging may be missing or incomplete.
   [junit4]   2> 761493 INFO  (jetty-launcher-2596-thread-2) [    ] o.a.s.s.SolrDispatchFilter Using logger factory org.apache.logging.slf4j.Log4jLoggerFactory
   [junit4]   2> 761493 INFO  (jetty-launcher-2596-thread-2) [    ] o.a.s.s.SolrDispatchFilter  ___      _       Welcome to Apache Solr™ version 7.6.0
   [junit4]   2> 761493 INFO  (jetty-launcher-2596-thread-2) [    ] o.a.s.s.SolrDispatchFilter / __| ___| |_ _   Starting in cloud mode on port null
   [junit4]   2> 761493 INFO  (jetty-launcher-2596-thread-2) [    ] o.a.s.s.SolrDispatchFilter \__ \/ _ \ | '_|  Install dir: null
   [junit4]   2> 761493 INFO  (jetty-launcher-2596-thread-2) [    ] o.a.s.s.SolrDispatchFilter |___/\___/_|_|    Start time: 2018-09-28T08:11:06.121549Z
   [junit4]   2> 761519 INFO  (jetty-launcher-2596-thread-1) [    ] o.e.j.s.session DefaultSessionIdManager workerName=node0
   [junit4]   2> 761519 INFO  (jetty-launcher-2596-thread-1) [    ] o.e.j.s.session No SessionScavenger set, using defaults
   [junit4]   2> 761519 INFO  (jetty-launcher-2596-thread-1) [    ] o.e.j.s.session node0 Scavenging every 600000ms
   [junit4]   2> 761523 INFO  (zkConnectionManagerCallback-2601-thread-1) [    ] o.a.s.c.c.ConnectionManager zkClient has connected
   [junit4]   2> 761524 INFO  (jetty-launcher-2596-thread-2) [    ] o.a.s.s.SolrDispatchFilter solr.xml found in ZooKeeper. Loading...
   [junit4]   2> 761531 INFO  (jetty-launcher-2596-thread-1) [    ] o.e.j.s.h.ContextHandler Started o.e.j.s.ServletContextHandler@55d2556f{/solr,null,AVAILABLE}
   [junit4]   2> 761532 INFO  (jetty-launcher-2596-thread-1) [    ] o.e.j.s.AbstractConnector Started ServerConnector@9fa1677{SSL,[ssl, http/1.1]}{127.0.0.1:46107}
   [junit4]   2> 761532 INFO  (jetty-launcher-2596-thread-1) [    ] o.e.j.s.Server Started @761564ms
   [junit4]   2> 761532 INFO  (jetty-launcher-2596-thread-1) [    ] o.a.s.c.s.e.JettySolrRunner Jetty properties: {hostContext=/solr, hostPort=46107}
   [junit4]   2> 761532 ERROR (jetty-launcher-2596-thread-1) [    ] o.a.s.u.StartupLoggingUtils Missing Java Option solr.log.dir. Logging may be missing or incomplete.
   [junit4]   2> 761532 INFO  (jetty-launcher-2596-thread-1) [    ] o.a.s.s.SolrDispatchFilter Using logger factory org.apache.logging.slf4j.Log4jLoggerFactory
   [junit4]   2> 761532 INFO  (jetty-launcher-2596-thread-1) [    ] o.a.s.s.SolrDispatchFilter  ___      _       Welcome to Apache Solr™ version 7.6.0
   [junit4]   2> 761532 INFO  (jetty-launcher-2596-thread-1) [    ] o.a.s.s.SolrDispatchFilter / __| ___| |_ _   Starting in cloud mode on port null
   [junit4]   2> 761532 INFO  (jetty-launcher-2596-thread-1) [    ] o.a.s.s.SolrDispatchFilter \__ \/ _ \ | '_|  Install dir: null
   [junit4]   2> 761532 INFO  (jetty-launcher-2596-thread-1) [    ] o.a.s.s.SolrDispatchFilter |___/\___/_|_|    Start time: 2018-09-28T08:11:06.160953Z
   [junit4]   2> 761560 INFO  (zkConnectionManagerCallback-2603-thread-1) [    ] o.a.s.c.c.ConnectionManager zkClient has connected
   [junit4]   2> 761560 INFO  (jetty-launcher-2596-thread-1) [    ] o.a.s.s.SolrDispatchFilter solr.xml found in ZooKeeper. Loading...
   [junit4]   2> 761656 INFO  (jetty-launcher-2596-thread-1) [    ] o.a.s.c.ZkContainer Zookeeper client=127.0.0.1:43521/solr
   [junit4]   2> 761683 INFO  (zkConnectionManagerCallback-2607-thread-1) [    ] o.a.s.c.c.ConnectionManager zkClient has connected
   [junit4]   2> 761720 INFO  (zkConnectionManagerCallback-2609-thread-1) [    ] o.a.s.c.c.ConnectionManager zkClient has connected
   [junit4]   2> 761737 INFO  (jetty-launcher-2596-thread-2) [    ] o.a.s.c.ZkContainer Zookeeper client=127.0.0.1:43521/solr
   [junit4]   2> 761778 INFO  (zkConnectionManagerCallback-2613-thread-1) [    ] o.a.s.c.c.ConnectionManager zkClient has connected
   [junit4]   2> 761803 INFO  (jetty-launcher-2596-thread-1) [n:127.0.0.1:46107_solr    ] o.a.s.c.OverseerElectionContext I am going to be the leader 127.0.0.1:46107_solr
   [junit4]   2> 761804 INFO  (jetty-launcher-2596-thread-1) [n:127.0.0.1:46107_solr    ] o.a.s.c.Overseer Overseer (id=72301253184126980-127.0.0.1:46107_solr-n_0000000000) starting
   [junit4]   2> 761811 INFO  (zkConnectionManagerCallback-2617-thread-1) [    ] o.a.s.c.c.ConnectionManager zkClient has connected
   [junit4]   2> 761817 INFO  (jetty-launcher-2596-thread-2) [n:127.0.0.1:46467_solr    ] o.a.s.c.ZkController Register node as live in ZooKeeper:/live_nodes/127.0.0.1:46467_solr
   [junit4]   2> 761842 INFO  (zkCallback-2608-thread-1) [    ] o.a.s.c.c.ZkStateReader Updated live nodes from ZooKeeper... (0) -> (1)
   [junit4]   2> 761852 INFO  (zkCallback-2616-thread-1) [    ] o.a.s.c.c.ZkStateReader Updated live nodes from ZooKeeper... (0) -> (1)
   [junit4]   2> 761871 INFO  (zkConnectionManagerCallback-2622-thread-1) [    ] o.a.s.c.c.ConnectionManager zkClient has connected
   [junit4]   2> 761872 INFO  (jetty-launcher-2596-thread-1) [n:127.0.0.1:46107_solr    ] o.a.s.c.c.ZkStateReader Updated live nodes from ZooKeeper... (0) -> (1)
   [junit4]   2> 761873 INFO  (jetty-launcher-2596-thread-1) [n:127.0.0.1:46107_solr    ] o.a.s.c.s.i.ZkClientClusterStateProvider Cluster at 127.0.0.1:43521/solr ready
   [junit4]   2> 761893 INFO  (OverseerStateUpdate-72301253184126980-127.0.0.1:46107_solr-n_0000000000) [n:127.0.0.1:46107_solr    ] o.a.s.c.Overseer Starting to work on the main queue : 127.0.0.1:46107_solr
   [junit4]   2> 761904 INFO  (jetty-launcher-2596-thread-1) [n:127.0.0.1:46107_solr    ] o.a.s.c.TransientSolrCoreCacheDefault Allocating transient cache for 2147483647 transient cores
   [junit4]   2> 761904 INFO  (jetty-launcher-2596-thread-1) [n:127.0.0.1:46107_solr    ] o.a.s.c.ZkController Register node as live in ZooKeeper:/live_nodes/127.0.0.1:46107_solr
   [junit4]   2> 761905 INFO  (zkCallback-2616-thread-1) [    ] o.a.s.c.c.ZkStateReader Updated live nodes from ZooKeeper... (1) -> (2)
   [junit4]   2> 761911 INFO  (zkCallback-2608-thread-1) [    ] o.a.s.c.c.ZkStateReader Updated live nodes from ZooKeeper... (1) -> (2)
   [junit4]   2> 761933 INFO  (jetty-launcher-2596-thread-1) [n:127.0.0.1:46107_solr    ] o.a.s.h.a.MetricsHistoryHandler No .system collection, keeping metrics history in memory.
   [junit4]   2> 761952 INFO  (zkConnectionManagerCallback-2629-thread-1) [    ] o.a.s.c.c.ConnectionManager zkClient has connected
   [junit4]   2> 761953 INFO  (zkCallback-2621-thread-1) [    ] o.a.s.c.c.ZkStateReader Updated live nodes from ZooKeeper... (1) -> (2)
   [junit4]   2> 761954 INFO  (jetty-launcher-2596-thread-2) [n:127.0.0.1:46467_solr    ] o.a.s.c.c.ZkStateReader Updated live nodes from ZooKeeper... (0) -> (2)
   [junit4]   2> 761955 INFO  (jetty-launcher-2596-thread-2) [n:127.0.0.1:46467_solr    ] o.a.s.c.s.i.ZkClientClusterStateProvider Cluster at 127.0.0.1:43521/solr ready
   [junit4]   2> 761958 INFO  (jetty-launcher-2596-thread-1) [n:127.0.0.1:46107_solr    ] o.a.s.m.r.SolrJmxReporter JMX monitoring for 'solr_46107.solr.node' (registry 'solr.node') enabled at server: com.sun.jmx.mbeanserver.JmxMBeanServer@29951780
   [junit4]   2> 761963 INFO  (jetty-launcher-2596-thread-1) [n:127.0.0.1:46107_solr    ] o.a.s.m.r.SolrJmxReporter JMX monitoring for 'solr_46107.solr.jvm' (registry 'solr.jvm') enabled at server: com.sun.jmx.mbeanserver.JmxMBeanServer@29951780
   [junit4]   2> 761963 INFO  (jetty-launcher-2596-thread-1) [n:127.0.0.1:46107_solr    ] o.a.s.m.r.SolrJmxReporter JMX monitoring for 'solr_46107.solr.jetty' (registry 'solr.jetty') enabled at server: com.sun.jmx.mbeanserver.JmxMBeanServer@29951780
   [junit4]   2> 761964 INFO  (jetty-launcher-2596-thread-1) [n:127.0.0.1:46107_solr    ] o.a.s.c.CorePropertiesLocator Found 0 core definitions underneath /home/jenkins/workspace/Lucene-Solr-7.x-Linux/solr/build/solr-core/test/J0/temp/solr.cloud.api.collections.CollectionsAPIAsyncDistributedZkTest_86AE232BCF5DDDF6-001/tempDir-001/node1/.
   [junit4]   2> 761979 INFO  (jetty-launcher-2596-thread-2) [n:127.0.0.1:46467_solr    ] o.a.s.h.a.MetricsHistoryHandler No .system collection, keeping metrics history in memory.
   [junit4]   2> 761997 INFO  (jetty-launcher-2596-thread-2) [n:127.0.0.1:46467_solr    ] o.a.s.m.r.SolrJmxReporter JMX monitoring for 'solr_46467.solr.node' (registry 'solr.node') enabled at server: com.sun.jmx.mbeanserver.JmxMBeanServer@29951780
   [junit4]   2> 762013 INFO  (jetty-launcher-2596-thread-2) [n:127.0.0.1:46467_solr    ] o.a.s.m.r.SolrJmxReporter JMX monitoring for 'solr_46467.solr.jvm' (registry 'solr.jvm') enabled at server: com.sun.jmx.mbeanserver.JmxMBeanServer@29951780
   [junit4]   2> 762013 INFO  (jetty-launcher-2596-thread-2) [n:127.0.0.1:46467_solr    ] o.a.s.m.r.SolrJmxReporter JMX monitoring for 'solr_46467.solr.jetty' (registry 'solr.jetty') enabled at server: com.sun.jmx.mbeanserver.JmxMBeanServer@29951780
   [junit4]   2> 762014 INFO  (jetty-launcher-2596-thread-2) [n:127.0.0.1:46467_solr    ] o.a.s.c.CorePropertiesLocator Found 0 core definitions underneath /home/jenkins/workspace/Lucene-Solr-7.x-Linux/solr/build/solr-core/test/J0/temp/solr.cloud.api.collections.CollectionsAPIAsyncDistributedZkTest_86AE232BCF5DDDF6-001/tempDir-001/node2/.
   [junit4]   2> 762038 INFO  (zkConnectionManagerCallback-2633-thread-1) [    ] o.a.s.c.c.ConnectionManager zkClient has connected
   [junit4]   2> 762053 INFO  (zkConnectionManagerCallback-2638-thread-1) [    ] o.a.s.c.c.ConnectionManager zkClient has connected
   [junit4]   2> 762054 INFO  (SUITE-CollectionsAPIAsyncDistributedZkTest-seed#[86AE232BCF5DDDF6]-worker) [    ] o.a.s.c.c.ZkStateReader Updated live nodes from ZooKeeper... (0) -> (2)
   [junit4]   2> 762054 INFO  (SUITE-CollectionsAPIAsyncDistributedZkTest-seed#[86AE232BCF5DDDF6]-worker) [    ] o.a.s.c.s.i.ZkClientClusterStateProvider Cluster at 127.0.0.1:43521/solr ready
   [junit4]   2> 762066 INFO  (TEST-CollectionsAPIAsyncDistributedZkTest.testAsyncIdRaceCondition-seed#[86AE232BCF5DDDF6]) [    ] o.a.s.SolrTestCaseJ4 ###Starting testAsyncIdRaceCondition
   [junit4]   2> 762099 INFO  (qtp1192465965-10485) [n:127.0.0.1:46107_solr    ] o.a.s.h.a.CollectionsHandler Invoked Collection Action :create with params async=c1069874-0aff-4f16-9648-5ab8ca90d05a&shards=shard1&collection.configName=conf1&name=testAsyncIdRaceCondition&router.name=implicit&nrtReplicas=1&action=CREATE&numShards=1&wt=javabin&version=2 and sendToOCPQueue=true
   [junit4]   2> 762101 INFO  (qtp1192465965-10485) [n:127.0.0.1:46107_solr    ] o.a.s.s.HttpSolrCall [admin] webapp=null path=/admin/collections params={async=c1069874-0aff-4f16-9648-5ab8ca90d05a&shards=shard1&collection.configName=conf1&name=testAsyncIdRaceCondition&router.name=implicit&nrtReplicas=1&action=CREATE&numShards=1&wt=javabin&version=2} status=0 QTime=2
   [junit4]   2> 762103 INFO  (qtp1192465965-10485) [n:127.0.0.1:46107_solr    ] o.a.s.h.a.CollectionsHandler Invoked Collection Action :requeststatus with params requestid=c1069874-0aff-4f16-9648-5ab8ca90d05a&action=REQUESTSTATUS&wt=javabin&version=2 and sendToOCPQueue=true
   [junit4]   2> 762104 INFO  (qtp1192465965-10485) [n:127.0.0.1:46107_solr    ] o.a.s.s.HttpSolrCall [admin] webapp=null path=/admin/collections params={requestid=c1069874-0aff-4f16-9648-5ab8ca90d05a&action=REQUESTSTATUS&wt=javabin&version=2} status=0 QTime=1
   [junit4]   2> 762116 INFO  (OverseerThreadFactory-4026-thread-1-processing-n:127.0.0.1:46107_solr) [n:127.0.0.1:46107_solr    ] o.a.s.c.a.c.CreateCollectionCmd Create collection testAsyncIdRaceCondition
   [junit4]   2> 762222 INFO  (OverseerStateUpdate-72301253184126980-127.0.0.1:46107_solr-n_0000000000) [n:127.0.0.1:46107_solr    ] o.a.s.c.o.SliceMutator createReplica() {
   [junit4]   2>   "operation":"ADDREPLICA",
   [junit4]   2>   "collection":"testAsyncIdRaceCondition",
   [junit4]   2>   "shard":"shard1",
   [junit4]   2>   "core":"testAsyncIdRaceCondition_shard1_replica_n1",
   [junit4]   2>   "state":"down",
   [junit4]   2>   "base_url":"https://127.0.0.1:46107/solr",
   [junit4]   2>   "type":"NRT",
   [junit4]   2>   "waitForFinalState":"false"} 
   [junit4]   2> 762434 INFO  (qtp1192465965-10497) [n:127.0.0.1:46107_solr    x:testAsyncIdRaceCondition_shard1_replica_n1] o.a.s.s.HttpSolrCall [admin] webapp=null path=/admin/cores params={qt=/admin/cores&collection.configName=conf1&newCollection=true&collection=testAsyncIdRaceCondition&version=2&replicaType=NRT&async=c1069874-0aff-4f16-9648-5ab8ca90d05a3717944478242006&coreNodeName=core_node2&name=testAsyncIdRaceCondition_shard1_replica_n1&action=CREATE&numShards=1&shard=shard1&wt=javabin} status=0 QTime=0
   [junit4]   2> 762434 INFO  (parallelCoreAdminExecutor-4027-thread-1-processing-n:127.0.0.1:46107_solr x:testAsyncIdRaceCondition_shard1_replica_n1 c1069874-0aff-4f16-9648-5ab8ca90d05a3717944478242006 CREATE) [n:127.0.0.1:46107_solr    x:testAsyncIdRaceCondition_shard1_replica_n1] o.a.s.h.a.CoreAdminOperation core create command qt=/admin/cores&collection.configName=conf1&newCollection=true&collection=testAsyncIdRaceCondition&version=2&replicaType=NRT&async=c1069874-0aff-4f16-9648-5ab8ca90d05a3717944478242006&coreNodeName=core_node2&name=testAsyncIdRaceCondition_shard1_replica_n1&action=CREATE&numShards=1&shard=shard1&wt=javabin
   [junit4]   2> 762451 INFO  (qtp1192465965-10493) [n:127.0.0.1:46107_solr    ] o.a.s.h.a.CoreAdminOperation Checking request status for : c1069874-0aff-4f16-9648-5ab8ca90d05a3717944478242006
   [junit4]   2> 762451 INFO  (qtp1192465965-10493) [n:127.0.0.1:46107_solr    ] o.a.s.s.HttpSolrCall [admin] webapp=null path=/admin/cores params={qt=/admin/cores&requestid=c1069874-0aff-4f16-9648-5ab8ca90d05a3717944478242006&action=REQUESTSTATUS&wt=javabin&version=2} status=0 QTime=0
   [junit4]   2> 763105 INFO  (qtp1192465965-10494) [n:127.0.0.1:46107_solr    ] o.a.s.h.a.CollectionsHandler Invoked Collection Action :requeststatus with params requestid=c1069874-0aff-4f16-9648-5ab8ca90d05a&action=REQUESTSTATUS&wt=javabin&version=2 and sendToOCPQueue=true
   [junit4]   2> 763110 INFO  (qtp1192465965-10494) [n:127.0.0.1:46107_solr    ] o.a.s.s.HttpSolrCall [admin] webapp=null path=/admin/collections params={requestid=c1069874-0aff-4f16-9648-5ab8ca90d05a&action=REQUESTSTATUS&wt=javabin&version=2} status=0 QTime=5
   [junit4]   2> 763452 INFO  (qtp1192465965-10497) [n:127.0.0.1:46107_solr    ] o.a.s.h.a.CoreAdminOperation Checking request status for : c1069874-0aff-4f16-9648-5ab8ca90d05a3717944478242006
   [junit4]   2> 763452 INFO  (qtp1192465965-10497) [n:127.0.0.1:46107_solr    ] o.a.s.s.HttpSolrCall [admin] webapp=null path=/admin/cores params={qt=/admin/cores&requestid=c1069874-0aff-4f16-9648-5ab8ca90d05a3717944478242006&action=REQUESTSTATUS&wt=javabin&version=2} status=0 QTime=0
   [junit4]   2> 763459 INFO  (parallelCoreAdminExecutor-4027-thread-1-processing-n:127.0.0.1:46107_solr x:testAsyncIdRaceCondition_shard1_replica_n1 c1069874-0aff-4f16-9648-5ab8ca90d05a3717944478242006 CREATE) [n:127.0.0.1:46107_solr c:testAsyncIdRaceCondition s:shard1 r:core_node2 x:testAsyncIdRaceCondition_shard1_replica_n1] o.a.s.c.SolrConfig Using Lucene MatchVersion: 7.6.0
   [junit4]   2> 763465 INFO  (parallelCoreAdminExecutor-4027-thread-1-processing-n:127.0.0.1:46107_solr x:testAsyncIdRaceCondition_shard1_replica_n1 c1069874-0aff-4f16-9648-5ab8ca90d05a3717944478242006 CREATE) [n:127.0.0.1:46107_solr c:testAsyncIdRaceCondition s:shard1 r:core_node2 x:testAsyncIdRaceCondition_shard1_replica_n1] o.a.s.s.IndexSchema [testAsyncIdRaceCondition_shard1_replica_n1] Schema name=minimal
   [junit4]   2> 763478 INFO  (parallelCoreAdminExecutor-4027-thread-1-processing-n:127.0.0.1:46107_solr x:testAsyncIdRaceCondition_shard1_replica_n1 c1069874-0aff-4f16-9648-5ab8ca90d05a3717944478242006 CREATE) [n:127.0.0.1:46107_solr c:testAsyncIdRaceCondition s:shard1 r:core_node2 x:testAsyncIdRaceCondition_shard1_replica_n1] o.a.s.s.IndexSchema Loaded schema minimal/1.1 with uniqueid field id
   [junit4]   2> 763479 INFO  (parallelCoreAdminExecutor-4027-thread-1-processing-n:127.0.0.1:46107_solr x:testAsyncIdRaceCondition_shard1_replica_n1 c1069874-0aff-4f16-9648-5ab8ca90d05a3717944478242006 CREATE) [n:127.0.0.1:46107_solr c:testAsyncIdRaceCondition s:shard1 r:core_node2 x:testAsyncIdRaceCondition_shard1_replica_n1] o.a.s.c.CoreContainer Creating SolrCore 'testAsyncIdRaceCondition_shard1_replica_n1' using configuration from collection testAsyncIdRaceCondition, trusted=true
   [junit4]   2> 763480 INFO  (parallelCoreAdminExecutor-4027-thread-1-processing-n:127.0.0.1:46107_solr x:testAsyncIdRaceCondition_shard1_replica_n1 c1069874-0aff-4f16-9648-5ab8ca90d05a3717944478242006 CREATE) [n:127.0.0.1:46107_solr c:testAsyncIdRaceCondition s:shard1 r:core_node2 x:testAsyncIdRaceCondition_shard1_replica_n1] o.a.s.m.r.SolrJmxReporter JMX monitoring for 'solr_46107.solr.core.testAsyncIdRaceCondition.shard1.replica_n1' (registry 'solr.core.testAsyncIdRaceCondition.shard1.replica_n1') enabled at server: com.sun.jmx.mbeanserver.JmxMBeanServer@29951780
   [junit4]   2> 763480 INFO  (parallelCoreAdminExecutor-4027-thread-1-processing-n:127.0.0.1:46107_solr x:testAsyncIdRaceCondition_shard1_replica_n1 c1069874-0aff-4f16-9648-5ab8ca90d05a3717944478242006 CREATE) [n:127.0.0.1:46107_solr c:testAsyncIdRaceCondition s:shard1 r:core_node2 x:testAsyncIdRaceCondition_shard1_replica_n1] o.a.s.c.SolrCore [[testAsyncIdRaceCondition_shard1_replica_n1] ] Opening new SolrCore at [/home/jenkins/workspace/Lucene-Solr-7.x-Linux/solr/build/solr-core/test/J0/temp/solr.cloud.api.collections.CollectionsAPIAsyncDistributedZkTest_86AE232BCF5DDDF6-001/tempDir-001/node1/testAsyncIdRaceCondition_shard1_replica_n1], dataDir=[/home/jenkins/workspace/Lucene-Solr-7.x-Linux/solr/build/solr-core/test/J0/temp/solr.cloud.api.collections.CollectionsAPIAsyncDistributedZkTest_86AE232BCF5DDDF6-001/tempDir-001/node1/./testAsyncIdRaceCondition_shard1_replica_n1/data/]
   [junit4]   2> 763556 INFO  (parallelCoreAdminExecutor-4027-thread-1-processing-n:127.0.0.1:46107_solr x:testAsyncIdRaceCondition_shard1_replica_n1 c1069874-0aff-4f16-9648-5ab8ca90d05a3717944478242006 CREATE) [n:127.0.0.1:46107_solr c:testAsyncIdRaceCondition s:shard1 r:core_node2 x:testAsyncIdRaceCondition_shard1_replica_n1] o.a.s.u.UpdateHandler Using UpdateLog implementation: org.apache.solr.update.UpdateLog
   [junit4]   2> 763556 INFO  (parallelCoreAdminExecutor-4027-thread-1-processing-n:127.0.0.1:46107_solr x:testAsyncIdRaceCondition_shard1_replica_n1 c1069874-0aff-4f16-9648-5ab8ca90d05a3717944478242006 CREATE) [n:127.0.0.1:46107_solr c:testAsyncIdRaceCondition s:shard1 r:core_node2 x:testAsyncIdRaceCondition_shard1_replica_n1] o.a.s.u.UpdateLog Initializing UpdateLog: dataDir=null defaultSyncLevel=FLUSH numRecordsToKeep=100 maxNumLogsToKeep=10 numVersionBuckets=65536
   [junit4]   2> 763559 INFO  (parallelCoreAdminExecutor-4027-thread-1-processing-n:127.0.0.1:46107_solr x:testAsyncIdRaceCondition_shard1_replica_n1 c1069874-0aff-4f16-9648-5ab8ca90d05a3717944478242006 CREATE) [n:127.0.0.1:46107_solr c:testAsyncIdRaceCondition s:shard1 r:core_node2 x:testAsyncIdRaceCondition_shard1_replica_n1] o.a.s.u.CommitTracker Hard AutoCommit: disabled
   [junit4]   2> 763559 INFO  (parallelCoreAdminExecutor-4027-thread-1-processing-n:127.0.0.1:46107_solr x:testAsyncIdRaceCondition_shard1_replica_n1 c1069874-0aff-4f16-9648-5ab8ca90d05a3717944478242006 CREATE) [n:127.0.0.1:46107_solr c:testAsyncIdRaceCondition s:shard1 r:core_node2 x:testAsyncIdRaceCondition_shard1_replica_n1] o.a.s.u.CommitTracker Soft AutoCommit: disabled
   [junit4]   2> 763560 INFO  (parallelCoreAdminExecutor-4027-thread-1-processing-n:127.0.0.1:46107_solr x:testAsyncIdRaceCondition_shard1_replica_n1 c1069874-0aff-4f16-9648-5ab8ca90d05a3717944478242006 CREATE) [n:127.0.0.1:46107_solr c:testAsyncIdRaceCondition s:shard1 r:core_node2 x:testAsyncIdRaceCondition_shard1_replica_n1] o.a.s.s.SolrIndexSearcher Opening [Searcher@5cd72ccd[testAsyncIdRaceCondition_shard1_replica_n1] main]
   [junit4]   2> 763569 INFO  (parallelCoreAdminExecutor-4027-thread-1-processing-n:127.0.0.1:46107_solr x:testAsyncIdRaceCondition_shard1_replica_n1 c1069874-0aff-4f16-9648-5ab8ca90d05a3717944478242006 CREATE) [n:127.0.0.1:46107_solr c:testAsyncIdRaceCondition s:shard1 r:core_node2 x:testAsyncIdRaceCondition_shard1_replica_n1] o.a.s.r.ManagedResourceStorage Configured ZooKeeperStorageIO with znodeBase: /configs/conf1
   [junit4]   2> 763570 INFO  (parallelCoreAdminExecutor-4027-thread-1-processing-n:127.0.0.1:46107_solr x:testAsyncIdRaceCondition_shard1_replica_n1 c1069874-0aff-4f16-9648-5ab8ca90d05a3717944478242006 CREATE) [n:127.0.0.1:46107_solr c:testAsyncIdRaceCondition s:shard1 r:core_node2 x:testAsyncIdRaceCondition_shard1_replica_n1] o.a.s.r.ManagedResourceStorage Loaded null at path _rest_managed.json using ZooKeeperStorageIO:path=/configs/conf1
   [junit4]   2> 763570 INFO  (parallelCoreAdminExecutor-4027-thread-1-processing-n:127.0.0.1:46107_solr x:testAsyncIdRaceCondition_shard1_replica_n1 c1069874-0aff-4f16-9648-5ab8ca90d05a3717944478242006 CREATE) [n:127.0.0.1:46107_solr c:testAsyncIdRaceCondition s:shard1 r:core_node2 x:testAsyncIdRaceCondition_shard1_replica_n1] o.a.s.h.ReplicationHandler Commits will be reserved for 10000ms.
   [junit4]   2> 763571 INFO  (parallelCoreAdminExecutor-4027-thread-1-processing-n:127.0.0.1:46107_solr x:testAsyncIdRaceCondition_shard1_replica_n1 c1069874-0aff-4f16-9648-5ab8ca90d05a3717944478242006 CREATE) [n:127.0.0.1:46107_solr c:testAsyncIdRaceCondition s:shard1 r:core_node2 x:testAsyncIdRaceCondition_shard1_replica_n1] o.a.s.u.UpdateLog Could not find max version in index or recent updates, using new clock 1612838095499034624
   [junit4]   2> 763571 INFO  (searcherExecutor-4034-thread-1-processing-x:testAsyncIdRaceCondition_shard1_replica_n1 c1069874-0aff-4f16-9648-5ab8ca90d05a3717944478242006 r:core_node2 CREATE n:127.0.0.1:46107_solr c:testAsyncIdRaceCondition s:shard1) [n:127.0.0.1:46107_solr c:testAsyncIdRaceCondition s:shard1 r:core_node2 x:testAsyncIdRaceCondition_shard1_replica_n1] o.a.s.c.SolrCore [testAsyncIdRaceCondition_shard1_replica_n1] Registered new searcher Searcher@5cd72ccd[testAsyncIdRaceCondition_shard1_replica_n1] main{ExitableDirectoryReader(UninvertingDirectoryReader())}
   [junit4]   2> 763575 INFO  (parallelCoreAdminExecutor-4027-thread-1-processing-n:127.0.0.1:46107_solr x:testAsyncIdRaceCondition_shard1_replica_n1 c1069874-0aff-4f16-9648-5ab8ca90d05a3717944478242006 CREATE) [n:127.0.0.1:46107_solr c:testAsyncIdRaceCondition s:shard1 r:core_node2 x:testAsyncIdRaceCondition_shard1_replica_n1] o.a.s.c.ZkShardTerms Successful update of terms at /collections/testAsyncIdRaceCondition/terms/shard1 to Terms{values={core_node2=0}, version=0}
   [junit4]   2> 763577 INFO  (parallelCoreAdminExecutor-4027-thread-1-processing-n:127.0.0.1:46107_solr x:testAsyncIdRaceCondition_shard1_replica_n1 c1069874-0aff-4f16-9648-5ab8ca90d05a3717944478242006 CREATE) [n:127.0.0.1:46107_solr c:testAsyncIdRaceCondition s:shard1 r:core_node2 x:testAsyncIdRaceCondition_shard1_replica_n1] o.a.s.c.ShardLeaderElectionContext Enough replicas found to continue.
   [junit4]   2> 763577 INFO  (parallelCoreAdminExecutor-4027-thread-1-processing-n:127.0.0.1:46107_solr x:testAsyncIdRaceCondition_shard1_replica_n1 c1069874-0aff-4f16-9648-5ab8ca90d05a3717944478242006 CREATE) [n:127.0.0.1:46107_solr c:testAsyncIdRaceCondition s:shard1 r:core_node2 x:testAsyncIdRaceCondition_shard1_replica_n1] o.a.s.c.ShardLeaderElectionContext I may be the new leader - try and sync
   [junit4]   2> 763577 INFO  (parallelCoreAdminExecutor-4027-thread-1-processing-n:127.0.0.1:46107_solr x:testAsyncIdRaceCondition_shard1_replica_n1 c1069874-0aff-4f16-9648-5ab8ca90d05a3717944478242006 CREATE) [n:127.0.0.1:46107_solr c:testAsyncIdRaceCondition s:shard1 r:core_node2 x:testAsyncIdRaceCondition_shard1_replica_n1] o.a.s.c.SyncStrategy Sync replicas to https://127.0.0.1:46107/solr/testAsyncIdRaceCondition_shard1_replica_n1/
   [junit4]   2> 763577 INFO  (parallelCoreAdminExecutor-4027-thread-1-processing-n:127.0.0.1:46107_solr x:testAsyncIdRaceCondition_shard1_replica_n1 c1069874-0aff-4f16-9648-5ab8ca90d05a3717944478242006 CREATE) [n:127.0.0.1:46107_solr c:testAsyncIdRaceCondition s:shard1 r:core_node2 x:testAsyncIdRaceCondition_shard1_replica_n1] o.a.s.c.SyncStrategy Sync Success - now sync replicas to me
   [junit4]   2> 763577 INFO  (parallelCoreAdminExecutor-4027-thread-1-processing-n:127.0.0.1:46107_solr x:testAsyncIdRaceCondition_shard1_replica_n1 c1069874-0aff-4f16-9648-5ab8ca90d05a3717944478242006 CREATE) [n:127.0.0.1:46107_solr c:testAsyncIdRaceCondition s:shard1 r:core_node2 x:testAsyncIdRaceCondition_shard1_replica_n1] o.a.s.c.SyncStrategy https://127.0.0.1:46107/solr/testAsyncIdRaceCondition_shard1_replica_n1/ has no replicas
   [junit4]   2> 763577 INFO  (parallelCoreAdminExecutor-4027-thread-1-processing-n:127.0.0.1:46107_solr x:testAsyncIdRaceCondition_shard1_replica_n1 c1069874-0aff-4f16-9648-5ab8ca90d05a3717944478242006 CREATE) [n:127.0.0.1:46107_solr c:testAsyncIdRaceCondition s:shard1 r:core_node2 x:testAsyncIdRaceCondition_shard1_replica_n1] o.a.s.c.ShardLeaderElectionContext Found all replicas participating in election, clear LIR
   [junit4]   2> 763585 INFO  (parallelCoreAdminExecutor-4027-thread-1-processing-n:127.0.0.1:46107_solr x:testAsyncIdRaceCondition_shard1_replica_n1 c1069874-0aff-4f16-9648-5ab8ca90d05a3717944478242006 CREATE) [n:127.0.0.1:46107_solr c:testAsyncIdRaceCondition s:shard1 r:core_node2 x:testAsyncIdRaceCondition_shard1_replica_n1] o.a.s.c.ShardLeaderElectionContext I am the new leader: https://127.0.0.1:46107/solr/testAsyncIdRaceCondition_shard1_replica_n1/ shard1
   [junit4]   2> 763688 INFO  (parallelCoreAdminExecutor-4027-thread-1-processing-n:127.0.0.1:46107_solr x:testAsyncIdRaceCondition_shard1_replica_n1 c1069874-0aff-4f16-9648-5ab8ca90d05a3717944478242006 CREATE) [n:127.0.0.1:46107_solr c:testAsyncIdRaceCondition s:shard1 r:core_node2 x:testAsyncIdRaceCondition_shard1_replica_n1] o.a.s.c.ZkController I am the leader, no recovery necessary
   [junit4]   2> 763790 INFO  (zkCallback-2608-thread-1) [    ] o.a.s.c.c.ZkStateReader A cluster state change: [WatchedEvent state:SyncConnected type:NodeDataChanged path:/collections/testAsyncIdRaceCondition/state.json] for collection [testAsyncIdRaceCondition] has occurred - updating... (live nodes size: [2])
   [junit4]   2> 764111 INFO  (qtp1192465965-10493) [n:127.0.0.1:46107_solr    ] o.a.s.h.a.CollectionsHandler Invoked Collection Action :requeststatus with params requestid=c1069874-0aff-4f16-9648-5ab8ca90d05a&action=REQUESTSTATUS&wt=javabin&version=2 and sendToOCPQueue=true
   [junit4]   2> 764112 INFO  (qtp1192465965-10493) [n:127.0.0.1:46107_solr    ] o.a.s.s.HttpSolrCall [admin] webapp=null path=/admin/collections params={requestid=c1069874-0aff-4f16-9648-5ab8ca90d05a&action=REQUESTSTATUS&wt=javabin&version=2} status=0 QTime=0
   [junit4]   2> 764454 INFO  (qtp1192465965-10497) [n:127.0.0.1:46107_solr    ] o.a.s.h.a.CoreAdminOperation Checking request status for : c1069874-0aff-4f16-9648-5ab8ca90d05a3717944478242006
   [junit4]   2> 764454 INFO  (qtp1192465965-10497) [n:127.0.0.1:46107_solr    ] o.a.s.s.HttpSolrCall [admin] webapp=null path=/admin/cores params={qt=/admin/cores&requestid=c1069874-0aff-4f16-9648-5ab8ca90d05a3717944478242006&action=REQUESTSTATUS&wt=javabin&version=2} status=0 QTime=0
   [junit4]   2> 764455 INFO  (OverseerThreadFactory-4026-thread-1-processing-n:127.0.0.1:46107_solr) [n:127.0.0.1:46107_solr    ] o.a.s.c.OverseerTaskQueue Response ZK path: /overseer/collection-queue-work/qnr-0000000000 doesn't exist.  Requestor may have disconnected from ZooKeeper
   [junit4]   2> 765113 INFO  (qtp1192465965-10494) [n:127.0.0.1:46107_solr    ] o.a.s.h.a.CollectionsHandler Invoked Collection Action :requeststatus with params requestid=c1069874-0aff-4f16-9648-5ab8ca90d05a&action=REQUESTSTATUS&wt=javabin&version=2 and sendToOCPQueue=true
   [junit4]   2> 765113 INFO  (qtp1192465965-10494) [n:127.0.0.1:46107_solr    ] o.a.s.s.HttpSolrCall [admin] webapp=null path=/admin/collections params={requestid=c1069874-0aff-4f16-9648-5ab8ca90d05a&action=REQUESTSTATUS&wt=javabin&version=2} status=0 QTime=0
   [junit4]   2> 765114 INFO  (qtp1192465965-10497) [n:127.0.0.1:46107_solr    ] o.a.s.h.a.CollectionsHandler Invoked Collection Action :deletestatus with params requestid=c1069874-0aff-4f16-9648-5ab8ca90d05a&action=DELETESTATUS&wt=javabin&version=2 and sendToOCPQueue=true
   [junit4]   2> 765114 INFO  (qtp1192465965-10497) [n:127.0.0.1:46107_solr    ] o.a.s.s.HttpSolrCall [admin] webapp=null path=/admin/collections params={requestid=c1069874-0aff-4f16-9648-5ab8ca90d05a&action=DELETESTATUS&wt=javabin&version=2} status=0 QTime=0
   [junit4]   2> 765123 INFO  (testAsyncIdRaceCondition-4039-thread-10) [    ] o.a.s.c.a.c.CollectionsAPIAsyncDistributedZkTest testAsyncIdRaceCondition-4039-thread-10 - Reloading Collection.
   [junit4]   2> 765123 INFO  (testAsyncIdRaceCondition-4039-thread-5) [    ] o.a.s.c.a.c.CollectionsAPIAsyncDistributedZkTest testAsyncIdRaceCondition-4039-thread-5 - Reloading Collection.
   [junit4]   2> 765123 INFO  (testAsyncIdRaceCondition-4039-thread-6) [    ] o.a.s.c.a.c.CollectionsAPIAsyncDistributedZkTest testAsyncIdRaceCondition-4039-thread-6 - Reloading Collection.
   [junit4]   2> 765123 INFO  (testAsyncIdRaceCondition-4039-thread-7) [    ] o.a.s.c.a.c.CollectionsAPIAsyncDistributedZkTest testAsyncIdRaceCondition-4039-thread-7 - Reloading Collection.
   [junit4]   2> 765123 INFO  (testAsyncIdRaceCondition-4039-thread-4) [    ] o.a.s.c.a.c.CollectionsAPIAsyncDistributedZkTest testAsyncIdRaceCondition-4039-thread-4 - Reloading Collection.
   [junit4]   2> 765123 INFO  (testAsyncIdRaceCondition-4039-thread-2) [    ] o.a.s.c.a.c.CollectionsAPIAsyncDistributedZkTest testAsyncIdRaceCondition-4039-thread-2 - Reloading Collection.
   [junit4]   2> 765124 INFO  (testAsyncIdRaceCondition-4039-thread-8) [    ] o.a.s.c.a.c.CollectionsAPIAsyncDistributedZkTest testAsyncIdRaceCondition-4039-thread-8 - Reloading Collection.
   [junit4]   2> 765124 INFO  (testAsyncIdRaceCondition-4039-thread-9) [    ] o.a.s.c.a.c.CollectionsAPIAsyncDistributedZkTest testAsyncIdRaceCondition-4039-thread-9 - Reloading Collection.
   [junit4]   2> 765123 INFO  (testAsyncIdRaceCondition-4039-thread-1) [    ] o.a.s.c.a.c.CollectionsAPIAsyncDistributedZkTest testAsyncIdRaceCondition-4039-thread-1 - Reloading Collection.
   [junit4]   2> 765124 INFO  (testAsyncIdRaceCondition-4039-thread-3) [    ] o.a.s.c.a.c.CollectionsAPIAsyncDistributedZkTest testAsyncIdRaceCondition-4039-thread-3 - Reloading Collection.
   [junit4]   2> 765128 WARN  (qtp1192465965-10493) [n:127.0.0.1:46107_solr    ] o.e.j.u.t.s.EatWhatYouKill 
   [junit4]   2> java.util.NoSuchElementException: No value present
   [junit4]   2> 	at java.util.Optional.get(Optional.java:148) ~[?:?]
   [junit4]   2> 	at sun.security.ssl.ServerHello$T13ServerHelloProducer.produce(ServerHello.java:551) ~[?:?]
   [junit4]   2> 	at sun.security.ssl.SSLHandshake.produce(SSLHandshake.java:436) ~[?:?]
   [junit4]   2> 	at sun.security.ssl.ClientHello$T13ClientHelloConsumer.goServerHello(ClientHello.java:1189) ~[?:?]
   [junit4]   2> 	at sun.security.ssl.ClientHello$T13ClientHelloConsumer.consume(ClientHello.java:1125) ~[?:?]
   [junit4]   2> 	at sun.security.ssl.ClientHello$ClientHelloConsumer.onClientHello(ClientHello.java:831) ~[?:?]
   [junit4]   2> 	at sun.security.ssl.ClientHello$ClientHelloConsumer.consume(ClientHello.java:792) ~[?:?]
   [junit4]   2> 	at sun.security.ssl.SSLHandshake.consume(SSLHandshake.java:392) ~[?:?]
   [junit4]   2> 	at sun.security.ssl.HandshakeContext.dispatch(HandshakeContext.java:444) ~[?:?]
   [junit4]   2> 	at sun.security.ssl.SSLEngineImpl$DelegatedTask$DelegatedAction.run(SSLEngineImpl.java:1065) ~[?:?]
   [junit4]   2> 	at sun.security.ssl.SSLEngineImpl$DelegatedTask$DelegatedAction.run(SSLEngineImpl.java:1052) ~[?:?]
   [junit4]   2> 	at java.security.AccessController.doPrivileged(Native Method) ~[?:?]
   [junit4]   2> 	at sun.security.ssl.SSLEngineImpl$DelegatedTask.run(SSLEngineImpl.java:999) ~[?:?]
   [junit4]   2> 	at org.eclipse.jetty.io.ssl.SslConnection$DecryptedEndPoint.fill(SslConnection.java:775) ~[jetty-io-9.4.11.v20180605.jar:9.4.11.v20180605]
   [junit4]   2> 	at org.eclipse.jetty.server.HttpConnection.fillRequestBuffer(HttpConnection.java:331) ~[jetty-server-9.4.11.v20180605.jar:9.4.11.v20180605]
   [junit4]   2> 	at org.eclipse.jetty.server.HttpConnection.onFillable(HttpConnection.java:243) ~[jetty-server-9.4.11.v20180605.jar:9.4.11.v20180605]
   [junit4]   2> 	at org.eclipse.jetty.io.AbstractConnection$ReadCallback.succeeded(AbstractConnection.java:281) ~[jetty-io-9.4.11.v20180605.jar:9.4.11.v20180605]
   [junit4]   2> 	at org.eclipse.jetty.io.FillInterest.fillable(FillInterest.java:102) ~[jetty-io-9.4.11.v20180605.jar:9.4.11.v20180605]
   [junit4]   2> 	at org.eclipse.jetty.io.ssl.SslConnection.onFillable(SslConnection.java:291) ~[jetty-io-9.4.11.v20180605.jar:9.4.11.v20180605]
   [junit4]   2> 	at org.eclipse.jetty.io.ssl.SslConnection$3.succeeded(SslConnection.java:151) ~[jetty-io-9.4.11.v20180605.jar:9.4.11.v20180605]
   [junit4]   2> 	at org.eclipse.jetty.io.FillInterest.fillable(FillInterest.java:102) ~[jetty-io-9.4.11.v20180605.jar:9.4.11.v20180605]
   [junit4]   2> 	at org.eclipse.jetty.io.ChannelEndPoint$2.run(ChannelEndPoint.java:118) ~[jetty-io-9.4.11.v20180605.jar:9.4.11.v20180605]
   [junit4]   2> 	at org.eclipse.jetty.util.thread.strategy.EatWhatYouKill.runTask(EatWhatYouKill.java:333) [jetty-util-9.4.11.v20180605.jar:9.4.11.v20180605]
   [junit4]   2> 	at org.eclipse.jetty.util.thread.strategy.EatWhatYouKill.doProduce(EatWhatYouKill.java:310) [jetty-util-9.4.11.v20180605.jar:9.4.11.v20180605]
   [junit4]   2> 	at org.eclipse.jetty.util.thread.strategy.EatWhatYouKill.tryProduce(EatWhatYouKill.java:168) [jetty-util-9.4.11.v20180605.jar:9.4.11.v20180605]
   [junit4]   2> 	at org.eclipse.jetty.util.thread.strategy.EatWhatYouKill.run(EatWhatYouKill.java:126) [jetty-util-9.4.11.v20180605.jar:9.4.11.v20180605]
   [junit4]   2> 	at org.eclipse.jetty.util.thread.ReservedThreadExecutor$ReservedThread.run(ReservedThreadExecutor.java:366) [jetty-util-9.4.11.v20180605.jar:9.4.11.v20180605]
   [junit4]   2> 	at org.eclipse.jetty.util.thread.QueuedThreadPool.runJob(QueuedThreadPool.java:762) [jetty-util-9.4.11.v20180605.jar:9.4.11.v20180605]
   [junit4]   2> 	at org.eclipse.jetty.util.thread.QueuedThreadPool$2.run(QueuedThreadPool.java:680) [jetty-util-9.4.11.v20180605.jar:9.4.11.v20180605]
   [junit4]   2> 	at java.lang.Thread.run(Thread.java:835) [?:?]
   [junit4]   2> 765132 INFO  (testAsyncIdRaceCondition-4039-thread-7) [    ] o.a.h.i.e.RetryExec I/O exception (java.net.SocketException) caught when processing request to {s}->https://127.0.0.1:46107: Socket input is already shutdown
   [junit4]   2> 765132 INFO  (testAsyncIdRaceCondition-4039-thread-7) [    ] o.a.h.i.e.RetryExec Retrying request to {s}->https://127.0.0.1:46107
   [junit4]   2> 765137 INFO  (testAsyncIdRaceCondition-4039-thread-1) [    ] o.a.s.c.a.c.CollectionsAPIAsyncDistributedZkTest IOException occured when talking to server at: https://127.0.0.1:46107/solr
   [junit4]   2> 765138 INFO  (qtp1192465965-10557) [n:127.0.0.1:46107_solr    ] o.a.s.h.a.CollectionsHandler Invoked Collection Action :reload with params async=repeatedId&name=testAsyncIdRaceCondition&action=RELOAD&wt=javabin&version=2 and sendToOCPQueue=true
   [junit4]   2> 765143 INFO  (qtp1192465965-10557) [n:127.0.0.1:46107_solr    ] o.a.s.s.HttpSolrCall [admin] webapp=null path=/admin/collections params={async=repeatedId&name=testAsyncIdRaceCondition&action=RELOAD&wt=javabin&version=2} status=0 QTime=5
   [junit4]   2> 765146 INFO  (qtp1192465965-10489) [n:127.0.0.1:46107_solr    ] o.a.s.h.a.CollectionsHandler Invoked Collection Action :reload with params async=repeatedId&name=testAsyncIdRaceCondition&action=RELOAD&wt=javabin&version=2 and sendToOCPQueue=true
   [junit4]   2> 765146 INFO  (qtp1192465965-10489) [n:127.0.0.1:46107_solr    ] o.a.s.s.HttpSolrCall [admin] webapp=null path=/admin/collections params={async=repeatedId&name=testAsyncIdRaceCondition&action=RELOAD&wt=javabin&version=2} status=0 QTime=0
   [junit4]   2> 765147 INFO  (testAsyncIdRaceCondition-4039-thread-6) [    ] o.a.s.c.a.c.CollectionsAPIAsyncDistributedZkTest Task with the same requestid already exists.
   [junit4]   2> 765153 INFO  (qtp1192465965-10497) [n:127.0.0.1:46107_solr    ] o.a.s.h.a.CollectionsHandler Invoked Collection Action :reload with params async=repeatedId&name=testAsyncIdRaceCondition&action=RELOAD&wt=javabin&version=2 and sendToOCPQueue=true
   [junit4]   2> 765154 INFO  (qtp1192465965-10557) [n:127.0.0.1:46107_solr    ] o.a.s.h.a.CollectionsHandler Invoked Collection Action :reload with params async=repeatedId&name=testAsyncIdRaceCondition&action=RELOAD&wt=javabin&version=2 and sendToOCPQueue=true
   [junit4]   2> 765155 INFO  (qtp1192465965-10497) [n:127.0.0.1:46107_solr    ] o.a.s.s.HttpSolrCall [admin] webapp=null path=/admin/collections params={async=repeatedId&name=testAsyncIdRaceCondition&action=RELOAD&wt=javabin&version=2} status=0 QTime=2
   [junit4]   2> 765156 INFO  (qtp1192465965-10489) [n:127.0.0.1:46107_solr    ] o.a.s.h.a.CollectionsHandler Invoked Collection Action :reload with params async=repeatedId&name=testAsyncIdRaceCondition&action=RELOAD&wt=javabin&version=2 and sendToOCPQueue=true
   [junit4]   2> 765157 INFO  (qtp1192465965-10489) [n:127.0.0.1:46107_solr    ] o.a.s.s.HttpSolrCall [admin] webapp=null path=/admin/collections params={async=repeatedId&name=testAsyncIdRaceCondition&action=RELOAD&wt=javabin&version=2} status=0 QTime=0
   [junit4]   2> 765157 INFO  (testAsyncIdRaceCondition-4039-thread-4) [    ] o.a.s.c.a.c.CollectionsAPIAsyncDistributedZkTest Task with the same requestid already exists.
   [junit4]   2> 765163 INFO  (testAsyncIdRaceCondition-4039-thread-10) [    ] o.a.s.c.a.c.CollectionsAPIAsyncDistributedZkTest Task with the same requestid already exists.
   [junit4]   2> 765167 INFO  (OverseerThreadFactory-4026-thread-2-processing-n:127.0.0.1:46107_solr) [n:127.0.0.1:46107_solr    ] o.a.s.c.a.c.OverseerCollectionMessageHandler Executing Collection Cmd=action=RELOAD, asyncId=repeatedId
   [junit4]   2> 765168 INFO  (qtp1192465965-10494) [n:127.0.0.1:46107_solr    ] o.a.s.h.a.CollectionsHandler Invoked Collection Action :reload with params async=repeatedId&name=testAsyncIdRaceCondition&action=RELOAD&wt=javabin&version=2 and sendToOCPQueue=true
   [junit4]   2> 765168 INFO  (qtp1192465965-10487) [n:127.0.0.1:46107_solr    ] o.a.s.h.a.CollectionsHandler Invoked Collection Action :reload with params async=repeatedId&name=testAsyncIdRaceCondition&action=RELOAD&wt=javabin&version=2 and sendToOCPQueue=true
   [junit4]   2> 765168 INFO  (qtp1192465965-10557) [n:127.0.0.1:46107_solr    ] o.a.s.s.HttpSolrCall [admin] webapp=null path=/admin/collections params={async=repeatedId&name=testAsyncIdRaceCondition&action=RELOAD&wt=javabin&version=2} status=0 QTime=14
   [junit4]   2> 765169 INFO  (testAsyncIdRaceCondition-4039-thread-5) [    ] o.a.s.c.a.c.CollectionsAPIAsyncDistributedZkTest Task with the same requestid already exists.
   [junit4]   2> 765171 INFO  (qtp1192465965-10493) [n:127.0.0.1:46107_solr    ] o.a.s.h.a.CollectionsHandler Invoked Collection Action :reload with params async=repeatedId&name=testAsyncIdRaceCondition&action=RELOAD&wt=javabin&version=2 and sendToOCPQueue=true
   [junit4]   2> 765171 INFO  (OverseerCollectionConfigSetProcessor-72301253184126980-127.0.0.1:46107_solr-n_0000000000) [n:127.0.0.1:46107_solr    ] o.a.s.c.OverseerTaskQueue Response ZK path: /overseer/collection-queue-work/qnr-0000000000 doesn't exist.  Requestor may have disconnected from ZooKeeper
   [junit4]   2> 765171 INFO  (qtp1192465965-10485) [n:127.0.0.1:46107_solr    x:testAsyncIdRaceCondition_shard1_replica_n1] o.a.s.s.HttpSolrCall [admin] webapp=null path=/admin/cores params={core=testAsyncIdRaceCondition_shard1_replica_n1&async=repeatedId3717947424054206&qt=/admin/cores&action=RELOAD&wt=javabin&version=2} status=0 QTime=3
   [junit4]   2> 765172 INFO  (qtp1192465965-10494) [n:127.0.0.1:46107_solr    ] o.a.s.s.HttpSolrCall [admin] webapp=null path=/admin/collections params={async=repeatedId&name=testAsyncIdRaceCondition&action=RELOAD&wt=javabin&version=2} status=0 QTime=6
   [junit4]   2> 765172 INFO  (testAsyncIdRaceCondition-4039-thread-7) [    ] o.a.s.c.a.c.CollectionsAPIAsyncDistributedZkTest Task with the same requestid already exists.
   [junit4]   2> 765174 INFO  (qtp1192465965-10497) [n:127.0.0.1:46107_solr    ] o.a.s.h.a.CollectionsHandler Invoked Collection Action :reload with params async=repeatedId&name=testAsyncIdRaceCondition&action=RELOAD&wt=javabin&version=2 and sendToOCPQueue=true
   [junit4]   2> 765174 INFO  (qtp1192465965-10557) [n:127.0.0.1:46107_solr    ] o.a.s.h.a.CoreAdminOperation Checking request status for : repeatedId3717947424054206
   [junit4]   2> 765175 INFO  (qtp1192465965-10557) [n:127.0.0.1:46107_solr    ] o.a.s.s.HttpSolrCall [admin] webapp=null path=/admin/cores params={qt=/admin/cores&requestid=repeatedId3717947424054206&action=REQUESTSTATUS&wt=javabin&version=2} status=0 QTime=0
   [junit4]   2> 765175 INFO  (qtp1192465965-10497) [n:127.0.0.1:46107_solr    ] o.a.s.s.HttpSolrCall [admin] webapp=null path=/admin/collections params={async=repeatedId&name=testAsyncIdRaceCondition&action=RELOAD&wt=javabin&version=2} status=0 QTime=0
   [junit4]   2> 765175 INFO  (testAsyncIdRaceCondition-4039-thread-9) [    ] o.a.s.c.a.c.CollectionsAPIAsyncDistributedZkTest Task with the same requestid already exists.
   [junit4]   2> 765175 INFO  (qtp1192465965-10487) [n:127.0.0.1:46107_solr    ] o.a.s.s.HttpSolrCall [admin] webapp=null path=/admin/collections params={async=repeatedId&name=testAsyncIdRaceCondition&action=RELOAD&wt=javabin&version=2} status=0 QTime=6
   [junit4]   2> 765175 INFO  (qtp1192465965-10493) [n:127.0.0.1:46107_solr    ] o.a.s.s.HttpSolrCall [admin] webapp=null path=/admin/collections params={async=repeatedId&name=testAsyncIdRaceCondition&action=RELOAD&wt=javabin&version=2} status=0 QTime=4
   [junit4]   2> 765175 INFO  (testAsyncIdRaceCondition-4039-thread-3) [    ] o.a.s.c.a.c.CollectionsAPIAsyncDistributedZkTest Task with the same requestid already exists.
   [junit4]   2> 765175 INFO  (testAsyncIdRaceCondition-4039-thread-8) [    ] o.a.s.c.a.c.CollectionsAPIAsyncDistributedZkTest Task with the same requestid already exists.
   [junit4]   2> 765177 INFO  (TEST-CollectionsAPIAsyncDistributedZkTest.testAsyncIdRaceCondition-seed#[86AE232BCF5DDDF6]) [    ] o.a.s.SolrTestCaseJ4 ###Ending testAsyncIdRaceCondition
   [junit4]   2> 765177 INFO  (parallelCoreAdminExecutor-4027-thread-2-processing-n:127.0.0.1:46107_solr x:testAsyncIdRaceCondition_shard1_replica_n1 repeatedId3717947424054206 RELOAD) [n:127.0.0.1:46107_solr    x:testAsyncIdRaceCondition_shard1_replica_n1] o.a.s.c.SolrConfig Using Lucene MatchVersion: 7.6.0
   [junit4]   2> NOTE: reproduce with: ant test  -Dtestcase=CollectionsAPIAsyncDistributedZkTest -Dtests.method=testAsyncIdRaceCondition -Dtests.seed=86AE232BCF5DDDF6 -Dtests.multiplier=3 -Dtests.slow=true -Dtests.locale=ko -Dtests.timezone=Africa/Ndjamena -Dtests.asserts=true -Dtests.file.encoding=UTF-8
   [junit4] FAILURE 3.12s J0 | CollectionsAPIAsyncDistributedZkTest.testAsyncIdRaceCondition <<<
   [junit4]    > Throwable #1: java.lang.AssertionError: expected:<9> but was:<8>
   [junit4]    > 	at __randomizedtesting.SeedInfo.seed([86AE232BCF5DDDF6:D3234EC6A333245D]:0)
   [junit4]    > 	at org.apache.solr.cloud.api.collections.CollectionsAPIAsyncDistributedZkTest.testAsyncIdRaceCondition(CollectionsAPIAsyncDistributedZkTest.java:244)
   [junit4]    > 	at java.base/jdk.internal.reflect.NativeMethodAccessorImpl.invoke0(Native Method)
   [junit4]    > 	at java.base/jdk.internal.reflect.NativeMethodAccessorImpl.invoke(NativeMethodAccessorImpl.java:62)
   [junit4]    > 	at java.base/jdk.internal.reflect.DelegatingMethodAccessorImpl.invoke(DelegatingMethodAccessorImpl.java:43)
   [junit4]    > 	at java.base/java.lang.reflect.Method.invoke(Method.java:566)
   [junit4]    > 	at java.base/java.lang.Thread.run(Thread.java:835)
   [junit4]   2> 765182 INFO  (parallelCoreAdminExecutor-4027-thread-2-processing-n:127.0.0.1:46107_solr x:testAsyncIdRaceCondition_shard1_replica_n1 repeatedId3717947424054206 RELOAD) [n:127.0.0.1:46107_solr    x:testAsyncIdRaceCondition_shard1_replica_n1] o.a.s.s.IndexSchema [testAsyncIdRaceCondition_shard1_replica_n1] Schema name=minimal
   [junit4]   2> 765183 INFO  (parallelCoreAdminExecutor-4027-thread-2-processing-n:127.0.0.1:46107_solr x:testAsyncIdRaceCondition_shard1_replica_n1 repeatedId3717947424054206 RELOAD) [n:127.0.0.1:46107_solr    x:testAsyncIdRaceCondition_shard1_replica_n1] o.a.s.s.IndexSchema Loaded schema minimal/1.1 with uniqueid field id
   [junit4]   2> 765184 INFO  (parallelCoreAdminExecutor-4027-thread-2-processing-n:127.0.0.1:46107_solr x:testAsyncIdRaceCondition_shard1_replica_n1 repeatedId3717947424054206 RELOAD) [n:127.0.0.1:46107_solr    x:testAsyncIdRaceCondition_shard1_replica_n1] o.a.s.c.CoreContainer Reloading SolrCore 'testAsyncIdRaceCondition_shard1_replica_n1' using configuration from collection testAsyncIdRaceCondition
   [junit4]   2> 765202 INFO  (TEST-CollectionsAPIAsyncDistributedZkTest.testAsyncIdBackCompat-seed#[86AE232BCF5DDDF6]) [    ] o.a.s.SolrTestCaseJ4 ###Starting testAsyncIdBackCompat
   [junit4]   2> 765203 INFO  (qtp1192465965-10494) [n:127.0.0.1:46107_solr    ] o.a.s.h.a.CollectionsHandler Invoked Collection Action :create with params async=testAsyncIdBackCompat&collection.configName=conf1&name=testAsyncIdBackCompat&nrtReplicas=1&action=CREATE&numShards=1&wt=javabin&version=2 and sendToOCPQueue=true
   [junit4]   2> 765203 INFO  (qtp1192465965-10494) [n:127.0.0.1:46107_solr    ] o.a.s.s.HttpSolrCall [admin] webapp=null path=/admin/collections params={async=testAsyncIdBackCompat&collection.configName=conf1&name=testAsyncIdBackCompat&nrtReplicas=1&action=CREATE&numShards=1&wt=javabin&version=2} status=0 QTime=0
   [junit4]   2> 765204 INFO  (TEST-CollectionsAPIAsyncDistributedZkTest.testAsyncIdBackCompat-seed#[86AE232BCF5DDDF6]) [    ] o.a.s.SolrTestCaseJ4 ###Ending testAsyncIdBackCompat
   [junit4]   2> 765234 INFO  (parallelCoreAdminExecutor-4027-thread-2-processing-n:127.0.0.1:46107_solr x:testAsyncIdRaceCondition_shard1_replica_n1 repeatedId3717947424054206 RELOAD) [n:127.0.0.1:46107_solr c:testAsyncIdRaceCondition s:shard1 r:core_node2 x:testAsyncIdRaceCondition_shard1_replica_n1] o.a.s.m.r.SolrJmxReporter JMX monitoring for 'solr_46107.solr.core.testAsyncIdRaceCondition.shard1.replica_n1' (registry 'solr.core.testAsyncIdRaceCondition.shard1.replica_n1') enabled at server: com.sun.jmx.mbeanserver.JmxMBeanServer@29951780
   [junit4]   2> 765234 INFO  (parallelCoreAdminExecutor-4027-thread-2-processing-n:127.0.0.1:46107_solr x:testAsyncIdRaceCondition_shard1_replica_n1 repeatedId3717947424054206 RELOAD) [n:127.0.0.1:46107_solr c:testAsyncIdRaceCondition s:shard1 r:core_node2 x:testAsyncIdRaceCondition_shard1_replica_n1] o.a.s.c.SolrCore [[testAsyncIdRaceCondition_shard1_replica_n1] ] Opening new SolrCore at [/home/jenkins/workspace/Lucene-Solr-7.x-Linux/solr/build/solr-core/test/J0/temp/solr.cloud.api.collections.CollectionsAPIAsyncDistributedZkTest_86AE232BCF5DDDF6-001/tempDir-001/node1/testAsyncIdRaceCondition_shard1_replica_n1], dataDir=[/home/jenkins/workspace/Lucene-Solr-7.x-Linux/solr/build/solr-core/test/J0/temp/solr.cloud.api.collections.CollectionsAPIAsyncDistributedZkTest_86AE232BCF5DDDF6-001/tempDir-001/node1/./testAsyncIdRaceCondition_shard1_replica_n1/data/]
   [junit4]   2> 765248 INFO  (TEST-CollectionsAPIAsyncDistributedZkTest.testSolrJAPICalls-seed#[86AE232BCF5DDDF6]) [    ] o.a.s.SolrTestCaseJ4 ###Starting testSolrJAPICalls
   [junit4]   2> 765249 INFO  (qtp1192465965-10582) [n:127.0.0.1:46107_solr    ] o.a.s.h.a.CollectionsHandler Invoked Collection Action :create with params async=90b45aeb-dae6-46f4-a261-ff0fa0edd6c0&collection.configName=conf1&name=testasynccollectioncreation&nrtReplicas=1&action=CREATE&numShards=1&wt=javabin&version=2 and sendToOCPQueue=true
   [junit4]   2> 765251 INFO  (qtp1192465965-10582) [n:127.0.0.1:46107_solr    ] o.a.s.s.HttpSolrCall [admin] webapp=null path=/admin/collections params={async=90b45aeb-dae6-46f4-a261-ff0fa0edd6c0&collection.configName=conf1&name=testasynccollectioncreation&nrtReplicas=1&action=CREATE&numShards=1&wt=javabin&version=2} status=0 QTime=1
   [junit4]   2> 765251 INFO  (qtp1192465965-10494) [n:127.0.0.1:46107_solr    ] o.a.s.h.a.CollectionsHandler Invoked Collection Action :requeststatus with params requestid=90b45aeb-dae6-46f4-a261-ff0fa0edd6c0&action=REQUESTSTATUS&wt=javabin&version=2 and sendToOCPQueue=true
   [junit4]   2> 765256 INFO  (qtp1192465965-10494) [n:127.0.0.1:46107_solr    ] o.a.s.s.HttpSolrCall [admin] webapp=null path=/admin/collections params={requestid=90b45aeb-dae6-46f4-a261-ff0fa0edd6c0&action=REQUESTSTATUS&wt=javabin&version=2} status=0 QTime=5
   [junit4]   2> 765257 INFO  (OverseerThreadFactory-4026-thread-3-processing-n:127.0.0.1:46107_solr) [n:127.0.0.1:46107_solr    ] o.a.s.c.a.c.CreateCollectionCmd Create collection testasynccollectioncreation
   [junit4]   2> 765303 INFO  (parallelCoreAdminExecutor-4027-thread-2-processing-n:127.0.0.1:46107_solr x:testAsyncIdRaceCondition_shard1_replica_n1 repeatedId3717947424054206 RELOAD) [n:127.0.0.1:46107_solr c:testAsyncIdRaceCondition s:shard1 r:core_node2 x:testAsyncIdRaceCondition_shard1_replica_n1] o.a.s.u.CommitTracker Hard AutoCommit: disabled
   [junit4]   2> 765303 INFO  (parallelCoreAdminExecutor-4027-thread-2-processing-n:127.0.0.1:46107_solr x:testAsyncIdRaceCondition_shard1_replica_n1 repeatedId3717947424054206 RELOAD) [n:127.0.0.1:46107_solr c:testAsyncIdRaceCondition s:shard1 r:core_node2 x:testAsyncIdRaceCondition_shard1_replica_n1] o.a.s.u.CommitTracker Soft AutoCommit: disabled
   [junit4]   2> 765305 INFO  (parallelCoreAdminExecutor-4027-thread-2-processing-n:127.0.0.1:46107_solr x:testAsyncIdRaceCondition_shard1_replica_n1 repeatedId3717947424054206 RELOAD) [n:127.0.0.1:46107_solr c:testAsyncIdRaceCondition s:shard1 r:core_node2 x:testAsyncIdRaceCondition_shard1_replica_n1] o.a.s.s.SolrIndexSearcher Opening [Searcher@596dcd1b[testAsyncIdRaceCondition_shard1_replica_n1] main]
   [junit4]   2> 765306 INFO  (parallelCoreAdminExecutor-4027-thread-2-processing-n:127.0.0.1:46107_solr x:testAsyncIdRaceCondition_shard1_replica_n1 repeatedId3717947424054206 RELOAD) [n:127.0.0.1:46107_solr c:testAsyncIdRaceCondition s:shard1 r:core_node2 x:testAsyncIdRaceCondition_shard1_replica_n1] o.a.s.r.ManagedResourceStorage Configured ZooKeeperStorageIO with znodeBase: /configs/conf1
   [junit4]   2> 765306 INFO  (parallelCoreAdminExecutor-4027-thread-2-processing-n:127.0.0.1:46107_solr x:testAsyncIdRaceCondition_shard1_replica_n1 repeatedId3717947424054206 RELOAD) [n:127.0.0.1:46107_solr c:testAsyncIdRaceCondition s:shard1 r:core_node2 x:testAsyncIdRaceCondition_shard1_replica_n1] o.a.s.r.ManagedResourceStorage Loaded null at path _rest_managed.json using ZooKeeperStorageIO:path=/configs/conf1
   [junit4]   2> 765306 INFO  (parallelCoreAdminExecutor-4027-thread-2-processing-n:127.0.0.1:46107_solr x:testAsyncIdRaceCondition_shard1_replica_n1 repeatedId3717947424054206 RELOAD) [n:127.0.0.1:46107_solr c:testAsyncIdRaceCondition s:shard1 r:core_node2 x:testAsyncIdRaceCondition_shard1_replica_n1] o.a.s.h.ReplicationHandler Commits will be reserved for 10000ms.
   [junit4]   2> 765306 INFO  (parallelCoreAdminExecutor-4027-thread-2-processing-n:127.0.0.1:46107_solr x:testAsyncIdRaceCondition_shard1_replica_n1 repeatedId3717947424054206 RELOAD) [n:127.0.0.1:46107_solr c:testAsyncIdRaceCondition s:shard1 r:core_node2 x:testAsyncIdRaceCondition_shard1_replica_n1] o.a.s.u.UpdateLog Could not find max version in index or recent updates, using new clock 1612838097318313984
   [junit4]   2> 765309 INFO  (parallelCoreAdminExecutor-4027-thread-2-processing-n:127.0.0.1:46107_solr x:testAsyncIdRaceCondition_shard1_replica_n1 repeatedId3717947424054206 RELOAD) [n:127.0.0.1:46107_solr c:testAsyncIdRaceCondition s:shard1 r:core_node2 x:testAsyncIdRaceCondition_shard1_replica_n1] o.a.s.u.DefaultSolrCoreState New IndexWriter is ready to be used.
   [junit4]   2> 765309 INFO  (searcherExecutor-4040-thread-1-processing-x:testAsyncIdRaceCondition_shard1_replica_n1 repeatedId3717947424054206 r:core_node2 RELOAD n:127.0.0.1:46107_solr c:testAsyncIdRaceCondition s:shard1) [n:127.0.0.1:46107_solr c:testAsyncIdRaceCondition s:shard1 r:core_node2 x:testAsyncIdRaceCondition_shard1_replica_n1] o.a.s.c.SolrCore [testAsyncIdRaceCondition_shard1_replica_n1] Registered new searcher Searcher@596dcd1b[testAsyncIdRaceCondition_shard1_replica_n1] main{ExitableDirectoryReader(UninvertingDirectoryReader())}
   [junit4]   2> 765309 INFO  (parallelCoreAdminExecutor-4027-thread-2-processing-n:127.0.0.1:46107_solr x:testAsyncIdRaceCondition_shard1_replica_n1 repeatedId3717947424054206 RELOAD) [n:127.0.0.1:46107_solr c:testAsyncIdRaceCondition s:shard1 r:core_node2 x:testAsyncIdRaceCondition_shard1_replica_n1] o.a.s.s.SolrIndexSearcher Opening [Searcher@51a0c398[testAsyncIdRaceCondition_shard1_replica_n1] main]
   [junit4]   2> 765309 INFO  (parallelCoreAdminExecutor-4027-thread-2-processing-n:127.0.0.1:46107_solr x:testAsyncIdRaceCondition_shard1_replica_n1 repeatedId3717947424054206 RELOAD) [n:127.0.0.1:46107_solr c:testAsyncIdRaceCondition s:shard1 r:core_node2 x:testAsyncIdRaceCondition_shard1_replica_n1] o.a.s.c.SolrCore [testAsyncIdRaceCondition_shard1_replica_n1]  CLOSING SolrCore org.apache.solr.core.SolrCore@1b267cff
   [junit4]   2> 765309 INFO  (parallelCoreAdminExecutor-4027-thread-2-processing-n:127.0.0.1:46107_solr x:testAsyncIdRaceCondition_shard1_replica_n1 repeatedId3717947424054206 RELOAD) [n:127.0.0.1:46107_solr c:testAsyncIdRaceCondition s:shard1 r:core_node2 x:testAsyncIdRaceCondition_shard1_replica_n1] o.a.s.m.SolrMetricManager Closing metric reporters for registry=solr.core.testAsyncIdRaceCondition.shard1.replica_n1, tag=1b267cff
   [junit4]   2> 765309 INFO  (parallelCoreAdminExecutor-4027-thread-2-processing-n:127.0.0.1:46107_solr x:testAsyncIdRaceCondition_shard1_replica_n1 repeatedId3717947424054206 RELOAD) [n:127.0.0.1:46107_solr c:testAsyncIdRaceCondition s:shard1 r:core_node2 x:testAsyncIdRaceCondition_shard1_replica_n1] o.a.s.m.r.SolrJmxReporter Closing reporter [org.apache.solr.metrics.reporters.SolrJmxReporter@5360dca7: rootName = solr_46107, domain = solr.core.testAsyncIdRaceCondition.shard1.replica_n1, service url = null, agent id = null] for registry solr.core.testAsyncIdRaceCondition.shard1.replica_n1 / com.codahale.metrics.MetricRegistry@352da1d7
   [junit4]   2> 765310 INFO  (searcherExecutor-4040-thread-1-processing-x:testAsyncIdRaceCondition_shard1_replica_n1 repeatedId3717947424054206 r:core_node2 RELOAD n:127.0.0.1:46107_solr c:testAsyncIdRaceCondition s:shard1) [n:127.0.0.1:46107_solr c:testAsyncIdRaceCondition s:shard1 r:core_node2 x:testAsyncIdRaceCondition_shard1_replica_n1] o.a.s.c.SolrCore [testAsyncIdRaceCondition_shard1_replica_n1] Registered new searcher Searcher@51a0c398[testAsyncIdRaceCondition_shard1_replica_n1] main{ExitableDirectoryReader(UninvertingDirectoryReader())}
   [junit4]   2> 765316 INFO  (parallelCoreAdminExecutor-4027-thread-2-processing-n:127.0.0.1:46107_solr x:testAsyncIdRaceCondition_shard1_replica_n1 repeatedId3717947424054206 RELOAD) [n:127.0.0.1:46107_solr c:testAsyncIdRaceCondition s:shard1 r:core_node2 x:testAsyncIdRaceCondition_shard1_replica_n1] o.a.s.m.SolrMetricManager Closing metric reporters for registry=solr.collection.testAsyncIdRaceCondition.shard1.leader, tag=1b267cff
   [junit4]   2> 765462 INFO  (OverseerStateUpdate-72301253184126980-127.0.0.1:46107_solr-n_0000000000) [n:127.0.0.1:46107_solr    ] o.a.s.c.o.SliceMutator createReplica() {
   [junit4]   2>   "operation":"ADDREPLICA",
   [junit4]   2>   "collection":"testasynccollectioncreation",
   [junit4]   2>   "shard":"shard1",
   [junit4]   2>   "core":"testasynccollectioncreation_shard1_replica_n1",
   [junit4]   2>   "state":"down",
   [junit4]   2>   "base_url":"https://127.0.0.1:46107/solr",
   [junit4]   2>   "type":"NRT",
   [junit4]   2>   "waitForFinalState":"false"} 
   [junit4]   2> 765663 INFO  (qtp1192465965-10557) [n:127.0.0.1:46107_solr    x:testasynccollectioncreation_shard1_replica_n1] o.a.s.s.HttpSolrCall [admin] webapp=null path=/admin/cores params={qt=/admin/cores&collection.configName=conf1&newCollection=true&collection=testasynccollectioncreation&version=2&replicaType=NRT&async=90b45aeb-dae6-46f4-a261-ff0fa0edd6c03717947718486849&coreNodeName=core_node2&name=testasynccollectioncreation_shard1_replica_n1&action=CREATE&numShards=1&shard=shard1&wt=javabin} status=0 QTime=0
   [junit4]   2> 765664 INFO  (parallelCoreAdminExecutor-4027-thread-3-processing-n:127.0.0.1:46107_solr x:testasynccollectioncreation_shard1_replica_n1 90b45aeb-dae6-46f4-a261-ff0fa0edd6c03717947718486849 CREATE) [n:127.0.0.1:46107_solr    x:testasynccollectioncreation_shard1_replica_n1] o.a.s.h.a.CoreAdminOperation core create command qt=/admin/cores&collection.configName=conf1&newCollection=true&collection=testasynccollectioncreation&version=2&replicaType=NRT&async=90b45aeb-dae6-46f4-a261-ff0fa0edd6c03717947718486849&coreNodeName=core_node2&name=testasynccollectioncreation_shard1_replica_n1&action=CREATE&numShards=1&shard=shard1&wt=javabin
   [junit4]   2> 765664 INFO  (qtp1192465965-10494) [n:127.0.0.1:46107_solr    ] o.a.s.h.a.CoreAdminOperation Checking request status for : 90b45aeb-dae6-46f4-a261-ff0fa0edd6c03717947718486849
   [junit4]   2> 765664 INFO  (qtp1192465965-10494) [n:127.0.0.1:46107_solr    ] o.a.s.s.HttpSolrCall [admin] webapp=null path=/admin/cores params={qt=/admin/cores&requestid=90b45aeb-dae6-46f4-a261-ff0fa0edd6c03717947718486849&action=REQUESTSTATUS&wt=javabin&version=2} status=0 QTime=0
   [junit4]   2> 766176 INFO  (qtp1192465965-10557) [n:127.0.0.1:46107_solr    ] o.a.s.h.a.CoreAdminOperation Checking request status for : repeatedId3717947424054206
   [junit4]   2> 766176 INFO  (qtp1192465965-10557) [n:127.0.0.1:46107_solr    ] o.a.s.s.HttpSolrCall [admin] webapp=null path=/admin/cores params={qt=/admin/cores&requestid=repeatedId3717947424054206&action=REQUESTSTATUS&wt=javabin&version=2} status=0 QTime=0
   [junit4]   2> 766177 INFO  (OverseerThreadFactory-4026-thread-2-processing-n:127.0.0.1:46107_solr) [n:127.0.0.1:46107_solr    ] o.a.s.c.OverseerTaskQueue Response ZK path: /overseer/collection-queue-work/qnr-0000000001 doesn't exist.  Requestor may have disconnected from ZooKeeper
   [junit4]   2> 766257 INFO  (qtp1192465965-10582) [n:127.0.0.1:46107_solr    ] o.a.s.h.a.CollectionsHandler Invoked Collection Action :requeststatus with params requestid=90b45aeb-dae6-46f4-a261-ff0fa0edd6c0&action=REQUESTSTATUS&wt=javabin&version=2 and sendToOCPQueue=true
   [junit4]   2> 766258 INFO  (qtp1192465965-10582) [n:127.0.0.1:46107_solr    ] o.a.s.s.HttpSolrCall [admin] webapp=null path=/admin/collections params={requestid=90b45aeb-dae6-46f4-a261-ff0fa0edd6c0&action=REQUESTSTATUS&wt=javabin&version=2} status=0 QTime=0
   [junit4]   2> 766665 INFO  (qtp1192465965-10494) [n:127.0.0.1:46107_solr    ] o.a.s.h.a.CoreAdminOperation Checking request status for : 90b45aeb-dae6-46f4-a261-ff0fa0edd6c03717947718486849
   [junit4]   2> 766665 INFO  (qtp1192465965-10494) [n:127.0.0.1:46107_solr    ] o.a.s.s.HttpSolrCall [admin] webapp=null path=/admin/cores params={qt=/admin/cores&requestid=90b45aeb-dae6-46f4-a261-ff0fa0edd6c03717947718486849&action=REQUESTSTATUS&wt=javabin&version=2} status=0 QTime=0
   [junit4]   2> 766670 INFO  (parallelCoreAdminExecutor-4027-thread-3-processing-n:127.0.0.1:46107_solr x:testasynccollectioncreation_shard1_replica_n1 90b45aeb-dae6-46f4-a261-ff0fa0edd6c03717947718486849 CREATE) [n:127.0.0.1:46107_solr c:testasynccollectioncreation s:shard1 r:core_node2 x:testasynccollectioncreation_shard1_replica_n1] o.a.s.c.SolrConfig Using Lucene MatchVersion: 7.6.0
   [junit4]   2> 766674 INFO  (parallelCoreAdminExecutor-4027-thread-3-processing-n:127.0.0.1:46107_solr x:testasynccollectioncreation_shard1_replica_n1 90b45aeb-dae6-46f4-a261-ff0fa0edd6c03717947718486849 CREATE) [n:127.0.0.1:46107_solr c:testasynccollectioncreation s:shard1 r:core_node2 x:testasynccollectioncreation_shard1_replica_n1] o.a.s.s.IndexSchema [testasynccollectioncreation_shard1_replica_n1] Schema name=minimal
   [junit4]   2> 766675 INFO  (parallelCoreAdminExecutor-4027-thread-3-processing-n:127.0.0.1:46107_solr x:testasynccollectioncreation_shard1_replica_n1 90b45aeb-dae6-46f4-a261-ff0fa0edd6c03717947718486849 CREATE) [n:127.0.0.1:46107_solr c:testasynccollectioncreation s:shard1 r:core_node2 x:testasynccollectioncreation_shard1_replica_n1] o.a.s.s.IndexSchema Loaded schema minimal/1.1 with uniqueid field id
   [junit4]   2> 766675 INFO  (parallelCoreAdminExecutor-4027-thread-3-processing-n:127.0.0.1:46107_solr x:testasynccollectioncreation_shard1_replica_n1 90b45aeb-dae6-46f4-a261-ff0fa0edd6c03717947718486849 CREATE) [n:127.0.0.1:46107_solr c:testasynccollectioncreation s:shard1 r:core_node2 x:testasynccollectioncreation_shard1_replica_n1] o.a.s.c.CoreContainer Creating SolrCore 'testasynccollectioncreation_shard1_replica_n1' using configuration from collection testasynccollectioncreation, trusted=true
   [junit4]   2> 766676 INFO  (parallelCoreAdminExecutor-4027-thread-3-processing-n:127.0.0.1:46107_solr x:testasynccollectioncreation_shard1_replica_n1 90b45aeb-dae6-46f4-a261-ff0fa0edd6c03717947718486849 CREATE) [n:127.0.0.1:46107_solr c:testasynccollectioncreation s:shard1 r:core_node2 x:testasynccollectioncreation_shard1_replica_n1] o.a.s.m.r.SolrJmxReporter JMX monitoring for 'solr_46107.solr.core.testasynccollectioncreation.shard1.replica_n1' (registry 'solr.core.testasynccollectioncreation.shard1.replica_n1') enabled at server: com.sun.jmx.mbeanserver.JmxMBeanServer@29951780
   [junit4]   2> 766676 INFO  (parallelCoreAdminExecutor-4027-thread-3-processing-n:127.0.0.1:46107_solr x:testasynccollectioncreation_shard1_replica_n1 90b45aeb-dae6-46f4-a261-ff0fa0edd6c03717947718486849 CREATE) [n:127.0.0.1:46107_solr c:testasynccollectioncreation s:shard1 r:core_node2 x:testasynccollectioncreation_shard1_replica_n1] o.a.s.c.SolrCore [[testasynccollectioncreation_shard1_replica_n1] ] Opening new SolrCore at [/home/jenkins/workspace/Lucene-Solr-7.x-Linux/solr/build/solr-core/test/J0/temp/solr.cloud.api.collections.CollectionsAPIAsyncDistributedZkTest_86AE232BCF5DDDF6-001/tempDir-001/node1/testasynccollectioncreation_shard1_replica_n1], dataDir=[/home/jenkins/workspace/Lucene-Solr-7.x-Linux/solr/build/solr-core/test/J0/temp/solr.cloud.api.collections.CollectionsAPIAsyncDistributedZkTest_86AE232BCF5DDDF6-001/tempDir-001/node1/./testasynccollectioncreation_shard1_replica_n1/data/]
   [junit4]   2> 766717 INFO  (parallelCoreAdminExecutor-4027-thread-3-processing-n:127.0.0.1:46107_solr x:testasynccollectioncreation_shard1_replica_n1 90b45aeb-dae6-46f4-a261-ff0fa0edd6c03717947718486849 CREATE) [n:127.0.0.1:46107_solr c:testasynccollectioncreation s:shard1 r:core_node2 x:testasynccollectioncreation_shard1_replica_n1] o.a.s.u.UpdateHandler Using UpdateLog implementation: org.apache.solr.update.UpdateLog
   [junit4]   2> 766717 INFO  (parallelCoreAdminExecutor-4027-thread-3-processing-n:127.0.0.1:46107_solr x:testasynccollectioncreation_shard1_replica_n1 90b45aeb-dae6-46f4-a261-ff0fa0edd6c03717947718486849 CREATE) [n:127.0.0.1:46107_solr c:testasynccollectioncreation s:shard1 r:core_node2 x:testasynccollectioncreation_shard1_replica_n1] o.a.s.u.UpdateLog Initializing UpdateLog: dataDir=null defaultSyncLevel=FLUSH numRecordsToKeep=100 maxNumLogsToKeep=10 numVersionBuckets=65536
   [junit4]   2> 766718 INFO  (parallelCoreAdminExecutor-4027-thread-3-processing-n:127.0.0.1:46107_solr x:testasynccollectioncreation_shard1_replica_n1 90b45aeb-dae6-46f4-a261-ff0fa0edd6c03717947718486849 CREATE) [n:127.0.0.1:46107_solr c:testasynccollectioncreation s:shard1 r:core_node2 x:testasynccollectioncreation_shard1_replica_n1] o.a.s.u.CommitTracker Hard AutoCommit: disabled
   [junit4]   2> 766719 INFO  (parallelCoreAdminExecutor-4027-thread-3-processing-n:127.0.0.1:46107_solr x:testasynccollectioncreation_shard1_replica_n1 90b45aeb-dae6-46f4-a261-ff0fa0edd6c03717947718486849 CREATE) [n:127.0.0.1:46107_solr c:testasynccollectioncreation s:shard1 r:core_node2 x:testasynccollectioncreation_shard1_replica_n1] o.a.s.u.CommitTracker Soft AutoCommit: disabled
   [junit4]   2> 766720 INFO  (parallelCoreAdminExecutor-4027-thread-3-processing-n:127.0.0.1:46107_solr x:testasynccollectioncreation_shard1_replica_n1 90b45aeb-dae6-46f4-a261-ff0fa0edd6c03717947718486849 CREATE) [n:127.0.0.1:46107_solr c:testasynccollectioncreation s:shard1 r:core_node2 x:testasynccollectioncreation_shard1_replica_n1] o.a.s.s.SolrIndexSearcher Opening [Searcher@77027b[testasynccollectioncreation_shard1_replica_n1] main]
   [junit4]   2> 766721 INFO  (parallelCoreAdminExecutor-4027-thread-3-processing-n:127.0.0.1:46107_solr x:testasynccollectioncreation_shard1_replica_n1 90b45aeb-dae6-46f4-a261-ff0fa0edd6c03717947718486849 CREATE) [n:127.0.0.1:46107_solr c:testasynccollectioncreation s:shard1 r:core_node2 x:testasynccollectioncreation_shard1_replica_n1] o.a.s.r.ManagedResourceStorage Configured ZooKeeperStorageIO with znodeBase: /configs/conf1
   [junit4]   2> 766721 INFO  (parallelCoreAdminExecutor-4027-thread-3-processing-n:127.0.0.1:46107_solr x:testasynccollectioncreation_shard1_replica_n1 90b45aeb-dae6-46f4-a261-ff0fa0edd6c03717947718486849 CREATE) [n:127.0.0.1:46107_solr c:testasynccollectioncreation s:shard1 r:core_node2 x:testasynccollectioncreation_shard1_replica_n1] o.a.s.r.ManagedResourceStorage Loaded null at path _rest_managed.json using ZooKeeperStorageIO:path=/configs/conf1
   [junit4]   2> 766721 INFO  (parallelCoreAdminExecutor-4027-thread-3-processing-n:127.0.0.1:46107_solr x:testasynccollectioncreation_shard1_replica_n1 90b45aeb-dae6-46f4-a261-ff0fa0edd6c03717947718486849 CREATE) [n:127.0.0.1:46107_solr c:testasynccollectioncreation s:shard1 r:core_node2 x:testasynccollectioncreation_shard1_replica_n1] o.a.s.h.ReplicationHandler Commits will be reserved for 10000ms.
   [junit4]   2> 766722 INFO  (parallelCoreAdminExecutor-4027-thread-3-processing-n:127.0.0.1:46107_solr x:testasynccollectioncreation_shard1_replica_n1 90b45aeb-dae6-46f4-a261-ff0fa0edd6c03717947718486849 CREATE) [n:127.0.0.1:46107_solr c:testasynccollectioncreation s:shard1 r:core_node2 x:testasynccollectioncreation_shard1_replica_n1] o.a.s.u.UpdateLog Could not find max version in index or recent updates, using new clock 1612838098802049024
   [junit4]   2> 766722 INFO  (searcherExecutor-4044-thread-1-processing-x:testasynccollectioncreation_shard1_replica_n1 90b45aeb-dae6-46f4-a261-ff0fa0edd6c03717947718486849 r:core_node2 CREATE n:127.0.0.1:46107_solr c:testasynccollectioncreation s:shard1) [n:127.0.0.1:46107_solr c:testasynccollectioncreation s:shard1 r:core_node2 x:testasynccollectioncreation_shard1_replica_n1] o.a.s.c.SolrCore [testasynccollectioncreation_shard1_replica_n1] Registered new searcher Searcher@77027b[testasynccollectioncreation_shard1_replica_n1] main{ExitableDirectoryReader(UninvertingDirectoryReader())}
   [junit4]   2> 766725 INFO  (parallelCoreAdminExecutor-4027-thread-3-processing-n:127.0.0.1:46107_solr x:testasynccollectioncreation_shard1_replica_n1 90b45aeb-dae6-46f4-a261-ff0fa0edd6c03717947718486849 CREATE) [n:127.0.0.1:46107_solr c:testasynccollectioncreation s:shard1 r:core_node2 x:testasynccollectioncreation_shard1_replica_n1] o.a.s.c.ZkShardTerms Successful update of terms at /collections/testasynccollectioncreation/terms/shard1 to Terms{values={core_n

[...truncated too long message...]

ins/workspace/Lucene-Solr-7.x-Linux/solr/core/test-lib/apacheds-i18n-2.0.0-M15.jar:/home/jenkins/workspace/Lucene-Solr-7.x-Linux/solr/core/test-lib/apacheds-interceptor-kerberos-2.0.0-M15.jar:/home/jenkins/workspace/Lucene-Solr-7.x-Linux/solr/core/test-lib/apacheds-interceptors-admin-2.0.0-M15.jar:/home/jenkins/workspace/Lucene-Solr-7.x-Linux/solr/core/test-lib/apacheds-interceptors-authn-2.0.0-M15.jar:/home/jenkins/workspace/Lucene-Solr-7.x-Linux/solr/core/test-lib/apacheds-interceptors-authz-2.0.0-M15.jar:/home/jenkins/workspace/Lucene-Solr-7.x-Linux/solr/core/test-lib/apacheds-interceptors-changelog-2.0.0-M15.jar:/home/jenkins/workspace/Lucene-Solr-7.x-Linux/solr/core/test-lib/apacheds-interceptors-collective-2.0.0-M15.jar:/home/jenkins/workspace/Lucene-Solr-7.x-Linux/solr/core/test-lib/apacheds-interceptors-event-2.0.0-M15.jar:/home/jenkins/workspace/Lucene-Solr-7.x-Linux/solr/core/test-lib/apacheds-interceptors-exception-2.0.0-M15.jar:/home/jenkins/workspace/Lucene-Solr-7.x-Linux/solr/core/test-lib/apacheds-interceptors-journal-2.0.0-M15.jar:/home/jenkins/workspace/Lucene-Solr-7.x-Linux/solr/core/test-lib/apacheds-interceptors-normalization-2.0.0-M15.jar:/home/jenkins/workspace/Lucene-Solr-7.x-Linux/solr/core/test-lib/apacheds-interceptors-operational-2.0.0-M15.jar:/home/jenkins/workspace/Lucene-Solr-7.x-Linux/solr/core/test-lib/apacheds-interceptors-referral-2.0.0-M15.jar:/home/jenkins/workspace/Lucene-Solr-7.x-Linux/solr/core/test-lib/apacheds-interceptors-schema-2.0.0-M15.jar:/home/jenkins/workspace/Lucene-Solr-7.x-Linux/solr/core/test-lib/apacheds-interceptors-subtree-2.0.0-M15.jar:/home/jenkins/workspace/Lucene-Solr-7.x-Linux/solr/core/test-lib/apacheds-interceptors-trigger-2.0.0-M15.jar:/home/jenkins/workspace/Lucene-Solr-7.x-Linux/solr/core/test-lib/apacheds-jdbm-partition-2.0.0-M15.jar:/home/jenkins/workspace/Lucene-Solr-7.x-Linux/solr/core/test-lib/apacheds-jdbm1-2.0.0-M2.jar:/home/jenkins/workspace/Lucene-Solr-7.x-Linux/solr/core/test-lib/apacheds-kerberos-codec-2.0.0-M15.jar:/home/jenkins/workspace/Lucene-Solr-7.x-Linux/solr/core/test-lib/apacheds-ldif-partition-2.0.0-M15.jar:/home/jenkins/workspace/Lucene-Solr-7.x-Linux/solr/core/test-lib/apacheds-mavibot-partition-2.0.0-M15.jar:/home/jenkins/workspace/Lucene-Solr-7.x-Linux/solr/core/test-lib/apacheds-protocol-kerberos-2.0.0-M15.jar:/home/jenkins/workspace/Lucene-Solr-7.x-Linux/solr/core/test-lib/apacheds-protocol-ldap-2.0.0-M15.jar:/home/jenkins/workspace/Lucene-Solr-7.x-Linux/solr/core/test-lib/apacheds-protocol-shared-2.0.0-M15.jar:/home/jenkins/workspace/Lucene-Solr-7.x-Linux/solr/core/test-lib/apacheds-xdbm-partition-2.0.0-M15.jar:/home/jenkins/workspace/Lucene-Solr-7.x-Linux/solr/core/test-lib/api-all-1.0.0-M20.jar:/home/jenkins/workspace/Lucene-Solr-7.x-Linux/solr/core/test-lib/bcprov-jdk15on-1.54.jar:/home/jenkins/workspace/Lucene-Solr-7.x-Linux/solr/core/test-lib/byte-buddy-1.6.2.jar:/home/jenkins/workspace/Lucene-Solr-7.x-Linux/solr/core/test-lib/commons-collections-3.2.2.jar:/home/jenkins/workspace/Lucene-Solr-7.x-Linux/solr/core/test-lib/ehcache-core-2.4.4.jar:/home/jenkins/workspace/Lucene-Solr-7.x-Linux/solr/core/test-lib/hadoop-common-2.7.4-tests.jar:/home/jenkins/workspace/Lucene-Solr-7.x-Linux/solr/core/test-lib/hadoop-hdfs-2.7.4-tests.jar:/home/jenkins/workspace/Lucene-Solr-7.x-Linux/solr/core/test-lib/hadoop-minikdc-2.7.4.jar:/home/jenkins/workspace/Lucene-Solr-7.x-Linux/solr/core/test-lib/htrace-core-3.2.0-incubating.jar:/home/jenkins/workspace/Lucene-Solr-7.x-Linux/solr/core/test-lib/jersey-core-1.9.jar:/home/jenkins/workspace/Lucene-Solr-7.x-Linux/solr/core/test-lib/jersey-server-1.9.jar:/home/jenkins/workspace/Lucene-Solr-7.x-Linux/solr/core/test-lib/jetty-6.1.26.jar:/home/jenkins/workspace/Lucene-Solr-7.x-Linux/solr/core/test-lib/jetty-sslengine-6.1.26.jar:/home/jenkins/workspace/Lucene-Solr-7.x-Linux/solr/core/test-lib/jetty-util-6.1.26.jar:/home/jenkins/workspace/Lucene-Solr-7.x-Linux/solr/core/test-lib/mina-core-2.0.0-M5.jar:/home/jenkins/workspace/Lucene-Solr-7.x-Linux/solr/core/test-lib/mockito-core-2.6.2.jar:/home/jenkins/workspace/Lucene-Solr-7.x-Linux/solr/core/test-lib/netty-all-4.0.36.Final.jar:/home/jenkins/workspace/Lucene-Solr-7.x-Linux/solr/core/test-lib/objenesis-2.5.jar:/home/jenkins/workspace/Lucene-Solr-7.x-Linux/lucene/build/analysis/icu/lucene-analyzers-icu-7.6.0-SNAPSHOT.jar:/home/jenkins/workspace/Lucene-Solr-7.x-Linux/solr/build/contrib/solr-analysis-extras/classes/java:/home/jenkins/workspace/Lucene-Solr-7.x-Linux/lucene/build/queryparser/classes/test:/home/jenkins/workspace/Lucene-Solr-7.x-Linux/lucene/build/backward-codecs/classes/test:/home/jenkins/workspace/Lucene-Solr-7.x-Linux/solr/contrib/analysis-extras/lib/icu4j-62.1.jar:/var/lib/jenkins/tools/hudson.tasks.Ant_AntInstallation/ANT_1.8.2/lib/ant-launcher.jar:/home/jenkins/.ant/lib/ivy-2.4.0.jar:/var/lib/jenkins/tools/hudson.tasks.Ant_AntInstallation/ANT_1.8.2/lib/ant-netrexx.jar:/var/lib/jenkins/tools/hudson.tasks.Ant_AntInstallation/ANT_1.8.2/lib/ant-apache-xalan2.jar:/var/lib/jenkins/tools/hudson.tasks.Ant_AntInstallation/ANT_1.8.2/lib/ant.jar:/var/lib/jenkins/tools/hudson.tasks.Ant_AntInstallation/ANT_1.8.2/lib/ant-javamail.jar:/var/lib/jenkins/tools/hudson.tasks.Ant_AntInstallation/ANT_1.8.2/lib/ant-commons-net.jar:/var/lib/jenkins/tools/hudson.tasks.Ant_AntInstallation/ANT_1.8.2/lib/ant-apache-regexp.jar:/var/lib/jenkins/tools/hudson.tasks.Ant_AntInstallation/ANT_1.8.2/lib/ant-apache-oro.jar:/var/lib/jenkins/tools/hudson.tasks.Ant_AntInstallation/ANT_1.8.2/lib/ant-jmf.jar:/var/lib/jenkins/tools/hudson.tasks.Ant_AntInstallation/ANT_1.8.2/lib/ant-apache-log4j.jar:/var/lib/jenkins/tools/hudson.tasks.Ant_AntInstallation/ANT_1.8.2/lib/ant-jsch.jar:/var/lib/jenkins/tools/hudson.tasks.Ant_AntInstallation/ANT_1.8.2/lib/ant-jai.jar:/var/lib/jenkins/tools/hudson.tasks.Ant_AntInstallation/ANT_1.8.2/lib/ant-apache-bsf.jar:/var/lib/jenkins/tools/hudson.tasks.Ant_AntInstallation/ANT_1.8.2/lib/ant-junit4.jar:/var/lib/jenkins/tools/hudson.tasks.Ant_AntInstallation/ANT_1.8.2/lib/ant-apache-resolver.jar:/var/lib/jenkins/tools/hudson.tasks.Ant_AntInstallation/ANT_1.8.2/lib/ant-apache-bcel.jar:/var/lib/jenkins/tools/hudson.tasks.Ant_AntInstallation/ANT_1.8.2/lib/ant-junit.jar:/var/lib/jenkins/tools/hudson.tasks.Ant_AntInstallation/ANT_1.8.2/lib/ant-jdepend.jar:/var/lib/jenkins/tools/hudson.tasks.Ant_AntInstallation/ANT_1.8.2/lib/ant-testutil.jar:/var/lib/jenkins/tools/hudson.tasks.Ant_AntInstallation/ANT_1.8.2/lib/ant-antlr.jar:/var/lib/jenkins/tools/hudson.tasks.Ant_AntInstallation/ANT_1.8.2/lib/ant-swing.jar:/var/lib/jenkins/tools/hudson.tasks.Ant_AntInstallation/ANT_1.8.2/lib/ant-commons-logging.jar:/home/jenkins/.ivy2/cache/com.carrotsearch.randomizedtesting/junit4-ant/jars/junit4-ant-2.6.4.jar com.carrotsearch.ant.tasks.junit4.slave.SlaveMainSafe -eventsfile /home/jenkins/workspace/Lucene-Solr-7.x-Linux/solr/build/solr-core/test/temp/junit4-J1-20180928_075824_48216134528748805645879.events @/home/jenkins/workspace/Lucene-Solr-7.x-Linux/solr/build/solr-core/test/temp/junit4-J1-20180928_075824_4826906684093515895941.suites -stdin
   [junit4] ERROR: JVM J1 ended with an exception: Forked process returned with error code: 134. Very likely a JVM crash.  See process stdout at: /home/jenkins/workspace/Lucene-Solr-7.x-Linux/solr/build/solr-core/test/temp/junit4-J1-20180928_075824_4827917770525809364151.sysout
   [junit4] 	at com.carrotsearch.ant.tasks.junit4.JUnit4.executeSlave(JUnit4.java:1542)
   [junit4] 	at com.carrotsearch.ant.tasks.junit4.JUnit4.access$000(JUnit4.java:123)
   [junit4] 	at com.carrotsearch.ant.tasks.junit4.JUnit4$2.call(JUnit4.java:997)
   [junit4] 	at com.carrotsearch.ant.tasks.junit4.JUnit4$2.call(JUnit4.java:994)
   [junit4] 	at java.base/java.util.concurrent.FutureTask.run(FutureTask.java:264)
   [junit4] 	at java.base/java.util.concurrent.ThreadPoolExecutor.runWorker(ThreadPoolExecutor.java:1128)
   [junit4] 	at java.base/java.util.concurrent.ThreadPoolExecutor$Worker.run(ThreadPoolExecutor.java:628)
   [junit4] 	at java.base/java.lang.Thread.run(Thread.java:835)

BUILD FAILED
/home/jenkins/workspace/Lucene-Solr-7.x-Linux/build.xml:633: The following error occurred while executing this line:
/home/jenkins/workspace/Lucene-Solr-7.x-Linux/build.xml:577: The following error occurred while executing this line:
/home/jenkins/workspace/Lucene-Solr-7.x-Linux/build.xml:59: The following error occurred while executing this line:
/home/jenkins/workspace/Lucene-Solr-7.x-Linux/solr/build.xml:267: The following error occurred while executing this line:
/home/jenkins/workspace/Lucene-Solr-7.x-Linux/solr/common-build.xml:558: The following error occurred while executing this line:
/home/jenkins/workspace/Lucene-Solr-7.x-Linux/lucene/common-build.xml:1567: The following error occurred while executing this line:
/home/jenkins/workspace/Lucene-Solr-7.x-Linux/lucene/common-build.xml:1092: At least one slave process threw an exception, first: Forked process returned with error code: 134. Very likely a JVM crash.  See process stdout at: /home/jenkins/workspace/Lucene-Solr-7.x-Linux/solr/build/solr-core/test/temp/junit4-J1-20180928_075824_4827917770525809364151.sysout

Total time: 79 minutes 2 seconds
Build step 'Invoke Ant' marked build as failure
Archiving artifacts
Setting ANT_1_8_2_HOME=/var/lib/jenkins/tools/hudson.tasks.Ant_AntInstallation/ANT_1.8.2
[WARNINGS] Skipping publisher since build result is FAILURE
Recording test results
Setting ANT_1_8_2_HOME=/var/lib/jenkins/tools/hudson.tasks.Ant_AntInstallation/ANT_1.8.2
Email was triggered for: Failure - Any
Sending email for trigger: Failure - Any
Setting ANT_1_8_2_HOME=/var/lib/jenkins/tools/hudson.tasks.Ant_AntInstallation/ANT_1.8.2
Setting ANT_1_8_2_HOME=/var/lib/jenkins/tools/hudson.tasks.Ant_AntInstallation/ANT_1.8.2
Setting ANT_1_8_2_HOME=/var/lib/jenkins/tools/hudson.tasks.Ant_AntInstallation/ANT_1.8.2
Setting ANT_1_8_2_HOME=/var/lib/jenkins/tools/hudson.tasks.Ant_AntInstallation/ANT_1.8.2

Mime
View raw message