lucene-dev mailing list archives

Site index · List index
Message view « Date » · « Thread »
Top « Date » · « Thread »
From Policeman Jenkins Server <jenk...@thetaphi.de>
Subject [JENKINS] Lucene-Solr-master-Linux (64bit/jdk-9.0.4) - Build # 22908 - Still Unstable!
Date Sun, 23 Sep 2018 11:05:16 GMT
Build: https://jenkins.thetaphi.de/job/Lucene-Solr-master-Linux/22908/
Java: 64bit/jdk-9.0.4 -XX:-UseCompressedOops -XX:+UseG1GC

3 tests failed.
FAILED:  org.apache.solr.cloud.MoveReplicaHDFSTest.testFailedMove

Error Message:
No live SolrServers available to handle this request:[https://127.0.0.1:34973/solr/MoveReplicaHDFSTest_failed_coll_true, https://127.0.0.1:39649/solr/MoveReplicaHDFSTest_failed_coll_true]

Stack Trace:
org.apache.solr.client.solrj.SolrServerException: No live SolrServers available to handle this request:[https://127.0.0.1:34973/solr/MoveReplicaHDFSTest_failed_coll_true, https://127.0.0.1:39649/solr/MoveReplicaHDFSTest_failed_coll_true]
	at __randomizedtesting.SeedInfo.seed([90D82B603989D855:3A15F8928E5A0D85]:0)
	at org.apache.solr.client.solrj.impl.LBHttpSolrClient.request(LBHttpSolrClient.java:462)
	at org.apache.solr.client.solrj.impl.CloudSolrClient.sendRequest(CloudSolrClient.java:1107)
	at org.apache.solr.client.solrj.impl.CloudSolrClient.requestWithRetryOnStaleState(CloudSolrClient.java:884)
	at org.apache.solr.client.solrj.impl.CloudSolrClient.requestWithRetryOnStaleState(CloudSolrClient.java:994)
	at org.apache.solr.client.solrj.impl.CloudSolrClient.request(CloudSolrClient.java:817)
	at org.apache.solr.client.solrj.SolrRequest.process(SolrRequest.java:194)
	at org.apache.solr.client.solrj.SolrClient.query(SolrClient.java:942)
	at org.apache.solr.cloud.MoveReplicaTest.testFailedMove(MoveReplicaTest.java:301)
	at java.base/jdk.internal.reflect.NativeMethodAccessorImpl.invoke0(Native Method)
	at java.base/jdk.internal.reflect.NativeMethodAccessorImpl.invoke(NativeMethodAccessorImpl.java:62)
	at java.base/jdk.internal.reflect.DelegatingMethodAccessorImpl.invoke(DelegatingMethodAccessorImpl.java:43)
	at java.base/java.lang.reflect.Method.invoke(Method.java:564)
	at com.carrotsearch.randomizedtesting.RandomizedRunner.invoke(RandomizedRunner.java:1742)
	at com.carrotsearch.randomizedtesting.RandomizedRunner$8.evaluate(RandomizedRunner.java:935)
	at com.carrotsearch.randomizedtesting.RandomizedRunner$9.evaluate(RandomizedRunner.java:971)
	at com.carrotsearch.randomizedtesting.RandomizedRunner$10.evaluate(RandomizedRunner.java:985)
	at com.carrotsearch.randomizedtesting.rules.SystemPropertiesRestoreRule$1.evaluate(SystemPropertiesRestoreRule.java:57)
	at org.apache.lucene.util.TestRuleSetupTeardownChained$1.evaluate(TestRuleSetupTeardownChained.java:49)
	at org.apache.lucene.util.AbstractBeforeAfterRule$1.evaluate(AbstractBeforeAfterRule.java:45)
	at org.apache.lucene.util.TestRuleThreadAndTestName$1.evaluate(TestRuleThreadAndTestName.java:48)
	at org.apache.lucene.util.TestRuleIgnoreAfterMaxFailures$1.evaluate(TestRuleIgnoreAfterMaxFailures.java:64)
	at org.apache.lucene.util.TestRuleMarkFailure$1.evaluate(TestRuleMarkFailure.java:47)
	at com.carrotsearch.randomizedtesting.rules.StatementAdapter.evaluate(StatementAdapter.java:36)
	at com.carrotsearch.randomizedtesting.ThreadLeakControl$StatementRunner.run(ThreadLeakControl.java:368)
	at com.carrotsearch.randomizedtesting.ThreadLeakControl.forkTimeoutingTask(ThreadLeakControl.java:817)
	at com.carrotsearch.randomizedtesting.ThreadLeakControl$3.evaluate(ThreadLeakControl.java:468)
	at com.carrotsearch.randomizedtesting.RandomizedRunner.runSingleTest(RandomizedRunner.java:944)
	at com.carrotsearch.randomizedtesting.RandomizedRunner$5.evaluate(RandomizedRunner.java:830)
	at com.carrotsearch.randomizedtesting.RandomizedRunner$6.evaluate(RandomizedRunner.java:880)
	at com.carrotsearch.randomizedtesting.RandomizedRunner$7.evaluate(RandomizedRunner.java:891)
	at com.carrotsearch.randomizedtesting.rules.StatementAdapter.evaluate(StatementAdapter.java:36)
	at com.carrotsearch.randomizedtesting.rules.SystemPropertiesRestoreRule$1.evaluate(SystemPropertiesRestoreRule.java:57)
	at org.apache.lucene.util.AbstractBeforeAfterRule$1.evaluate(AbstractBeforeAfterRule.java:45)
	at com.carrotsearch.randomizedtesting.rules.StatementAdapter.evaluate(StatementAdapter.java:36)
	at org.apache.lucene.util.TestRuleStoreClassName$1.evaluate(TestRuleStoreClassName.java:41)
	at com.carrotsearch.randomizedtesting.rules.NoShadowingOrOverridesOnMethodsRule$1.evaluate(NoShadowingOrOverridesOnMethodsRule.java:40)
	at com.carrotsearch.randomizedtesting.rules.NoShadowingOrOverridesOnMethodsRule$1.evaluate(NoShadowingOrOverridesOnMethodsRule.java:40)
	at com.carrotsearch.randomizedtesting.rules.StatementAdapter.evaluate(StatementAdapter.java:36)
	at com.carrotsearch.randomizedtesting.rules.StatementAdapter.evaluate(StatementAdapter.java:36)
	at org.apache.lucene.util.TestRuleAssertionsRequired$1.evaluate(TestRuleAssertionsRequired.java:53)
	at org.apache.lucene.util.TestRuleMarkFailure$1.evaluate(TestRuleMarkFailure.java:47)
	at org.apache.lucene.util.TestRuleIgnoreAfterMaxFailures$1.evaluate(TestRuleIgnoreAfterMaxFailures.java:64)
	at org.apache.lucene.util.TestRuleIgnoreTestSuites$1.evaluate(TestRuleIgnoreTestSuites.java:54)
	at com.carrotsearch.randomizedtesting.rules.StatementAdapter.evaluate(StatementAdapter.java:36)
	at com.carrotsearch.randomizedtesting.ThreadLeakControl$StatementRunner.run(ThreadLeakControl.java:368)
	at java.base/java.lang.Thread.run(Thread.java:844)
Caused by: org.apache.solr.client.solrj.impl.HttpSolrClient$RemoteSolrException: Error from server at https://127.0.0.1:39649/solr/MoveReplicaHDFSTest_failed_coll_true: no servers hosting shard: shard1
	at org.apache.solr.client.solrj.impl.HttpSolrClient.executeMethod(HttpSolrClient.java:643)
	at org.apache.solr.client.solrj.impl.HttpSolrClient.request(HttpSolrClient.java:255)
	at org.apache.solr.client.solrj.impl.HttpSolrClient.request(HttpSolrClient.java:244)
	at org.apache.solr.client.solrj.impl.LBHttpSolrClient.doRequest(LBHttpSolrClient.java:483)
	at org.apache.solr.client.solrj.impl.LBHttpSolrClient.request(LBHttpSolrClient.java:413)
	... 45 more


FAILED:  org.apache.solr.cloud.MoveReplicaHDFSTest.testFailedMove

Error Message:
No live SolrServers available to handle this request:[https://127.0.0.1:35381/solr/MoveReplicaHDFSTest_failed_coll_true, https://127.0.0.1:33437/solr/MoveReplicaHDFSTest_failed_coll_true]

Stack Trace:
org.apache.solr.client.solrj.SolrServerException: No live SolrServers available to handle this request:[https://127.0.0.1:35381/solr/MoveReplicaHDFSTest_failed_coll_true, https://127.0.0.1:33437/solr/MoveReplicaHDFSTest_failed_coll_true]
	at __randomizedtesting.SeedInfo.seed([90D82B603989D855:3A15F8928E5A0D85]:0)
	at org.apache.solr.client.solrj.impl.LBHttpSolrClient.request(LBHttpSolrClient.java:462)
	at org.apache.solr.client.solrj.impl.CloudSolrClient.sendRequest(CloudSolrClient.java:1107)
	at org.apache.solr.client.solrj.impl.CloudSolrClient.requestWithRetryOnStaleState(CloudSolrClient.java:884)
	at org.apache.solr.client.solrj.impl.CloudSolrClient.requestWithRetryOnStaleState(CloudSolrClient.java:994)
	at org.apache.solr.client.solrj.impl.CloudSolrClient.request(CloudSolrClient.java:817)
	at org.apache.solr.client.solrj.SolrRequest.process(SolrRequest.java:194)
	at org.apache.solr.client.solrj.SolrClient.query(SolrClient.java:942)
	at org.apache.solr.cloud.MoveReplicaTest.testFailedMove(MoveReplicaTest.java:301)
	at java.base/jdk.internal.reflect.NativeMethodAccessorImpl.invoke0(Native Method)
	at java.base/jdk.internal.reflect.NativeMethodAccessorImpl.invoke(NativeMethodAccessorImpl.java:62)
	at java.base/jdk.internal.reflect.DelegatingMethodAccessorImpl.invoke(DelegatingMethodAccessorImpl.java:43)
	at java.base/java.lang.reflect.Method.invoke(Method.java:564)
	at com.carrotsearch.randomizedtesting.RandomizedRunner.invoke(RandomizedRunner.java:1742)
	at com.carrotsearch.randomizedtesting.RandomizedRunner$8.evaluate(RandomizedRunner.java:935)
	at com.carrotsearch.randomizedtesting.RandomizedRunner$9.evaluate(RandomizedRunner.java:971)
	at com.carrotsearch.randomizedtesting.RandomizedRunner$10.evaluate(RandomizedRunner.java:985)
	at com.carrotsearch.randomizedtesting.rules.SystemPropertiesRestoreRule$1.evaluate(SystemPropertiesRestoreRule.java:57)
	at org.apache.lucene.util.TestRuleSetupTeardownChained$1.evaluate(TestRuleSetupTeardownChained.java:49)
	at org.apache.lucene.util.AbstractBeforeAfterRule$1.evaluate(AbstractBeforeAfterRule.java:45)
	at org.apache.lucene.util.TestRuleThreadAndTestName$1.evaluate(TestRuleThreadAndTestName.java:48)
	at org.apache.lucene.util.TestRuleIgnoreAfterMaxFailures$1.evaluate(TestRuleIgnoreAfterMaxFailures.java:64)
	at org.apache.lucene.util.TestRuleMarkFailure$1.evaluate(TestRuleMarkFailure.java:47)
	at com.carrotsearch.randomizedtesting.rules.StatementAdapter.evaluate(StatementAdapter.java:36)
	at com.carrotsearch.randomizedtesting.ThreadLeakControl$StatementRunner.run(ThreadLeakControl.java:368)
	at com.carrotsearch.randomizedtesting.ThreadLeakControl.forkTimeoutingTask(ThreadLeakControl.java:817)
	at com.carrotsearch.randomizedtesting.ThreadLeakControl$3.evaluate(ThreadLeakControl.java:468)
	at com.carrotsearch.randomizedtesting.RandomizedRunner.runSingleTest(RandomizedRunner.java:944)
	at com.carrotsearch.randomizedtesting.RandomizedRunner$5.evaluate(RandomizedRunner.java:830)
	at com.carrotsearch.randomizedtesting.RandomizedRunner$6.evaluate(RandomizedRunner.java:880)
	at com.carrotsearch.randomizedtesting.RandomizedRunner$7.evaluate(RandomizedRunner.java:891)
	at com.carrotsearch.randomizedtesting.rules.StatementAdapter.evaluate(StatementAdapter.java:36)
	at com.carrotsearch.randomizedtesting.rules.SystemPropertiesRestoreRule$1.evaluate(SystemPropertiesRestoreRule.java:57)
	at org.apache.lucene.util.AbstractBeforeAfterRule$1.evaluate(AbstractBeforeAfterRule.java:45)
	at com.carrotsearch.randomizedtesting.rules.StatementAdapter.evaluate(StatementAdapter.java:36)
	at org.apache.lucene.util.TestRuleStoreClassName$1.evaluate(TestRuleStoreClassName.java:41)
	at com.carrotsearch.randomizedtesting.rules.NoShadowingOrOverridesOnMethodsRule$1.evaluate(NoShadowingOrOverridesOnMethodsRule.java:40)
	at com.carrotsearch.randomizedtesting.rules.NoShadowingOrOverridesOnMethodsRule$1.evaluate(NoShadowingOrOverridesOnMethodsRule.java:40)
	at com.carrotsearch.randomizedtesting.rules.StatementAdapter.evaluate(StatementAdapter.java:36)
	at com.carrotsearch.randomizedtesting.rules.StatementAdapter.evaluate(StatementAdapter.java:36)
	at org.apache.lucene.util.TestRuleAssertionsRequired$1.evaluate(TestRuleAssertionsRequired.java:53)
	at org.apache.lucene.util.TestRuleMarkFailure$1.evaluate(TestRuleMarkFailure.java:47)
	at org.apache.lucene.util.TestRuleIgnoreAfterMaxFailures$1.evaluate(TestRuleIgnoreAfterMaxFailures.java:64)
	at org.apache.lucene.util.TestRuleIgnoreTestSuites$1.evaluate(TestRuleIgnoreTestSuites.java:54)
	at com.carrotsearch.randomizedtesting.rules.StatementAdapter.evaluate(StatementAdapter.java:36)
	at com.carrotsearch.randomizedtesting.ThreadLeakControl$StatementRunner.run(ThreadLeakControl.java:368)
	at java.base/java.lang.Thread.run(Thread.java:844)
Caused by: org.apache.solr.client.solrj.impl.HttpSolrClient$RemoteSolrException: Error from server at https://127.0.0.1:35381/solr/MoveReplicaHDFSTest_failed_coll_true: no servers hosting shard: shard2
	at org.apache.solr.client.solrj.impl.HttpSolrClient.executeMethod(HttpSolrClient.java:643)
	at org.apache.solr.client.solrj.impl.HttpSolrClient.request(HttpSolrClient.java:255)
	at org.apache.solr.client.solrj.impl.HttpSolrClient.request(HttpSolrClient.java:244)
	at org.apache.solr.client.solrj.impl.LBHttpSolrClient.doRequest(LBHttpSolrClient.java:483)
	at org.apache.solr.client.solrj.impl.LBHttpSolrClient.request(LBHttpSolrClient.java:436)
	... 45 more


FAILED:  org.apache.solr.cloud.MoveReplicaHDFSTest.testFailedMove

Error Message:
No live SolrServers available to handle this request:[https://127.0.0.1:33053/solr/MoveReplicaHDFSTest_failed_coll_true, https://127.0.0.1:38857/solr/MoveReplicaHDFSTest_failed_coll_true]

Stack Trace:
org.apache.solr.client.solrj.SolrServerException: No live SolrServers available to handle this request:[https://127.0.0.1:33053/solr/MoveReplicaHDFSTest_failed_coll_true, https://127.0.0.1:38857/solr/MoveReplicaHDFSTest_failed_coll_true]
	at __randomizedtesting.SeedInfo.seed([90D82B603989D855:3A15F8928E5A0D85]:0)
	at org.apache.solr.client.solrj.impl.LBHttpSolrClient.request(LBHttpSolrClient.java:462)
	at org.apache.solr.client.solrj.impl.CloudSolrClient.sendRequest(CloudSolrClient.java:1107)
	at org.apache.solr.client.solrj.impl.CloudSolrClient.requestWithRetryOnStaleState(CloudSolrClient.java:884)
	at org.apache.solr.client.solrj.impl.CloudSolrClient.requestWithRetryOnStaleState(CloudSolrClient.java:994)
	at org.apache.solr.client.solrj.impl.CloudSolrClient.request(CloudSolrClient.java:817)
	at org.apache.solr.client.solrj.SolrRequest.process(SolrRequest.java:194)
	at org.apache.solr.client.solrj.SolrClient.query(SolrClient.java:942)
	at org.apache.solr.cloud.MoveReplicaTest.testFailedMove(MoveReplicaTest.java:301)
	at java.base/jdk.internal.reflect.NativeMethodAccessorImpl.invoke0(Native Method)
	at java.base/jdk.internal.reflect.NativeMethodAccessorImpl.invoke(NativeMethodAccessorImpl.java:62)
	at java.base/jdk.internal.reflect.DelegatingMethodAccessorImpl.invoke(DelegatingMethodAccessorImpl.java:43)
	at java.base/java.lang.reflect.Method.invoke(Method.java:564)
	at com.carrotsearch.randomizedtesting.RandomizedRunner.invoke(RandomizedRunner.java:1742)
	at com.carrotsearch.randomizedtesting.RandomizedRunner$8.evaluate(RandomizedRunner.java:935)
	at com.carrotsearch.randomizedtesting.RandomizedRunner$9.evaluate(RandomizedRunner.java:971)
	at com.carrotsearch.randomizedtesting.RandomizedRunner$10.evaluate(RandomizedRunner.java:985)
	at com.carrotsearch.randomizedtesting.rules.SystemPropertiesRestoreRule$1.evaluate(SystemPropertiesRestoreRule.java:57)
	at org.apache.lucene.util.TestRuleSetupTeardownChained$1.evaluate(TestRuleSetupTeardownChained.java:49)
	at org.apache.lucene.util.AbstractBeforeAfterRule$1.evaluate(AbstractBeforeAfterRule.java:45)
	at org.apache.lucene.util.TestRuleThreadAndTestName$1.evaluate(TestRuleThreadAndTestName.java:48)
	at org.apache.lucene.util.TestRuleIgnoreAfterMaxFailures$1.evaluate(TestRuleIgnoreAfterMaxFailures.java:64)
	at org.apache.lucene.util.TestRuleMarkFailure$1.evaluate(TestRuleMarkFailure.java:47)
	at com.carrotsearch.randomizedtesting.rules.StatementAdapter.evaluate(StatementAdapter.java:36)
	at com.carrotsearch.randomizedtesting.ThreadLeakControl$StatementRunner.run(ThreadLeakControl.java:368)
	at com.carrotsearch.randomizedtesting.ThreadLeakControl.forkTimeoutingTask(ThreadLeakControl.java:817)
	at com.carrotsearch.randomizedtesting.ThreadLeakControl$3.evaluate(ThreadLeakControl.java:468)
	at com.carrotsearch.randomizedtesting.RandomizedRunner.runSingleTest(RandomizedRunner.java:944)
	at com.carrotsearch.randomizedtesting.RandomizedRunner$5.evaluate(RandomizedRunner.java:830)
	at com.carrotsearch.randomizedtesting.RandomizedRunner$6.evaluate(RandomizedRunner.java:880)
	at com.carrotsearch.randomizedtesting.RandomizedRunner$7.evaluate(RandomizedRunner.java:891)
	at com.carrotsearch.randomizedtesting.rules.StatementAdapter.evaluate(StatementAdapter.java:36)
	at com.carrotsearch.randomizedtesting.rules.SystemPropertiesRestoreRule$1.evaluate(SystemPropertiesRestoreRule.java:57)
	at org.apache.lucene.util.AbstractBeforeAfterRule$1.evaluate(AbstractBeforeAfterRule.java:45)
	at com.carrotsearch.randomizedtesting.rules.StatementAdapter.evaluate(StatementAdapter.java:36)
	at org.apache.lucene.util.TestRuleStoreClassName$1.evaluate(TestRuleStoreClassName.java:41)
	at com.carrotsearch.randomizedtesting.rules.NoShadowingOrOverridesOnMethodsRule$1.evaluate(NoShadowingOrOverridesOnMethodsRule.java:40)
	at com.carrotsearch.randomizedtesting.rules.NoShadowingOrOverridesOnMethodsRule$1.evaluate(NoShadowingOrOverridesOnMethodsRule.java:40)
	at com.carrotsearch.randomizedtesting.rules.StatementAdapter.evaluate(StatementAdapter.java:36)
	at com.carrotsearch.randomizedtesting.rules.StatementAdapter.evaluate(StatementAdapter.java:36)
	at org.apache.lucene.util.TestRuleAssertionsRequired$1.evaluate(TestRuleAssertionsRequired.java:53)
	at org.apache.lucene.util.TestRuleMarkFailure$1.evaluate(TestRuleMarkFailure.java:47)
	at org.apache.lucene.util.TestRuleIgnoreAfterMaxFailures$1.evaluate(TestRuleIgnoreAfterMaxFailures.java:64)
	at org.apache.lucene.util.TestRuleIgnoreTestSuites$1.evaluate(TestRuleIgnoreTestSuites.java:54)
	at com.carrotsearch.randomizedtesting.rules.StatementAdapter.evaluate(StatementAdapter.java:36)
	at com.carrotsearch.randomizedtesting.ThreadLeakControl$StatementRunner.run(ThreadLeakControl.java:368)
	at java.base/java.lang.Thread.run(Thread.java:844)
Caused by: org.apache.solr.client.solrj.impl.HttpSolrClient$RemoteSolrException: Error from server at https://127.0.0.1:33053/solr/MoveReplicaHDFSTest_failed_coll_true: no servers hosting shard: shard1
	at org.apache.solr.client.solrj.impl.HttpSolrClient.executeMethod(HttpSolrClient.java:643)
	at org.apache.solr.client.solrj.impl.HttpSolrClient.request(HttpSolrClient.java:255)
	at org.apache.solr.client.solrj.impl.HttpSolrClient.request(HttpSolrClient.java:244)
	at org.apache.solr.client.solrj.impl.LBHttpSolrClient.doRequest(LBHttpSolrClient.java:483)
	at org.apache.solr.client.solrj.impl.LBHttpSolrClient.request(LBHttpSolrClient.java:436)
	... 45 more




Build Log:
[...truncated 12899 lines...]
   [junit4] Suite: org.apache.solr.cloud.MoveReplicaHDFSTest
   [junit4]   2> 576781 INFO  (SUITE-MoveReplicaHDFSTest-seed#[90D82B603989D855]-worker) [    ] o.a.s.SolrTestCaseJ4 SecureRandom sanity checks: test.solr.allowed.securerandom=null & java.security.egd=file:/dev/./urandom
   [junit4]   2> Creating dataDir: /home/jenkins/workspace/Lucene-Solr-master-Linux/solr/build/solr-core/test/J0/temp/solr.cloud.MoveReplicaHDFSTest_90D82B603989D855-001/init-core-data-001
   [junit4]   2> 576782 WARN  (SUITE-MoveReplicaHDFSTest-seed#[90D82B603989D855]-worker) [    ] o.a.s.SolrTestCaseJ4 startTrackingSearchers: numOpens=5 numCloses=5
   [junit4]   2> 576782 INFO  (SUITE-MoveReplicaHDFSTest-seed#[90D82B603989D855]-worker) [    ] o.a.s.SolrTestCaseJ4 Using PointFields (NUMERIC_POINTS_SYSPROP=true) w/NUMERIC_DOCVALUES_SYSPROP=false
   [junit4]   2> 576783 INFO  (SUITE-MoveReplicaHDFSTest-seed#[90D82B603989D855]-worker) [    ] o.a.s.SolrTestCaseJ4 Randomized ssl (true) and clientAuth (true) via: @org.apache.solr.util.RandomizeSSL(reason="", ssl=0.0/0.0, value=0.0/0.0, clientAuth=0.0/0.0)
   [junit4]   2> 576783 INFO  (SUITE-MoveReplicaHDFSTest-seed#[90D82B603989D855]-worker) [    ] o.a.s.c.MiniSolrCloudCluster Starting cluster of 4 servers in /home/jenkins/workspace/Lucene-Solr-master-Linux/solr/build/solr-core/test/J0/temp/solr.cloud.MoveReplicaHDFSTest_90D82B603989D855-001/tempDir-001
   [junit4]   2> 576784 INFO  (SUITE-MoveReplicaHDFSTest-seed#[90D82B603989D855]-worker) [    ] o.a.s.c.ZkTestServer STARTING ZK TEST SERVER
   [junit4]   2> 576784 INFO  (Thread-1628) [    ] o.a.s.c.ZkTestServer client port:0.0.0.0/0.0.0.0:0
   [junit4]   2> 576784 INFO  (Thread-1628) [    ] o.a.s.c.ZkTestServer Starting server
   [junit4]   2> 576786 ERROR (Thread-1628) [    ] o.a.z.s.ZooKeeperServer ZKShutdownHandler is not registered, so ZooKeeper server won't take any action on ERROR or SHUTDOWN server state changes
   [junit4]   2> 576884 INFO  (SUITE-MoveReplicaHDFSTest-seed#[90D82B603989D855]-worker) [    ] o.a.s.c.ZkTestServer start zk server on port:45151
   [junit4]   2> 576885 INFO  (zkConnectionManagerCallback-2194-thread-1) [    ] o.a.s.c.c.ConnectionManager zkClient has connected
   [junit4]   2> 576888 INFO  (jetty-launcher-2191-thread-2) [    ] o.e.j.s.Server jetty-9.4.11.v20180605; built: 2018-06-05T18:24:03.829Z; git: d5fc0523cfa96bfebfbda19606cad384d772f04c; jvm 9.0.4+11
   [junit4]   2> 576888 INFO  (jetty-launcher-2191-thread-4) [    ] o.e.j.s.Server jetty-9.4.11.v20180605; built: 2018-06-05T18:24:03.829Z; git: d5fc0523cfa96bfebfbda19606cad384d772f04c; jvm 9.0.4+11
   [junit4]   2> 576888 INFO  (jetty-launcher-2191-thread-3) [    ] o.e.j.s.Server jetty-9.4.11.v20180605; built: 2018-06-05T18:24:03.829Z; git: d5fc0523cfa96bfebfbda19606cad384d772f04c; jvm 9.0.4+11
   [junit4]   2> 576888 INFO  (jetty-launcher-2191-thread-1) [    ] o.e.j.s.Server jetty-9.4.11.v20180605; built: 2018-06-05T18:24:03.829Z; git: d5fc0523cfa96bfebfbda19606cad384d772f04c; jvm 9.0.4+11
   [junit4]   2> 576890 INFO  (jetty-launcher-2191-thread-4) [    ] o.e.j.s.session DefaultSessionIdManager workerName=node0
   [junit4]   2> 576890 INFO  (jetty-launcher-2191-thread-4) [    ] o.e.j.s.session No SessionScavenger set, using defaults
   [junit4]   2> 576890 INFO  (jetty-launcher-2191-thread-2) [    ] o.e.j.s.session DefaultSessionIdManager workerName=node0
   [junit4]   2> 576890 INFO  (jetty-launcher-2191-thread-2) [    ] o.e.j.s.session No SessionScavenger set, using defaults
   [junit4]   2> 576890 INFO  (jetty-launcher-2191-thread-4) [    ] o.e.j.s.session node0 Scavenging every 660000ms
   [junit4]   2> 576890 INFO  (jetty-launcher-2191-thread-2) [    ] o.e.j.s.session node0 Scavenging every 660000ms
   [junit4]   2> 576891 INFO  (jetty-launcher-2191-thread-1) [    ] o.e.j.s.session DefaultSessionIdManager workerName=node0
   [junit4]   2> 576891 INFO  (jetty-launcher-2191-thread-1) [    ] o.e.j.s.session No SessionScavenger set, using defaults
   [junit4]   2> 576891 INFO  (jetty-launcher-2191-thread-1) [    ] o.e.j.s.session node0 Scavenging every 600000ms
   [junit4]   2> 576892 INFO  (jetty-launcher-2191-thread-3) [    ] o.e.j.s.session DefaultSessionIdManager workerName=node0
   [junit4]   2> 576892 INFO  (jetty-launcher-2191-thread-3) [    ] o.e.j.s.session No SessionScavenger set, using defaults
   [junit4]   2> 576892 INFO  (jetty-launcher-2191-thread-3) [    ] o.e.j.s.session node0 Scavenging every 660000ms
   [junit4]   2> 576892 INFO  (jetty-launcher-2191-thread-1) [    ] o.e.j.s.h.ContextHandler Started o.e.j.s.ServletContextHandler@1dd14188{/solr,null,AVAILABLE}
   [junit4]   2> 576892 INFO  (jetty-launcher-2191-thread-2) [    ] o.e.j.s.h.ContextHandler Started o.e.j.s.ServletContextHandler@60509238{/solr,null,AVAILABLE}
   [junit4]   2> 576892 INFO  (jetty-launcher-2191-thread-4) [    ] o.e.j.s.h.ContextHandler Started o.e.j.s.ServletContextHandler@30f0f335{/solr,null,AVAILABLE}
   [junit4]   2> 576892 INFO  (jetty-launcher-2191-thread-3) [    ] o.e.j.s.h.ContextHandler Started o.e.j.s.ServletContextHandler@41b0342b{/solr,null,AVAILABLE}
   [junit4]   2> 576893 INFO  (jetty-launcher-2191-thread-2) [    ] o.e.j.s.AbstractConnector Started ServerConnector@3685417f{SSL,[ssl, http/1.1]}{127.0.0.1:38857}
   [junit4]   2> 576893 INFO  (jetty-launcher-2191-thread-4) [    ] o.e.j.s.AbstractConnector Started ServerConnector@14d6bcb{SSL,[ssl, http/1.1]}{127.0.0.1:40165}
   [junit4]   2> 576893 INFO  (jetty-launcher-2191-thread-1) [    ] o.e.j.s.AbstractConnector Started ServerConnector@6f401e4b{SSL,[ssl, http/1.1]}{127.0.0.1:33107}
   [junit4]   2> 576893 INFO  (jetty-launcher-2191-thread-4) [    ] o.e.j.s.Server Started @576945ms
   [junit4]   2> 576893 INFO  (jetty-launcher-2191-thread-3) [    ] o.e.j.s.AbstractConnector Started ServerConnector@d1dda00{SSL,[ssl, http/1.1]}{127.0.0.1:33053}
   [junit4]   2> 576893 INFO  (jetty-launcher-2191-thread-1) [    ] o.e.j.s.Server Started @576945ms
   [junit4]   2> 576893 INFO  (jetty-launcher-2191-thread-3) [    ] o.e.j.s.Server Started @576945ms
   [junit4]   2> 576893 INFO  (jetty-launcher-2191-thread-2) [    ] o.e.j.s.Server Started @576945ms
   [junit4]   2> 576893 INFO  (jetty-launcher-2191-thread-4) [    ] o.a.s.c.s.e.JettySolrRunner Jetty properties: {hostContext=/solr, hostPort=40165}
   [junit4]   2> 576893 INFO  (jetty-launcher-2191-thread-3) [    ] o.a.s.c.s.e.JettySolrRunner Jetty properties: {hostContext=/solr, hostPort=33053}
   [junit4]   2> 576893 INFO  (jetty-launcher-2191-thread-1) [    ] o.a.s.c.s.e.JettySolrRunner Jetty properties: {hostContext=/solr, hostPort=33107}
   [junit4]   2> 576893 INFO  (jetty-launcher-2191-thread-2) [    ] o.a.s.c.s.e.JettySolrRunner Jetty properties: {hostContext=/solr, hostPort=38857}
   [junit4]   2> 576893 ERROR (jetty-launcher-2191-thread-2) [    ] o.a.s.u.StartupLoggingUtils Missing Java Option solr.log.dir. Logging may be missing or incomplete.
   [junit4]   2> 576893 ERROR (jetty-launcher-2191-thread-1) [    ] o.a.s.u.StartupLoggingUtils Missing Java Option solr.log.dir. Logging may be missing or incomplete.
   [junit4]   2> 576893 ERROR (jetty-launcher-2191-thread-4) [    ] o.a.s.u.StartupLoggingUtils Missing Java Option solr.log.dir. Logging may be missing or incomplete.
   [junit4]   2> 576893 INFO  (jetty-launcher-2191-thread-1) [    ] o.a.s.s.SolrDispatchFilter Using logger factory org.apache.logging.slf4j.Log4jLoggerFactory
   [junit4]   2> 576893 INFO  (jetty-launcher-2191-thread-4) [    ] o.a.s.s.SolrDispatchFilter Using logger factory org.apache.logging.slf4j.Log4jLoggerFactory
   [junit4]   2> 576893 ERROR (jetty-launcher-2191-thread-3) [    ] o.a.s.u.StartupLoggingUtils Missing Java Option solr.log.dir. Logging may be missing or incomplete.
   [junit4]   2> 576894 INFO  (jetty-launcher-2191-thread-3) [    ] o.a.s.s.SolrDispatchFilter Using logger factory org.apache.logging.slf4j.Log4jLoggerFactory
   [junit4]   2> 576893 INFO  (jetty-launcher-2191-thread-2) [    ] o.a.s.s.SolrDispatchFilter Using logger factory org.apache.logging.slf4j.Log4jLoggerFactory
   [junit4]   2> 576894 INFO  (jetty-launcher-2191-thread-4) [    ] o.a.s.s.SolrDispatchFilter  ___      _       Welcome to Apache Solr? version 8.0.0
   [junit4]   2> 576894 INFO  (jetty-launcher-2191-thread-3) [    ] o.a.s.s.SolrDispatchFilter  ___      _       Welcome to Apache Solr? version 8.0.0
   [junit4]   2> 576894 INFO  (jetty-launcher-2191-thread-1) [    ] o.a.s.s.SolrDispatchFilter  ___      _       Welcome to Apache Solr? version 8.0.0
   [junit4]   2> 576894 INFO  (jetty-launcher-2191-thread-2) [    ] o.a.s.s.SolrDispatchFilter  ___      _       Welcome to Apache Solr? version 8.0.0
   [junit4]   2> 576894 INFO  (jetty-launcher-2191-thread-4) [    ] o.a.s.s.SolrDispatchFilter / __| ___| |_ _   Starting in cloud mode on port null
   [junit4]   2> 576894 INFO  (jetty-launcher-2191-thread-3) [    ] o.a.s.s.SolrDispatchFilter / __| ___| |_ _   Starting in cloud mode on port null
   [junit4]   2> 576894 INFO  (jetty-launcher-2191-thread-1) [    ] o.a.s.s.SolrDispatchFilter / __| ___| |_ _   Starting in cloud mode on port null
   [junit4]   2> 576894 INFO  (jetty-launcher-2191-thread-2) [    ] o.a.s.s.SolrDispatchFilter / __| ___| |_ _   Starting in cloud mode on port null
   [junit4]   2> 576894 INFO  (jetty-launcher-2191-thread-3) [    ] o.a.s.s.SolrDispatchFilter \__ \/ _ \ | '_|  Install dir: null
   [junit4]   2> 576894 INFO  (jetty-launcher-2191-thread-1) [    ] o.a.s.s.SolrDispatchFilter \__ \/ _ \ | '_|  Install dir: null
   [junit4]   2> 576894 INFO  (jetty-launcher-2191-thread-2) [    ] o.a.s.s.SolrDispatchFilter \__ \/ _ \ | '_|  Install dir: null
   [junit4]   2> 576894 INFO  (jetty-launcher-2191-thread-1) [    ] o.a.s.s.SolrDispatchFilter |___/\___/_|_|    Start time: 2018-09-23T10:06:41.894166Z
   [junit4]   2> 576894 INFO  (jetty-launcher-2191-thread-4) [    ] o.a.s.s.SolrDispatchFilter \__ \/ _ \ | '_|  Install dir: null
   [junit4]   2> 576894 INFO  (jetty-launcher-2191-thread-3) [    ] o.a.s.s.SolrDispatchFilter |___/\___/_|_|    Start time: 2018-09-23T10:06:41.894157Z
   [junit4]   2> 576894 INFO  (jetty-launcher-2191-thread-4) [    ] o.a.s.s.SolrDispatchFilter |___/\___/_|_|    Start time: 2018-09-23T10:06:41.894194Z
   [junit4]   2> 576894 INFO  (jetty-launcher-2191-thread-2) [    ] o.a.s.s.SolrDispatchFilter |___/\___/_|_|    Start time: 2018-09-23T10:06:41.894178Z
   [junit4]   2> 576904 INFO  (zkConnectionManagerCallback-2200-thread-1) [    ] o.a.s.c.c.ConnectionManager zkClient has connected
   [junit4]   2> 576904 INFO  (zkConnectionManagerCallback-2199-thread-1) [    ] o.a.s.c.c.ConnectionManager zkClient has connected
   [junit4]   2> 576904 INFO  (zkConnectionManagerCallback-2201-thread-1) [    ] o.a.s.c.c.ConnectionManager zkClient has connected
   [junit4]   2> 576905 INFO  (jetty-launcher-2191-thread-4) [    ] o.a.s.s.SolrDispatchFilter solr.xml found in ZooKeeper. Loading...
   [junit4]   2> 576905 INFO  (jetty-launcher-2191-thread-2) [    ] o.a.s.s.SolrDispatchFilter solr.xml found in ZooKeeper. Loading...
   [junit4]   2> 576905 INFO  (jetty-launcher-2191-thread-3) [    ] o.a.s.s.SolrDispatchFilter solr.xml found in ZooKeeper. Loading...
   [junit4]   2> 576905 INFO  (zkConnectionManagerCallback-2202-thread-1) [    ] o.a.s.c.c.ConnectionManager zkClient has connected
   [junit4]   2> 576906 INFO  (jetty-launcher-2191-thread-1) [    ] o.a.s.s.SolrDispatchFilter solr.xml found in ZooKeeper. Loading...
   [junit4]   2> 576955 INFO  (jetty-launcher-2191-thread-2) [    ] o.a.s.c.ZkContainer Zookeeper client=127.0.0.1:45151/solr
   [junit4]   2> 576959 INFO  (zkConnectionManagerCallback-2206-thread-1) [    ] o.a.s.c.c.ConnectionManager zkClient has connected
   [junit4]   2> 576960 DEBUG (jetty-launcher-2191-thread-2) [n:127.0.0.1:38857_solr    ] o.a.s.c.ZkController Added new OnReconnect listener org.apache.solr.cloud.ZkController$$Lambda$183/723224897@38244ede
   [junit4]   2> 576967 INFO  (zkConnectionManagerCallback-2208-thread-1) [    ] o.a.s.c.c.ConnectionManager zkClient has connected
   [junit4]   2> 576969 INFO  (jetty-launcher-2191-thread-1) [    ] o.a.s.c.ZkContainer Zookeeper client=127.0.0.1:45151/solr
   [junit4]   2> 576975 INFO  (zkConnectionManagerCallback-2212-thread-1) [    ] o.a.s.c.c.ConnectionManager zkClient has connected
   [junit4]   2> 576976 DEBUG (jetty-launcher-2191-thread-1) [n:127.0.0.1:33107_solr    ] o.a.s.c.ZkController Added new OnReconnect listener org.apache.solr.cloud.ZkController$$Lambda$183/723224897@1cdfdd2a
   [junit4]   2> 576991 INFO  (zkConnectionManagerCallback-2216-thread-1) [    ] o.a.s.c.c.ConnectionManager zkClient has connected
   [junit4]   2> 576994 DEBUG (SyncThread:0) [    ] o.a.s.c.ZkTestServer Watch added: data: /solr/clusterprops.json
   [junit4]   2> 576995 DEBUG (SyncThread:0) [    ] o.a.s.c.ZkTestServer Watch added: children: /solr/live_nodes
   [junit4]   2> 576995 DEBUG (SyncThread:0) [    ] o.a.s.c.ZkTestServer Watch added: data: /solr/clusterstate.json
   [junit4]   2> 576995 DEBUG (SyncThread:0) [    ] o.a.s.c.ZkTestServer Watch added: children: /solr/collections
   [junit4]   2> 576995 DEBUG (SyncThread:0) [    ] o.a.s.c.ZkTestServer Watch added: create/delete: /solr/aliases.json
   [junit4]   2> 576995 DEBUG (SyncThread:0) [    ] o.a.s.c.ZkTestServer Watch added: create/delete: /solr/security.json
   [junit4]   2> 576997 DEBUG (jetty-launcher-2191-thread-1) [n:127.0.0.1:33107_solr    ] o.a.s.c.LeaderElector Joined leadership election with path: /overseer_elect/election/72273396183138312-127.0.0.1:33107_solr-n_0000000000
   [junit4]   2> 576997 INFO  (jetty-launcher-2191-thread-1) [n:127.0.0.1:33107_solr    ] o.a.s.c.OverseerElectionContext I am going to be the leader 127.0.0.1:33107_solr
   [junit4]   2> 576997 INFO  (jetty-launcher-2191-thread-1) [n:127.0.0.1:33107_solr    ] o.a.s.c.Overseer Overseer (id=72273396183138312-127.0.0.1:33107_solr-n_0000000000) starting
   [junit4]   2> 577001 INFO  (zkConnectionManagerCallback-2223-thread-1) [    ] o.a.s.c.c.ConnectionManager zkClient has connected
   [junit4]   2> 577001 DEBUG (SyncThread:0) [    ] o.a.s.c.ZkTestServer Watch added: data: /solr/clusterprops.json
   [junit4]   2> 577001 DEBUG (SyncThread:0) [    ] o.a.s.c.ZkTestServer Watch added: children: /solr/live_nodes
   [junit4]   2> 577001 DEBUG (SyncThread:0) [    ] o.a.s.c.ZkTestServer Watch added: data: /solr/clusterstate.json
   [junit4]   2> 577001 DEBUG (SyncThread:0) [    ] o.a.s.c.ZkTestServer Watch added: children: /solr/collections
   [junit4]   2> 577001 DEBUG (SyncThread:0) [    ] o.a.s.c.ZkTestServer Watch added: create/delete: /solr/aliases.json
   [junit4]   2> 577002 INFO  (jetty-launcher-2191-thread-1) [n:127.0.0.1:33107_solr    ] o.a.s.c.s.i.ZkClientClusterStateProvider Cluster at 127.0.0.1:45151/solr ready
   [junit4]   2> 577002 INFO  (OverseerStateUpdate-72273396183138312-127.0.0.1:33107_solr-n_0000000000) [n:127.0.0.1:33107_solr    ] o.a.s.c.Overseer Starting to work on the main queue : 127.0.0.1:33107_solr
   [junit4]   2> 577002 DEBUG (SyncThread:0) [    ] o.a.s.c.ZkTestServer Watch added: children: /solr/overseer/queue-work
   [junit4]   2> 577003 DEBUG (SyncThread:0) [    ] o.a.s.c.ZkTestServer Watch added: children: /solr/overseer/queue
   [junit4]   2> 577003 DEBUG (SyncThread:0) [    ] o.a.s.c.ZkTestServer Watch added: data: /solr/clusterprops.json
   [junit4]   2> 577003 DEBUG (SyncThread:0) [    ] o.a.s.c.ZkTestServer Watch added: children: /solr/live_nodes
   [junit4]   2> 577003 DEBUG (OverseerCollectionConfigSetProcessor-72273396183138312-127.0.0.1:33107_solr-n_0000000000) [n:127.0.0.1:33107_solr    ] o.a.s.c.OverseerTaskProcessor Process current queue of overseer operations
   [junit4]   2> 577003 DEBUG (SyncThread:0) [    ] o.a.s.c.ZkTestServer Watch added: data: /solr/clusterstate.json
   [junit4]   2> 577003 DEBUG (SyncThread:0) [    ] o.a.s.c.ZkTestServer Watch added: children: /solr/collections
   [junit4]   2> 577004 DEBUG (SyncThread:0) [    ] o.a.s.c.ZkTestServer Watch added: create/delete: /solr/aliases.json
   [junit4]   2> 577004 DEBUG (OverseerCollectionConfigSetProcessor-72273396183138312-127.0.0.1:33107_solr-n_0000000000) [n:127.0.0.1:33107_solr    ] o.a.s.c.OverseerTaskProcessor Cleaning up work-queue. #Running tasks: 0
   [junit4]   2> 577004 DEBUG (OverseerCollectionConfigSetProcessor-72273396183138312-127.0.0.1:33107_solr-n_0000000000) [n:127.0.0.1:33107_solr    ] o.a.s.c.OverseerTaskProcessor RunningTasks: []
   [junit4]   2> 577004 DEBUG (OverseerCollectionConfigSetProcessor-72273396183138312-127.0.0.1:33107_solr-n_0000000000) [n:127.0.0.1:33107_solr    ] o.a.s.c.OverseerTaskProcessor BlockedTasks: []
   [junit4]   2> 577004 DEBUG (OverseerCollectionConfigSetProcessor-72273396183138312-127.0.0.1:33107_solr-n_0000000000) [n:127.0.0.1:33107_solr    ] o.a.s.c.OverseerTaskProcessor CompletedTasks: []
   [junit4]   2> 577004 DEBUG (OverseerCollectionConfigSetProcessor-72273396183138312-127.0.0.1:33107_solr-n_0000000000) [n:127.0.0.1:33107_solr    ] o.a.s.c.OverseerTaskProcessor RunningZKTasks: []
   [junit4]   2> 577004 DEBUG (SyncThread:0) [    ] o.a.s.c.ZkTestServer Watch added: create/delete: /solr/security.json
   [junit4]   2> 577004 DEBUG (OverseerCollectionConfigSetProcessor-72273396183138312-127.0.0.1:33107_solr-n_0000000000) [n:127.0.0.1:33107_solr    ] o.a.s.c.OverseerTaskQueue Peeking for top 100 elements. ExcludeSet: []
   [junit4]   2> 577004 DEBUG (SyncThread:0) [    ] o.a.s.c.ZkTestServer Watch added: children: /solr/overseer/collection-queue-work
   [junit4]   2> 577004 DEBUG (jetty-launcher-2191-thread-2) [n:127.0.0.1:38857_solr    ] o.a.s.c.LeaderElector Joined leadership election with path: /overseer_elect/election/72273396183138310-127.0.0.1:38857_solr-n_0000000001
   [junit4]   2> 577005 DEBUG (SyncThread:0) [    ] o.a.s.c.ZkTestServer Watch added: data: /solr/overseer_elect/election/72273396183138312-127.0.0.1:33107_solr-n_0000000000
   [junit4]   2> 577005 DEBUG (jetty-launcher-2191-thread-2) [n:127.0.0.1:38857_solr    ] o.a.s.c.LeaderElector Watching path /overseer_elect/election/72273396183138312-127.0.0.1:33107_solr-n_0000000000 to know if I could be the leader
   [junit4]   2> 577005 INFO  (jetty-launcher-2191-thread-2) [n:127.0.0.1:38857_solr    ] o.a.s.c.ZkController Register node as live in ZooKeeper:/live_nodes/127.0.0.1:38857_solr
   [junit4]   2> 577005 DEBUG (SyncThread:0) [    ] o.a.s.c.ZkTestServer Watch fired: children: /solr/live_nodes
   [junit4]   2> 577005 DEBUG (SyncThread:0) [    ] o.a.s.c.ZkTestServer Watch fired: children: /solr/live_nodes
   [junit4]   2> 577005 DEBUG (SyncThread:0) [    ] o.a.s.c.ZkTestServer Watch fired: children: /solr/live_nodes
   [junit4]   2> 577007 DEBUG (OverseerAutoScalingTriggerThread-72273396183138312-127.0.0.1:33107_solr-n_0000000000) [    ] o.a.s.c.a.OverseerTriggerThread Adding .auto_add_replicas and .scheduled_maintenance triggers
   [junit4]   2> 577008 DEBUG (SyncThread:0) [    ] o.a.s.c.ZkTestServer Watch added: data: /solr/autoscaling.json
   [junit4]   2> 577008 DEBUG (OverseerAutoScalingTriggerThread-72273396183138312-127.0.0.1:33107_solr-n_0000000000) [    ] o.a.s.c.a.OverseerTriggerThread Refreshing /autoscaling.json with znode version 1
   [junit4]   2> 577008 DEBUG (OverseerAutoScalingTriggerThread-72273396183138312-127.0.0.1:33107_solr-n_0000000000) [    ] o.a.s.c.a.OverseerTriggerThread Current znodeVersion 1, lastZnodeVersion -1
   [junit4]   2> 577008 DEBUG (OverseerAutoScalingTriggerThread-72273396183138312-127.0.0.1:33107_solr-n_0000000000) [    ] o.a.s.c.a.OverseerTriggerThread Processed trigger updates upto znodeVersion 1
   [junit4]   2> 577011 DEBUG (SyncThread:0) [    ] o.a.s.c.ZkTestServer Watch added: children: /solr/live_nodes
   [junit4]   2> 577011 DEBUG (jetty-launcher-2191-thread-1) [n:127.0.0.1:33107_solr    ] o.a.s.c.ZkController Publish node=127.0.0.1:33107_solr as DOWN
   [junit4]   2> 577011 INFO  (zkCallback-2222-thread-1) [    ] o.a.s.c.c.ZkStateReader Updated live nodes from ZooKeeper... (0) -> (1)
   [junit4]   2> 577012 DEBUG (SyncThread:0) [    ] o.a.s.c.ZkTestServer Watch fired: children: /solr/overseer/queue
   [junit4]   2> 577012 INFO  (jetty-launcher-2191-thread-1) [n:127.0.0.1:33107_solr    ] o.a.s.c.TransientSolrCoreCacheDefault Allocating transient cache for 2147483647 transient cores
   [junit4]   2> 577012 INFO  (jetty-launcher-2191-thread-1) [n:127.0.0.1:33107_solr    ] o.a.s.c.ZkController Register node as live in ZooKeeper:/live_nodes/127.0.0.1:33107_solr
   [junit4]   2> 577012 DEBUG (SyncThread:0) [    ] o.a.s.c.ZkTestServer Watch fired: children: /solr/live_nodes
   [junit4]   2> 577019 DEBUG (SyncThread:0) [    ] o.a.s.c.ZkTestServer Watch added: children: /solr/live_nodes
   [junit4]   2> 577019 INFO  (zkCallback-2215-thread-1) [    ] o.a.s.c.c.ZkStateReader Updated live nodes from ZooKeeper... (0) -> (2)
   [junit4]   2> 577020 DEBUG (SyncThread:0) [    ] o.a.s.c.ZkTestServer Watch added: children: /solr/live_nodes
   [junit4]   2> 577020 INFO  (zkCallback-2222-thread-1) [    ] o.a.s.c.c.ZkStateReader Updated live nodes from ZooKeeper... (1) -> (2)
   [junit4]   2> 577023 DEBUG (SyncThread:0) [    ] o.a.s.c.ZkTestServer Watch added: children: /solr/live_nodes
   [junit4]   2> 577023 INFO  (zkCallback-2207-thread-1) [    ] o.a.s.c.c.ZkStateReader Updated live nodes from ZooKeeper... (0) -> (2)
   [junit4]   2> 577023 DEBUG (SyncThread:0) [    ] o.a.s.c.ZkTestServer Watch added: children: /solr/autoscaling/events/.scheduled_maintenance
   [junit4]   2> 577024 DEBUG (SyncThread:0) [    ] o.a.s.c.ZkTestServer Watch added: children: /solr/overseer/queue
   [junit4]   2> 577024 DEBUG (OverseerAutoScalingTriggerThread-72273396183138312-127.0.0.1:33107_solr-n_0000000000) [    ] o.a.s.c.a.NodeLostTrigger NodeLostTrigger .auto_add_replicas - Initial livenodes: [127.0.0.1:38857_solr, 127.0.0.1:33107_solr]
   [junit4]   2> 577027 INFO  (jetty-launcher-2191-thread-1) [n:127.0.0.1:33107_solr    ] o.a.s.h.a.MetricsHistoryHandler No .system collection, keeping metrics history in memory.
   [junit4]   2> 577027 DEBUG (OverseerAutoScalingTriggerThread-72273396183138312-127.0.0.1:33107_solr-n_0000000000) [    ] o.a.s.c.a.OverseerTriggerThread -- clean old nodeAdded markers
   [junit4]   2> 577027 DEBUG (SyncThread:0) [    ] o.a.s.c.ZkTestServer Watch added: children: /solr/autoscaling/events/.auto_add_replicas
   [junit4]   2> 577027 DEBUG (OverseerAutoScalingTriggerThread-72273396183138312-127.0.0.1:33107_solr-n_0000000000) [    ] o.a.s.c.a.OverseerTriggerThread Current znodeVersion 1, lastZnodeVersion 1
   [junit4]   2> 577028 DEBUG (ScheduledTrigger-2924-thread-3) [    ] o.a.s.c.a.NodeLostTrigger Running NodeLostTrigger: .auto_add_replicas with currently live nodes: 2
   [junit4]   2> 577032 INFO  (jetty-launcher-2191-thread-4) [    ] o.a.s.c.ZkContainer Zookeeper client=127.0.0.1:45151/solr
   [junit4]   2> 577038 INFO  (jetty-launcher-2191-thread-1) [n:127.0.0.1:33107_solr    ] o.a.s.m.r.SolrJmxReporter JMX monitoring for 'solr_33107.solr.node' (registry 'solr.node') enabled at server: com.sun.jmx.mbeanserver.JmxMBeanServer@7c96ba05
   [junit4]   2> 577039 INFO  (zkConnectionManagerCallback-2230-thread-1) [    ] o.a.s.c.c.ConnectionManager zkClient has connected
   [junit4]   2> 577040 INFO  (zkConnectionManagerCallback-2233-thread-1) [    ] o.a.s.c.c.ConnectionManager zkClient has connected
   [junit4]   2> 577040 DEBUG (SyncThread:0) [    ] o.a.s.c.ZkTestServer Watch added: data: /solr/clusterprops.json
   [junit4]   2> 577040 DEBUG (SyncThread:0) [    ] o.a.s.c.ZkTestServer Watch added: children: /solr/live_nodes
   [junit4]   2> 577040 INFO  (jetty-launcher-2191-thread-2) [n:127.0.0.1:38857_solr    ] o.a.s.c.c.ZkStateReader Updated live nodes from ZooKeeper... (0) -> (2)
   [junit4]   2> 577040 DEBUG (SyncThread:0) [    ] o.a.s.c.ZkTestServer Watch added: data: /solr/clusterstate.json
   [junit4]   2> 577040 DEBUG (jetty-launcher-2191-thread-4) [n:127.0.0.1:40165_solr    ] o.a.s.c.ZkController Added new OnReconnect listener org.apache.solr.cloud.ZkController$$Lambda$183/723224897@6bfbdc01
   [junit4]   2> 577040 DEBUG (SyncThread:0) [    ] o.a.s.c.ZkTestServer Watch added: children: /solr/collections
   [junit4]   2> 577040 DEBUG (SyncThread:0) [    ] o.a.s.c.ZkTestServer Watch added: create/delete: /solr/aliases.json
   [junit4]   2> 577041 INFO  (jetty-launcher-2191-thread-2) [n:127.0.0.1:38857_solr    ] o.a.s.c.s.i.ZkClientClusterStateProvider Cluster at 127.0.0.1:45151/solr ready
   [junit4]   2> 577043 INFO  (jetty-launcher-2191-thread-1) [n:127.0.0.1:33107_solr    ] o.a.s.m.r.SolrJmxReporter JMX monitoring for 'solr_33107.solr.jvm' (registry 'solr.jvm') enabled at server: com.sun.jmx.mbeanserver.JmxMBeanServer@7c96ba05
   [junit4]   2> 577043 INFO  (jetty-launcher-2191-thread-1) [n:127.0.0.1:33107_solr    ] o.a.s.m.r.SolrJmxReporter JMX monitoring for 'solr_33107.solr.jetty' (registry 'solr.jetty') enabled at server: com.sun.jmx.mbeanserver.JmxMBeanServer@7c96ba05
   [junit4]   2> 577044 INFO  (jetty-launcher-2191-thread-1) [n:127.0.0.1:33107_solr    ] o.a.s.c.CorePropertiesLocator Found 0 core definitions underneath /home/jenkins/workspace/Lucene-Solr-master-Linux/solr/build/solr-core/test/J0/temp/solr.cloud.MoveReplicaHDFSTest_90D82B603989D855-001/tempDir-001/node1/.
   [junit4]   2> 577047 INFO  (zkConnectionManagerCallback-2235-thread-1) [    ] o.a.s.c.c.ConnectionManager zkClient has connected
   [junit4]   2> 577047 INFO  (jetty-launcher-2191-thread-2) [n:127.0.0.1:38857_solr    ] o.a.s.h.a.MetricsHistoryHandler No .system collection, keeping metrics history in memory.
   [junit4]   2> 577050 DEBUG (SyncThread:0) [    ] o.a.s.c.ZkTestServer Watch added: data: /solr/clusterprops.json
   [junit4]   2> 577050 DEBUG (SyncThread:0) [    ] o.a.s.c.ZkTestServer Watch added: children: /solr/live_nodes
   [junit4]   2> 577050 INFO  (jetty-launcher-2191-thread-4) [n:127.0.0.1:40165_solr    ] o.a.s.c.c.ZkStateReader Updated live nodes from ZooKeeper... (0) -> (2)
   [junit4]   2> 577050 DEBUG (SyncThread:0) [    ] o.a.s.c.ZkTestServer Watch added: data: /solr/clusterstate.json
   [junit4]   2> 577050 DEBUG (SyncThread:0) [    ] o.a.s.c.ZkTestServer Watch added: children: /solr/collections
   [junit4]   2> 577050 DEBUG (SyncThread:0) [    ] o.a.s.c.ZkTestServer Watch added: create/delete: /solr/aliases.json
   [junit4]   2> 577051 DEBUG (SyncThread:0) [    ] o.a.s.c.ZkTestServer Watch added: create/delete: /solr/security.json
   [junit4]   2> 577051 DEBUG (jetty-launcher-2191-thread-4) [n:127.0.0.1:40165_solr    ] o.a.s.c.LeaderElector Joined leadership election with path: /overseer_elect/election/72273396183138316-127.0.0.1:40165_solr-n_0000000002
   [junit4]   2> 577051 DEBUG (SyncThread:0) [    ] o.a.s.c.ZkTestServer Watch added: data: /solr/overseer_elect/election/72273396183138310-127.0.0.1:38857_solr-n_0000000001
   [junit4]   2> 577051 DEBUG (jetty-launcher-2191-thread-4) [n:127.0.0.1:40165_solr    ] o.a.s.c.LeaderElector Watching path /overseer_elect/election/72273396183138310-127.0.0.1:38857_solr-n_0000000001 to know if I could be the leader
   [junit4]   2> 577052 DEBUG (jetty-launcher-2191-thread-4) [n:127.0.0.1:40165_solr    ] o.a.s.c.ZkController Publish node=127.0.0.1:40165_solr as DOWN
   [junit4]   2> 577052 DEBUG (SyncThread:0) [    ] o.a.s.c.ZkTestServer Watch fired: children: /solr/overseer/queue
   [junit4]   2> 577052 INFO  (jetty-launcher-2191-thread-4) [n:127.0.0.1:40165_solr    ] o.a.s.c.TransientSolrCoreCacheDefault Allocating transient cache for 2147483647 transient cores
   [junit4]   2> 577052 INFO  (jetty-launcher-2191-thread-4) [n:127.0.0.1:40165_solr    ] o.a.s.c.ZkController Register node as live in ZooKeeper:/live_nodes/127.0.0.1:40165_solr
   [junit4]   2> 577052 DEBUG (SyncThread:0) [    ] o.a.s.c.ZkTestServer Watch added: children: /solr/overseer/queue
   [junit4]   2> 577053 DEBUG (SyncThread:0) [    ] o.a.s.c.ZkTestServer Watch fired: children: /solr/live_nodes
   [junit4]   2> 577053 DEBUG (SyncThread:0) [    ] o.a.s.c.ZkTestServer Watch fired: children: /solr/live_nodes
   [junit4]   2> 577053 DEBUG (SyncThread:0) [    ] o.a.s.c.ZkTestServer Watch fired: children: /solr/live_nodes
   [junit4]   2> 577053 DEBUG (SyncThread:0) [    ] o.a.s.c.ZkTestServer Watch fired: children: /solr/live_nodes
   [junit4]   2> 577053 DEBUG (SyncThread:0) [    ] o.a.s.c.ZkTestServer Watch fired: children: /solr/live_nodes
   [junit4]   2> 577053 DEBUG (SyncThread:0) [    ] o.a.s.c.ZkTestServer Watch added: children: /solr/live_nodes
   [junit4]   2> 577053 INFO  (zkCallback-2222-thread-1) [    ] o.a.s.c.c.ZkStateReader Updated live nodes from ZooKeeper... (2) -> (3)
   [junit4]   2> 577053 DEBUG (SyncThread:0) [    ] o.a.s.c.ZkTestServer Watch added: children: /solr/live_nodes
   [junit4]   2> 577053 DEBUG (SyncThread:0) [    ] o.a.s.c.ZkTestServer Watch added: children: /solr/live_nodes
   [junit4]   2> 577053 INFO  (zkCallback-2207-thread-1) [    ] o.a.s.c.c.ZkStateReader Updated live nodes from ZooKeeper... (2) -> (3)
   [junit4]   2> 577053 INFO  (zkCallback-2215-thread-2) [    ] o.a.s.c.c.ZkStateReader Updated live nodes from ZooKeeper... (2) -> (3)
   [junit4]   2> 577053 DEBUG (SyncThread:0) [    ] o.a.s.c.ZkTestServer Watch added: children: /solr/live_nodes
   [junit4]   2> 577053 INFO  (zkCallback-2229-thread-1) [    ] o.a.s.c.c.ZkStateReader Updated live nodes from ZooKeeper... (2) -> (3)
   [junit4]   2> 577053 DEBUG (SyncThread:0) [    ] o.a.s.c.ZkTestServer Watch added: children: /solr/live_nodes
   [junit4]   2> 577053 INFO  (zkCallback-2234-thread-1) [    ] o.a.s.c.c.ZkStateReader Updated live nodes from ZooKeeper... (2) -> (3)
   [junit4]   2> 577065 INFO  (jetty-launcher-2191-thread-2) [n:127.0.0.1:38857_solr    ] o.a.s.m.r.SolrJmxReporter JMX monitoring for 'solr_38857.solr.node' (registry 'solr.node') enabled at server: com.sun.jmx.mbeanserver.JmxMBeanServer@7c96ba05
   [junit4]   2> 577066 INFO  (jetty-launcher-2191-thread-3) [    ] o.a.s.c.ZkContainer Zookeeper client=127.0.0.1:45151/solr
   [junit4]   2> 577076 INFO  (zkConnectionManagerCallback-2242-thread-1) [    ] o.a.s.c.c.ConnectionManager zkClient has connected
   [junit4]   2> 577076 DEBUG (jetty-launcher-2191-thread-3) [n:127.0.0.1:33053_solr    ] o.a.s.c.ZkController Added new OnReconnect listener org.apache.solr.cloud.ZkController$$Lambda$183/723224897@21e6b70d
   [junit4]   2> 577077 INFO  (zkConnectionManagerCallback-2244-thread-1) [    ] o.a.s.c.c.ConnectionManager zkClient has connected
   [junit4]   2> 577079 INFO  (jetty-launcher-2191-thread-2) [n:127.0.0.1:38857_solr    ] o.a.s.m.r.SolrJmxReporter JMX monitoring for 'solr_38857.solr.jvm' (registry 'solr.jvm') enabled at server: com.sun.jmx.mbeanserver.JmxMBeanServer@7c96ba05
   [junit4]   2> 577079 INFO  (jetty-launcher-2191-thread-2) [n:127.0.0.1:38857_solr    ] o.a.s.m.r.SolrJmxReporter JMX monitoring for 'solr_38857.solr.jetty' (registry 'solr.jetty') enabled at server: com.sun.jmx.mbeanserver.JmxMBeanServer@7c96ba05
   [junit4]   2> 577080 INFO  (jetty-launcher-2191-thread-2) [n:127.0.0.1:38857_solr    ] o.a.s.c.CorePropertiesLocator Found 0 core definitions underneath /home/jenkins/workspace/Lucene-Solr-master-Linux/solr/build/solr-core/test/J0/temp/solr.cloud.MoveReplicaHDFSTest_90D82B603989D855-001/tempDir-001/node2/.
   [junit4]   2> 577081 DEBUG (SyncThread:0) [    ] o.a.s.c.ZkTestServer Watch added: data: /solr/clusterprops.json
   [junit4]   2> 577081 DEBUG (SyncThread:0) [    ] o.a.s.c.ZkTestServer Watch added: children: /solr/live_nodes
   [junit4]   2> 577081 INFO  (jetty-launcher-2191-thread-3) [n:127.0.0.1:33053_solr    ] o.a.s.c.c.ZkStateReader Updated live nodes from ZooKeeper... (0) -> (3)
   [junit4]   2> 577081 DEBUG (SyncThread:0) [    ] o.a.s.c.ZkTestServer Watch added: data: /solr/clusterstate.json
   [junit4]   2> 577081 DEBUG (SyncThread:0) [    ] o.a.s.c.ZkTestServer Watch added: children: /solr/collections
   [junit4]   2> 577082 DEBUG (SyncThread:0) [    ] o.a.s.c.ZkTestServer Watch added: create/delete: /solr/aliases.json
   [junit4]   2> 577082 INFO  (zkConnectionManagerCallback-2251-thread-1) [    ] o.a.s.c.c.ConnectionManager zkClient has connected
   [junit4]   2> 577082 DEBUG (SyncThread:0) [    ] o.a.s.c.ZkTestServer Watch added: create/delete: /solr/security.json
   [junit4]   2> 577082 DEBUG (SyncThread:0) [    ] o.a.s.c.ZkTestServer Watch added: data: /solr/clusterprops.json
   [junit4]   2> 577082 DEBUG (SyncThread:0) [    ] o.a.s.c.ZkTestServer Watch added: children: /solr/live_nodes
   [junit4]   2> 577082 INFO  (jetty-launcher-2191-thread-4) [n:127.0.0.1:40165_solr    ] o.a.s.c.c.ZkStateReader Updated live nodes from ZooKeeper... (0) -> (3)
   [junit4]   2> 577082 DEBUG (SyncThread:0) [    ] o.a.s.c.ZkTestServer Watch added: data: /solr/clusterstate.json
   [junit4]   2> 577082 DEBUG (SyncThread:0) [    ] o.a.s.c.ZkTestServer Watch added: children: /solr/collections
   [junit4]   2> 577082 DEBUG (SyncThread:0) [    ] o.a.s.c.ZkTestServer Watch added: create/delete: /solr/aliases.json
   [junit4]   2> 577082 DEBUG (jetty-launcher-2191-thread-3) [n:127.0.0.1:33053_solr    ] o.a.s.c.LeaderElector Joined leadership election with path: /overseer_elect/election/72273396183138318-127.0.0.1:33053_solr-n_0000000003
   [junit4]   2> 577083 INFO  (jetty-launcher-2191-thread-4) [n:127.0.0.1:40165_solr    ] o.a.s.c.s.i.ZkClientClusterStateProvider Cluster at 127.0.0.1:45151/solr ready
   [junit4]   2> 577083 DEBUG (SyncThread:0) [    ] o.a.s.c.ZkTestServer Watch added: data: /solr/overseer_elect/election/72273396183138316-127.0.0.1:40165_solr-n_0000000002
   [junit4]   2> 577083 DEBUG (jetty-launcher-2191-thread-3) [n:127.0.0.1:33053_solr    ] o.a.s.c.LeaderElector Watching path /overseer_elect/election/72273396183138316-127.0.0.1:40165_solr-n_0000000002 to know if I could be the leader
   [junit4]   2> 577083 DEBUG (jetty-launcher-2191-thread-3) [n:127.0.0.1:33053_solr    ] o.a.s.c.ZkController Publish node=127.0.0.1:33053_solr as DOWN
   [junit4]   2> 577083 INFO  (jetty-launcher-2191-thread-4) [n:127.0.0.1:40165_solr    ] o.a.s.h.a.MetricsHistoryHandler No .system collection, keeping metrics history in memory.
   [junit4]   2> 577083 DEBUG (SyncThread:0) [    ] o.a.s.c.ZkTestServer Watch fired: children: /solr/overseer/queue
   [junit4]   2> 577083 INFO  (jetty-launcher-2191-thread-3) [n:127.0.0.1:33053_solr    ] o.a.s.c.TransientSolrCoreCacheDefault Allocating transient cache for 2147483647 transient cores
   [junit4]   2> 577083 INFO  (jetty-launcher-2191-thread-3) [n:127.0.0.1:33053_solr    ] o.a.s.c.ZkController Register node as live in ZooKeeper:/live_nodes/127.0.0.1:33053_solr
   [junit4]   2> 577083 DEBUG (SyncThread:0) [    ] o.a.s.c.ZkTestServer Watch added: children: /solr/overseer/queue
   [junit4]   2> 577084 DEBUG (SyncThread:0) [    ] o.a.s.c.ZkTestServer Watch fired: children: /solr/live_nodes
   [junit4]   2> 577084 DEBUG (SyncThread:0) [    ] o.a.s.c.ZkTestServer Watch fired: children: /solr/live_nodes
   [junit4]   2> 577084 DEBUG (SyncThread:0) [    ] o.a.s.c.ZkTestServer Watch fired: children: /solr/live_nodes
   [junit4]   2> 577084 DEBUG (SyncThread:0) [    ] o.a.s.c.ZkTestServer Watch fired: children: /solr/live_nodes
   [junit4]   2> 577084 DEBUG (SyncThread:0) [    ] o.a.s.c.ZkTestServer Watch fired: children: /solr/live_nodes
   [junit4]   2> 577084 DEBUG (SyncThread:0) [    ] o.a.s.c.ZkTestServer Watch fired: children: /solr/live_nodes
   [junit4]   2> 577084 DEBUG (SyncThread:0) [    ] o.a.s.c.ZkTestServer Watch fired: children: /solr/live_nodes
   [junit4]   2> 577084 DEBUG (SyncThread:0) [    ] o.a.s.c.ZkTestServer Watch added: children: /solr/live_nodes
   [junit4]   2> 577084 INFO  (zkCallback-2222-thread-1) [    ] o.a.s.c.c.ZkStateReader Updated live nodes from ZooKeeper... (3) -> (4)
   [junit4]   2> 577084 DEBUG (SyncThread:0) [    ] o.a.s.c.ZkTestServer Watch added: children: /solr/live_nodes
   [junit4]   2> 577084 DEBUG (SyncThread:0) [    ] o.a.s.c.ZkTestServer Watch added: children: /solr/live_nodes
   [junit4]   2> 577084 DEBUG (SyncThread:0) [    ] o.a.s.c.ZkTestServer Watch added: children: /solr/live_nodes
   [junit4]   2> 577084 INFO  (zkCallback-2215-thread-2) [    ] o.a.s.c.c.ZkStateReader Updated live nodes from ZooKeeper... (3) -> (4)
   [junit4]   2> 577084 DEBUG (SyncThread:0) [    ] o.a.s.c.ZkTestServer Watch added: children: /solr/live_nodes
   [junit4]   2> 577084 DEBUG (SyncThread:0) [    ] o.a.s.c.ZkTestServer Watch added: children: /solr/live_nodes
   [junit4]   2> 577084 INFO  (zkCallback-2234-thread-1) [    ] o.a.s.c.c.ZkStateReader Updated live nodes from ZooKeeper... (3) -> (4)
   [junit4]   2> 577084 INFO  (zkCallback-2207-thread-1) [    ] o.a.s.c.c.ZkStateReader Updated live nodes from ZooKeeper... (3) -> (4)
   [junit4]   2> 577084 INFO  (zkCallback-2229-thread-1) [    ] o.a.s.c.c.ZkStateReader Updated live nodes from ZooKeeper... (3) -> (4)
   [junit4]   2> 577084 INFO  (zkCallback-2250-thread-1) [    ] o.a.s.c.c.ZkStateReader Updated live nodes from ZooKeeper... (3) -> (4)
   [junit4]   2> 577089 DEBUG (SyncThread:0) [    ] o.a.s.c.ZkTestServer Watch added: children: /solr/live_nodes
   [junit4]   2> 577089 INFO  (zkCallback-2243-thread-1) [    ] o.a.s.c.c.ZkStateReader Updated live nodes from ZooKeeper... (3) -> (4)
   [junit4]   2> 577091 INFO  (jetty-launcher-2191-thread-4) [n:127.0.0.1:40165_solr    ] o.a.s.m.r.SolrJmxReporter JMX monitoring for 'solr_40165.solr.node' (registry 'solr.node') enabled at server: com.sun.jmx.mbeanserver.JmxMBeanServer@7c96ba05
   [junit4]   2> 577093 INFO  (zkConnectionManagerCallback-2257-thread-1) [    ] o.a.s.c.c.ConnectionManager zkClient has connected
   [junit4]   2> 577093 DEBUG (SyncThread:0) [    ] o.a.s.c.ZkTestServer Watch added: data: /solr/clusterprops.json
   [junit4]   2> 577093 DEBUG (SyncThread:0) [    ] o.a.s.c.ZkTestServer Watch added: children: /solr/live_nodes
   [junit4]   2> 577093 INFO  (jetty-launcher-2191-thread-3) [n:127.0.0.1:33053_solr    ] o.a.s.c.c.ZkStateReader Updated live nodes from ZooKeeper... (0) -> (4)
   [junit4]   2> 577093 DEBUG (SyncThread:0) [    ] o.a.s.c.ZkTestServer Watch added: data: /solr/clusterstate.json
   [junit4]   2> 577093 DEBUG (SyncThread:0) [    ] o.a.s.c.ZkTestServer Watch added: children: /solr/collections
   [junit4]   2> 577094 DEBUG (SyncThread:0) [    ] o.a.s.c.ZkTestServer Watch added: create/delete: /solr/aliases.json
   [junit4]   2> 577094 INFO  (jetty-launcher-2191-thread-3) [n:127.0.0.1:33053_solr    ] o.a.s.c.s.i.ZkClientClusterStateProvider Cluster at 127.0.0.1:45151/solr ready
   [junit4]   2> 577094 INFO  (jetty-launcher-2191-thread-3) [n:127.0.0.1:33053_solr    ] o.a.s.h.a.MetricsHistoryHandler No .system collection, keeping metrics history in memory.
   [junit4]   2> 577096 INFO  (jetty-launcher-2191-thread-4) [n:127.0.0.1:40165_solr    ] o.a.s.m.r.SolrJmxReporter JMX monitoring for 'solr_40165.solr.jvm' (registry 'solr.jvm') enabled at server: com.sun.jmx.mbeanserver.JmxMBeanServer@7c96ba05
   [junit4]   2> 577096 INFO  (jetty-launcher-2191-thread-4) [n:127.0.0.1:40165_solr    ] o.a.s.m.r.SolrJmxReporter JMX monitoring for 'solr_40165.solr.jetty' (registry 'solr.jetty') enabled at server: com.sun.jmx.mbeanserver.JmxMBeanServer@7c96ba05
   [junit4]   2> 577097 INFO  (jetty-launcher-2191-thread-4) [n:127.0.0.1:40165_solr    ] o.a.s.c.CorePropertiesLocator Found 0 core definitions underneath /home/jenkins/workspace/Lucene-Solr-master-Linux/solr/build/solr-core/test/J0/temp/solr.cloud.MoveReplicaHDFSTest_90D82B603989D855-001/tempDir-001/node4/.
   [junit4]   2> 577102 INFO  (jetty-launcher-2191-thread-3) [n:127.0.0.1:33053_solr    ] o.a.s.m.r.SolrJmxReporter JMX monitoring for 'solr_33053.solr.node' (registry 'solr.node') enabled at server: com.sun.jmx.mbeanserver.JmxMBeanServer@7c96ba05
   [junit4]   2> 577105 WARN  (jetty-launcher-2191-thread-3) [n:127.0.0.1:33053_solr    ] o.a.s.m.r.j.JmxMetricsReporter Unable to register gauge
   [junit4]   2> javax.management.InstanceNotFoundException: solr_33053:dom1=solr,dom2=jvm,name0=memory,name1=heap,name=usage
   [junit4]   2> 	at com.sun.jmx.interceptor.DefaultMBeanServerInterceptor.getMBean(DefaultMBeanServerInterceptor.java:1083) ~[?:?]
   [junit4]   2> 	at com.sun.jmx.interceptor.DefaultMBeanServerInterceptor.exclusiveUnregisterMBean(DefaultMBeanServerInterceptor.java:423) ~[?:?]
   [junit4]   2> 	at com.sun.jmx.interceptor.DefaultMBeanServerInterceptor.unregisterMBean(DefaultMBeanServerInterceptor.java:411) ~[?:?]
   [junit4]   2> 	at com.sun.jmx.mbeanserver.JmxMBeanServer.unregisterMBean(JmxMBeanServer.java:546) ~[?:?]
   [junit4]   2> 	at org.apache.solr.metrics.reporters.jmx.JmxMetricsReporter$JmxListener.registerMBean(JmxMetricsReporter.java:531) ~[java/:?]
   [junit4]   2> 	at org.apache.solr.metrics.reporters.jmx.JmxMetricsReporter$JmxListener.onGaugeAdded(JmxMetricsReporter.java:569) [java/:?]
   [junit4]   2> 	at org.apache.solr.metrics.reporters.jmx.JmxMetricsReporter.lambda$start$0(JmxMetricsReporter.java:742) [java/:?]
   [junit4]   2> 	at java.util.HashMap.forEach(HashMap.java:1341) [?:?]
   [junit4]   2> 	at org.apache.solr.metrics.reporters.jmx.JmxMetricsReporter.start(JmxMetricsReporter.java:732) [java/:?]
   [junit4]   2> 	at org.apache.solr.metrics.reporters.SolrJmxReporter.doInit(SolrJmxReporter.java:110) [java/:?]
   [junit4]   2> 	at org.apache.solr.metrics.SolrMetricReporter.init(SolrMetricReporter.java:70) [java/:?]
   [junit4]   2> 	at org.apache.solr.metrics.SolrMetricManager.loadReporter(SolrMetricManager.java:941) [java/:?]
   [junit4]   2> 	at org.apache.solr.metrics.SolrMetricManager.loadReporters(SolrMetricManager.java:868) [java/:?]
   [junit4]   2> 	at org.apache.solr.core.CoreContainer.load(CoreContainer.java:595) [java/:?]
   [junit4]   2> 	at org.apache.solr.servlet.SolrDispatchFilter.createCoreContainer(SolrDispatchFilter.java:252) [java/:?]
   [junit4]   2> 	at org.apache.solr.servlet.SolrDispatchFilter.init(SolrDispatchFilter.java:172) [java/:?]
   [junit4]   2> 	at org.eclipse.jetty.servlet.FilterHolder.initialize(FilterHolder.java:139) [jetty-servlet-9.4.11.v20180605.jar:9.4.11.v20180605]
   [junit4]   2> 	at org.eclipse.jetty.servlet.ServletHandler.initialize(ServletHandler.java:741) [jetty-servlet-9.4.11.v20180605.jar:9.4.11.v20180605]
   [junit4]   2> 	at org.eclipse.jetty.servlet.ServletHandler.updateMappings(ServletHandler.java:1477) [jetty-servlet-9.4.11.v20180605.jar:9.4.11.v20180605]
   [junit4]   2> 	at org.eclipse.jetty.servlet.ServletHandler.setFilterMappings(ServletHandler.java:1542) [jetty-servlet-9.4.11.v20180605.jar:9.4.11.v20180605]
   [junit4]   2> 	at org.eclipse.jetty.servlet.ServletHandler.addFilterMapping(ServletHandler.java:1186) [jetty-servlet-9.4.11.v20180605.jar:9.4.11.v20180605]
   [junit4]   2> 	at org.eclipse.jetty.servlet.ServletHandler.addFilterWithMapping(ServletHandler.java:1023) [jetty-servlet-9.4.11.v20180605.jar:9.4.11.v20180605]
   [junit4]   2> 	at org.eclipse.jetty.servlet.ServletContextHandler.addFilter(ServletContextHandler.java:473) [jetty-servlet-9.4.11.v20180605.jar:9.4.11.v20180605]
   [junit4]   2> 	at org.apache.solr.client.solrj.embedded.JettySolrRunner$1.lifeCycleStarted(JettySolrRunner.java:308) [java/:?]
   [junit4]   2> 	at org.eclipse.jetty.util.component.AbstractLifeCycle.setStarted(AbstractLifeCycle.java:179) [jetty-util-9.4.11.v20180605.jar:9.4.11.v20180605]
   [junit4]   2> 	at org.eclipse.jetty.util.component.AbstractLifeCycle.start(AbstractLifeCycle.java:69) [jetty-util-9.4.11.v20180605.jar:9.4.11.v20180605]
   [junit4]   2> 	at org.apache.solr.client.solrj.embedded.JettySolrRunner.start(JettySolrRunner.java:396) [java/:?]
   [junit4]   2> 	at org.apache.solr.client.solrj.embedded.JettySolrRunner.start(JettySolrRunner.java:369) [java/:?]
   [junit4]   2> 	at org.apache.solr.cloud.MiniSolrCloudCluster.startJettySolrRunner(MiniSolrCloudCluster.java:392) [java/:?]
   [junit4]   2> 	at org.apache.solr.cloud.MiniSolrCloudCluster.lambda$new$0(MiniSolrCloudCluster.java:248) [java/:?]
   [junit4]   2> 	at java.util.concurrent.FutureTask.run(FutureTask.java:264) [?:?]
   [junit4]   2> 	at org.apache.solr.common.util.ExecutorUtil$MDCAwareThreadPoolExecutor.lambda$execute$0(ExecutorUtil.java:209) [java/:?]
   [junit4]   2> 	at java.util.concurrent.ThreadPoolExecutor.runWorker(ThreadPoolExecutor.java:1167) [?:?]
   [junit4]   2> 	at java.util.concurrent.ThreadPoolExecutor$Worker.run(ThreadPoolExecutor.java:641) [?:?]
   [junit4]   2> 	at java.lang.Thread.run(Thread.java:844) [?:?]
   [junit4]   2> 577108 INFO  (jetty-launcher-2191-thread-3) [n:127.0.0.1:33053_solr    ] o.a.s.m.r.SolrJmxReporter JMX monitoring for 'solr_33053.solr.jvm' (registry 'solr.jvm') enabled at server: com.sun.jmx.mbeanserver.JmxMBeanServer@7c96ba05
   [junit4]   2> 577108 INFO  (jetty-launcher-2191-thread-3) [n:127.0.0.1:33053_solr    ] o.a.s.m.r.SolrJmxReporter JMX monitoring for 'solr_33053.solr.jetty' (registry 'solr.jetty') enabled at server: com.sun.jmx.mbeanserver.JmxMBeanServer@7c96ba05
   [junit4]   2> 577108 INFO  (jetty-launcher-2191-thread-3) [n:127.0.0.1:33053_solr    ] o.a.s.c.CorePropertiesLocator Found 0 core definitions underneath /home/jenkins/workspace/Lucene-Solr-master-Linux/solr/build/solr-core/test/J0/temp/solr.cloud.MoveReplicaHDFSTest_90D82B603989D855-001/tempDir-001/node3/.
   [junit4]   2> 577137 INFO  (zkConnectionManagerCallback-2260-thread-1) [    ] o.a.s.c.c.ConnectionManager zkClient has connected
   [junit4]   2> 577139 INFO  (zkConnectionManagerCallback-2265-thread-1) [    ] o.a.s.c.c.ConnectionManager zkClient has connected
   [junit4]   2> 577140 DEBUG (SyncThread:0) [    ] o.a.s.c.ZkTestServer Watch added: data: /solr/clusterprops.json
   [junit4]   2> 577140 DEBUG (SyncThread:0) [    ] o.a.s.c.ZkTestServer Watch added: children: /solr/live_nodes
   [junit4]   2> 577140 INFO  (SUITE-MoveReplicaHDFSTest-seed#[90D82B603989D855]-worker) [    ] o.a.s.c.c.ZkStateReader Updated live nodes from ZooKeeper... (0) -> (4)
   [junit4]   2> 577140 DEBUG (SyncThread:0) [    ] o.a.s.c.ZkTestServer Watch added: data: /solr/clusterstate.json
   [junit4]   2> 577140 DEBUG (SyncThread:0) [    ] o.a.s.c.ZkTestServer Watch added: children: /solr/collections
   [junit4]   2> 577140 DEBUG (SyncThread:0) [    ] o.a.s.c.ZkTestServer Watch added: create/delete: /solr/aliases.json
   [junit4]   2> 577140 INFO  (SUITE-MoveReplicaHDFSTest-seed#[90D82B603989D855]-worker) [    ] o.a.s.c.s.i.ZkClientClusterStateProvider Cluster at 127.0.0.1:45151/solr ready
   [junit4]   2> 577152 INFO  (qtp872475545-7243) [n:127.0.0.1:40165_solr    ] o.a.s.h.a.CollectionsHandler Invoked Collection Action :overseerstatus with params action=OVERSEERSTATUS&wt=javabin&version=2 and sendToOCPQueue=true
   [junit4]   2> 577152 DEBUG (SyncThread:0) [    ] o.a.s.c.ZkTestServer Watch fired: children: /solr/overseer/collection-queue-work
   [junit4]   2> 577152 DEBUG (SyncThread:0) [    ] o.a.s.c.ZkTestServer Watch added: children: /solr/overseer/collection-queue-work
   [junit4]   2> 577152 DEBUG (SyncThread:0) [    ] o.a.s.c.ZkTestServer Watch added: create/delete: /solr/overseer/collection-queue-work/qnr-0000000000
   [junit4]   2> 577153 DEBUG (OverseerCollectionConfigSetProcessor-72273396183138312-127.0.0.1:33107_solr-n_0000000000) [n:127.0.0.1:33107_solr    ] o.a.s.c.ZkDistributedQueue Found child node with improper name: qnr-0000000000
   [junit4]   2> 577153 DEBUG (SyncThread:0) [    ] o.a.s.c.ZkTestServer Watch fired: children: /solr/overseer/collection-queue-work
   [junit4]   2> 577153 DEBUG (SyncThread:0) [    ] o.a.s.c.ZkTestServer Watch added: children: /solr/overseer/collection-queue-work
   [junit4]   2> 577153 DEBUG (OverseerCollectionConfigSetProcessor-72273396183138312-127.0.0.1:33107_solr-n_0000000000) [n:127.0.0.1:33107_solr    ] o.a.s.c.ZkDistributedQueue Found child node with improper name: qnr-0000000000
   [junit4]   2> 577153 DEBUG (OverseerCollectionConfigSetProcessor-72273396183138312-127.0.0.1:33107_solr-n_0000000000) [n:127.0.0.1:33107_solr    ] o.a.s.c.OverseerTaskQueue Returning topN elements: [/overseer/collection-queue-work/qn-0000000000, ]
   [junit4]   2> 577153 DEBUG (OverseerCollectionConfigSetProcessor-72273396183138312-127.0.0.1:33107_solr-n_0000000000) [n:127.0.0.1:33107_solr    ] o.a.s.c.OverseerTaskProcessor Got 1 tasks from work-queue : [[org.apache.solr.cloud.OverseerTaskQueue$QueueEvent@2e684ecf]]
   [junit4]   2> 577153 DEBUG (OverseerCollectionConfigSetProcessor-72273396183138312-127.0.0.1:33107_solr-n_0000000000) [n:127.0.0.1:33107_solr    ] o.a.s.c.OverseerTaskProcessor Marked task [/overseer/collection-queue-work/qn-0000000000] as running
   [junit4]   2> 577153 DEBUG (OverseerCollectionConfigSetProcessor-72273396183138312-127.0.0.1:33107_solr-n_0000000000) [n:127.0.0.1:33107_solr    ] o.a.s.c.OverseerTaskProcessor Overseer Collection Message Handler: Get the message id:/overseer/collection-queue-work/qn-0000000000 message:{"operation":"overseerstatus"}
   [junit4]   2> 577154 DEBUG (OverseerThreadFactory-2926-thread-1-processing-n:127.0.0.1:33107_solr) [n:127.0.0.1:33107_solr    ] o.a.s.c.OverseerTaskProcessor Runner processing /overseer/collection-queue-work/qn-0000000000
   [junit4]   2> 577154 DEBUG (OverseerThreadFactory-2926-thread-1-processing-n:127.0.0.1:33107_solr) [n:127.0.0.1:33107_solr    ] o.a.s.c.a.c.OverseerCollectionMessageHandler OverseerCollectionMessageHandler.processMessage : overseerstatus , {"operation":"overseerstatus"}
   [junit4]   2> 577154 DEBUG (OverseerCollectionConfigSetProcessor-72273396183138312-127.0.0.1:33107_solr-n_0000000000) [n:127.0.0.1:33107_solr    ] o.a.s.c.OverseerTaskProcessor Cleaning up work-queue. #Running tasks: 1
   [junit4]   2> 577154 DEBUG (OverseerCollectionConfigSetProcessor-72273396183138312-127.0.0.1:33107_solr-n_0000000000) [n:127.0.0.1:33107_solr    ] o.a.s.c.OverseerTaskProcessor RunningTasks: [/overseer/collection-queue-work/qn-0000000000]
   [junit4]   2> 577154 DEBUG (OverseerCollectionConfigSetProcessor-72273396183138312-127.0.0.1:33107_solr-n_0000000000) [n:127.0.0.1:33107_solr    ] o.a.s.c.OverseerTaskProcessor BlockedTasks: []
   [junit4]   2> 577154 DEBUG (OverseerCollectionConfigSetProcessor-72273396183138312-127.0.0.1:33107_solr-n_0000000000) [n:127.0.0.1:33107_solr    ] o.a.s.c.OverseerTaskProcessor CompletedTasks: []
   [junit4]   2> 577154 DEBUG (OverseerCollectionConfigSetProcessor-72273396183138312-127.0.0.1:33107_solr-n_0000000000) [n:127.0.0.1:33107_solr    ] o.a.s.c.OverseerTaskProcessor RunningZKTasks: [/overseer/collection-queue-work/qn-0000000000]
   [junit4]   2> 577154 DEBUG (OverseerCollectionConfigSetProcessor-72273396183138312-127.0.0.1:33107_solr-n_0000000000) [n:127.0.0.1:33107_solr    ] o.a.s.c.OverseerTaskQueue Peeking for top 99 elements. ExcludeSet: [/overseer/collection-queue-work/qn-0000000000],[]
   [junit4]   2> 577155 DEBUG (OverseerThreadFactory-2926-thread-1-processing-n:127.0.0.1:33107_solr) [n:127.0.0.1:33107_solr    ] o.a.s.c.OverseerTaskProcessor Completed task:[/overseer/collection-queue-work/qn-0000000000]
   [junit4]   2> 577155 DEBUG (SyncThread:0) [    ] o.a.s.c.ZkTestServer Watch fired: data: /solr/overseer/collection-queue-work/qnr-0000000000
   [junit4]   2> 577155 DEBUG (zkCallback-2234-thread-1) [    ] o.a.s.c.OverseerTaskQueue NodeDataChanged fired on path /overseer/collection-queue-work/qnr-0000000000 state SyncConnected latchEventType null
   [junit4]   2> 577155 DEBUG (SyncThread:0) [    ] o.a.s.c.ZkTestServer Watch fired: children: /solr/overseer/collection-queue-work
   [junit4]   2> 577155 DEBUG (OverseerThreadFactory-2926-thread-1-processing-n:127.0.0.1:33107_solr) [n:127.0.0.1:33107_solr    ] o.a.s.c.OverseerTaskProcessor Marked task [/overseer/collection-queue-work/qn-0000000000] as completed.
   [junit4]   2> 577155 DEBUG (OverseerThreadFactory-2926-thread-1-processing-n:127.0.0.1:33107_solr) [n:127.0.0.1:33107_solr    ] o.a.s.c.OverseerTaskProcessor RunningTasks: []
   [junit4]   2> 577155 DEBUG (OverseerThreadFactory-2926-thread-1-processing-n:127.0.0.1:33107_solr) [n:127.0.0.1:33107_solr    ] o.a.s.c.OverseerTaskProcessor BlockedTasks: []
   [junit4]   2> 577155 DEBUG (OverseerThreadFactory-2926-thread-1-processing-n:127.0.0.1:33107_solr) [n:127.0.0.1:33107_solr    ] o.a.s.c.OverseerTaskProcessor CompletedTasks: [/overseer/collection-queue-work/qn-0000000000]
   [junit4]   2> 577155 DEBUG (SyncThread:0) [    ] o.a.s.c.ZkTestServer Watch added: children: /solr/overseer/collection-queue-work
   [junit4]   2> 577155 DEBUG (OverseerThreadFactory-2926-thread-1-processing-n:127.0.0.1:33107_solr) [n:127.0.0.1:33107_solr    ] o.a.s.c.OverseerTaskProcessor RunningZKTasks: [/overseer/collection-queue-work/qn-0000000000]
   [junit4]   2> 577155 DEBUG (SyncThread:0) [    ] o.a.s.c.ZkTestServer Watch fired: children: /solr/overseer/collection-queue-work
   [junit4]   2> 577155 DEBUG (OverseerCollectionConfigSetProcessor-72273396183138312-127.0.0.1:33107_solr-n_0000000000) [n:127.0.0.1:33107_solr    ] o.a.s.c.ZkDistributedQueue Found child node with improper name: qnr-0000000000
   [junit4]   2> 577155 DEBUG (OverseerThreadFactory-2926-thread-1-processing-n:127.0.0.1:33107_solr) [n:127.0.0.1:33107_solr    ] o.a.s.c.OverseerTaskProcessor Overseer Collection Message Handler: Message id:/overseer/collection-queue-work/qn-0000000000 complete, response:{leader=127.0.0.1:33107_solr,overseer_queue_size=3,overseer_work_queue_size=0,overseer_collection_queue_size=2,overseer_operations={am_i_leader={requests=2,errors=0,avgRequestsPerSecond=13.10197155716578,5minRateRequestsPerSecond=0.0,15minRateRequestsPerSecond=0.0,avgTimePerRequest=0.095844,medianRequestTime=0.097402,75thPcRequestTime=0.097402,95thPcRequestTime=0.097402,99thPcRequestTime=0.097402,999thPcRequestTime=0.097402},downnode={requests=3,errors=0,avgRequestsPerSecond=22.949649791786623,5minRateRequestsPerSecond=0.0,15minRateRequestsPerSecond=0.0,avgTimePerRequest=0.009414,medianRequestTime=0.009532,75thPcRequestTime=0.009945,95thPcRequestTime=0.009945,99thPcRequestTime=0.009945,999thPcRequestTime=0.009945}},collection_operations={am_i_leader={requests=3,errors=0,avgRequestsPerSecond=19.83893876596484,5minRateRequestsPerSecond=0.0,15minRateRequestsPerSecond=0.0,avgTimePerRequest=0.12229266666666666,medianRequestTime=0.106293,75thPcRequestTime=0.160996,95thPcRequestTime=0.160996,99thPcRequestTime=0.160996,999thPcRequestTime=0.160996},overseerstatus={requests=0,errors=0,avgRequestsPerSecond=0.0,5minRateRequestsPerSecond=0.0,15minRateRequestsPerSecond=0.0,avgTimePerRequest=0.0,medianRequestTime=0.0,75thPcRequestTime=0.0,95thPcRequestTime=0.0,99thPcRequestTime=0.0,999thPcRequestTime=0.0}},overseer_queue={},overseer_internal_queue={peek={avgRequestsPerSecond=6.574763612757127,5minRateRequestsPerSecond=0.0,15minRateRequestsPerSecond=0.0,avgTimePerRequest=0.089634,medianRequestTime=0.089634,75thPcRequestTime=0.089634,95thPcRequestTime=0.089634,99thPcRequestTime=0.089634,999thPcRequestTime=0.089634}},collection_queue={peektopn_wait2000={avgRequestsPerSecond=6.640301614717496,5minRateRequestsPerSecond=0.0,15minRateRequestsPerSecond=0.0,avgTimePerRequest=149.35171,medianRequestTime=149.35171,75thPcRequestTime=149.35171,95thPcRequestTime=149.35171,99thPcRequestTime=149.35171,999thPcRequestTime=149.35171}}}
   [junit4]   2> 577156 DEBUG (SyncThread:0) [    ] o.a.s.c.ZkTestServer Watch added: children: /solr/overseer/collection-queue-work
   [junit4]   2> 577156 INFO  (qtp872475545-7243) [n:127.0.0.1:40165_solr    ] o.a.s.s.HttpSolrCall [admin] webapp=null path=/admin/collections params={action=OVERSEERSTATUS&wt=javabin&version=2} status=0 QTime=4
   [junit4]   2> 577184 DEBUG (SyncThread:0) [    ] o.a.s.c.ZkTestServer Watch fired: children: /solr/overseer/queue
   [junit4]   2> 577184 DEBUG (SyncThread:0) [    ] o.a.s.c.ZkTestServer Watch added: children: /solr/overseer/queue
   [junit4]   2> 577306 WARN  (SUITE-MoveReplicaHDFSTest-seed#[90D82B603989D855]-worker) [    ] o.a.h.u.NativeCodeLoader Unable to load native-hadoop library for your platform... using builtin-java classes where applicable
   [junit4]   1> Formatting using clusterid: testClusterID
   [junit4]   2> 577599 WARN  (SUITE-MoveReplicaHDFSTest-seed#[90D82B603989D855]-worker) [    ] o.a.h.m.i.MetricsConfig Cannot locate configuration: tried hadoop-metrics2-namenode.properties,hadoop-metrics2.properties
   [junit4]   2> 577687 INFO  (SUITE-MoveReplicaHDFSTest-seed#[90D82B603989D855]-worker) [    ] o.m.log Logging to org.apache.logging.slf4j.Log4jLogger@507a9206 via org.mortbay.log.Slf4jLog
   [junit4]   2> 577694 WARN  (SUITE-MoveReplicaHDFSTest-seed#[90D82B603989D855]-worker) [    ] o.a.h.h.HttpRequestLog Jetty request log can only be enabled using Log4j
   [junit4]   2> 577720 INFO  (SUITE-MoveReplicaHDFSTest-seed#[90D82B603989D855]-worker) [    ] o.m.log jetty-6.1.x
   [junit4]   2> 577741 INFO  (SUITE-MoveReplicaHDFSTest-seed#[90D82B603989D855]-worker) [    ] o.m.log Extract jar:file:/home/jenkins/.ivy2/cache/org.apache.hadoop/hadoop-hdfs/tests/hadoop-hdfs-2.7.4-tests.jar!/webapps/hdfs to ./temp/Jetty_localhost_localdomain_38841_hdfs____jhix6/webapp
   [junit4]   2> 577823 INFO  (SUITE-MoveReplicaHDFSTest-seed#[90D82B603989D855]-worker) [    ] o.m.log Started HttpServer2$SelectChannelConnectorWithSafeStartup@localhost.localdomain:38841
   [junit4]   2> 578028 DEBUG (ScheduledTrigger-2924-thread-2) [    ] o.a.s.c.a.NodeLostTrigger Running NodeLostTrigger: .auto_add_replicas with currently live nodes: 4
   [junit4]   2> 578230 WARN  (SUITE-MoveReplicaHDFSTest-seed#[90D82B603989D855]-worker) [    ] o.a.h.h.HttpRequestLog Jetty request log can only be enabled using Log4j
   [junit4]   2> 578233 INFO  (SUITE-MoveReplicaHDFSTest-seed#[90D82B603989D855]-worker) [    ] o.m.log jetty-6.1.x
   [junit4]   2> 578239 INFO  (SUITE-MoveReplicaHDFSTest-seed#[90D82B603989D855]-worker) [    ] o.m.log Extract jar:file:/home/jenkins/.ivy2/cache/org.apache.hadoop/hadoop-hdfs/tests/hadoop-hdfs-2.7.4-tests.jar!/webapps/datanode to ./temp/Jetty_localhost_38397_datanode____uurldf/webapp
   [junit4]   2> 578315 INFO  (SUITE-MoveReplicaHDFSTest-seed#[90D82B603989D855]-worker) [    ] o.m.log Started HttpServer2$SelectChannelConnectorWithSafeStartup@localhost:38397
   [junit4]   2> 578329 INFO  (SUITE-MoveReplicaHDFSTest-seed#[90D82B603989D855]-worker) [    ] i.n.u.i.PlatformDependent Your platform does not provide complete low-level API for accessing direct buffers reliably. Unless explicitly requested, heap buffer will always be preferred to avoid potential system unstability.
   [junit4]   2> 578435 WARN  (SUITE-MoveReplicaHDFSTest-seed#[90D82B603989D855]-worker) [    ] o.a.h.h.HttpRequestLog Jetty request log can only be enabled using Log4j
   [junit4]   2> 578437 INFO  (SUITE-MoveReplicaHDFSTest-seed#[90D82B603989D855]-worker) [    ] o.m.log jetty-6.1.x
   [junit4]   2> 578440 INFO  (SUITE-MoveReplicaHDFSTest-seed#[90D82B603989D855]-worker) [    ] o.m.log Extract jar:file:/home/jenkins/.ivy2/cache/org.apache.hadoop/hadoop-hdfs/tests/hadoop-hdfs-2.7.4-tests.jar!/webapps/datanode to ./temp/Jetty_localhost_33979_datanode____gl6w2q/webapp
   [junit4]   2> 578506 INFO  (SUITE-MoveReplicaHDFSTest-seed#[90D82B603989D855]-worker) [    ] o.m.log Started HttpServer2$SelectChannelConnectorWithSafeStartup@localhost:33979
   [junit4]   2> 578987 ERROR (DataNode: [[[DISK]file:/home/jenkins/workspace/Lucene-Solr-master-Linux/solr/build/solr-core/test/J0/temp/solr.cloud.MoveReplicaHDFSTest_90D82B603989D855-001/tempDir-002/hdfsBaseDir/data/data1/, [DISK]file:/home/jenkins/workspace/Lucene-Solr-master-Linux/solr/build/solr-core/test/J0/temp/solr.cloud.MoveReplicaHDFSTest_90D82B603989D855-001/tempDir-002/hdfsBaseDir/data/data2/]]  heartbeating to localhost.localdomain/127.0.0.1:36413) [    ] o.a.h.h.s.d.DirectoryScanner dfs.datanode.directoryscan.throttle.limit.ms.per.sec set to value below 1 ms/sec. Assuming default value of 1000
   [junit4]   2> 578987 ERROR (DataNode: [[[DISK]file:/home/jenkins/workspace/Lucene-Solr-master-Linux/solr/build/solr-core/test/J0/temp/solr.cloud.MoveReplicaHDFSTest_90D82B603989D855-001/tempDir-002/hdfsBaseDir/data/data3/, [DISK]file:/home/jenkins/workspace/Lucene-Solr-master-Linux/solr/build/solr-core/test/J0/temp/solr.cloud.MoveReplicaHDFSTest_90D82B603989D855-001/tempDir-002/hdfsBaseDir/data/data4/]]  heartbeating to localhost.localdomain/127.0.0.1:36413) [    ] o.a.h.h.s.d.DirectoryScanner dfs.datanode.directoryscan.throttle.limit.ms.per.sec set to value below 1 ms/sec. Assuming default value of 1000
   [junit4]   2> 579029 DEBUG (ScheduledTrigger-2924-thread-4) [    ] o.a.s.c.a.NodeLostTrigger Running NodeLostTrigger: .auto_add_replicas with currently live nodes: 4
   [junit4]   2> 579046 INFO  (Block report processor) [    ] BlockStateChange BLOCK* processReport 0xbb2dbc21267bd: from storage DS-d753bf52-7311-4737-a909-106459cd3d8d node DatanodeRegistration(127.0.0.1:38737, datanodeUuid=5772449a-7011-433e-86bb-a003388f8fac, infoPort=42519, infoSecurePort=0, ipcPort=44903, storageInfo=lv=-56;cid=testClusterID;nsid=425817503;c=0), blocks: 0, hasStaleStorage: true, processing time: 0 msecs
   [junit4]   2> 579046 INFO  (Block report processor) [    ] BlockStateChange BLOCK* processReport 0xbb2dbc214ee7e: from storage DS-1737e88f-6559-4f10-98b5-d0c06f1d8f61 node DatanodeRegistration(127.0.0.1:33151, datanodeUuid=f567dda5-d06c-4cb2-aa19-9c6a0dd34610, infoPort=43903, infoSecurePort=0, ipcPort=45589, storageInfo=lv=-56;cid=testClusterID;nsid=425817503;c=0), blocks: 0, hasStaleStorage: true, processing time: 0 msecs
   [junit4]   2> 579046 INFO  (Block report processor) [    ] BlockStateChange BLOCK* processReport 0xbb2dbc21267bd: from storage DS-22d55d21-b50b-4db5-b75b-2b5654776391 node DatanodeRegistration(127.0.0.1:38737, datanodeUuid=5772449a-7011-433e-86bb-a003388f8fac, infoPort=42519, infoSecurePort=0, ipcPort=44903, storageInfo=lv=-56;cid=testClusterID;nsid=425817503;c=0), blocks: 0, hasStaleStorage: false, processing time: 0 msecs
   [junit4]   2> 579046 INFO  (Block report processor) [    ] BlockStateChange BLOCK* processReport 0xbb2dbc214ee7e: from storage DS-d44c2725-38f2-47a9-8cd5-592f7c60d0f6 node DatanodeRegistration(127.0.0.1:33151, datanodeUuid=f567dda5-d06c-4cb2-aa19-9c6a0dd34610, infoPort=43903, infoSecurePort=0, ipcPort=45589, storageInfo=lv=-56;cid=testClusterID;nsid=425817503;c=0), blocks: 0, hasStaleStorage: false, processing time: 0 msecs
   [junit4] IGNOR/A 0.00s J0 | MoveReplicaHDFSTest.testNormalFailedMove
   [junit4]    > Assumption #1: 'badapple' test group is disabled (@BadApple(bugUrl="https://issues.apache.org/jira/browse/SOLR-12028"))
   [junit4]   2> 579154 INFO  (TEST-MoveReplicaHDFSTest.testFailedMove-seed#[90D82B603989D855]) [    ] o.a.s.SolrTestCaseJ4 ###Starting testFailedMove
   [junit4]   2> 579155 DEBUG (OverseerCollectionConfigSetProcessor-72273396183138312-127.0.0.1:33107_solr-n_0000000000) [n:127.0.0.1:33107_solr    ] o.a.s.c.OverseerTaskProcessor Got 0 tasks from work-queue : [[]]
   [junit4]   2> 579155 DEBUG (SyncThread:0) [    ] o.a.s.c.ZkTestServer Watch added: data: /solr/clusterprops.json
   [junit4]   2> 579155 DEBUG (OverseerCollectionConfigSetProcessor-72273396183138312-127.0.0.1:33107_solr-n_0000000000) [n:127.0.0.1:33107_solr    ] o.a.s.c.OverseerTaskProcessor Cleaning up work-queue. #Running tasks: 0
   [junit4]   2> 579155 INFO  (OverseerCollectionConfigSetProcessor-72273396183138312-127.0.0.1:33107_solr-n_0000000000) [n:127.0.0.1:33107_solr    ] o.a.s.c.OverseerTaskQueue Response ZK path: /overseer/collection-queue-work/qnr-0000000000 doesn't exist.  Requestor may have disconnected from ZooKeeper
   [junit4]   2> 579155 DEBUG (SyncThread:0) [    ] o.a.s.c.ZkTestServer Watch added: children: /solr/live_nodes
   [junit4]   2> 579155 INFO  (TEST-MoveReplicaHDFSTest.testFailedMove-seed#[90D82B603989D855]) [    ] o.a.s.c.c.ZkStateReader Updated live nodes from ZooKeeper... (0) -> (4)
   [junit4]   2> 579155 DEBUG (SyncThread:0) [    ] o.a.s.c.ZkTestServer Watch added: data: /solr/clusterstate.json
   [junit4]   2> 579155 DEBUG (OverseerCollectionConfigSetProcessor-72273396183138312-127.0.0.1:33107_solr-n_0000000000) [n:127.0.0.1:33107_solr    ] o.a.s.c.OverseerTaskProcessor RunningTasks: []
   [junit4]   2> 579155 DEBUG (OverseerCollectionConfigSetProcessor-72273396183138312-127.0.0.1:33107_solr-n_0000000000) [n:127.0.0.1:33107_solr    ] o.a.s.c.OverseerTaskProcessor BlockedTasks: []
   [junit4]   2> 579155 DEBUG (OverseerCollectionConfigSetProcessor-72273396183138312-127.0.0.1:33107_solr-n_0000000000) [n:127.0.0.1:33107_solr    ] o.a.s.c.OverseerTaskProcessor CompletedTasks: []
   [junit4]   2> 579155 DEBUG (OverseerCollectionConfigSetProcessor-72273396183138312-127.0.0.1:33107_solr-n_0000000000) [n:127.0.0.1:33107_solr    ] o.a.s.c.OverseerTaskProcessor RunningZKTasks: []
   [junit4]   2> 579155 DEBUG (OverseerCollectionConfigSetProcessor-72273396183138312-127.0.0.1:33107_solr-n_0000000000) [n:127.0.0.1:33107_solr    ] o.a.s.c.OverseerTaskQueue Peeking for top 100 elements. ExcludeSet: []
   [junit4]   2> 579155 DEBUG (SyncThread:0) [    ] o.a.s.c.ZkTestServer Watch added: children: /solr/collections
   [junit4]   2> 579156 DEBUG (SyncThread:0) [    ] o.a.s.c.ZkTestServer Watch added: create/delete: /solr/aliases.json
   [junit4]   2> 579156 DEBUG (SyncThread:0) [    ] o.a.s.c.ZkTestServer Watch fired: data: /solr/aliases.json
   [junit4]   2> 579156 DEBUG (SyncThread:0) [    ] o.a.s.c.ZkTestServer Watch fired: data: /solr/aliases.json
   [junit4]   2> 579156 DEBUG (SyncThread:0) [    ] o.a.s.c.ZkTestServer Watch fired: data: /solr/aliases.json
   [junit4]   2> 579156 DEBUG (SyncThread:0) [    ] o.a.s.c.ZkTestServer Watch fired: data: /solr/aliases.json
   [junit4]   2> 579156 DEBUG (SyncThread:0) [    ] o.a.s.c.ZkTestServer Watch fired: data: /solr/aliases.json
   [junit4]   2> 579156 DEBUG (SyncThread:0) [    ] o.a.s.c.ZkTestServer Watch fired: data: /solr/aliases.json
   [junit4]   2> 579156 DEBUG (SyncThread:0) [    ] o.a.s.c.ZkTestServer Watch fired: data: /solr/aliases.json
   [junit4]   2> 579156 DEBUG (SyncThread:0) [    ] o.a.s.c.ZkTestServer Watch fired: data: /solr/aliases.json
   [junit4]   2> 579156 DEBUG (SyncThread:0) [    ] o.a.s.c.ZkTestServer Watch fired: data: /solr/aliases.json
   [junit4]   2> 579156 DEBUG (SyncThread:0) [    ] o.a.s.c.ZkTestServer Watch added: data: /solr/aliases.json
   [junit4]   2> 579156 DEBUG (SyncThread:0) [    ] o.a.s.c.ZkTestServer Watch added: data: /solr/aliases.json
   [junit4]   2> 579156 DEBUG (SyncThread:0) [    ] o.a.s.c.ZkTestServer Watch added: data: /solr/aliases.json
   [junit4]   2> 579156 DEBUG (SyncThread:0) [    ] o.a.s.c.ZkTestServer Watch added: data: /solr/aliases.json
   [junit4]   2> 579156 DEBUG (SyncThread:0) [    ] o.a.s.c.ZkTestServer Watch added: data: /solr/aliases.json
   [junit4]   2> 579156 DEBUG (SyncThread:0) [    ] o.a.s.c.ZkTestServer Watch added: data: /solr/aliases.json
   [junit4]   2> 579156 DEBUG (SyncThread:0) [    ] o.a.s.c.ZkTestServer Watch added: data: /solr/aliases.json
   [junit4]   2> 579156 DEBUG (SyncThread:0) [    ] o.a.s.c.ZkTestServer Watch added: data: /solr/aliases.json
   [junit4]   2> 579156 DEBUG (SyncThread:0) [    ] o.a.s.c.ZkTestServer Watch added: data: /solr/aliases.json
   [junit4]   2> 579156 DEBUG (SyncThread:0) [    ] o.a.s.c.ZkTestServer Watch added: data: /solr/aliases.json
   [junit4]   2> 579157 INFO  (TEST-MoveReplicaHDFSTest.testFailedMove-seed#[90D82B603989D855]) [    ] o.e.j.s.Server jetty-9.4.11.v20180605; built: 2018-06-05T18:24:03.829Z; git: d5fc0523cfa96bfebfbda19606cad384d772f04c; jvm 9.0.4+11
   [junit4]   2> 579163 INFO  (TEST-MoveReplicaHDFSTest.testFailedMove-seed#[90D82B603989D855]) [    ] o.e.j.s.session DefaultSessionIdManager workerName=node0
   [junit4]   2> 579164 INFO  (TEST-MoveReplicaHDFSTest.testFailedMove-seed#[90D82B603989D855]) [    ] o.e.j.s.session No SessionScavenger set, using defaults
   [junit4]   2> 579164 INFO  (TEST-MoveReplicaHDFSTest.testFailedMove-seed#[90D82B603989D855]) [    ] o.e.j.s.session node0 Scavenging every 660000ms
   [junit4]   2> 579164 INFO  (TEST-MoveReplicaHDFSTest.testFailedMove-seed#[90D82B603989D855]) [    ] o.e.j.s.h.ContextHandler Started o.e.j.s.ServletContextHandler@77451484{/solr,null,AVAILABLE}
   [junit4]   2> 579165 INFO  (TEST-MoveReplicaHDFSTest.testFailedMove-seed#[90D82B603989D855]) [    ] o.e.j.s.AbstractConnector Started ServerConnector@7cd0a119{SSL,[ssl, http/1.1]}{127.0.0.1:43049}
   [junit4]   2> 579165 INFO  (TEST-MoveReplicaHDFSTest.testFailedMove-seed#[90D82B603989D855]) [    ] o.e.j.s.Server Started @579216ms
   [junit4]   2> 579165 INFO  (TEST-MoveReplicaHDFSTest.testFailedMove-seed#[90D82B603989D855]) [    ] o.a.s.c.s.e.JettySolrRunner Jetty properties: {hostContext=/solr, hostPort=43049}
   [junit4]   2> 579167 ERROR (TEST-MoveReplicaHDFSTest.testFailedMove-seed#[90D82B603989D855]) [    ] o.a.s.u.StartupLoggingUtils Missing Java Option solr.log.dir. Logging may be missing or incomplete.
   [junit4]   2> 579167 INFO  (TEST-MoveReplicaHDFSTest.testFailedMove-seed#[90D82B603989D855]) [    ] o.a.s.s.SolrDispatchFilter Using logger factory org.apache.logging.slf4j.Log4jLoggerFactory
   [junit4]   2> 579167 INFO  (TEST-MoveReplicaHDFSTest.testFailedMove-seed#[90D82B603989D855]) [    ] o.a.s.s.SolrDispatchFilter  ___      _       Welcome to Apache Solr? version 8.0.0
   [junit4]   2> 579167 INFO  (TEST-MoveReplicaHDFSTest.testFailedMove-seed#[90D82B603989D855]) [    ] o.a.s.s.SolrDispatchFilter / __| ___| |_ _   Starting in cloud mode on port null
   [junit4]   2> 579167 INFO  (TEST-MoveReplicaHDFSTest.testFailedMove-seed#[90D82B603989D855]) [    ] o.a.s.s.SolrDispatchFilter \__ \/ _ \ | '_|  Install dir: null
   [junit4]   2> 579167 INFO  (TEST-MoveReplicaHDFSTest.testFailedMove-seed#[90D82B603989D855]) [    ] o.a.s.s.SolrDispatchFilter |___/\___/_|_|    Start time: 2018-09-23T10:06:44.167474Z
   [junit4]   2> 579168 INFO  (zkConnectionManagerCallback-2269-thread-1) [    ] o.a.s.c.c.ConnectionManager zkClient has connected
   [junit4]   2> 579169 INFO  (TEST-MoveReplicaHDFSTest.testFailedMove-seed#[90D82B603989D855]) [    ] o.a.s.s.SolrDispatchFilter solr.xml found in ZooKeeper. Loading...
   [junit4]   2> 579346 INFO  (TEST-MoveReplicaHDFSTest.testFailedMove-seed#[90D82B603989D855]) [    ] o.a.s.c.ZkContainer Zookeeper client=127.0.0.1:45151/solr
   [junit4]   2> 579347 INFO  (zkConnectionManagerCallback-2273-thread-1) [    ] o.a.s.c.c.ConnectionManager zkClient has connected
   [junit4]   2> 579348 DEBUG (TEST-MoveReplicaHDFSTest.testFailedMove-seed#[90D82B603989D855]) [n:127.0.0.1:43049_solr    ] o.a.s.c.ZkController Added new OnReconnect listener org.apache.solr.cloud.ZkController$$Lambda$183/723224897@3bda2b48
   [junit4]   2> 579349 INFO  (zkConnectionManagerCallback-2275-thread-1) [    ] o.a.s.c.c.ConnectionManager zkClient has connected
   [junit4]   2> 579352 DEBUG (SyncThread:0) [    ] o.a.s.c.ZkTestServer Watch added: data: /solr/clusterprops.json
   [junit4]   2> 579352 DEBUG (SyncThread:0) [    ] o.a.s.c.ZkTestServer Watch added: children: /solr/live_nodes
   [junit4]   2> 579352 INFO  (TEST-MoveReplicaHDFSTest.testFailedMove-seed#[90D82B603989D855]) [n:127.0.0.1:43049_solr    ] o.a.s.c.c.ZkStateReader Updated live nodes from ZooKeeper... (0) -> (4)
   [junit4]   2> 579352 DEBUG (SyncThread:0) [    ] o.a.s.c.ZkTestServer Watch added: data: /solr/clusterstate.json
   [junit4]   2> 579353 DEBUG (SyncThread:0) [    ] o.a.s.c.ZkTestServer Watch added: children: /solr/collections
   [junit4]   2> 579353 DEBUG (SyncThread:0) [    ] o.a.s.c.ZkTestServer Watch added: create/delete: /solr/aliases.json
   [junit4]   2> 579353 DEBUG (SyncThread:0) [    ] o.a.s.c.ZkTestServer Watch added: create/delete: /solr/security.json
   [junit4]   2> 579353 DEBUG (TEST-MoveReplicaHDFSTest.testFailedMove-seed#[90D82B603989D855]) [n:127.0.0.1:43049_solr    ] o.a.s.c.LeaderElector Joined leadership election with path: /overseer_elect/election/72273396183138325-127.0.0.1:43049_solr-n_0000000004
   [junit4]   2> 579354 DEBUG (SyncThread:0) [    ] o.a.s.c.ZkTestServer Watch added: data: /solr/overseer_elect/election/72273396183138318-127.0.0.1:33053_solr-n_0000000003
   [junit4]   2> 579354 DEBUG (TEST-MoveReplicaHDFSTest.testFailedMove-seed#[90D82B603989D855]) [n:127.0.0.1:43049_solr    ] o.a.s.c.LeaderElector Watching path /overseer_elect/election/72273396183138318-127.0.0.1:330

[...truncated too long message...]

2> 165769 INFO  (jetty-closer-146-thread-5) [    ] o.e.j.s.session node0 Stopped scavenging
   [junit4]   2> 167211 WARN  (zkCallback-228-thread-2) [    ] o.a.s.c.c.ZkStateReader ZooKeeper watch triggered, but Solr cannot talk to ZK: [KeeperErrorCode = Session expired for /live_nodes]
   [junit4]   2> 167211 INFO  (jetty-closer-146-thread-3) [    ] o.e.j.s.h.ContextHandler Stopped o.e.j.s.ServletContextHandler@b29d03f{/solr,null,UNAVAILABLE}
   [junit4]   2> 167211 INFO  (jetty-closer-146-thread-3) [    ] o.e.j.s.session node0 Stopped scavenging
   [junit4]   2> 167264 INFO  (jetty-closer-146-thread-4) [    ] o.e.j.s.h.ContextHandler Stopped o.e.j.s.ServletContextHandler@7039f4ac{/solr,null,UNAVAILABLE}
   [junit4]   2> 167264 INFO  (jetty-closer-146-thread-4) [    ] o.e.j.s.session node0 Stopped scavenging
   [junit4]   2> 167264 ERROR (SUITE-MoveReplicaHDFSTest-seed#[90D82B603989D855]-worker) [    ] o.a.z.s.ZooKeeperServer ZKShutdownHandler is not registered, so ZooKeeper server won't take any action on ERROR or SHUTDOWN server state changes
   [junit4]   2> 167265 INFO  (SUITE-MoveReplicaHDFSTest-seed#[90D82B603989D855]-worker) [    ] o.a.s.c.ZkTestServer connecting to 127.0.0.1:46437 46437
   [junit4]   2> 167291 INFO  (Thread-1912) [    ] o.a.s.c.ZkTestServer connecting to 127.0.0.1:46437 46437
   [junit4]   2> 167292 WARN  (Thread-1912) [    ] o.a.s.c.ZkTestServer Watch limit violations: 
   [junit4]   2> Maximum concurrent create/delete watches above limit:
   [junit4]   2> 
   [junit4]   2> 	31	/solr/collections/MoveReplicaHDFSTest_coll_false/terms/shard2
   [junit4]   2> 	27	/solr/collections/MoveReplicaHDFSTest_coll_true/terms/shard1
   [junit4]   2> 	19	/solr/aliases.json
   [junit4]   2> 	19	/solr/configs/conf1
   [junit4]   2> 	10	/solr/collections/MoveReplicaHDFSTest_failed_coll_true/terms/shard1
   [junit4]   2> 	10	/solr/collections/MoveReplicaHDFSTest_failed_coll_false/terms/shard1
   [junit4]   2> 	9	/solr/collections/MoveReplicaHDFSTest_failed_coll_true/terms/shard2
   [junit4]   2> 	9	/solr/collections/MoveReplicaHDFSTest_coll_true/terms/shard2
   [junit4]   2> 	8	/solr/collections/MoveReplicaHDFSTest_failed_coll_false/terms/shard2
   [junit4]   2> 	8	/solr/collections/MoveReplicaHDFSTest_coll_false/terms/shard1
   [junit4]   2> 	7	/solr/security.json
   [junit4]   2> 
   [junit4]   2> Maximum concurrent data watches above limit:
   [junit4]   2> 
   [junit4]   2> 	19	/solr/clusterprops.json
   [junit4]   2> 	19	/solr/clusterstate.json
   [junit4]   2> 	15	/solr/collections/MoveReplicaHDFSTest_coll_false/state.json
   [junit4]   2> 	10	/solr/aliases.json
   [junit4]   2> 	7	/solr/collections/MoveReplicaHDFSTest_coll_true/state.json
   [junit4]   2> 	4	/solr/collections/MoveReplicaHDFSTest_failed_coll_false/state.json
   [junit4]   2> 	4	/solr/collections/MoveReplicaHDFSTest_failed_coll_true/state.json
   [junit4]   2> 	3	/solr/overseer_elect/election/72273594393362442-127.0.0.1:33437_solr-n_0000000002
   [junit4]   2> 	2	/solr/collections/MoveReplicaHDFSTest_coll_true/leader_elect/shard1/election/72273594393362458-core_node3-n_0000000001
   [junit4]   2> 	2	/solr/overseer_elect/election/72273594393362440-127.0.0.1:42491_solr-n_0000000000
   [junit4]   2> 	2	/solr/collections/MoveReplicaHDFSTest_coll_false/leader_elect/shard2/election/72273594393362440-core_node8-n_0000000001
   [junit4]   2> 
   [junit4]   2> Maximum concurrent children watches above limit:
   [junit4]   2> 
   [junit4]   2> 	40	/solr/collections
   [junit4]   2> 	28	/solr/live_nodes
   [junit4]   2> 
   [junit4]   2> 167293 WARN  (SUITE-MoveReplicaHDFSTest-seed#[90D82B603989D855]-worker) [    ] o.a.h.h.s.d.DirectoryScanner DirectoryScanner: shutdown has been called
   [junit4]   2> 167297 INFO  (SUITE-MoveReplicaHDFSTest-seed#[90D82B603989D855]-worker) [    ] o.m.log Stopped HttpServer2$SelectChannelConnectorWithSafeStartup@localhost:0
   [junit4]   2> 167298 WARN  (DataNode: [[[DISK]file:/home/jenkins/workspace/Lucene-Solr-master-Linux/solr/build/solr-core/test/J2/temp/solr.cloud.MoveReplicaHDFSTest_90D82B603989D855-002/tempDir-002/hdfsBaseDir/data/data3/, [DISK]file:/home/jenkins/workspace/Lucene-Solr-master-Linux/solr/build/solr-core/test/J2/temp/solr.cloud.MoveReplicaHDFSTest_90D82B603989D855-002/tempDir-002/hdfsBaseDir/data/data4/]]  heartbeating to localhost.localdomain/127.0.0.1:37567) [    ] o.a.h.h.s.d.IncrementalBlockReportManager IncrementalBlockReportManager interrupted
   [junit4]   2> 167299 WARN  (DataNode: [[[DISK]file:/home/jenkins/workspace/Lucene-Solr-master-Linux/solr/build/solr-core/test/J2/temp/solr.cloud.MoveReplicaHDFSTest_90D82B603989D855-002/tempDir-002/hdfsBaseDir/data/data3/, [DISK]file:/home/jenkins/workspace/Lucene-Solr-master-Linux/solr/build/solr-core/test/J2/temp/solr.cloud.MoveReplicaHDFSTest_90D82B603989D855-002/tempDir-002/hdfsBaseDir/data/data4/]]  heartbeating to localhost.localdomain/127.0.0.1:37567) [    ] o.a.h.h.s.d.DataNode Ending block pool service for: Block pool BP-1354172809-88.99.242.108-1537700227674 (Datanode Uuid 41274c52-8fc6-494a-a6c2-67b44be36dcd) service to localhost.localdomain/127.0.0.1:37567
   [junit4]   2> 167300 WARN  (SUITE-MoveReplicaHDFSTest-seed#[90D82B603989D855]-worker) [    ] o.a.h.h.s.d.DirectoryScanner DirectoryScanner: shutdown has been called
   [junit4]   2> 167306 INFO  (SUITE-MoveReplicaHDFSTest-seed#[90D82B603989D855]-worker) [    ] o.m.log Stopped HttpServer2$SelectChannelConnectorWithSafeStartup@localhost:0
   [junit4]   2> 167407 WARN  (DataNode: [[[DISK]file:/home/jenkins/workspace/Lucene-Solr-master-Linux/solr/build/solr-core/test/J2/temp/solr.cloud.MoveReplicaHDFSTest_90D82B603989D855-002/tempDir-002/hdfsBaseDir/data/data1/, [DISK]file:/home/jenkins/workspace/Lucene-Solr-master-Linux/solr/build/solr-core/test/J2/temp/solr.cloud.MoveReplicaHDFSTest_90D82B603989D855-002/tempDir-002/hdfsBaseDir/data/data2/]]  heartbeating to localhost.localdomain/127.0.0.1:37567) [    ] o.a.h.h.s.d.IncrementalBlockReportManager IncrementalBlockReportManager interrupted
   [junit4]   2> 167407 WARN  (DataNode: [[[DISK]file:/home/jenkins/workspace/Lucene-Solr-master-Linux/solr/build/solr-core/test/J2/temp/solr.cloud.MoveReplicaHDFSTest_90D82B603989D855-002/tempDir-002/hdfsBaseDir/data/data1/, [DISK]file:/home/jenkins/workspace/Lucene-Solr-master-Linux/solr/build/solr-core/test/J2/temp/solr.cloud.MoveReplicaHDFSTest_90D82B603989D855-002/tempDir-002/hdfsBaseDir/data/data2/]]  heartbeating to localhost.localdomain/127.0.0.1:37567) [    ] o.a.h.h.s.d.DataNode Ending block pool service for: Block pool BP-1354172809-88.99.242.108-1537700227674 (Datanode Uuid be5b3171-0ffd-450b-982f-c375dc09cf0b) service to localhost.localdomain/127.0.0.1:37567
   [junit4]   2> 167415 INFO  (SUITE-MoveReplicaHDFSTest-seed#[90D82B603989D855]-worker) [    ] o.m.log Stopped HttpServer2$SelectChannelConnectorWithSafeStartup@localhost.localdomain:0
   [junit4]   2> 167526 INFO  (SUITE-MoveReplicaHDFSTest-seed#[90D82B603989D855]-worker) [    ] o.a.s.c.ZkTestServer connecting to 127.0.0.1:46437 46437
   [junit4]   2> NOTE: leaving temporary files on disk at: /home/jenkins/workspace/Lucene-Solr-master-Linux/solr/build/solr-core/test/J2/temp/solr.cloud.MoveReplicaHDFSTest_90D82B603989D855-002
   [junit4]   2> Sep 23, 2018 10:58:16 AM com.carrotsearch.randomizedtesting.ThreadLeakControl checkThreadLeaks
   [junit4]   2> WARNING: Will linger awaiting termination of 67 leaked thread(s).
   [junit4]   2> NOTE: test params are: codec=Asserting(Lucene80): {id=PostingsFormat(name=Direct)}, docValues:{}, maxPointsInLeafNode=487, maxMBSortInHeap=6.696278564037069, sim=Asserting(org.apache.lucene.search.similarities.AssertingSimilarity@4de3b971), locale=en-BZ, timezone=SystemV/HST10
   [junit4]   2> NOTE: Linux 4.15.0-32-generic amd64/Oracle Corporation 9.0.4 (64-bit)/cpus=8,threads=2,free=134646360,total=536870912
   [junit4]   2> NOTE: All tests run in this JVM: [MoveReplicaHDFSTest, MoveReplicaHDFSTest]
   [junit4] Completed [4/5 (3!)] on J2 in 80.66s, 4 tests, 1 error <<< FAILURES!

[...truncated 20 lines...]
BUILD FAILED
/home/jenkins/workspace/Lucene-Solr-master-Linux/lucene/common-build.xml:1567: The following error occurred while executing this line:
/home/jenkins/workspace/Lucene-Solr-master-Linux/lucene/common-build.xml:1092: There were test failures: 5 suites, 20 tests, 3 errors [seed: 90D82B603989D855]

Total time: 2 minutes 59 seconds

[repro] Setting last failure code to 256

[repro] Failures:
[repro]   3/5 failed: org.apache.solr.cloud.MoveReplicaHDFSTest
[repro] Exiting with code 256
+ mv lucene/build lucene/build.repro
+ mv solr/build solr/build.repro
+ mv lucene/build.orig lucene/build
+ mv solr/build.orig solr/build
Archiving artifacts
Setting ANT_1_8_2_HOME=/var/lib/jenkins/tools/hudson.tasks.Ant_AntInstallation/ANT_1.8.2
[WARNINGS] Parsing warnings in console log with parser Java Compiler (javac)
Setting ANT_1_8_2_HOME=/var/lib/jenkins/tools/hudson.tasks.Ant_AntInstallation/ANT_1.8.2
Setting ANT_1_8_2_HOME=/var/lib/jenkins/tools/hudson.tasks.Ant_AntInstallation/ANT_1.8.2
<Git Blamer> Using GitBlamer to create author and commit information for all warnings.
<Git Blamer> GIT_COMMIT=4ccf0fb8f6ce269de8b4501fca201f5b4763cfe7, workspace=/var/lib/jenkins/workspace/Lucene-Solr-master-Linux
[WARNINGS] Computing warning deltas based on reference build #22907
Recording test results
Setting ANT_1_8_2_HOME=/var/lib/jenkins/tools/hudson.tasks.Ant_AntInstallation/ANT_1.8.2
Build step 'Publish JUnit test result report' changed build result to UNSTABLE
Email was triggered for: Unstable (Test Failures)
Sending email for trigger: Unstable (Test Failures)
Setting ANT_1_8_2_HOME=/var/lib/jenkins/tools/hudson.tasks.Ant_AntInstallation/ANT_1.8.2
Setting ANT_1_8_2_HOME=/var/lib/jenkins/tools/hudson.tasks.Ant_AntInstallation/ANT_1.8.2
Setting ANT_1_8_2_HOME=/var/lib/jenkins/tools/hudson.tasks.Ant_AntInstallation/ANT_1.8.2
Setting ANT_1_8_2_HOME=/var/lib/jenkins/tools/hudson.tasks.Ant_AntInstallation/ANT_1.8.2

Mime
View raw message